##TITLE=abcd
##JCAMPDX= 6.0         $$ Bruker NMR JCAMP-DX V2.0
##DATA TYPE= NMR SPECTRUM
##DATA CLASS= NTUPLES
##ORIGIN= UXNMR, Bruker Analytische Messtechnik GmbH
##OWNER= root
$$ XWIN-NMR		Version 3.5
$$ Thu Oct 23 19:17:58 2025 Russian Standard Time (UT+4h)  servis@DPX200
##.OBSERVE FREQUENCY= 200.131235884673
##.OBSERVE NUCLEUS= ^1H
##.ACQUISITION MODE= SIMULTANEOUS
##.ACQUISITION SCHEME= undefined
##.AVERAGES= 24
##.DIGITISER RES= 18
##SPECTROMETER/DATA SYSTEM= spect
##.PULSE SEQUENCE= zg
##.SOLVENT NAME= CDCl3
##.SHIFT REFERENCE= (INTERNAL, CDCl3, 0, 16.4885)
##AUDIT TRAIL= $$ (NUMBER, WHEN, WHO, WHERE, WHAT)
$$ ##TITLE= Audit trail, XWIN-NMR		Version 3.5
$$ ##JCAMPDX= 5.01
$$ ##ORIGIN= Bruker BioSpin GmbH
$$ ##OWNER= servis
$$ F:\spectra/data/av/nmr/H1/1/pdata/1/auditp.txt
$$ ##AUDIT TRAIL=  $$ (NUMBER, WHEN, WHO, WHERE, WHAT)
(   1,<2025-10-23 19:17:25.76 +0400>,<servis>,<DPX200>,
      <created by zg, POWCHK disabled, PULCHK disabled
       terminated by command 'halt'
       configuration hash MD5:
       00 E9 B6 7A A2 85 ED C7 34 08 36 98 17 FE 4E 26
       data hash MD5: 32K
       CE 86 90 B7 74 0A 81 97 DB E9 A2 B3 F4 69 AF D4>)
(   2,<2025-10-23 19:17:27.42 +0400>,<servis>,<DPX200>,
      <Start of raw data processing
       efp BC_mod = 2 LB = 0.05 FT_mod = 6 PKNL = 1 PHC0 = -269.1076 PHC1 = 6.501565 SI = 16K 
       data hash MD5: 16K
       62 26 3C F7 1B 05 F4 9F 70 80 70 F7 BC 61 B5 15>)
$$ ##END=
$$ 
$$ hash MD5
$$ 61 57 DC 0F EB 59 C2 61 55 0A CA 33 82 2C 0D 3D
##$RELAX= 
##$RELAX= 
##$RELAX= 
##$RELAX= 
##$RELAX= 
##$RELAX= 
##$RELAX= 
##$RELAX= 
$$ Bruker specific parameters
$$ --------------------------
##$DU= <F:\spectra>
##$EXPNO= 1
##$NAME= <H1>
##$PROCNO= 1
##$TYPE= <nmr>
##$USER= <av>
##$AMP= (0..31)
100 100 100 100 100 100 100 100 100 100 100 100 100 100 100 100 100 100 
100 100 100 100 100 100 100 100 100 100 100 100 100 100 
##$AQSEQ= 0
##$AQ_mod= 1
##$AUNM= <au_zg>
##$AUTOPOS= <>
##$BF1= 200.13
##$BF2= 200.13
##$BF3= 200.13
##$BF4= 200.13
##$BF5= 500.13
##$BF6= 500.13
##$BF7= 500.13
##$BF8= 500.13
##$BYTORDA= 1
##$CFDGTYP= 0
##$CFRGTYP= 5
##$CHEMSTR= <none>
##$CNST= (0..31)
1 1 145 1 1 1 1 1 1 1 1 1 1 1 1 1 1 1 1 1 1 1 1 1 1 1 1 1 1 1 1 1 
##$CPDPRG= <>
##$CPDPRG1= <>
##$CPDPRG2= <>
##$CPDPRG3= <>
##$CPDPRG4= <mlev>
##$CPDPRG5= <mlev>
##$CPDPRG6= <mlev>
##$CPDPRG7= <mlev>
##$CPDPRG8= <mlev>
##$CPDPRGB= <>
##$CPDPRGT= <>
##$D= (0..31)
0 2 0 0 0 0 0 0 0 0.06 0 0 0 0 0 0 0.0002 0 0 0 0 0 0 0 0 0 0 0 0 0 0 
0 
##$DATE= 1761232645
##$DBL= (0..7)
120 120 120 120 120 120 120 120 
##$DBP= (0..7)
150 150 150 150 150 150 150 150 
##$DBP07= 0
##$DBPNAM0= <>
##$DBPNAM1= <>
##$DBPNAM2= <>
##$DBPNAM3= <>
##$DBPNAM4= <>
##$DBPNAM5= <>
##$DBPNAM6= <>
##$DBPNAM7= <>
##$DBPOAL= (0..7)
0.5 0.5 0.5 0.5 0.5 0.5 0.5 0.5 
##$DBPOFFS= (0..7)
0 0 0 0 0 0 0 0 
##$DE= 6
##$DECBNUC= <off>
##$DECIM= 32
##$DECNUC= <off>
##$DECSTAT= 4
##$DIGMOD= 1
##$DIGTYP= 9
##$DL= (0..7)
0 120 120 120 120 120 120 120 
##$DP= (0..7)
$$ [...]
##$SUBNAM4= <"">
##$SUBNAM5= <"">
##$SUBNAM6= <"">
##$SUBNAM7= <"">
##$SUBNAM8= <"">
##$SUBNAM9= <"">
##$SW= 20.6817932712277
##$SWIBOX= (0..15)
0 0 3 0 0 0 0 0 0 0 0 0 0 0 0 0 
##$SW_h= 4139.07284768212
##$TD= 32768
##$TD0= 1
##$TE= 0
##$TE2= 300
##$TE3= 300
##$TEG= 300
##$TL= (0..7)
0 120 120 120 120 120 120 120 
##$TP= (0..7)
150 150 150 150 150 150 150 150 
##$TP07= 0
##$TPNAME0= <>
##$TPNAME1= <>
##$TPNAME2= <>
##$TPNAME3= <>
##$TPNAME4= <>
##$TPNAME5= <>
##$TPNAME6= <>
##$TPNAME7= <>
##$TPOAL= (0..7)
0.5 0.5 0.5 0.5 0.5 0.5 0.5 0.5 
##$TPOFFS= (0..7)
0 0 0 0 0 0 0 0 
##$TUNHIN= 0
##$TUNHOUT= 0
##$TUNXOUT= 0
##$USERA1= <user>
##$USERA2= <user>
##$USERA3= <user>
##$USERA4= <user>
##$USERA5= <user>
##$V9= 5
##$VALIST= <valist>
##$VCLIST= <CCCCCCCCCCCCCCC>
##$VD= 0
##$VDLIST= <DDDDDDDDDDDDDDD>
##$VPLIST= <PPPPPPPPPPPPPPP>
##$VTLIST= <TTTTTTTTTTTTTTT>
##$WBST= 1024
##$WBSW= 30
##$XGAIN= (0..3)
0 0 0 0 
##$XL= 0
##$YL= 0
##$YMAX_a= 1063813
##$YMIN_a= -690826
##$ZGOPTNS= <>
##$ZL1= 120
##$ZL2= 120
##$ZL3= 120
##$ZL4= 120
##$ABSF1= 0
##$ABSF2= 0
##$ABSG= 0
##$ABSL= 0
##$ALPHA= 0
##$AQORDER= 0
##$ASSFAC= 0
##$ASSFACI= 0
##$ASSFACX= 0
##$ASSWID= 0
##$AUNMP= <proc_1d>
##$AZFE= 0.1
##$AZFW= 0.1
##$BCFW= 0
##$BC_mod= 2
##$BYTORDP= 0
##$COROFFS= 0
##$CY= 18.4799938201904
##$DATMOD= 1
##$DC= 0
##$DFILT= <>
##$DTYPP= 0
##$F1P= 9.9274215381318
##$F2P= -0.165520771350173
##$FCOR= 1
##$FTSIZE= 16384
##$FT_mod= 6
##$GAMMA= 0
##$GB= 0
##$INTBC= 1
##$INTSCL= 4.127829e-11
##$ISEN= 128
##$LB= 0.05
##$LEV0= 0
##$LPBIN= 0
##$MAXI= 10000
##$MC2= 0
##$MEAN= 0
##$ME_mod= 0
##$MI= 50
##$NCOEF= 0
##$NC_proc= -6
##$NLEV= 6
##$NOISF1= 3.799351
##$NOISF2= 2.8
##$NSP= 0
##$NTH_PI= 0
##$NZP= 0
##$OFFSET= 16.48848
##$PC= 4
##$PHC0= -269.1076
##$PHC1= 6.501565
##$PH_mod= 1
##$PKNL= yes
##$PPARMOD= 0
##$PSCAL= 4
##$PSIGN= 0
##$REVERSE= no
##$SF= 200.130005582386
##$SI= 16384
##$SIGF1= 3
##$SIGF2= 2
##$SINO= 400
##$SIOLD= 16384
##$SREGLST= <1H.CDCl3>
##$SSB= 0
##$STSI= 16384
##$STSR= 0
##$SW_p= 4139.07284768211
##$SYMM= 0
##$S_DEV= 0
##$TDeff= 32768
##$TDoff= 0
##$TI= <>
##$TILT= no
##$TM1= 0
##$TM2= 0
##$TOPLEV= 0
##$USERP1= <user>
##$USERP2= <user>
##$USERP3= <user>
##$USERP4= <user>
##$USERP5= <user>
##$WDW= 1
##$XDIM= 16384
##$YMAX_p= 454125643
##$YMIN_p= -2200919
$$ End of Bruker specific parameters
$$ ---------------------------------
##NTUPLES= NMR SPECTRUM
##VAR_NAME=  FREQUENCY,     SPECTRUM/REAL,   SPECTRUM/IMAG
##SYMBOL=    X,             R,               I
##VAR_TYPE=  INDEPENDENT,   DEPENDENT,       DEPENDENT
##VAR_FORM=  AFFN,          ASDF,            ASDF
##VAR_DIM=   16384,         16384,           16384
##UNITS=     HZ,            ARBITRARY UNITS, ARBITRARY UNITS
##FACTOR=    0.252644378177508, 1,           1
##FIRST=     3299.83951724647, 0,            0
##LAST=      -839.233330435636, 0,           0
##MIN=       -839.233330435636, -2200919,    0
##MAX=       3299.83951724647, 454125643,    0
$$ Real data points
##PAGE= N=1
##DATA TABLE= (X++(R..R)), XYDATA
$$ [...]
$$ plain form
7731 2465853 2533174 2404954 2298126 2315592 2480121 2308675 2201232 2024129 2146554 2178081
7721 2178081 2151395 2033127 1961201 2041075 1897382 1944759 1991639 1999847 2027863 2075955 1978405
7710 1978405 2073521 2253384 2337174 2460574 2422680 2612889 2656511 2730553 2885636 2913936 3166554
7699 3166554 3253555 3406560 3558812 3846079 4045383 4235454 4581279 4758462 4845627 5309171
7689 5309171 5410610 5626711 5371461 5740891 5714641 5727252 5600832 5548618 5227119 5296779
7679 5296779 5325889 5264657 5276546 5292021 5433037 5479468 5784872 5803997 6087257 6338849 6508206
7668 6508206 6757025 6854062 7271596 7393949 7499131 7635705 7738230 7481918 7523601 7432178
7658 7432178 7218219 7089695 6773008 6659201 6284919 5997022 5927808 5790918 5555937 5420646
$$ packed form
7731B465853O7321j28220j06828J7466J64529j71446j07443j77103J22425L1527
7721B178081k6686j18268p1926P9874j43693M7377M6880Q208K8016M8092r7550
7710A978405R5116J79863Q3790J23400l7894J90209M3622P4042J55083K8300K52618
7699C166554Q7001J53005J52252K87267J99304J90071L45825J77183Q7165M63544
7689E309171J01439K16101k55250L69430k6250J2611j26420n2214l21499O9660
7679E296779K9110o1232J1889J5475J41016M6431L05404J9125K83260K51592J69357
7668F508206K48819R7037M17534J22353J05182J36574J02525k56312M1683r1423
7658G432178k13959j28524l16687j13807l74282k87897o9214j36890k34981j35291
$$ plain form
7648 5420646 5382004 5301626 5230497 5304168 5273070 5144225 5326252 5212671 5293455 5068356 4947483
7637 4947483 5091896 4911236 4935382 4818848 5066124 4983749 5198529 5070106 5018005 5257010
7627 5257010 5232884 5252661 5164380 5330673 5250259 5474689 5296611 5637437 5699990 5881348
7617 5881348 6044113 6109682 6175444 6564918 6541011 6980647 7077562 7298766 7555658 7852023
7607 7852023 8168495 8603187 8676642 9110097 9333106 9343289 9482663 9593751 9700645 9557335
7597 9557335 9251932 9018103 8758795 8628053 8115920 7807695 7543053 7123131 6863184 6834269
7587 6834269 6577752 6452408 6163154 6143613 5815698 6001492 5929582 5781537 5984419 5741169
7577 5741169 5669152 5721879 5868165 5941052 5677082 5927960 6028490 6137625 6175687 6356785
$$ packed form
7648E420646l8642q0378p1129P3671l1098j28845J82027j13581Q0784k25099j20873
7637D947483J44413j80660K4146j16534K47276q2375K14780j28423n2101K39005
7627E257010k4126J9777q8281J66293q0414K24430j78078L40826O2553J81358
7617E881348J62765O5569O5762L89474k3907M39636R6915K21204K56892K96365
7607G852023L16472M34692P3455M33455K23009J0183J39374J11088J06894j43310
7597I557335l05403k33829k59308j30742n12133l08225k64642m19922k59947k8915
7587F834269k56517j25344k89254j9541l27915J85794p1910j48045K02882k43250
7577E741169p2017N2727J46286P2887k63970K50878J00530J09135L8062J81098
$$ plain form
7567 6356785 6328221 6281098 6485244 6774517 6858743 6885610 7079453 7257752 7348587 7487866
7557 7487866 7737942 8023174 8168269 8439134 8616733 9026905 9053521 9473397 9916465 10299745
7547 10299745 10677367 11229792 11544047 12142160 12447384 13181616 13749250 14443103 15140232
7538 15140232 16255603 17280635 18501044 19763968 21613039 23516947 25791758 28440558
7530 28440558 31287006 34759653 38777175 43058645 48178193 53888588 60198853 67632713
7522 67632713 75716986 84481445 93965263 103703376 113451315 123285436 132169806 139335611
7514 139335611 144229670 147487940 147360212 144436510 138998889 131715430 122405051 111328897
7506 111328897 99721266 88237257 77571429 67631971 58950101 51205352 44157949 38179887
$$ packed form
7567F356785k8564m7123K04146K89273Q4226K6867J93843J78299R0835J39279
7557G487866K50076K85232J45095K70865J77599M10172K6616M19876M43068L83280
7547A0299745L77622N52425L14255N98113L05224P34232N67634O93853O97129
7538A5140232J115371J025032J220409J262924J849071J903908K274811K648800
7530B8440558K846448L472647M017522M281470N119548N710395O310265P433860
7522F7632713Q084273Q764459R483818R738113R747939R834121Q884370P165805
7514A39335611M894059L258270j27728k923702n437621p283459r310379j1076154
7506A11328897j1607631j1484009j0665828r939458q681870p744749p047403n978062
$$ plain form
7498 38179887 32708416 28252632 24413493 21211294 18623956 16367120 14619002 13056942
7490 13056942 11882850 10861987 10076272 9258974 8561205 8026159 7518571 7147769 6702270
7481 6702270 6249714 6101466 5750281 5436209 5143671 4907574 4764774 4362660 4317434 4083984
7471 4083984 4053317 3870572 3592576 3565501 3435789 3421424 3295696 3256720 3076334 2973066
7461 2973066 3026532 2876241 2854117 2632770 2629584 2567388 2604542 2633515 2581012 2480527 2271471
7450 2271471 2382544 2278673 2237972 2237891 2183617 2206808 2060201 2041641 2058212 1904560 1864719
7439 1864719 1978534 1854066 1724806 1777543 1801794 1726597 1810930 1552401 1717722 1620601
7429 1620601 1648061 1559326 1699115 1652586 1722534 1650855 1631613 1668897 1651212 1657585 1640958
$$ packed form
7498C8179887n471471m455784l839139l202199k587338k256836j748118j562060
7490A3056942j174092j020863p85715q17298o97769n35046n07588l70802m45499
7481F702270m52556j48248l51185l14072k92538k36097j42800m02114m5226k33450
7471D083984l0667j82745k77996k7075j29712j4365j25728l8976j80386j03268
7461B973066N3466j50291k2124k21347l186o2196L7154K8973n2503j00485k09056
7450B271471J11073j03871m0701q1n4274K3191j46607j8560J6571j53652l9841
7439A864719J13815j24468j29260N2737K4251p5197Q4333k58529J65321r7121
7429A620601K7460q8735J39789m6529O9948p1679j9242L7284j7685O373j6627
$$ plain form
7418 1640958 1592448 1669497 1538434 1628639 1395783 1611699 1528908 1512870 1353639 1447800 1277398
7407 1277398 1380668 1307976 1472407 1277211 1171898 1323745 1162609 1300186 1339446 1386250
7397 1386250 1340082 1203971 1404051 1304003 1410568 1347266 1159395 1218408 1100970 1189186
7387 1189186 1331668 1207057 1187574 1311054 1300382 1181150 1117545 1187071 1112999 1158360 1100552
7376 1100552 1355386 1173052 1163908 1161839 1205203 1192085 1291140 1196389 1238699 1240409 1171283 1283157
7364 1283157 1145286 1132758 980184 1040030 1083098 1134882 1083448 1040040 1095491 1085322 1181533
7353 1181533 949879 1040132 986728 939183 994962 949808 1072171 864447 892686 983059 1043326
7342 1043326 938952 1004207 908369 985077 943284 905142 987964 1044299 1029151 1108737 940485
$$ packed form
7418A640958m8510P7049j31063R0205k32856K15916q2791j6038j59231R4161j70402
7407A277398J03270p2692J64431j95196j05313J51847j61136J37577L9260M6804
7397A386250m6168j36111K00080j00048J06565o3302j87871N9013j17438Q8216
7387A189186J42482j24611j9483J23480j0672j19232o3605O9526p4072M5361n7808
7376A100552K54834j82334r144k069M3364j3118R9055r4751M2310J710o9126J11874
7364A283157j37871j2528j52574N9846M3068N1784n1434m3408N5451j0169R6211
7353A181533k31654R0253n3404m7545N5779m5154J22363k07724K8239R0373O0267
7342A043326j04374O5255r5838P6708m1793l8142Q2822N6335j5148P9586j68252
$$ plain form
7331 940485 931934 924398 1007936 1107651 865165 756104 1016021 1147480 1153488 1110269 1033034
7320 1033034 1048771 1040559 1170849 1064160 1148517 1005274 1116936 1002687 842418 1038612
7310 1038612 930511 1082786 981747 969608 1185290 1159409 990004 1009977 1275973 975956
7300 975956 1130216 1048638 1265654 1097580 1224371 1249111 1245462 1339160 1279268 1331059 1496967
7289 1496967 1456785 1473225 1455605 1693142 1599084 1544066 1755371 1724928 1767411 1945896 2056152
7278 2056152 1860534 2006317 2192065 1976459 2179002 1966326 1964460 2062618 2133315 1886627
7268 1886627 1940658 1822831 1900092 1847749 1838976 1901111 1945409 1975882 1729600 1926495 1961398
7257 1961398 1892067 1854356 1984321 1967606 1880465 1887931 1903070 2001860 2044873 2066556 1936600
$$ packed form
7331I40485q551p536Q3538R9715k42486j09061K59917J31459O008m3219p7235
7320A033034J5737q212J30290j06689Q4357j43243J11662j14249j60269J96194
7310A038612j08101J52275j01039j2139K15682k5881j69405J9973K65996l00017
7300I75956J54260q1578K17016j68074J26791K4740l649R3698n9892N1791J65908
7289A496967m0182J6440j7620K37537r4058n5018K11305l0443M2483J78485J10256
7278B056152j95618J45783J85748k15606K02543k12676j866R8158P0697k46688
7268A886627N4031j17827P7261n2343q773O2135M4298L0473k46282J96895L4903
7257A961398o9331l7711J29965j6715q7141P466J5139R8790M3013K1683j29956
$$ plain form
7246 1936600 2078850 2091050 1981837 1988049 2196696 2084082 2021723 2302521 1979081 1923813
7236 1923813 1936753 1998309 1972745 1900626 1921561 2031054 1894118 1896938 1976743 1838543 1934549
7225 1934549 1913375 2201867 1844774 2043606 1972934 2086964 1846296 2000368 1941556 1997461
7215 1997461 2036854 1824061 1852804 1803152 1918608 1857283 1850063 1796626 1873052 1842507 1801012
7204 1801012 1798928 1852457 1872687 2000351 1980378 2079944 1997681 1985114 1984505 1974545 2072035 2241069
7192 2241069 2114531 2062468 2179290 2112500 2111990 2072544 2211928 2115143 2210508 2285315 2437798
7181 2437798 2423904 2391997 2441411 2529442 2425267 2457354 2547335 2597394 2594905 2741751 2545518
7170 2545518 2610193 3098688 2874684 2896103 2986591 3154253 3132265 3221292 3273451 3163445 3249762
$$ packed form
7246A936600J42250J2200j09213O212K08647j12614o2359K80798l23440n5268
7236A923813J2940O1556k5564p2119K0935J09493j36936K820P9805j38200R6006
7225A934549k1174K88492l57093J98832p0672J14030k40668J54072n8812N5905
7215A997461L9393k12793K8743m9652J15456o1325p220n3437P6426l0545m1495
7204A801012k084N3529K0230J27664j9973R9566q2263j2567o09r960R7490J69034
7192B241069j26538n2063J16822o6790n10l9446J39384r6785R5365P4807J52483
7181B437798j3894l1907M9414Q8031j04175L2087Q9981N0059k489J46846j96233
7170B545518O4675M88495k24004K1419R0488J67662k1988Q9027N2159j10006Q6317
$$ plain form
7159 3249762 3394211 3385615 3341127 3326937 3271707 3392986 3372304 3350226 3461658 3370579 3360707
7148 3360707 3246232 3480722 3339815 3342773 3376343 3349863 3179743 3287322 3322295 3474952
7138 3474952 3122358 3320041 3457974 3374246 3523862 3315919 3462567 3430636 3582362 3760893
7128 3760893 3651453 3854958 3713717 3876201 3933232 3839998 3968757 3965704 4120206 4012303
7118 4012303 4235219 4289088 4149905 4234153 4358179 4153685 4476641 4465206 4593956 4703256
7108 4703256 4808921 4994424 5038275 5143051 5219895 5274385 5498492 5697772 5863939 5895340
7098 5895340 5862591 5741551 5924009 5874609 5897923 5781375 5591837 5571400 5767732 5371334
7088 5371334 5526746 5414925 5445843 5369246 5364685 5388570 5297981 5487700 5462782 5443292 5436331
$$ packed form
7159C249762J44449q596m4488j4190n5230J21279k0682k2078J11432r1079r872
7148C360707j14475K34490j40907K958L3570k6480j70120J07579L4973J52657
7138C474952l52594J97683J37933q3728J49616k07943J46648l1931J51726J78531
7128C760893j09440K03505j41241J62484N7031r3234J28759l053J54502j07903
7118D012303K22916N3869j39183Q4248J24026k04494L22956j1435J28750J09300
7108D703256J05665J85503M3851J04776P6844N4490K24107J99280J66167L1401
7098E895340l2749j21040J82458m9400K3314j16548j89538k0437J96332l96398
7088E371334J55412j11821L0918p6597m561K3885r0589J89719k4918j9490o961
$$ plain form
7077 5436331 5530821 5693886 5857638 6075115 6035733 6308675 6219840 6236707 6349836 6382642
7067 6382642 6421122 6672139 6780302 6815464 6981241 7192360 7316649 7417076 7582493 7581116
7057 7581116 7892837 8004365 8274308 8370559 8665556 9040068 9049413 9317471 9523386 9776016
7047 9776016 9897123 10293320 10684244 10945652 10998119 11391310 11602560 12094898 12408810 12846034
7037 12846034 12993255 13548666 13881543 14369083 14738579 15226187 15772432 16139645 16516833
7028 16516833 17012202 17282116 17660880 17877866 18268966 18422658 18893524 19109079 19623166
7019 19623166 20158113 20656039 21566209 22352105 23309451 24448167 25888842 27393831 28898743
7010 28898743 30898894 33000174 35562753 38421787 41579101 45079623 48771209 53081846
$$ packed form
7077E436331R4490J63065J63752K17477l9382K72942q8835J6867J13129L2806
7067F382642L8480K51017J08163L5162J65777K11119J24289J00427J65417j377
7057G581116L11721J11528K69943R6251K94997L74512R345K68058K05915K52630
7047I776016J21107L96197L90924K61408N2467L93191K11250M92338L13912M37224
7037A2846034J47221N55411L32877M87540L69496M87608N46245L67213L77188
7028A6516833M95369K69914L78764K16986L91100J53692M70866K15555N14087
7019A9623166N34947M97926R10170P85896R57346J138716J440675J504989J504912
7010B8898743K000151K101280K562579K859034L157314L500522L691586M310637
$$ plain form
7002 53081846 57832291 62776717 67661665 72929779 78544098 84223689 90555791 97065654
6994 97065654 104039359 111373202 119370799 127882807 136598863 145589567 154333396 162272299
6986 162272299 168506568 173121114 175221086 174258758 170834810 165103902 156958161 146978034
6978 146978034 135554369 123774525 112446311 101717596 92424950 84037591 76855392
6971 76855392 70873792 65396109 60686057 56713798 53284080 50102468 47420191 44771140
6963 44771140 42548628 40178586 38303628 35988738 34337305 32521127 31249904 30037912
6955 30037912 29076188 28305790 27485082 26781508 26243446 25285689 24549430 23601457 22528283
6946 22528283 21504155 20361765 19407193 18397467 17521148 16659908 15914260 15237590 14467843
$$ packed form
7002E3081846M750445M944426M884948N268114N614319N679591O332102O509863
6994I7065654O973705P333843P997597Q512008Q716056Q990704Q743829P938903
6986A62272299O234269M614546K099972r62328l423948n730908q145741r980127
6978A46978034j1423665j1779844j1328214j0728715r292646q387359p182199
6971G6855392n981600n477683m710052l972259l429718l181612k682277k649051
6963D4771140k222512k370042j874958k314890j651433j816178j271223j211992
6955C0037912r61724p70398q20708p03574n38062r57757p36259r47973j073174
6946B2528283j024128j142390r54572j009726q76319q61240p45648o76670p69747
$$ plain form
6937 14467843 14209068 13755012 13316356 12978568 12526020 12223503 12081158 11930551 11799093
6928 11799093 11467509 11610919 11296959 11188445 11325808 11130051 11008954 10955036 10856100 10742247
6918 10742247 10639314 10694573 10748978 10719027 10720501 10692512 10647595 10685818 10757616 10659557 10757547
6907 10757547 10838088 10926972 11016083 10973799 11026676 11092345 11024587 11182510 11285203 11173556 11308581
6896 11308581 11232285 11466419 11432185 11590597 11589864 11454465 11485382 11467221 11475678 11575212 11583019
6885 11583019 11580443 11529180 11670458 11845436 11639111 11822967 11891990 12158048 12063444 12141913
6875 12141913 12225052 12520430 12480827 12630626 12856126 13100949 13373603 13503588 13829099 14020118
6865 14020118 14629823 15226606 15674569 16490705 17118789 17728098 18620022 19334091 20068488
$$ packed form
6937A4467843k58775m54056m38656l37788m52548l02517j42345j50607j31458
6928A1799093l31584J43410l13960j08514J37363j95757j21097n3918r8936j13853
6918A0742247j02933N5259N4405k9951J474k7989m4917L8223P1798r8059R7990
6907A0757547Q0541Q8884Q9111m2284N2877O5669o7758J57923J02693j11647J35025
6896A1308581p6296K34134l4234J58412p33j35399L0917j8161Q457R9534P807
6885A1583019k576n1263J41278J74978k06325J83856O9023K66058r4604P8469
6875A2141913Q3139K95378l9603J49799K25500K44823K72654J29985L25511J91019
6865A4020118O09705N96783M47963Q16136O28084O09309Q91924P14069P34397
$$ plain form
6856 20068488 20621034 20932885 21307792 21280850 21383866 21411478 20940425 20750772 20516967 20242353
6846 20242353 20077075 20042647 20338810 20577098 20547841 20666717 20483722 20643201 20301407 19830875
6836 19830875 19693689 19101450 18825362 18188834 17859618 17515524 17485816 17147248 16768408 16610526
6826 16610526 16618043 16419978 16305653 16254624 16253147 16328923 16214907 16469981 16523566 16462821 16529457
6815 16529457 16833398 17046869 17033119 17240456 17319119 17541480 17544429 17726778 17846923 18008769
6805 18008769 17848303 18142320 18082151 18238808 18172764 18333680 18224409 18296155 18169672 18447503
6795 18447503 18279802 18564906 18612569 18638534 18742202 18853920 18932124 18952683 19032667 19167692
6785 19167692 19586925 19590348 19429709 19712582 19829953 19980216 20010351 20281625 20069509 20147042
$$ packed form
6856B0068488N52546L11851L74907k6942J03016K7612m71053j89653k33805k74614
6846B0242353j65278l4428K96163K38288k9257J18876j82995J59479l41794m70532
6836A9830875j37186n92239k76088o36528l29216l44094k9708l38568l78840j57882
6826A6610526P517j98065j14325n1029j477P5776j14016K55074N3585o0745O6636
6815A6529457L03941K13471j3750K07337P8663K22361K949J82349J20145J61846
6805A8008769j60466K94017o0169J56657o6044J60916j09271P1746j26483K77831
6795A8447503j67701K85104M7663K5965J03668J11718P8204K0559P9984J35025
6785A9167692M19233L423j60639K82873J17371J50263L0135K71274k12116P7533
$$ plain form
6775 20147042 20192845 20240192 20396506 20384955 20389752 20519320 20659718 20616084 20855731 20939808 21067565
6764 21067565 21183403 21434668 21513262 21551119 21748632 21846738 22080090 22253585 22338273 22385782
6754 22385782 22690852 22772175 22867703 23033521 23144111 23474972 23273720 23393627 23521258 23526846
6744 23526846 23919955 23863846 23902406 24000922 24219304 24359518 24378938 24577565 24726987 24769024
6734 24769024 24763806 24908774 25155620 25136377 25326783 25467024 25490161 25409306 25542896 25716579
6724 25716579 25634349 25874292 25909274 26070311 26074867 26126682 26169637 26300999 26390490 26543141 26489568
6713 26489568 26550024 26651099 26694770 26844474 26841318 26938888 27012456 27099331 27107649 27275325 27223297
6702 27223297 27358729 27399211 27441592 27359892 27679723 27746941 27953292 27921001 28012757 28286856
$$ packed form
6775B0147042M5803M7347J56314j1551M797J29568J40398m3634K39647Q4077J27757
6764B1067565J15838K51265P8594L7857J97513R8106K33352J73495Q4688M7509
6754B2385782L05070Q1323R5528J65818J10590L30861k01252J19907J27631N588
6744B3526846L93109n6109L8560R8516K18382J40214J9420J98627J49422M2037
6734B4769024n218J44968K46846j9243J90406J40241K3137q0855J33590J73683
6724B5716579q2230K39943L4982J61037M556N1815M2955J31362Q9491J52651n3573
6713B6489568O0456J01075M3671J49704l156R7570P3568Q6875Q318J67676n2028
6702B7223297J35432M0482M2381q1700L19831O7218K06351l2291R1756K74099
$$ plain form
6692 28286856 28413526 28578647 28628993 28765510 29025242 29162238 29128516 29242653 29150811 29223392
6682 29223392 29417336 29446401 29502141 29454048 29441943 29452533 29414829 29448373 29372269 29284904 29295746
6671 29295746 28995555 28781856 28625688 28527002 28510469 28447599 28260403 28173006 27944666 27937550
6661 27937550 27960892 27757805 27891235 28004452 28015019 27931388 28134158 28230776 28404960 28461006
6651 28461006 28780384 29075117 28957014 28950889 29169827 29364984 29316615 29398917 28993377 29058559
6641 29058559 28958784 28897464 28693296 28501830 28558313 28479049 28395884 28368641 28587980 28415048
6631 28415048 28692514 28707377 29036393 29204860 29190786 29366118 29495720 29618678 29669686 29717156
6621 29717156 29581554 29322248 29111577 29110649 28483389 28224852 28097894 27908039 27407641 27171116
$$ packed form
6692B8286856J26670J65121N0346J36517K59732J36996l3722J14137r1842P2581
6682B9223392J93944K9065N5740m8093j2105J0590l7704L3544p6104q7365J0842
6671B9295746l00191k13699j56168r8686j6533o2870j87196q7397k28340p116
6661B7937550K3342k03087J33430J13217J0567q3631K02770R6618J74184N6046
6651B8461006L19378K94733j18103o125K18938J95157m8369Q2302m05540O5182
6641B9058559r9775o1320k04168j91466N6483p9264q3165k7243K19339j72932
6631B8415048K77466J4863L29016J68467j4074J75332J29602J22958N1008M7470
6621B9717156j35602k59306k10671r28o27260k58537j26958j89855n00398k36525
$$ plain form
6611 27171116 27239161 27070726 27091626 27025174 27436373 27378241 27839417 27775744 28195700 28662118
6601 28662118 29128863 29300511 29705718 30072135 30424423 30594167 30835394 30907187 30979145 30842725
6591 30842725 30677499 30525074 30320112 30119725 29667368 29510503 29065714 28647859 28529026
6582 28529026 28292718 28084892 28026494 27913213 27796845 27882471 27902584 28199064 28286322 28190913
6572 28190913 28381219 28668852 28799541 28886639 29125064 29156775 29501637 29529073 29870739 30108860
6562 30108860 30624651 30986196 31505692 31888384 32743754 33357624 34196341 35233788 36245507
6553 36245507 37087035 38553764 39835580 41093345 42530521 43850844 45255642 46313319
6545 46313319 47353971 48047254 48434087 48812603 48582653 47992614 47258283 46221928 44994464
$$ packed form
6611B7171116O8045j68435K0900o6452M11199n8132M61176o3673M19956M66418
6601B8662118M66745J71648M05207L66417L52288J69744K41227P1793P1958j36420
6591C0842725j65226j52425k04962k00387m52357j56865m44789m17855j18833
6582B8529026k36308k07826n8398j13281j16368Q5626K0113K96480Q7258r5409
6572B8190913J90306K87633J30689Q7098K38425L1711L44862K7436L41666K38121
6562C0108860N15791L61545N19496L82692Q55370O13870Q38717J037447J011719
6553C6245507Q41528J466729J281816J257765J437176J320323J404798J057677
6545D6313319J040652O93283L86833L78516k29950n90039p34331j036355j227464
$$ plain form
6536 44994464 43590178 41712091 40467320 38883087 37535725 35982282 34810566 33619274
6528 33619274 32507442 31618898 30827486 30070214 29509796 28986714 28421345 28115564 27631304
6519 27631304 27130215 26986895 26788434 26339311 25844361 25547624 24920028 24846135 24483698 24268119
6509 24268119 24060035 23741371 23547124 23518244 23267977 23095085 22865511 22793403 22436743 22394246
6499 22394246 21920955 21809817 21337270 21030189 20518876 20319257 19927938 19593321 19166269
6490 19166269 18971972 18855432 18383722 18375485 18244657 17945904 17799462 17798939 17426912 17402268
6480 17402268 17348813 16978559 16863595 16737326 16520241 16409663 16245950 16097587 15831026 15586757
6470 15586757 15620907 15403817 15264951 15299169 14994184 14859789 14701041 14574137 14346945 14285788
$$ packed form
6536D4994464j404286j878087j244771j584233j347362j553443j171716j191292
6528C3619274j111832q88544p91412p57272n60418n23082n65369l05781m84260
6519B7631304n01089j43320j98461m49123m94950k96737o27596p3893l62437k15579
6509B4268119k08084l18664j94247k8880k50267j72892k29574p2108l56660m2497
6499B2394246m73291j11138m72547l07081n11313j99619l91319l34617m27052
6490A9166269j94297j16540m71710q237j30828k98753j46442n23l72027k4644
6480A7402268n3455l70254j14964j26269k17085j10578j63713j48363k66561k44269
6470A5586757L4150k17090j38866L4218l04985j34395j58748j26904k27192o1157
$$ plain form
6460 14285788 14218210 14084496 14027412 13825307 13840162 13591588 13732889 13323190 13440914 13387842
6450 13387842 13345216 13226207 13348234 12970988 13062007 13098783 13216697 13076567 12745283 12878689
6440 12878689 12676183 12717475 12638101 12547186 12514205 12342089 12276484 12387591 12319319 12167505
6430 12167505 12155618 12149431 12248932 12015416 12187200 12095733 12001894 11861391 11940608 11882000 11922096
6419 11922096 11794605 11891814 11964559 11716311 11845271 11669648 11557915 11730741 11632587 11666127
6409 11666127 11541278 11617071 11579604 11493870 11535289 11572404 11464039 11603553 11590770 11528063 11422750
6398 11422750 11612940 11762882 11772116 11770453 11796046 12009478 11967416 12100441 12266836 12385566
6388 12385566 12196273 12433797 12431362 12439904 12471528 12559815 12605365 12572024 12856872 12699963 12987864
$$ packed form
6460A4285788o7578j33714n7084k02105J4855k48574J41301m09699J17724n3072
6450A3387842m2626j19009J22027l77246R1019L6776J17914j40130l31284J33406
6440A2878689k02506M1292p9374r0915l2981j72116o5605J11107o8272j51814
6430A2167505j1887o187R9501k33516J71784r1467r3839j40503P9217n8608M0096
6419A1922096j27491R7209P2745k48248J28960j75623j11733J72826r8154L3540
6409A1666127j24849P5793l7467q5734M1419L7115j08365J39514j2783o2707j05313
6398A1422750J90190J49942R234j663K5593K13432m2062J33025J66395J18730
6388A2385566j89293K37524k435Q542L1624Q8287M5550l3341K84848j56909K87901
$$ plain form
6377 12987864 12902637 12971602 13190613 13045770 13080788 13099080 13307800 13233546 13223445 13276167 13232924
6366 13232924 13352925 13463431 13393522 13513286 13433671 13519813 13398018 13536394 13610194 13619535
6356 13619535 13496828 13602968 13692303 13791020 13845831 13682431 13654586 13845356 13966039 13881409
6346 13881409 14005810 13965057 14110355 14118663 14223496 14261084 14410414 14280043 14442102 14663974
6336 14663974 14660874 14743240 14935258 14817640 15094794 15042664 15054397 15255031 15307008 15508037
6326 15508037 15577853 15898181 15900121 16046663 16242726 16339521 16391304 16581193 16555591 16753741
6316 16753741 16941458 17037175 17104116 17362055 17547637 17618628 17950409 18149278 18242358 18424906
6306 18424906 18713901 18904975 19298763 19572198 19598708 20055794 20016369 20259262 20476128 20642746
$$ packed form
6377A2987864q5227O8965K19011j44843L5018J8292K08720p4254j0101N2722m3243
6366A3232924J20001J10506o9909J19764p9615Q6142j21795J38376P3800R341
6356A3619535j22707J06140Q9335R8717N4811j63400k7845J90770J20683q4630
6346A3881409J24401m0753J45298Q308J04833L7588J49330j30371J62059K21872
6336A4663974l100Q2366J92018j17618K77154n2130J1733K00634N1977K01029
6326A5508037O9816L20328J940J46542J96063R6795N1783J89889k5602J98150
6316A6753741J87717R5717O6941K57939J85582P0991L31781J98869R3080J82548
6306A8424906K88995J91074L93788K73435K6510M57086l9425K42893K16866J66618
$$ plain form
6296 20642746 20795805 20856831 21182907 21303832 21401672 21568808 21723076 22120825 22361714 22735731
6286 22735731 23078069 23389000 24066962 24231337 24747221 25360095 25949365 26713470 27532924
6277 27532924 28515867 29431657 30889252 32203762 33796455 35505455 37547174 39872047
6269 39872047 42287361 45026437 47958619 51233102 54479212 58737543 62771402 67529845
6261 67529845 72604252 78126583 84160331 90698027 97543792 104613034 111715477 118448122
6253 118448122 124914482 130758197 135888051 139776917 142217297 143600048 143277394 141351720
6245 141351720 138336628 134102158 128620178 122763290 116024446 108969608 101996034 94917265
6237 94917265 88043145 81718004 75655902 69797163 64596263 60079929 55841945 52371111
$$ packed form
6296B0642746J53059O1026L26076J20925R7840J67136J54268L97749K40889L74017
6286B2735731L42338L10931O77962J64375N15884O12874N89270P64105Q19454
6277B7532924R82943R15790J457595J314510J592693J709000K041719K324873
6269C9872047K415314K739076K932182L274483L246110M258331M033859M758443
6261F7529845N074407N522331O033748O537696O845765P069242P102443O732645
6253A18448122O466360N843715N129854L888866K440380J382751l22654j925674
6245A41351720l015092m234470n481980n856888o738844p054838o973574p078769
6237I4917265o874120o325141o062102n858739n200900m516334m237984l470834
$$ plain form
6229 52371111 49391148 46929263 44954267 43070158 41749586 40819201 39948543 39432849 39099096
6220 39099096 39014452 38929485 39132333 39374423 39949080 40526670 40756599 41056860 41347062 41010471
6210 41010471 40488965 39798793 38764400 37695108 36384834 34836812 33432648 32042110
6202 32042110 31074966 30281568 29475433 28812967 28354613 27926336 27766288 27689085 27799638 27733408
6192 27733408 27980293 28504234 28668808 29072359 29522105 29805930 30171331 30588551 30803805
6183 30803805 31084541 31121502 31175937 31218799 31352540 31242995 31323789 31407291 31366820 31478828
6173 31478828 31616367 31906626 32069579 32236444 32673963 32930551 33336941 33759160 34019330
6164 34019330 34247726 34664488 35040678 35302997 35545802 36193471 36605554 37190854 38030858
$$ packed form
6229E2371111k979963k461885j974996j884109j320572r30385q70658n15694l33753
6220C9099096q4644q4967K02848K42090N74657N77590K29929L00261K90202l36591
6210D1010471n21506o90172j034393j069292j310274j548022j404164j390538
6202C2042110r67144p93398q06135o62466m58354m28277j60048p7203J10553o6230
6192B7733408K46885N23941J64574M03551M49746K83825L65401M17220K15254
6183C0803805K80736L6961N4435M2862J33741j09545Q0794Q3502m0471J12008
6173C1478828J37539K90259J62953J66865M37519K56588M06390M22219K60170
6164C4019330K28396M16762L76190K62319K42805O47669M12083N85300Q40004
$$ plain form
6155 38030858 38922816 39825918 40850728 41779148 42672636 43527623 44071508 44428437 44808271
6146 44808271 44813219 44624153 44072621 43283632 42273657 41360276 40400548 39203885 38569118
6137 38569118 37600406 37005695 36775461 36714592 37007537 37233416 37476445 38010893 38433749 38608429
6127 38608429 38985765 38983503 38777707 38375570 37752261 37048729 36282155 35197113 33911114
6118 33911114 32766069 31561982 30403322 29435223 28529550 27676147 26688088 26409760 26008653
6109 26008653 25592402 25362071 25263543 25098486 25125873 25175272 25446151 25387851 25441291 25151051
6099 25151051 25007861 24716555 24263921 23758773 23181042 22614964 22029886 21458703 20675773
6090 20675773 20166591 19948069 19494340 19466730 19375757 19201356 19196051 19000645 18955881 18909829
$$ packed form
6155C8030858Q91958R03102J024810R28420Q93488Q54987N43885L56929L79834
6146D4808271M948j89066n51532p88989j009975r13381r59728j196663o34767
6137C8569118r68712n94711k30234o0869K92945K25879K43029N34448M22856J74680
6127C8608429L77336k262k05796m02137o23309p03532p66574j085042j285999
6118C3911114j145045j204087j158660r68099r05673q53403r88059k78328m01107
6109B6008653m16251k30331r8528j65057K7387M9399K70879n8300N3440k90240
6099B5151051j43190k91306m52634n05148n77731n66078n85078n71183p82930
6090B0675773n09182k18522m53729k7610r0973j74401n305j95406m4764m6052
$$ plain form
6080 18909829 18618166 18283379 18165114 17720348 17354212 16709003 16468020 16208616 15572660
6071 15572660 15347084 15006020 14715522 14608730 14335373 14066332 13890364 13844504 13727508 13735147
6061 13735147 13963441 14101768 14103168 14324343 14373412 14371007 14591616 14492465 14542391 14576548 14475677
6050 14475677 14512026 14625510 14391436 14473679 14352400 14451166 14790887 14709877 14876777 15264566
6040 15264566 15667721 16232627 17147275 17958512 19000873 20253790 21626973 23252447 25124661
6031 25124661 27173636 29745031 33014162 36640899 40300432 45531339 51334600 57525021
6023 57525021 64077998 71791769 79542033 86407787 90958815 96095393 96906514 95492660
6015 95492660 91849736 87443657 81188428 73098512 63655119 54224337 47233971 41097946
$$ packed form
6080A8909829k91663l34787j18265m44766l66136o45209k40983k59404o35956
6071A5572660k25576l41064k90498j06792k73357k69041j75968m5860j16996P639
6061A3735147K28294J38327J400K21175M9069k405K20609r9151M9926L4157j00871
6050A4475677L6349J13484k34074Q2243j21279R8766L39721q1010J66900L87789
6040A5264566M03155N64906R14648Q11237J042361J252917J373183J625474J872214
6031B5124661K048975K571395L269131L626737L659533N230907N803261O190421
6023E7525021O552977P713771P750264O865754M551028N136578Q11121j413854
6015I5492660l642924m406079o255229q089916r443393r430782o990366o136025
$$ plain form
6007 41097946 36283635 32058178 28344352 24973965 22402715 19617658 17504588 16054334
5999 16054334 14755071 13940370 13282874 12914015 12703330 12272924 12062435 11912028 11643939
5990 11643939 11699632 11682186 11846363 11819239 12140627 12067399 12120619 12426553 12456108 12691190
5980 12691190 12780776 12685385 12783610 12739614 12603888 12539569 12099354 12087244 11959427 11695049
5970 11695049 11438309 11357825 11121170 10945291 10775338 10717324 10650497 10572682 10302177 10390618
5960 10390618 10510536 10593918 10377722 10506183 10629284 10755347 10864361 10866577 11170700 11339740
5950 11339740 11355905 11276085 11161530 11414276 11419550 11396347 11275613 11237853 11304271 11359742 11339594
5939 11339594 11251849 11289177 11246376 11162212 11410818 11441511 11531884 11617772 11726004 11589828 11528335
$$ packed form
6007D1097946m814311m225457l713826l370387k571250k785057k113070j450254
5999A6054334j299263q14701o57496l68859k10685m30406k10489j50407k68089
5990A1643939N5693j7446J64177k7124L21388p3228N3220L05934K9555K35082
5980A2691190Q9586r5391R8225m3996j35726o4319m40215j2110j27817k64378
5970A1695049k56740q0484k36655j75879j69953n8014o6827p7815k70505Q8441
5960A0390618J19918Q3382k16196J28461J23101J26063J09014K216L04123J69040
5950A1339740J6165p9820j14555K52746N274k3203j20734l7760O6418N5471k0148
5939A1339594q7745L7328m2801q4164K48606L0693R0373Q5888J08232j36176o1493
$$ plain form
5928 11528335 11570366 11355792 11095739 10925366 10729365 10555133 10336007 10045009 9828323 9810589
5918 9810589 9609182 9772248 9549926 9375711 9449333 9310989 9219739 9459317 9378926 9618896
5908 9618896 9664876 10013708 10086229 10259632 10328374 10384683 10248254 10433536 10393126 10450297 10213470
5897 10213470 10216758 10432185 10458317 10420769 10694360 11026514 11006426 10970231 10954964 10927756 10672215
5886 10672215 10441532 10186264 10116799 9583544 9224360 9091187 8816068 8552838 8548808 8431437
5876 8431437 8359981 8223862 8316046 8391533 8455220 8534141 8899113 8913744 9081800 9395014 9623299
5865 9623299 9873704 10015203 10097028 10208556 9952737 9884318 9731306 9553073 9198897 8948642
5855 8948642 8591702 8665844 8240760 8123462 8073024 7787051 7707871 7694149 7685989 7581471 7468836
$$ packed form
5928A1528335M2031k14574k60053j70373j96001j74232k19126k90998k16686j7734
5918I810589k01407J63066k22322j74215P3622j38344r1250K39578q0391K39970
5908I618896M5980L48832P2521J73403O8742N6309j36429J85282m0410N7171k36827
5897A0213470L288K15427K6132l7548K73591L32154k0088l6195j5267k7208k55541
5886A0672215k30683k55268o9465n33255l59184j33173k75119k63230m030j17371
5876H431437p1456j36119R2184P5487O3687P8921L64972J4631J68056L13214K28285
5865I623299K50405J41499Q1825J11528k55819o8419j53012j78233l54176k50255
5855H948642l56940P4142m25084j17298n0438k85973p9180j3722q160j04518j12635
$$ plain form
5844 7468836 7579446 7462398 7512463 7492807 7566886 7604583 7613889 7660011 7695713 7692669 7907031
5833 7907031 7937020 7800224 7996223 8014745 7960414 8129770 8094083 8090233 8094505 8094820 7951693
5822 7951693 8004684 7976663 7947558 8072768 8072993 7998484 8033868 8242747 8269590 8254234 8294688
5811 8294688 8471266 8558476 8621369 8639362 8782782 8929853 9014190 9103355 9279135 9226062 9459815
5800 9459815 9436575 9531358 9755233 9743832 9871847 10044909 10091547 10410502 10463861 10547521 10682405
5789 10682405 10866562 10970058 10918285 10971552 11304618 11211688 11239865 11242055 11388155 11509582
5779 11509582 11442113 11339721 11444075 11538832 11374556 11500518 11478295 11458247 11633898 11400914
5769 11400914 11537039 11685700 11586410 11805335 11516687 11861468 11799546 11912074 11986148 12041262
$$ packed form
5844G468836J10610j17048N0065j9656P4079L7697R306M6122L5702l044K14362
5833G907031K9989j36796J95999J8522n4331J69356l5687l850M272L15j43127
5822G951693N2991k8021k9105J25210K25p4509L5384K08879K6843j5356M0454
5811H294688J76578Q7210O2893J7993J43420J47071Q4337Q9165J75780n3073K33753
5800I459815k3240R4783K23875j1401J28015J73062M6638L18955N3359Q3660J34884
5789A0682405J84157J03496n1773N3267L33066r2930K8177K190J46100J21427
5779A1509582o7469j02392J04354R4757j64276J25962k2223k0048J75651k32984
5769A1400914J36125J48661r9290K18925k88648L44781o1922J12528P4074N5114
$$ plain form
5759 12041262 11943761 12079744 12203458 12188357 12342984 12458883 12438036 12373209 12773324 12639470
5749 12639470 12776304 12842017 12856260 12870217 12969439 13083468 13313428 13000814 13333832 13499790
5739 13499790 13593552 13778871 14097039 14122946 14374482 14672677 14716364 14878667 14948326 15058195
5729 15058195 15176023 15518164 15436036 15574763 15632041 15712622 15815289 15866921 16067796 16122594
5719 16122594 16245799 16453869 16617354 16772544 16921493 17305134 17415363 17663352 18191798
5710 18191798 18445322 19107884 19307733 19646738 19968230 20225447 20438759 20877627 21223066
5701 21223066 21291406 21240453 21693592 21668721 21612287 21874042 21811785 22112907 22342589 22397829
5691 22397829 22643910 22568296 22839594 22745472 22670365 22677382 22472598 22226171 22167132 22032733
$$ packed form
5759A2041262r7501J35983J23714j5101J54627J15899k0847o4827M00115j33854
5749A2639470J36834O5713J4243J3957R9222J14029K29960l12614L33018J65958
5739A3499790R3762J85319L18168K5907K51536K98195M3687J62303O9659J09869
5729A5058195J17828L42141q2128J38727N7278Q0581J02667N1632K00875N4798
5719A6122594J23205K08070J63485J55190J48949L83641J10229K47989N28446
5710A8191798K53524O62562J99849L39005L21492K57217K13312M38868L45439
5701B1223066O8340n0953M53139k4871n6434K61755o2257L01122K29682N5240
5691B2397829K46081p5614K71298r4122p5107P017k04784k46427n9039j34399
$$ plain form
5681 22032733 21922017 21987630 22099909 22245923 22504954 22901279 23366366 24041468 24941852 25898319
5671 25898319 26884745 28002915 29579069 31212431 32817187 35319521 37793765 40964256
5663 40964256 44256312 47944698 51947856 56116814 60301767 63831865 66978637 68732333
5655 68732333 69873221 69330276 67762976 65775065 62732466 58962075 54909399 51177482
5647 51177482 47777415 45192614 43082600 41312491 39644379 38257449 36939017 35787877
5639 35787877 34938413 33845023 33374755 32770450 32113699 31573530 31388649 31076264 30743757
5630 30743757 30810881 30653024 30763219 31275624 31262805 31614074 32294883 32760794 33579396 34280429
5620 34280429 35201720 36516906 38067484 39648451 41318054 43664378 46231296 49127793
$$ packed form
5681B2032733j10716O5613J12279J46014K59031L96325M65087O75102R00384R56467
5671B5898319R86426J118170J576154J633362J604756K502334K474244L170491
5663D0964256L292056L688386M003158M168958M184953L530098L146772J753696
5655F8732333J140888n42945j567300j987911l042599l770391m052676l731917
5647E1177482l400067k584801k110014j770109j668112j386930j318432j151140
5639C5787877q49464j093390m70268o04305o56751n40169j84881l12385l32507
5630C0743757O7124j57857J10195N12405j2819L51269O80809M65911Q18602P01033
5620C4280429R21291J315186J550578J580967J669603K346324K566918K896497
$$ plain form
5612 49127793 52252415 55701591 59291531 62831503 66071460 69252001 70973454 72201171
5604 72201171 72378198 71735608 70288913 68110192 65428595 62734280 59564685 56978858
5596 56978858 54729082 53009956 51522470 50669124 49841318 49265679 48717950 48390118 48500026
5587 48500026 48821939 48839188 49618688 50083779 50729566 51437046 52168743 52762328 53475425 53974721
5577 53974721 54732002 55334750 56243465 57163846 58056513 58940906 60138103 61127008 62582557
5568 62582557 63744269 64803459 66278712 67570804 68873289 70114723 71406278 72643099
5560 72643099 73876257 75286051 76720629 78273617 80006870 81712297 83703479 85742960
5552 85742960 88212976 90717251 93256285 96011286 98769573 101801243 104577833 107710712
$$ packed form
5612D9127793L124622L449176L589940L539972L239957L180541J721453J227717
5604G2201171J77027o42590j446695k178721k681597k694315l169595k585827
5596E6978858k249776j719126j487486q53346q27806n75639n47729l27832J09908
5587D8500026L21913J7249P79500M65091O45787P07480P31697N93585P13097M99296
5577E3974721P57281O02748R08715R20381Q92667Q84393J197197R88905J455549
5568F2582557J161712J059190J475253J292092J302485J241434J291555J236821
5560G2643099J233158J409794J434578J552988J733253J705427J991182K039481
5552H5742960K470016K504275K539034K755001K758287L031670K776590L132879
$$ plain form
5544 107710712 110804158 113696554 116891601 120019488 123041545 126366834 129757525 133497374
5536 133497374 137024648 141193731 145724065 150365181 155506873 161349104 167797990 175092215
5528 175092215 183141338 191767263 201092302 210939058 221315897 231934457 242936404 253934323
5520 253934323 264958866 275211463 284861154 293301457 300072940 304872707 307315031 306953056
5512 306953056 304204550 298633631 290497664 280589426 269143613 256650821 243598435 230494847
5504 230494847 217950000 205867773 194707417 184553194 175263281 167042596 159621834
5497 159621834 153117970 147489085 142469803 138292517 134566003 131455380 128216095 125373454
5489 125373454 122419155 119360244 115926677 112341016 108674633 104531522 100338073 96152168
$$ packed form
5544A07710712L093446K892396L195047L127887L022057L325289L390691L739849
5536A33497374L527274M169083M530334M641116N141692N842231O448886P294225
5528A75092215Q049123Q625925R325039R846756J0376839J0618560J1001947J0997919
5520B53934323J1024543J0252597R649691Q440303O771483M799767K442324l61975
5512C06953056k748506n570919q135967r908238j1445813j2492792j3052386j3103588
5504B30494847j2544847j2082227j1160356j0154223r289913q220685p420762
5497A59621834o503864n628885n019282m177286l726514l110623l239285k842641
5489A25373454k954299l058911l433567l585661l666383m143111m193449m185905
$$ plain form
5481 96152168 91835596 87699899 83873755 80308220 76939425 73950348 71307211 68609808
5473 68609808 66207926 64198446 62463706 60721645 59112397 57899903 56704610 55587027
5465 55587027 54610846 53318502 52369488 51168305 50005908 48943607 48004115 47076543 46016651
5456 46016651 45270491 44462916 43796380 43002784 42366871 41875049 41507436 41002227 40903023 40628948
5446 40628948 40392366 40164058 39977670 39886142 39969416 39695429 39699736 39773160 39702453 39680582 39502481
5435 39502481 39521529 39181053 39181148 38994939 38635266 38450016 38407477 38238628 38063151 37762850
5425 37762850 37751115 37627047 37301521 37155307 37199054 36857844 36959592 36956952 36934946 36895670
5415 36895670 36853759 37053328 37370000 37595470 37941095 38470603 38696738 39165702 39428978 39841250
$$ packed form
5481I6152168m316572m135697l826144l565535l368795k989077k643137k697403
5473F8609808k401882k009480j734740j742061j609248j212494j195293j117583
5465E5587027r76181j292344r49014j201183j162397j062301r39492r27572j059892
5456D6016651p46160q07575o66536p93596o35913m91822l67613n05209r9204k74075
5446D0628948k36582k28308j86388r1528Q3274k73987M307P3424p0707k1871j78101
5435C9502481J9048l40476R5j86209l59673j85250m2539j68849j75477l00301
5425C7762850j1735j24068l25526j46214M3747l41210J01748k640k2006l9276
5415C6895670m1911J99569L16672K25470L45625N29508K26135M68964K63276M12272
$$ plain form
5405 39841250 40170708 40334163 40464743 40497483 40488612 40458221 40245774 40065364 40018819 39993686
5395 39993686 39920031 39844707 39938014 40048353 40042359 40278922 40341681 40397434 40549873 40791265 40755792
5384 40755792 40997258 41029816 41144017 41146655 41498303 41418315 41693966 41973378 42370756 43114023
5374 43114023 43460446 44173176 45014525 45968390 47168249 48346403 49688244 51477136 53404131
5365 53404131 55600422 57908447 60379282 63270858 66055950 69192899 72184059 75208750
5357 75208750 78433980 81666902 84670892 87871960 90957278 93943386 97149810 100334769
5349 100334769 103881721 107680415 111759495 116399595 121842800 127953746 135463606 144083304
5341 144083304 153990019 165142365 177835355 191405545 205783387 220926101 235907286
$$ packed form
5405C9841250L29458J63455J30580L2740q871l0391k12447j80410m6545k5133
5395C9993686p3655p5324R3307J10339n994K36563O2759N5753J52439K41392l5473
5384D0755792K41466L2558J14201K638L51648p9988K75651K79412L97378P43267
5374D3114023L46423P12730Q41349R53865J199859J178154J341841J788892J926995
5365E3404131K196291K308025K470835K891576K785092L136949K991160L024691
5357G5208750L225230L232922L003990L201068L085318K986108L206424L184959
5349A00334769L546952L798694M079080M640100N443205O110946P509860Q619698
5341A44083304R906715J1152346J2692990J3570190J4377842J5142714J4981185
$$ plain form
5334 235907286 249337976 260732001 269020073 273619737 274181877 271020939 264528541 255585377
5326 255585377 244022515 231342648 218485612 206838723 196939372 189177203 182739868
5319 182739868 177739879 173445027 170684495 168249586 166752090 165766855 165280623 165047895
5311 165047895 165376900 165500299 165974183 166119272 165562168 165176429 164301953 163274703 162176438
5302 162176438 160768522 159408998 158192248 157209647 156983719 157067355 158176408 160091765 162971240
5293 162971240 166931157 172107872 178534099 186110590 194821415 204866408 216247502 228388527
5285 228388527 241979296 256354668 271603604 287162048 302924470 318310279 332505417
5278 332505417 344269502 353314284 358668558 359757122 356683988 350159646 341150946 330004043
$$ packed form
5334B35907286J3430690J1394025Q288072M599664N62140l160938o492398q943164
5326B55585377j1562862j2679867j2857036j1646889r899351p762169o437335
5319A82739868m999989m294852k760532k434909j497496r85235m86232k32728
5311A65047895L29005J23399M73884J45089n57104l85739q74476j027250j098265
5302A62176438j407916j359524j216750r82601k25928Q3636J109053J915357K879475
5293A62971240L959917N176715O426227P576491Q710825J0044993J1381094J2141025
5285B28388527J3590769J4375372J5248936J5558444J5762422J5385809J4195138
5278C32505417J1764085R044782N354274J088564l073134o524342r008700j1146903
$$ plain form
5270 330004043 317168582 304140594 292501865 283567521 278036710 275009557 274703891 276615260
5262 276615260 280539629 286237330 293583943 302647437 312945460 324351205 336129001 347052248
5254 347052248 357566570 365402507 370252266 371877211 369845624 364116596 354959416 343070500
5246 343070500 329778027 315566983 302244757 290427544 281251741 274968989 272264126
5239 272264126 273147451 277269816 284166432 293615417 305331003 318386270 332088096 345085227
5231 345085227 355804545 363206773 366612084 365496407 359028832 348018919 332880218 314524912
5223 314524912 294618454 273299311 252666043 233235904 215581430 200000317 186563701
5216 186563701 174847206 164866258 156252413 149006211 143343715 138684530 134868257 132138876
$$ packed form
5270C30004043j2835461j3027988j1638729q934344n530811l027153l05666J911369
5262B76615260L924369N697701P346613R063494J0298023J1405745J1777796J0923247
5254C47052248J0514322P835937M849759J624945k031587n729028r157180j1888916
5246C43070500j3292473j4211044j3322226j1817213r175803o282752k704863
5239B72264126Q83325M122365O896616R448985J1715586J3055267J3701826J2997131
5231C45085227J0719318P402228L405311j115677o467575j1009913j5138701j8355306
5223C14524912j9906458k1319143k0633268j9430139j7654474j5581113j3436616
5216A86563701j1716495r980948q613845p246202n662496m659185l816273k729381
$$ plain form
5208 132138876 129921715 128178399 126981330 125701497 124635840 123536287 122160729 120895818
5200 120895818 119293649 117567515 115792219 113613079 111266249 108779620 106628346 104018598
5192 104018598 101889626 99775278 97861518 96053929 94067537 92203644 90373504 87966463
5184 87966463 85451275 83319428 80748782 78341392 75883663 73774638 71884079 70427205
5176 70427205 69112271 68325405 67515897 66924790 66276352 66026236 65442285 65132341 64582296
5167 64582296 64082346 63298738 62791651 61916575 61166033 60377126 59662433 59302265 58606871
5158 58606871 58548839 58525576 58834499 59353298 60062426 61087296 62348264 63517089 65203707
5149 65203707 66948616 68362536 69879501 71281312 72475513 73463463 73776539 74000821 73962161
$$ packed form
5208A32138876k217161j743316j197069j279833j065657j099553j375558j264911
5200A20895818j602169j726134j775296k179140k346830k486629k151274k609748
5192A04018598k128972k114348j913760j807589j986392j863893j830140k407041
5184H7966463k515188k131847k570646k407390k457729k109025j890559j456874
5176G0427205j314934p86866q09508n91107o48438k50116n83951l09944n50045
5167F4582296m99950p83608n07087q75076p50542p88907p14693l60168o95394
5158E8606871n8032k3263L08923N18799P09128J024870J260968J168825J686618
5149F5203707J744909J413920J516965J401811J194201R87950L13076K24282l8660
$$ plain form
5140 73962161 73528053 72938233 71847576 70764792 69337812 68358372 67318398 66116736 65146908
5131 65146908 64346006 63646593 63043488 62563446 61845442 61146973 60294837 59620405 58580872
5122 58580872 57252431 55890592 54600085 53388675 51951592 50609907 49389638 48435877
5114 48435877 47849472 47181494 46590747 46340427 45882202 45860924 45641343 45590410 45641682 45494843
5104 45494843 45394394 45298643 45463997 45355319 45389964 45595192 45703471 46005217 46267000 46580547
5094 46580547 47068215 47759361 48568694 49006892 49566387 50564329 51248401 51844212 52611501
5085 52611501 53247061 53951014 54553500 55465963 56141018 57310099 58242677 59420974 60946804
5076 60946804 62189476 63754195 65422204 66921198 68837109 70727095 72698544 75261554
$$ packed form
5140G3962161m34108n89820j090657j082784j426980r79440j039974j201662r69828
5131F5146908q00902o99413o03105m80042p18004o98469q52136o74432j039533
5122E8580872j328441j361839j290507j211410j437083j341685j220269r53761
5114D8435877n86405o67978n90747k50320m58225k1278k19581n0933N1272j46839
5104D5494843j00449r5751J65354j08678L4645K05228J08279L01746K61783L13547
5094D6580547M87668O91146Q09333M38198N59495R97942O84072N95811P67289
5085E2611501O35560P03953O02486R12463O75055J169081R32578J178297J525830
5076F0946804J242672J564719J668009J498994J915911J889986J971449K563010
$$ plain form
5068 75261554 78150147 81482756 86072845 91027573 96315833 102510671 109581152 116569309
5060 116569309 125705695 135997881 147622265 162948346 179327726 197780131 221834306
5053 221834306 249241720 278177526 306542905 344368043 380180416 410416182 431079034
5046 431079034 453974341 454125643 444867080 427197998 406576866 376590429 336031677
5039 336031677 292747715 251460590 220510158 193726347 172625599 154824683 138035750
5032 138035750 124164544 111491998 100356698 91520673 83895038 78201430 74188720 71165894
5024 71165894 68603602 66067819 63833837 61638260 59430573 57518294 55569944 54089584
5016 54089584 52360149 50824100 49213292 47782184 46197966 44448451 43258392 42133949
$$ packed form
5068G5261554K888593L332609M590089M954728N288260O194838P070481O988157
5060A16569309R136386J0292186J1624384J5326081J6379380J8452405K4054175
5053B21834306K7407414K8935806K8365379L7825138L5812373L0235766K0662852
5046D31079034K2895307J51302r258563j7669082k0621132k9986437m0558752
5039C36031677m3283962m1287125l0950432k6783811k1100748j7800916j6788933
5032A38035750j3871206j2672546j1135300q836025p625635n693608m012710l022826
5024G1165894k562292k535783k233982k195577k207687j912279j948350j480360
5016E4089584j729435j536049j610808j431108j584218j749515j190059j124443
$$ plain form
5008 42133949 40790884 39550443 38369159 37346161 36107164 35107836 34265175 33102039
5000 33102039 32359523 31494146 30646763 29730231 29153370 28481670 27796423 27167740 26809100
4991 26809100 26360069 25804200 25617809 25135205 24944263 24759788 24484594 24561287 24547307 24353451
4981 24353451 24533533 24407690 24485289 24468565 24397165 24337106 24334717 23946911 23609893 23264130
4971 23264130 23152585 22951126 22917519 22676927 22642648 22542982 22435959 22464924 22328616 22099345
4961 22099345 21878656 21557077 21245627 20492991 20095203 19501301 18935260 18282027 17646802
4952 17646802 17204118 16975903 16160880 16030352 15487014 15383414 14911239 14808093 14716546 14417685
4942 14417685 14139400 13784054 13765082 13371338 13088691 13095369 12855200 12676886 12482161 12135175
$$ packed form
5008D2133949j343065j240441j181284j022998j238997r99328q42661j163136
5000C3102039p42516q65377q47383r16532n76861o71700o85247o28683l58640
4991B6809100m49031n55869j86391m82604j90942j84475k75194P6693j3980j93856
4981B4353451J80082j25843P7599j6724p1400o0059k389l87806l37018l45763
4971B3264130j11545k01459l3607k40592l4279r9666j07023K8965j36308k29271
4961B2099345k20689l21579l11450p52636l97788n93902n66041o53233o35225
4952A7646802m42684k28215q15023j30528n43338j03600m72175j03146r1547k98861
4942A4417685k78285l55346j8972l93744k82647O678k40169j78314j94725l46986
$$ plain form
4932 12135175 11776539 11648731 11316209 11128478 11043988 10782637 10459929 10451356 10377133 10285306
4922 10285306 10309311 10217555 10266109 10336915 10275769 10276520 10321356 10472855 10515444 10490231 10555275
4911 10555275 10705389 10772038 10839825 11203665 11170257 11341260 11359218 11684103 11998706 12318888
4901 12318888 12537840 13046038 13502768 14080993 14715384 15420104 16132690 17072307 17892767
4892 17892767 18649835 19848320 20681841 21431564 21957475 22261742 22268209 21887607 21346700 20628998
4882 20628998 19576420 18214790 17221036 15857514 14731903 13483673 12609113 11810194 11098580
4873 11098580 10477273 10033580 9519153 9129563 8844515 8498987 8217578 7915992 7794722
4864 7794722 7624643 7132510 7269376 6935782 6886544 6828181 6474920 6393255 6335563 6206859
$$ packed form
4932A2135175l58636j27808l32522j87731q4490k61351l22708q573p4223r1827
4922A0285306K4005r1756M8554P0806o1146P51M4836J51499M2589k5213O5044
4911A0555275J50114O6649O7787L63840l3408J71003J7958L24885L14603L20182
4901A2318888K18952N08198M56730N78225O34391P04720P12586R39617Q20460
4892A7892767P57068J198485Q33521P49723N25911L04267O467l80602n40907p17702
4882B0628998j052578j361630r93754j363522j125611j248230q74560p98919p11614
4873A1098580o21307m43693n14427l89590k85048l45528k81409l01586j21270
4864G794722j70079m92133J36866l33594m9238n8363l53261q1665n7692j28704
$$ plain form
4854 6206859 6173534 6105745 5975836 5913902 6021476 5715545 5775604 5689152 5653887 5650216 5277935
4843 5277935 5376996 5325568 5249257 5114417 5196761 4949511 5083500 5042125 5067183 4970955 5054911
4832 5054911 4954058 5061719 4985985 4980753 4813252 4800680 4958796 4914089 4978618 4904846 4934988
4821 4934988 4845357 4759287 4855092 4833812 4827892 4911875 4828607 4993427 4895392 4913762 5006890
4810 5006890 5069208 4954100 5123317 5172464 5186064 5219807 5349099 5312722 5458184 5624573
4800 5624573 5583835 5761377 5965803 6280285 6554415 6568716 6628081 6722579 6783302 6638780
4790 6638780 6686093 6399746 6409024 6139100 6055005 5877257 5523536 5414255 5435176 5348987 5187106
4779 5187106 5176902 5120806 5228988 5056764 5173862 5079518 5024457 4930897 4928444 5230139 5236051
$$ packed form
4854F206859l3325o7789j29909o1934J07574l05931O0059q6452l5265l671l72281
4843E277935R9061n1428p6311j34840Q2344k47250J33989m1375K5058r6228Q3956
4832E054911j00853J07661p5734n232j67501j2572J58116m4707O4529p3772L0142
4821D934988q9631q6070R5805k1280n920Q3983q3268J64820r8035J8370R3128
4810E006890O2318j15108J69217M9147J3600L3743J29292l6377J45462J66389
4800E624573m0738J77542K04426L14482K74130J4301N9365R4498O0723j44522
4790F638780M7313k86347R278k69924q4095j77748l53721j09281K0921q6189j61881
4779E187106j0204n6096J08182j72224J17098r4344n5061r3560k453L01695N912
$$ plain form
4768 5236051 5051969 5063807 5297978 5163856 5269316 5233084 5261907 5251085 5293234 5409350
4758 5409350 5422514 5685495 5305056 5475973 5496633 5490243 5552157 5630637 5553668 5801200 5666338
4747 5666338 5750656 5799414 5847850 5999643 5816533 5965255 5977158 6050666 6133557 6240422 6412324
4736 6412324 6485445 6721835 6592197 6893074 6975146 6996444 7096176 7162507 7475134 7470893 7589790
4725 7589790 7890850 7963741 8189910 8341053 8589791 8809776 9037813 9212254 9433720 9425361
4715 9425361 9720917 9819888 10027917 10113531 10529637 10398774 10533173 10559334 10740267 10731508
4705 10731508 10910774 11034557 11093580 11105237 11263601 11418100 11302606 11406055 11484795 11513845
4695 11513845 11662812 11570979 11769455 11734068 11853218 11860674 12012613 12113474 11980298 12309602
$$ packed form
4768E236051j84082J1838K34171j34122J05460l6232K8823j0822M2149J16116
4758E409350J3164K62981l80439J70917K0660o390O1914P8480p6969K47532j34862
4747E666338Q4318M8758M8436J51793j83110J48722J1903P3508Q2891J06865J71902
4736F412324P3121K36390j29638L00877Q2072K1298R9732O6331L12627m241J18897
4725G589790L01060P2891K26169J51143K48738K19985K28037J74441K21466q359
4715I425361K95556R8971K08029Q5614M16106j30863J34399K6161J80933q759
4705A0731508J79266J23783N9023J1657J58364J54499j15494J03449P8740K9050
4695A1513845J48967r1833J98476l5387J19150P456J51939J00861j33176L29304
$$ plain form
4685 12309602 12498237 12647890 12732568 12945484 13013830 13483453 13745213 13623978 13946920 14050280
4675 14050280 14551407 14445352 14737786 14814203 15238174 15316197 15407247 15609602 15813877 15871212
4665 15871212 16093835 16246016 16140168 16327259 16339956 16234413 16288708 16318887 16266138 16170799
4655 16170799 16192909 16191321 16268832 16204217 16325386 16191805 16215740 16195902 16310407 16637364 16698456
4644 16698456 16794245 16878699 17332693 17409786 17766703 18111133 18398460 19052615 19450508 20041723
4634 20041723 20756440 21519804 22358607 23259030 24040987 25148270 26337188 27431679 28518637
4625 28518637 29796837 31007643 32363520 33528142 34663058 35815814 37160213 38099349
4617 38099349 38996252 39898610 40568703 41163259 41633303 41969247 42228545 42290999 42253648 42092211
$$ packed form
4685A2309602J88635J49653Q4678K12916O8346M69623K61760j21235L22942J03360
4675A4050280N01127j06055K92434P6417M23971P8023R1050K02355K04275N7335
4665A5871212K22623J52181j05848J87091J2697j05543N4295L0179n2749r5339
4655A6170799K2110j588P7511o4615J21169j33581K3935j9838J14505L26957O1092
4644A6698456R5789Q4454M53994P7093L56917L44430K87327O54155L97893N91215
4634B0041723P14717P63364Q38803R00423P81957J107283J188918J094491J086958
4625B8518637J278200J210806J355877J164622J134916J152756J344399R39136
4617C8099349Q96903R02358O70093N94556M70044L35944K59298O2454l7351j61437
$$ plain form
4607 42092211 41810996 41576267 41135904 40543851 39937778 39182282 38491171 37629958 36724708
4598 36724708 35965936 34861831 33773784 32949303 31914216 31068925 30172865 29480897 28840403
4589 28840403 28246120 27829371 27490440 26946921 26856803 26715413 26605861 26633444 26598172 26509191
4579 26509191 26710567 26725777 27199921 27255762 27454962 27740914 27904385 28281629 28646491 28959761
4569 28959761 29472288 29781531 30211135 30748952 31208979 31703751 32338330 32982592 33517118
4560 33517118 34334306 35121704 36120953 37170690 38364242 39476948 40843237 42336524 43706554
4551 43706554 45158723 46601225 48222391 49960212 51402053 52841639 54265726 55745554
4543 55745554 56858604 57790389 58873096 59836694 60393908 60995323 61316550 61859380 61915937
$$ packed form
4607D2092211k81215k34729m40363n92053o06073p55496o91111q61213r05250
4598C6724708p58772j104105j088047q24481j035087q45291q96060o91968o40494
4589B8840403n94283m16749l38931n43519r0118j41390j09552K7583l5272q8981
4579B6509191K01376J5210M74144N5841J99200K85952J63471L77244L64862L13270
4569B8959761N12527L09243M29604N37817M60027M94772O34579O44262N34526
4560C3517118Q17188P87398R99249J049737J193552J112706J366289J493287J370030
4551D3706554J452169J442502J621166J737821J441841J439586J424087J479828
4543E5745554J113050R31785J082707R63598N57214O01415L21227N42830N6557
$$ plain form
4534 61915937 61985863 61968885 61617537 61370309 60772367 60102924 59170061 58479352 57453818 56387998
4524 56387998 55301293 54470358 53395876 52433927 51867948 51038300 50629283 50199256 49859473
4515 49859473 49807934 49707776 49909599 49976680 50294572 50375904 50878345 51137869 51363915 51551878
4505 51551878 51991824 52187062 52414805 52463020 52597935 52671012 52676331 52512871 52382005 52219709
4495 52219709 51966125 51556536 51364379 50980915 50357786 50007061 49548676 49104186 48818513
4486 48818513 48247303 48054971 47695529 47670884 47544541 47587109 47723691 47911694 47957157 48289690
4476 48289690 49015565 49322405 49845510 50342288 51328034 51867504 52870675 53383096 54420059
4467 54420059 55011164 55917760 56718561 57557173 58266568 59101674 59768154 60440918 61078540
$$ packed form
4534F1915937O9926j6978l51348k47228n97942o69443r32863o90709j025534j065820
4524E6387998j086705q30935j074482r61949n65979q29648m09017m30027l39783
4515D9859473n1539j00158K01823O7081L17892Q1332N02441K59524K26046J87963
4505E1551878M39946J95238K27743M8215J34915P3077N319j63460j30866j62296
4495E2219709k53584m09589j92157l83464o23129l50725m58385m44490k85673
4486D8818513n71210j92332l59442k4645j26343M2568J36582J88003M5463L32533
4476D8289690P25875L06840N23105M96778R85746N39470J003171N12421J036963
4467E4420059N91105R06596Q00801Q38612P09395Q35106O66480O72764O37622
$$ plain form
4458 61078540 61758774 62252633 62997641 63761341 64490425 65547333 66551410 67614347 68985495
4449 68985495 70266611 71882798 73304456 74948308 76350665 77921335 78915695 80160466
4441 80160466 80870203 81351245 81540315 81481273 81268004 80826551 80129242 79527413 78845011 77976624
4431 77976624 77080129 76385762 75600478 74942826 74460083 73878915 73395710 72924637 72321451
4422 72321451 72003338 71327521 71077733 70770990 70176835 70077539 69857222 69532938 69588305 69474200
4412 69474200 69618333 69862128 70272571 70691968 71330335 71942900 72801968 73690230 74844115
4403 74844115 76091498 77400074 79076486 80723115 82395468 84364750 86237061 88401975
4395 88401975 90764178 93019485 95829434 98635023 101725943 105115317 108726804 112589929
$$ packed form
4458F1078540O80234M93859P45008P63700P29084J056908J004077J062937J371148
4449F8985495J281116J616187J421658J643852J402357J570670R94360J244771
4441H0160466P09737M81042J89070n9042k13269m41453o97309o01829o82402q68387
4431G7976624q96495o94367p85284o57652m82743n81168m83205m71073o03186
4422G2321451l18113o75817k49788l06743n94155r9296k20317l24284N5367j14105
4412F9474200J44133K43795M10443M19397O38367O12565Q59068Q88262J153885
4403G4844115J247383J308576J676412J646629J672353J969282J872311K164914
4395H8401975K362203K255307K809949K805589L090920L389374L611487L863125
$$ plain form
4387 112589929 116969822 121402510 126519250 131482149 136970195 142788748 148762787 155096273
4379 155096273 161763185 168826752 175734921 183086517 190659926 198102205 205681114 213572684
4371 213572684 221082465 228270810 235580375 242287788 248732384 254380426 259341874 263936261
4363 263936261 267722086 270712623 273118377 274641638 275521170 275873009 275789409 275191616 274321822
4354 274321822 272632000 270884149 268549137 265783973 262349102 258852811 254784590 250878164
4346 250878164 246740324 242359117 238090072 233999626 229932965 226354381 222936686 219594667
4338 219594667 216697061 213951229 211361726 209103860 206895020 205048790 203209825 201348484
4330 201348484 199581534 197661385 195624542 193434965 190847678 188271294 185336692 182168732
$$ packed form
4387A12589929M379893M432688N116740M962899N488046N818553N974039O333486
4379A55096273O666912P063567O908169P351596P573409P442279P578909P891570
4371B13572684P509781P188345P309565O707413O444596N648042M961448M594387
4363B63936261L785825K990537K405754J523261Q79532L51839q3600n97793q69794
4354B74321822j689822j747851k335012k765164l434871l496291m068221l906426
4346B50878164m137840m381207m269045m090446m066661l578584l417695l342019
4338B19594667k897606k745832k589503k257866k208840j846230j838965j861341
4330B01348484j766950j920149k036843k189577k587287k576384k934602l167960
$$ plain form
4322 182168732 178464944 174297884 169878338 165199261 160261513 155254184 150477915 145438022
4314 145438022 140796849 136301298 132284724 128562380 125354435 122272096 119295306 116549886
4306 116549886 113496155 110757219 107755714 104968573 102078978 99101232 96256463 93868114
4298 93868114 91442007 89198909 87413336 85260820 83365239 81506025 80177707 78803220
4290 78803220 77623764 76712609 76083686 75786069 75445707 75397683 75718003 76212480 76553097
4281 76553097 76485755 76907289 76491139 75684284 74632627 73458371 72003718 70205858 68147217
4272 68147217 66214090 64612236 63659905 62501533 61802867 61094590 60761829 60690632 60277797
4263 60277797 60400955 60737192 60964556 61537745 62183297 63163965 63990419 65204199 66337326
$$ packed form
4322A82168732l703788m167060m419546m679077m937748n007329m776269n039893
4314A45438022m641173m495551m016574l722344l207945l082339k976790k745420
4306A16549886l053731k738936l001505k787141k889595k977746k844769k388349
4298I3868114k426107k243098j785573k152516j895581j859214j328318j374487
4290G8803220j179456r11155o28923k97617l40362m8024L20320M94477L40617
4281G6553097o7342M21534m16150q06855j051657j174256j454653j797860k058641
4272F8147217j933127j601854r52331j158372o98666p08277l32761p1197m12835
4263F0277797J23158L36237K27364N73189O45552R80668Q26454J213780J133127
$$ plain form
4254 66337326 67246694 68257051 68996751 69610315 69923188 69960118 70055809 69886855 69686363 69505963
4244 69505963 69429627 69527440 69851582 70558290 71265080 72190338 73303577 74830015 76644622
4235 76644622 78433224 80609181 83040838 85336653 87851869 90618040 93151510 95495825
4227 95495825 97813771 99858627 101609476 103072264 104244648 105042960 105460591 105451847 104973320
4218 104973320 104869234 103863842 103109471 102155852 101053721 99989284 98928966 97714132
4210 97714132 96685912 95715601 94229521 93063858 91730587 90298601 89023349 87364422
4202 87364422 85781664 84086587 82215758 80303511 78389990 76569907 74655590 72945697
4194 72945697 70796666 69029091 67384732 65864072 64032705 62616503 61303611 59986670
$$ packed form
4254F6337326R09368J010357P39700O13564L12873L6930R5691j68954k00492j80400
4244F9505963p6336R7813L24142P06708P06790R25258J113239J526438J814607
4235G6644622J788602K175957K431657K295815K515216K766171K533470K344315
4227I5495825K317946K044856J750849J462788J172384P98312M17631q744m78527
4218A04973320j04086j005392p54371r53619j102131j064437j060318j214834
4210I7714132j028220r70311j486080j165663j333271j431986j275252j658927
4202H7364422j582758j695077j870829j912247j913521j820083j914317j709893
4194G2945697k149031j767575j644359j520660j831367j416202j312892j316941
$$ plain form
4186 59986670 58447873 57342915 56145680 54890700 53867249 52913527 51698894 50431904
4178 50431904 49305556 48076731 46963858 45656822 44266367 43142579 41905512 40811287
4170 40811287 39346204 38255357 37073451 36268445 35299041 34320608 33460719 32864047 32058114
4161 32058114 31408081 30793666 30242857 29590283 29061997 28456944 28140997 27423852 27188919
4152 27188919 26592383 26204188 25671312 25258643 24919067 24618710 24201495 23911989 23590696
4143 23590696 23248116 22946824 22852323 22644499 22660731 22361193 22284883 22335283 22225251 22107462
4133 22107462 21983853 22026235 22036165 22023591 21733486 21919310 21825841 21951192 21813647 22002306
4123 22002306 21876215 21705511 21809884 21767719 21807430 21447192 21650306 21586861 21313218 21119678
$$ packed form
4186E9986670j538797j104958j197235j254980j023451r53722j214633j266990
4178E0431904j126348j228825j112873j307036j390455j123788j237067j094225
4170D0811287j465083j090847j181906q05006r69404r78433q59889n96672q05933
4161C2058114o50033o14415n50809o52574n28286o05053l15947p17145k34933
4152B7188919n96536l88195n32876m12669l39576l00357m17215k89506l21293
4143B3590696l42580l01292r4501k07824J6232k99538p6310N0400j10032j17789
4133B2107462j23609M2382R930j2574k90105J85824r3469J25351j37545J88659
4123B2002306j26091j70704J04373m2165L9711l60238K03114o3445k73643j93540
$$ plain form
4113 21119678 21059820 20938212 20815820 20692064 20498472 20506305 20416439 20246123 20296159 20189248
4103 20189248 20211033 20175390 20229285 20355585 20382300 20421327 20572685 20872964 20911742 21212263
4093 21212263 21607021 21705308 22272462 22463552 22943107 23299526 23647625 24120953 24199675 24543704
4083 24543704 24827366 24995401 25113806 25447361 25672621 25771378 26199191 26600275 26934517 27458223
4073 27458223 27798325 28510316 29234987 29862800 30660112 31553319 32622118 33669711 34660596
4064 34660596 35870978 37010649 38371781 39684078 41253187 42802319 44167966 45975823
4056 45975823 47886256 49868954 51984139 54079611 56513364 59074077 61774975 64755602
4048 64755602 67764922 71263763 74928973 78960536 83310111 87665557 92800198 98013912
$$ packed form
4113B1119678n9858j21608j22392j23756j93592P833q9866j70316N0036j06911
4103B0189248K1785l5643N3895J26300K6715L9027J51358L00279L8778L00521
4093B1212263L94758R8287N67154J91090M79555L56419L48099M73328P8722L44029
4083B4543704K83662J68035J18405L33555K25260R8757M27813M01084L34242N23706
4073B7458223L40102P11991P24671O27813P97312Q93207J068799J047593R90885
4064C4660596J210382J139671J361132J312297J569109J549132J365647J807857
4056D5975823J910433J982698K115185K095472K433753K560713K700898K980627
4048F4755602L009320L498841L665210M031563M349575M355446N134641N213714
$$ plain form
4040 98013912 103385812 109385943 115203800 121546449 127931207 134552389 141260916 148235018
4032 148235018 155604188 163074817 171067346 179351182 188252635 197393931 206842195 216778928
4024 216778928 226713443 236688611 246805614 257374181 267727675 278371405 289396487
4017 289396487 301036778 313292188 326216792 339374976 352982651 366579892 379794996
4010 379794996 392018422 402980676 411922278 417664905 420136363 419072759 414643965 406626783
4002 406626783 395771359 382807695 367548680 351396093 334252870 317095352 300628702
3995 300628702 284794302 269257871 254183892 239602519 225640224 212566125 200142288
3988 200142288 188379501 177274096 167208646 157684339 148430025 139965656 132077212 124409369
$$ packed form
4040I8013912N371900O000131N817857O342649O384758O621182O708527O974102
4032A48235018P369170P470629P992529Q283836Q901453R141296R448264R936733
4024B16778928R934515R975168J0117003J0568567J0353494J0643730J1025082
4017B89396487J1640291J2255410J2924604J3158184J3607675J3597241J3215104
4010C79794996J2223426J0962254Q941602N742627K471458j063604m428794q017182
4002D06626783j0855424j2963664j5259015j6152587j7143223j7157518j6466650
3995C00628702j5834400j5536431j5073979j4581373j3962295j3074099j2423837
3988B00142288j1762787j1105405j0065450r524307r254314q464369p888444p667843
$$ plain form
3980 124409369 117159836 110430896 104280035 98257082 93047031 87927369 83396350 78791767
3972 78791767 74800278 70849308 67093547 63557828 60259039 57261717 54350271 51689990
3964 51689990 49056659 46835703 44645340 42855732 41139747 39524407 37995826 36434981
3956 36434981 35125832 33996039 32727921 31650919 30507193 29450988 28720682 27844203
3948 27844203 26956033 26412086 25626665 25154717 24707604 24459447 24015778 23965863 23856985 23839764
3938 23839764 23697541 24101449 24320029 24555865 25144308 25576644 26346967 26653567 27422222
3929 27422222 28167521 28654647 28784018 28778179 28787274 28572480 28173395 27435063 26464628 25376245
3919 25376245 24313651 23348957 22071012 20617430 19777015 18714349 17727441 16668457 15916246
$$ packed form
3980A24409369p249533o728940o150861o022953n210051n119662m531019m604583
3972G8791767l991489l950970l755761l535719l298789k997322k911446k660281
3964E1689990k633331k220956k190363j789608j715985j615340j528581j560845
3956C6434981j309149j129793j268118j077002j143726j056205p30306q76479
3948B7844203q88170n43947p85421m71948m47113k48157m43669m9915j08878j7221
3938B3839764j42223M03908K18580K35836N88443M32336P70323L06600P68655
3929B7422222P45299M87126J29371n839R095k14794l99085p38332r70435j088383
3919B5376245j062594r64694j277945j453582q40415j062666r86908j058984p52211
$$ plain form
3910 15916246 15104217 14213737 13608272 12958954 12462047 11989445 11389210 10836076 10518519
3901 10518519 10171988 9853684 9426285 9273512 8923513 8814031 8475481 8444938 8109073 8100371
3891 8100371 7881213 7553272 7427708 7524525 7378775 7316992 7049336 7137909 7077979 7060011
3881 7060011 7084265 6827128 6763533 6899358 6789599 6617106 6538914 6565857 6403177 6301352
3871 6301352 6174009 6235269 6073143 5994289 5777752 5871155 5684035 5739576 5653829 5636777 5601717
3860 5601717 5805222 5669126 5644525 5856421 5986401 6039047 6123705 6217923 6339586 6612581
3850 6612581 6613291 6842037 6996371 7254077 7317574 7245555 7244347 7188373 7062518 6780588 6666625
3839 6666625 6432073 6148773 5872281 5700731 5500760 5594244 5327808 5298118 5265663 5204540
$$ packed form
3910A5916246q12029q90480o05465o49318m96907m72602o00235n53134l17557
3901A0518519l46531l18304m27399j52773l49999j09482l38550l0543l35865q702
3891H100371k19158l27941j25564R6817j45750o1783k67656Q8573n9930j7968
3881G060011K4254k57137o3595J35825j09759j72493p8192K6943j62680j01825
3871F301352j27343O1260j62126p8854k16537R3403j87120N5541q5747j7052l5060
3860E601717K03505j36096k4601K11896J29980N2646Q4658R4218J21663K72995
3850F612581P10K28746J54334K57706O3497p2019j208n5974j25855k81930j13963
3839F666625k34552k83300k76492j71550j99971R3484k66436k9690l2455o1123
$$ plain form
3829 5204540 5284100 5310030 5455984 5508143 5723054 5656063 6077115 5985764 6299400 6434869
3819 6434869 6587813 6427229 6342524 6346346 6193121 5903786 5660078 5532910 5326364 4935163
3809 4935163 4739713 4406271 4192956 3923266 3954389 3798440 3412901 3567357 3488298 3433110
3799 3433110 3322370 3126662 3248162 3001867 3111685 3312563 3037426 2910142 3145086 3039174
3789 3039174 3062911 3041842 3092172 2944703 3078744 3232922 3113825 3311608 3141395 3206916
3779 3206916 3332894 3329577 3531231 3610893 3619385 3807166 3984853 3894316 3908741 4107250 4302806
3768 4302806 4143684 4266050 4270378 4249144 4432736 4424971 4394853 4405747 4394549 4372841 4304595
3757 4304595 4212439 4147684 4099680 3914756 3934223 3848945 3744999 3617879 3433728 3673070
$$ packed form
3829E204540P9560K5930J45954N2159K14911o6991M21052r1351L13636J35469
3819F434869J52944j60584q4705L822j53225k89335k43708j27168k06546l91201
3809D935163j95450l33442k13315k69690L1123j55949l85539J54456p9059n5188
3799C433110j10740j95708J21500k46295J09818K00878k75137j27284K34944j05912
3789C039174K3737k1069N0330j47469J34041J54178j19097J97783j70213O5521
3779C206916J25978l317K01654P9662Q492J87781J77687r0537J4425J98509J95556
3768D302806j59122J22366M328k1234J83592p765l0118J0894j1198k1708o8246
3757D304595r2156o4755m8004j84924J9467q5278j03946j27120j84151K39342
$$ plain form
3747 3673070 3235878 3265469 3278902 3127726 2992324 3053314 2870403 2919157 2768370 3004186
3737 3004186 2606554 2629556 2508970 2442848 2497859 2434639 2164428 2174850 2035667 2210616
3727 2210616 2031555 2069164 1862732 1645385 1771048 1740381 1545574 1540297 1574277 1305095
3717 1305095 1425780 1336668 1356058 1286920 1254703 1358990 1076741 1182832 1342262 1282737
3707 1282737 1156014 1271135 1087430 1257550 1110947 1214427 858873 1039026 1097337 942101
3697 942101 1033529 954270 878845 923448 936075 764467 857918 927553 719276 760873 669566
3686 669566 921439 794267 686907 819643 857148 912830 745211 845231 690444 748782
3676 748782 804712 707226 930028 729997 626571 693089 600078 769030 564103 558427 513708
$$ packed form
3747C673070m37192K9591J3433j51176j35402O0990j82911M8754j50787K35816
3737C004186l97632K3002j20586o6122N5011o3220k70211J0422j39183J74949
3727B210616j79061L7609k06432k17347J25663l0667j94807n277L3980k69182
3717A305095J20685q9112J9390o9138l2217J04287k82249J06091J59430n9525
3707A282737j26723J15121j83705J70120j46603J03480l55554J80153N8311j55236
3697I42101R1428p9259p5425M4603J2627j71608R3451O9635k08277M1597r1307
3686F69566K51873j27172j07360J32736L7505N5682j67619J00020j54787N8338
3676G48782N5930r7486K22802k00031j03426O6518r3011J68952k04927n676m4719
$$ plain form
3665 513708 610157 628769 606207 577978 655439 560457 593771 392276 472426 565721 686708
3654 686708 740807 445886 558479 384144 417036 563344 656846 509248 544991 560302 702286
3643 702286 538792 516070 459931 486689 465902 518418 462039 469780 499197 434266 425088 529373
3631 529373 393250 260055 389898 530122 422222 427958 501615 482545 527312 466034 282954
3620 282954 507653 406816 490490 526127 385334 388828 543152 390002 361595 528024 338199
3609 338199 373746 299226 324886 423290 342951 294801 253003 191493 331106 177907 398634
3598 398634 310091 338257 365294 404389 603309 326759 351365 231227 480638 429857 367706
3587 367706 469165 232753 401127 298334 339925 380290 465934 437846 426451 437982 520665
$$ packed form
3665E13708R6449J8612k2562k8229P7461r4982L3314k01495Q0150R3295J20987
3654F86708N4099k94921J12593j74335L2892J46308R3502j47598L5743J5311J41984
3643G02286j63494k2722n6139K6758k0787N2516n6379P741K9417o4931r178J04285
3631E29373j36123j33195J29843J40224j07900N736P3657j9070M4767o1278j83080
3620B82954K24699j00837Q3674L5637j40793L494J54324j53150k8407J66429j89825
3609C38199L5547p4520K5660R8404q0339m8150m1798o1510J39613j53199K20727
3598C98634q8543K8166K7037L9095J98920k76550K4606j20138K49411n0781o2151
3587C67706J01459k36412J68374j02793M1591M0365Q5644k8088j1395J1531Q2683
$$ plain form
3576 520665 454276 500423 413674 456516 660308 675581 710605 698506 745991 781878 892132
3565 892132 720495 642588 676682 654935 605375 578101 606564 469625 627314 414010 528869
3554 528869 450743 169515 236046 202019 174631 427892 277729 271179 228850 233922 218605
3543 218605 321268 247208 242169 248968 346712 130973 243266 233302 266169 195543 477238
3532 477238 269048 267073 249274 297795 263060 224812 228728 205069 363166 306006 113262
3521 113262 107399 158539 32002 153592 133194 237301 142710 305137 160024 190038 131853
3510 131853 -17628 171206 241755 134966 306987 295389 360335 281967 302263 265896 113982
3499 113982 61732 267698 108960 119589 206343 163972 314929 284481 214313 298038 213140
$$ packed form
3576E20665o6389M6147q6749M2842K03792J5273L5024j2099M7485L5887J10254
3565H92132j71637p7907L4094k1747m9560k7274K8463j36939J57689k13304J14859
3554E28869p8126k81228O6531l4027k7388K53261j50163o550m2329N072j5317
3543B18605J02663p4060n039O799R7744k15739J12293r964L2867p0626K81695
3532D77238k08190j975j7799M8521l4735l8248L916k3659J58097n7160j92744
3521A13262n863N1140j26537J21590k0398J04107r4591J62427j45113L0014n8185
3510A31853j49481J88834P0549j06789J72021j1598O4946p8368K0296l6367j51914
3499A13982n2250K05966j58738J0629Q6754m2371J50957l0448p0168Q3725q4898
$$ plain form
3488 213140 288441 287313 200991 158758 263602 221572 182994 154169 206508 67258 240447
3477 240447 -493 183215 200935 274627 247340 245538 221208 355112 373824 221465 241773
3466 241773 385224 271160 328786 259773 289378 423127 394279 351530 521777 421359 364513
3455 364513 275713 486359 370037 413344 343316 425467 126092 413305 450262 426297 358901
3444 358901 372023 559837 300812 472775 476903 472894 473785 442264 498576 399376 628756 467501
3432 467501 624871 438037 498497 558016 674875 493155 542885 633390 728532 678595 726601
3421 726601 623815 593268 656997 697872 800982 638350 677657 854148 830188 885856 1005628
3410 1005628 897015 838433 1023923 1014483 1037516 1097737 1082109 1159887 1095706 1230736 1230770 1168056
$$ packed form
3488B13140P5301j128q6322m2233J04844m2030l8578k8825N2339j39250J73189
3477B40447k40940J83708J7720P3692k7287j802k4330J33904J8712j52359K0308
3466B41773J43451j14064N7626o9013K9605J33749k8848m2749J70247j00418n6846
3455C64513q8800K10646j16322M3307p0028Q2151k99375K87213L6957k3965o7396
3444C58901J3122J87814k59025J71963M128m009Q91l1521N6312r9200K29380j61255
3432D67501J57370j86834O0460N9519J16859j81720M9730R0505R5142m9937M8006
3421G26601j02786l0547O3729M0875J03110j62632L9307J76491k3960N5668J19772
3410A005628j08613n8582J85490r440K3033O0221j5628P7778o4181J35030L4o2714
$$ plain form
3398 1168056 1181141 1249131 1251251 1510491 1661894 1711305 1497746 1581418 1629085 1562431 1591271
3387 1591271 1750681 1787953 1979273 1867841 1956721 2067113 2017555 2028043 2149739 2165028
3377 2165028 2193558 2284007 2247554 2418056 2512223 2604519 2676494 2730647 2796041 3001989 3081679
3366 3081679 3273670 3546310 3738816 3977818 4019270 4427159 4685587 5004701 5280860 5748911
3356 5748911 6367847 7062739 7729424 8863329 10072578 11526039 12883398 14616229 16428117
3347 16428117 18681051 20852904 23876026 27212485 30726400 35066784 40471752 46575712
3339 46575712 52208968 59379594 67094078 74191179 78739560 84308614 86038328 84982505
3331 84982505 82117656 78101220 72683060 65358350 56375043 47209118 40227187 33874100
$$ packed form
3398A168056J3085O7990K120K59240J51403M9411k13559Q3672M7667o6654K8840
3387A591271J59410L7272J91320j11432Q8880J10392m9558J0488J21696J5289
3377B165028K8530R0449l6453J70502R4167R2296P1975N4153O5394K05948P9690
3366C081679J91991K72640J92506K39002M1452M07889K58428L19114K76159M68051
3356E748911O18936O94892O66685J133905J209249J453461J357359J732831J811888
3347A6428117K252934K171853L023122L336459L513915M340384N404968O103960
3339D6575712N633256P170626P714484P097101M548381N569054J729714j055823
3331H4982505k864849m016436n418160p324710q983307r165925o981931o353087
$$ plain form
3323 33874100 29115761 25182748 21710157 18568346 15640146 13174058 11021171 9294815
3315 9294815 8099661 6918155 6173165 5489047 4948757 4475512 4114064 3699808 3371841
3306 3371841 3256047 3028070 2771007 2753808 2504080 2335221 2206532 2176896 1848773 1727234
3296 1727234 1660026 1605023 1479490 1350355 1516331 1355049 1296634 1185290 1066650 1081927
3286 1081927 1146022 833440 1130517 855603 974358 903887 919982 889762 888524 834561 869531
3275 869531 888810 889890 794302 675430 569541 624141 648350 737494 551523 722079 608212
3264 608212 492073 542539 691475 572492 597341 407135 457451 438907 469673 558630 428245
3253 428245 324302 340509 291942 278390 205411 458396 260232 269876 309299 374446 159257
$$ packed form
3323C3874100m758339l933013l472591l141811k928200k466088k152887j726356
3315I294815j195154j181506p44990o84118n40290m73245l61448m14256l27967
3306C371841j15794k27977k57063j7199k49728j68859j28689k9636l28123j21539
3296A727234o7208n5003j25533j29135J65976j61282n8415j11344j18640J5277
3286A081927O4095l12582K97077k74914J18755p0471J6095l0220j238n3963L4970
3275H69531J9279J080r5588j18872j05889N4600K4209Q9144j85971J70556j13867
3264F08212j16139N0466J48936j18983K4849j90206N0316j8544L0766Q8957j30385
3253D28245j03943J6207m8567j3552p2979K52985j98164R644L9423O5147k15189
$$ plain form
3242 159257 423169 169930 197374 247304 213040 279170 115759 93412 431118 276702 253756
3231 253756 241232 146317 166592 190587 320813 77237 232702 153316 134728 111928 13159
3220 13159 11413 67303 32131 -8384 77242 85409 16589 113714 27788 -6884 106109 24953
3208 24953 15295 -105812 -74831 32149 100457 -30176 63843 -25279 -70998 -13753 -139455
3197 -139455 -70980 27264 66237 57108 14722 -70812 52835 87926 189418 -31836 -43255
3186 -43255 2703 135615 -49200 22223 -37971 -54574 154287 17600 1439 -122418 -36191
3175 -36191 -137204 -176609 160596 70635 -75967 -83835 233738 -79236 -30483 -29285 -120387
3164 -120387 -27813 -233055 22458 16594 -20244 57670 -107710 47708 -36396 -43004 48309
$$ packed form
3242A59257K63912k53239K7444M9930l4264O6130j63411k2347L37706j54416k2946
3231B53756j2524r4915K0275K3995J30226k43576J55465p9386j8588k2800r8769
3220A3159j746N5890l5172m0515Q5626Q167o8820R7125q5926l4672J12993q1156
3208B4953r658j21107L0981J06980O8308j30633R4019q9122m5719N7245j25702
3197a39455O8475R8244L8973r129m2386q5534J23647L5091J01492k21254j1419
3186d3255M5958J32912j84815P1423o0194j6603K08861j36687j6161j23857Q6227
3175c6191j01013l9405L37205q9961j46602p868L17573l12974M8753J198r1102
3164a20387R2574k05242K55513n864l6838P7914j65380J55418q4104o608R1313
$$ plain form
3153 48309 -54999 -233321 -203436 -108987 28244 -86686 -192583 -275032 -9721 -18373 -34480
3142 -34480 -184020 -16238 -72243 18698 -4377 -78336 -154844 -152869 -149513 -98218 25859 -115975
3130 -115975 -15409 -33084 -53159 -105861 -127244 -106381 -15534 18088 -83412 -140681 -40566
3119 -40566 -30290 48620 -40422 -38119 100130 -67652 114373 77956 -84856 101516 -42427
3108 -42427 45696 177420 51111 145218 234818 371508 178764 237051 255846 470688 364167
3097 364167 397687 530152 208600 198326 208764 182700 207831 162101 -93415 35353 -77335
3086 -77335 14103 26593 -53171 60523 -23010 -101287 -40105 97533 -114741 -176446 -91264
3075 -91264 -108990 -200955 -270040 -74610 -85453 -213547 -251343 -227514 -261545 -419661 -306988
$$ packed form
3153D8309j03308j78322K9885R4449J37231j14930j05897q2449K65311q652j6107
3142c4480j49540J67782n6005R0941k3075p3959p6508J975L356N1295J24077j41834
3130a15975J00566j7675k0075n2702k1383K0863R0847L3622j01500n7269J00115
3119d0566J0276P8910q9042K303J38249j67782J82025l6417j62812J86372j43943
3108d2427Q8123J31724j26309R4107Q9600J36690j92744N8287J8795K14842j06521
3097C64167L3520J32465l21552j0274J0438k6064K5131m5730k55516J28768j12688
3086g7335R1438J2490p9764J13694q3533p8277O1182J37638k12274o1705Q5182
3075i1264j7726r1965o9085J95430j0843j28094l7796K3829l4031j58116J12673
$$ plain form
3064 -306988 -168118 -92257 -195212 -131593 -288297 -268524 -213684 -330316 -115443 -48762 -152328
3053 -152328 -167309 -295372 -163987 -109471 -164087 -179212 -102115 -222135 -53428 -172611 -220863
3042 -220863 -117379 -130827 -19185 -135086 -176238 -353711 -154411 -126735 -126151 -216159 -187188
3031 -187188 -253184 -124433 -168727 -242158 -244621 -312145 -290836 -233118 -374241 -230000 -108917
3020 -108917 -214368 -23562 -222584 -81111 -48681 -340319 -72605 -233836 -252908 -229275
3010 -229275 -308744 -193312 -224005 -205072 -132813 -99710 -91994 -116252 -178503 -240520 -333475 -195043
2998 -195043 -258907 -264788 -158433 -154695 -224025 -128806 -153489 -279404 -365652 -270571 -88471
2987 -88471 -191679 -107775 -103308 -210367 -144355 -235797 -150098 -388770 -242879 -200928 -215902
$$ packed form
3064c06988J38870P5861j02955O3619j56704J9773N4840j16632K14873O6681j03566
3053a52328j4981j28063J31385N4516n4616j5125P7097j20020J68707j19183m8252
3042b20863J03484j3448J11642j15901m1152j77473J99300K7676N84r0008K8971
3031a87188o5996J28751m4294p3431k463o7524K1309N7718j41123J44241J21083
3020a08917j05451J90806j99022J41473L2430k91638K67714j61231j9072K3633
3010b29275p9469J15432l0693J8933P2259L3103P716k4258o2251o2017r2955J38432
2998a95043o3864n881J06355L738o9330R5219k4683j25915q6248R5081J82100
2987h8471j03208Q3904M467j07059O6012r1442Q5699k38672J45891M1951j4974
$$ plain form
2976 -215902 -287270 -220746 -220249 -143781 11592 -221101 -226388 -184005 -248720 -280367 -246951 -223011
2964 -223011 -96075 -99019 -166403 -239070 -152620 -114824 25487 -81335 -294291 -164111 -271411
2953 -271411 -295358 -377956 -303820 -262726 -259626 -239211 -23662 -177724 -166617 -142566 -235629
2942 -235629 -119660 -305282 -242127 -296039 -198220 -472809 -290940 -354543 -282562 -265442 -109728
2931 -109728 -206884 -329335 -403350 -260554 -216053 -305008 -314525 -245638 -257659 -272378 -286432
2920 -286432 -144402 -314396 -203910 -247616 -170733 -250799 -378447 -186808 -340837 -187214
2910 -187214 -326796 -152315 -211914 -113172 -168572 -260888 -193674 -352302 -287798 -168043 -15504
2899 -15504 -443467 -286685 -288550 -314442 -254941 -248942 -357796 -96161 -292779 -326118 -362991
$$ packed form
2976b15902p1368O6524M97P6468J55373k32693n287M2383o4715l1647L3416K3940
2964b23011J26936k944o7384p2667Q6450L7796J40311j06822k12956J30180j07300
2953b71411k3947q2598P4136M1094L100K0415K15549j54062J1107K4051r3063
2942b35629J15969j85622O3155n3912R7819k74589J81869o3603P1981J7120J55714
2931a09728r7156j22451p4015J42796M4501q8955r517O8887j2021j4719j4054
2920b86432J42030j69994J10486m3706P6883q0066j27648J91639j54029J53623
2910a87214j39582J74481n9599R8742n5400r2316O7214j58628O4504J19755J52539
2899a5504m27963J56782j865k5892N9501N999j08854K61635j96618l3339l6873
$$ plain form
2888 -362991 -283948 -386433 -220760 -185881 -351910 -215765 -368146 -255151 -348549 -283851
2878 -283851 -344940 -401405 -353786 -172409 -376911 -334156 -347842 -330196 -182543 -272272 -205707
2867 -205707 -197691 -260461 -306269 -300282 -223434 -265813 -121298 -214983 -190654 -234384 -339884 -184427
2855 -184427 -354031 -158390 -398662 -181449 -293384 -294754 -243985 -287002 -412465 -451673 -137861
2844 -137861 -293476 -288009 -356631 -277244 -236946 -282084 -183024 -390562 -186042 -322489 -217321
2833 -217321 -202861 -302608 -314960 -274170 -238369 -308968 -313071 -485238 -405780 -273640 -364241
2822 -364241 -321369 -74787 -175149 -241461 -354709 -388512 -187734 -209536 -193428 -201644 -186721
2811 -186721 -216404 -293449 -363099 -106914 -321982 -153014 -160135 -200358 -150055 -311491 -411086
$$ packed form
2888c62991P9043j02485J65673L4879j66029J36145j52381J12995r3398O4698
2878b83851o1089n6465M7619J81377k04502M2755j3686J7646J47653q9729O6565
2867b05707Q016o2770m5808N987P6848m2379J44515r3685K4329m3730j05500J55457
2855a84427j69604J95641k40272K17213j11935j370N0769m3017j25463l9208L13812
2844a37861j55615N467o8622P9387M0298m5138R9060k07538K04520j36447J05168
2833b17321J4460r9747j2352M0790L5801p0599m103j72167P9458J32140r0601
2822c64241M2872K46582j00362o6312j13248l3803K00778k1802J6108q216J4923
2811a86721k9683p7045o9650K56185k15068J68968p121m0223N0303j61436r9595
$$ plain form
2800 -411086 -354451 -262356 -240579 -374493 -170084 -171513 -195183 -186892 -108837 -230052 -142135
2789 -142135 -301175 -486353 -519617 -263759 -347878 -483204 -433232 -290559 -215157 -378552
2779 -378552 -305162 -319483 -229914 -273196 -315162 -135516 -238957 -286051 -442177 -382542 -390755
2768 -390755 -236685 -248058 -191192 -364340 -241795 -240301 -360227 -163254 -423743 -444312 -179233
2757 -179233 -290846 -287571 -212784 -222950 -287282 -135273 -253531 -216522 -220541 -146117 -167408
2746 -167408 -241944 -271729 -384767 -253133 -411641 -338331 -380837 -335621 -295915 -311542 -237643
2735 -237643 -337423 -121858 -250525 -214716 -204406 -137651 -256326 -103419 -318875 -366734 -157678
2724 -157678 -256434 -375632 -293827 -375659 -312157 -251280 -292333 -171736 -333968 -329464 -391746
$$ packed form
2800d11086N6635R2095K1777j33914K04409j429k3670Q291P8055j21215Q7917
2789a42135j59040j85178l3264K55858q4119j35326M9972J42673P5402j63395
2779c78552P3390j4321Q9569m3282m1966J79646j03441m7094j56126N9635q213
2768c90755J54070j1373N6866j73148J22545J494j19926J96973k60489k0569K65079
2757a79233j11613L275P4787j0166o4332J52009j18258L7009m019P4424k1291
2746a67408p4536k9785j13038J31634j58508P3310m2506M5216L9706j5627P3899
2735b37643r9780K15565j28667L5809J0310O6755j18675J52907k15456m7859K09056
2724a57678r8756j19198Q1805q1832O3502O0877m1053J20597j62232M504o2282
$$ plain form
2713 -391746 -234550 -340116 -312832 -220806 -223384 -321332 -383797 -275047 -257584 -395978 -386095
2702 -386095 14481 -282977 -362579 -345917 -472769 -254655 -176876 -305421 -259394 -202500 -378948
2691 -378948 -281419 -374568 -265997 -183169 -212780 -321869 -298347 -276877 -271838 -210937 -548106
2680 -548106 -356973 -254598 -341814 -215013 -356985 -229472 -127815 -349622 -282676 -294552
2670 -294552 -219808 -393499 -276945 -286050 -245903 -415944 -114099 -391012 -244979 -241086 -302412
2659 -302412 -367071 -210919 -300833 -237841 -217009 -257298 -339275 -420071 -289408 -412376 -228625
2648 -228625 -311703 -295225 -326638 -297777 -151869 -218624 -527816 -349164 -344353 -273088 -350300
2637 -350300 -284732 -383253 -299072 -416916 -358522 -220093 -267696 -295822 -343541 -168433 -300612
$$ packed form
2713c91746J57196j05566K7284R2026k578r7948o2465J08750J7463j38394R883
2702c86095M00576k97458p9602J6662j26852K18114P7779j28545M6027N6894j76448
2691c78948R7529r3149J08571Q2828k9611j09089K3522K1470N039O0901l37169
2680e48106J91133J02375q7216J26801j41972J27513J01657k21807O6946j1876
2670b94552P4744j73691J16554r105M0147j70041L01845k76913J46033L893o1326
2659c02412o4659J56152q9914O2992K0832m0289q1977q0796J30663j22968J83751
2648b28625q3078J6478l1413K8861J45908o6755l09192J78652M811P1265p7212
2637c50300O5568r8521Q4181j17844N8394J38429m7603k8126m7719J75108j32179
$$ plain form
2626 -300612 -316782 -346349 -124114 -380294 -218856 -279750 -290079 -166465 -436868 -219301
2616 -219301 -426720 -297049 -265594 -525933 -306790 -319086 -323990 -320994 -242605 -352411 -221892
2605 -221892 -513099 -259794 -366896 -427806 -378740 -448813 -218313 -454675 -313451 -445816
2595 -445816 -352273 -236020 -581270 -478740 -319497 -288269 -387270 -261047 -371317 -325769
2585 -325769 -288805 -486115 -206966 -349587 -360117 -155966 -431069 -497819 -299648 -271326
2575 -271326 -407248 -297678 -540842 -307757 -331326 -437726 -338180 -311618 -459116 -396260
2565 -396260 -324507 -371541 -314716 -289424 -520195 -432432 -402057 -276996 -233218 -417847 -382971
2554 -382971 -466041 -256464 -259619 -231311 -388815 -296420 -435398 -259086 -365822 -483233 -504362
$$ packed form
2626c00612j6170k9567K22235k56180J61438o0894j0329J23614k70403K17567
2616b19301k07419J29671L1455k60339K19143j2296m904K996P8389j09806J30519
2605b21892k91207K53305j07102o0910M9066p0073K30500k36362J41224j32365
2595d45816R3543J16253l45250J02530J59243L1228r9001J26223j10270M5548
2585c25769L6964j97310K79149j42621j0530K04151k75103o6750J98171K8322
2575b71326j35922J09570k43164K33085k3569j06400R9546K6562j47498O2856
2565c96260P1753m7034N6825K5292k30771Q7763L0375J25061M3778j84629L4876
2554c82971q3070K09577l155K8308j57504R2395j38978J76312j06736j17411k1129
$$ plain form
2543 -504362 -372539 -370833 -476384 -238736 -412724 -480604 -356931 -418831 -321461 -285814 -413132
2532 -413132 -353385 -458566 -350288 -402516 -621597 -316028 -331092 -420616 -252529 -348011 -386163
2521 -386163 -378215 -218623 -284640 -398814 -352179 -280112 -469376 -453126 -269587 -383340 -321761
2510 -321761 -195623 -406384 -292065 -307372 -390761 -309219 -495537 -334891 -403625 -377826 -455652
2499 -455652 -306459 -420275 -436266 -457956 -380004 -416900 -282320 -191441 -324677 -460630 -300990
2488 -300990 -453013 -263329 -620361 -405091 -429237 -363330 -556516 -288313 -440565 -436847
2478 -436847 -435206 -167116 -351357 -325079 -370964 -449306 -292121 -469850 -264736 -476110 -403246
2467 -403246 -335140 -279877 -386382 -318490 -354908 -430868 -358944 -340593 -272350 -432094 -462049
$$ packed form
2543e04362J31823J706j05551K37648j73988o7880J23673o1900R7370L5647j27318
2532d13132N9747j05181J08278n2228k19081L05569j5064q9524J68087r5482l8152
2521c86163P948J59592o6017j14174M6635P2067j89264J6250J83539j13753O1579
2510c21761J26138k10761J14319j5307q3389Q1542j86318J60646o8734K5799p7826
2499d55652J49193j13816j5991k1690P7952l6896J34580R0879j33236j35953J59640
2488c00990j52023J89684l57032K15270k4146O5907j93186K68203j52252L718
2478d36847J641K68090j84241K6278m5885p8342J57185j77729K05114k11374P2864
2467d03246O8106N5263j06505O7892l6418p5960P1924J8351O8243j59744k9955
$$ plain form
2456 -462049 -429480 -312367 -399915 -220584 -260309 -314958 -419016 -313455 -478042 -230427
2446 -230427 -295603 -368122 -279408 -334675 -342527 -457743 -473751 -584903 -330551 -354663 -331255
2435 -331255 -365711 -441849 -384419 -405414 -352162 -387557 -446808 -568075 -332025 -433497 -437562
2424 -437562 -363201 -312104 -412737 -447571 -475396 -381198 -233180 -363720 -224253 -372251 -384846
2413 -384846 -232240 -411157 -306947 -268172 -362655 -492433 -286043 -342687 -367119 -455903 -398450
2402 -398450 -385395 -296850 -478413 -371287 -269097 -363419 -457500 -459072 -186667 -404018 -389826
2391 -389826 -337083 -422557 -395066 -456344 -433162 -489079 -299088 -290710 -314689 -398098 -339223 -255839
2379 -255839 -217142 -421590 -501349 -357136 -358630 -196943 -434596 -300169 -373368 -436968 -367975
$$ packed form
2456d62049L2569J17113q7548J79331l9725n4649j04058J05561j64587K47615
2446b30427o5176p2519Q8714n5267p852j15216j6008j11152K54352k4112K3408
2435c31255l4456p6138N7430k0995N3252l5395n9251j21267K36050j01472m065
2424d37562P4361N1097j00633l4834k7825R4198J48018j30540J39467j47998j2595
2413c84846J52606j78917J04210L8775r4483j29778K06390n6644k4432q8784N7453
2402c98450J3055Q8545j81563J07126J02190r4322r4081j572K72405k17351J4192
2391c89826N2743q5474K7491o1278K3182n5917J89991Q378k3979q3409N8875Q3384
2379b55839L8697k04448p9759J44213j494J61687k37653J34427p3199o3600O8993
$$ plain form
2368 -367975 -400065 -405582 -474152 -359396 -400760 -410258 -427436 -499422 -288099 -365756 -209779
2357 -209779 -457032 -288440 -380386 -401088 -373434 -232669 -325170 -350465 -338889 -341518 -247839
2346 -247839 -298544 -271685 -289358 -319011 -389260 -246187 -392758 -352344 -347794 -387616 -493263
2335 -493263 -442603 -330884 -550118 -444984 -388136 -449568 -439125 -387507 -484369 -348716 -424634
2324 -424634 -405346 -293441 -279509 -424546 -330096 -402638 -444238 -460079 -431608 -306630 -370609
2313 -370609 -354401 -416312 -450649 -440241 -299946 -402329 -403117 -471409 -388172 -498567 -266976
2302 -266976 -412416 -497055 -483318 -367471 -408357 -314640 -437256 -311804 -370616 -398272 -414950
2291 -414950 -414428 -360356 -370403 -334331 -382107 -331763 -446265 -295263 -278084 -234906 -396288
$$ packed form
2368c67975l2090n517o8570J14756m1364r498j7178p1986K11323p7657J55977
2357b09779k47253J68592r1946k0702K7654J40765r2501k5295J1576k629R3679
2346b47839n0705K6859j7673k9653p0249J43073j46571M0414M550l9822j05647
2335d93263N0660J11719k19234J05134N6848o1432J0443N1618r6862J35653p5918
2324d24634J9288J11905J3932j45037R4450p2542m1600j5841K8471J24978o3979
2313c70609J6208o1911l4337J0408J40295j02383p88o8292Q3237j10395K31591
2302b66976j45440q4639J3737J15847m0886R3717j22616J25452n8812k7656j6678
2291d14950N22N4072j0047L6072m7776N0344j14502J51002J7179M3178j61382
$$ plain form
2280 -396288 -300076 -317329 -277158 -381846 -199787 -303140 -418453 -349567 -442946 -251501 -278226
2269 -278226 -304998 -483735 -361099 -357096 -500103 -396756 -377724 -396382 -366948 -446028 -283544
2258 -283544 -430070 -400026 -364655 -450881 -257208 -415263 -390181 -335328 -374527 -469747 -382187
2247 -382187 -383619 -449227 -306718 -352477 -350231 -590373 -244279 -534051 -365389 -367377 -544982
2236 -544982 -388780 -357066 -468129 -283644 -279761 -344722 -427847 -374631 -342015 -301810 -416547
2225 -416547 -432552 -455196 -332657 -210801 -388354 -549350 -428793 -406211 -509197 -394185
2215 -394185 -240176 -332213 -416222 -450023 -416878 -246125 -327070 -435479 -405172 -338616 -318756
$$ packed form
2280c96288R6212j7253M0171j04688J82059j03353j15313O8886r3379J91445k6725
2269b78226k6772j78737J22636M003j43007J03347J9032j8658K9434p9080J62484
2258b83544j46526L0044L5371q6226J93673j58055K5082N4853l9199r5220Q7560
2247c82187j432o5608J42509m5759K246k40142L46094k89772J68662j988j77605
2236e44982J56202L1714j11063J84485L883o4961q3125N3216L2616M0205j14737
2225d16547j6005k2644J22539J21856j77553j60996J20557K2582j02986J15012
2215c94185J54009r2037q4009l3801L3145J70753q0945j08409L0307O6556J9860
$$ [...]
##END NTUPLES=NMR SPECTRUM
##END=
