##TITLE=1H_DE-80H_X3
 200.13MHz, d2o
 8 sc
 
 19ns.26.2.2025
##JCAMPDX= 6.0         $$ Bruker NMR JCAMP-DX V2.0
##DATA TYPE= NMR FID
##DATA CLASS= NTUPLES
##ORIGIN= UXNMR, Bruker Analytische Messtechnik GmbH
##OWNER= pz
$$ XWIN-NMR		Version 3.5
$$ Thu Jun 26 11:14:50 2025 Russian Standard Time (UT+4h)  Yarkov@DPX200
##.OBSERVE FREQUENCY= 200.1313
##.OBSERVE NUCLEUS= ^1H
##.DELAY= (6, 6)
##.ACQUISITION MODE= SIMULTANEOUS
##.ACQUISITION SCHEME= undefined
##.AVERAGES= 8
##.DIGITISER RES= 18
##SPECTROMETER/DATA SYSTEM= spect
##.PULSE SEQUENCE= zg30
##.SOLVENT NAME= CDCl3
##.SHIFT REFERENCE= (INTERNAL, CDCl3, 0, 14.3821)
##AUDIT TRAIL= $$ (NUMBER, WHEN, WHO, WHERE, WHAT)
$$ ##TITLE= Audit trail, XWIN-NMR		Version 3.5
$$ ##JCAMPDX= 5.01
$$ ##ORIGIN= Bruker BioSpin GmbH
$$ ##OWNER= Yarkov
$$ C:/Bruker/XWIN-NMR/data/yarkov2/nmr/H-C/1/audita.txt
$$ ##AUDIT TRAIL=  $$ (NUMBER, WHEN, WHO, WHERE, WHAT)
(   1,<2025-06-26 11:13:52.37 +0400>,<Yarkov>,<DPX200>,
      <created by zg, POWCHK disabled, PULCHK disabled
       configuration hash MD5:
       00 E9 B6 7A A2 85 ED C7 34 08 36 98 17 FE 4E 26
       data hash MD5: 16K
       70 1C 77 A0 DB 97 1D 1B A8 BB 82 DE C2 C7 60 31>)
$$ ##END=
$$ 
$$ hash MD5
$$ A6 20 8D 03 8D 6B C6 EE 14 58 54 41 B2 25 D7 75
##$RELAX= 
##$RELAX= 
##$RELAX= 
##$RELAX= 
##$RELAX= 
##$RELAX= 
$$ Bruker specific parameters
$$ --------------------------
##$DU= <C:/Bruker/XWIN-NMR>
##$EXPNO= 1
##$NAME= <H-C>
##$PROCNO= 1
##$TYPE= <nmr>
##$USER= <yarkov2>
##$AMP= (0..31)
100 100 100 100 100 100 100 100 100 100 100 100 100 100 100 100 100 100 
100 100 100 100 100 100 100 100 100 100 100 100 100 100 
##$AQSEQ= 0
##$AQ_mod= 1
##$AUNM= <au_zg>
##$AUTOPOS= <>
##$BF1= 200.13
##$BF2= 200.13
##$BF3= 200.13
##$BF4= 200.13
##$BF5= 200.13
##$BF6= 200.13
##$BF7= 200.13
##$BF8= 200.13
##$BYTORDA= 1
##$CFDGTYP= 0
##$CFRGTYP= 5
##$CHEMSTR= <none>
##$CNST= (0..31)
1 1 145 1 1 1 1 1 1 1 1 1 1 1 1 1 1 1 1 1 1 1 1 1 1 1 1 1 1 1 1 1 
##$CPDPRG= <>
##$CPDPRG1= <>
##$CPDPRG2= <>
##$CPDPRG3= <>
##$CPDPRG4= <mlev>
##$CPDPRG5= <mlev>
##$CPDPRG6= <mlev>
##$CPDPRG7= <mlev>
##$CPDPRG8= <mlev>
##$CPDPRGB= <>
##$CPDPRGT= <>
##$D= (0..31)
0 0.7 0 0 0 0 0 0 0 0 0 0.03 0 0 0 0 0 0 0 0 0 0 0 0 0 0 0 0 0 0 0 0 
##$DATE= 1750922031
##$DBL= (0..7)
120 120 120 120 120 120 120 120 
##$DBP= (0..7)
150 150 150 150 150 150 150 150 
##$DBP07= 0
##$DBPNAM0= <>
##$DBPNAM1= <>
##$DBPNAM2= <>
##$DBPNAM3= <>
##$DBPNAM4= <>
##$DBPNAM5= <>
##$DBPNAM6= <>
##$DBPNAM7= <>
##$DBPOAL= (0..7)
0.5 0.5 0.5 0.5 0.5 0.5 0.5 0.5 
##$DBPOFFS= (0..7)
0 0 0 0 0 0 0 0 
##$DE= 6
##$DECBNUC= <off>
##$DECIM= 32
##$DECNUC= <off>
##$DECSTAT= 4
##$DIGMOD= 1
##$DIGTYP= 9
##$DL= (0..7)
0 120 120 120 120 120 120 120 
##$DP= (0..7)
150 150 150 150 150 150 150 150 
##$DP07= 0
##$DPNAME0= <>
##$DPNAME1= <>
##$DPNAME2= <>
##$DPNAME3= <>
##$DPNAME4= <>
##$DPNAME5= <>
##$DPNAME6= <>
##$DPNAME7= <>
##$DPOAL= (0..7)
0.5 0.5 0.5 0.5 0.5 0.5 0.5 0.5 
##$DPOFFS= (0..7)
0 0 0 0 0 0 0 0 
##$DQDMODE= 0
##$DR= 18
##$DS= 0
$$ [...]
##$SUBNAM2= <"">
##$SUBNAM3= <"">
##$SUBNAM4= <"">
##$SUBNAM5= <"">
##$SUBNAM6= <"">
##$SUBNAM7= <"">
##$SUBNAM8= <"">
##$SUBNAM9= <"">
##$SW= 18.0517328524113
##$SWIBOX= (0..15)
0 0 2 0 0 0 0 0 0 0 0 0 0 0 0 0 
##$SW_h= 3612.71676300578
##$TD= 16384
##$TD0= 1
##$TE= 0
##$TE2= 300
##$TE3= 300
##$TEG= 300
##$TL= (0..7)
0 120 120 120 120 120 120 120 
##$TP= (0..7)
150 150 150 150 150 150 150 150 
##$TP07= 0
##$TPNAME0= <>
##$TPNAME1= <>
##$TPNAME2= <>
##$TPNAME3= <>
##$TPNAME4= <>
##$TPNAME5= <>
##$TPNAME6= <>
##$TPNAME7= <>
##$TPOAL= (0..7)
0.5 0.5 0.5 0.5 0.5 0.5 0.5 0.5 
##$TPOFFS= (0..7)
0 0 0 0 0 0 0 0 
##$TUNHIN= 0
##$TUNHOUT= 0
##$TUNXOUT= 0
##$USERA1= <user>
##$USERA2= <user>
##$USERA3= <user>
##$USERA4= <user>
##$USERA5= <user>
##$V9= 5
##$VALIST= <valist>
##$VCLIST= <CCCCCCCCCCCCCCC>
##$VD= 0
##$VDLIST= <DDDDDDDDDDDDDDD>
##$VPLIST= <PPPPPPPPPPPPPPP>
##$VTLIST= <TTTTTTTTTTTTTTT>
##$WBST= 1024
##$WBSW= 4
##$XGAIN= (0..3)
0 0 0 0 
##$XL= 0
##$YL= 0
##$YMAX_a= 176925
##$YMIN_a= -165530
##$ZGOPTNS= <>
##$ZL1= 120
##$ZL2= 120
##$ZL3= 120
##$ZL4= 120
##$ABSF1= 10
##$ABSF2= 0
##$ABSG= 5
##$ABSL= 3
##$ALPHA= 0
##$AQORDER= 0
##$ASSFAC= 0
##$ASSFACI= 0
##$ASSFACX= 0
##$ASSWID= 0
##$AUNMP= <proc_1d>
##$AZFE= 0.1
##$AZFW= 0.1
##$BCFW= 1
##$BC_mod= 2
##$BYTORDP= 1
##$COROFFS= 0
##$CY= 83.5205535888672
##$DATMOD= 1
##$DC= 2
##$DFILT= <>
##$DTYPP= 0
##$F1P= 10.8118882576601
##$F2P= -7.23987719738617
##$FCOR= 0.5
##$FTSIZE= 0
##$FT_mod= 4
##$GAMMA= 1
##$GB= 0.15
##$INTBC= 1
##$INTSCL= 1
##$ISEN= 128
##$LB= 0.25
##$LEV0= 0
##$LPBIN= 0
##$MAXI= 10000
##$MC2= 0
##$MEAN= 0
##$ME_mod= 0
##$MI= 1.114404
##$NCOEF= 0
##$NC_proc= 0
##$NLEV= 6
##$NOISF1= 3.799351
##$NOISF2= 2.8
##$NSP= 1
##$NTH_PI= 0
##$NZP= 0
##$OFFSET= 14.38212
##$PC= 1
##$PHC0= -1728.754
##$PHC1= 23.7666
##$PH_mod= 1
##$PKNL= yes
##$PPARMOD= 0
##$PSCAL= 0
##$PSIGN= 0
##$REVERSE= no
##$SF= 200.129724274929
##$SI= 16384
##$SIGF1= 3
##$SIGF2= 2
##$SINO= 400
##$SIOLD= 16384
##$SREGLST= <1H.CDCl3>
##$SSB= 0
##$STSI= 0
##$STSR= 0
##$SW_p= 3205.1282051282
##$SYMM= 0
##$S_DEV= 0
##$TDeff= 0
##$TDoff= 0
##$TI= <>
##$TILT= no
##$TM1= 0
##$TM2= 0
##$TOPLEV= 0
##$USERP1= <user>
##$USERP2= <user>
##$USERP3= <user>
##$USERP4= <user>
##$USERP5= <user>
##$WDW= 1
##$XDIM= 8192
##$YMAX_p= 0
##$YMIN_p= 0
$$ End of Bruker specific parameters
$$ ---------------------------------
##NTUPLES= NMR FID
##VAR_NAME=  TIME,          FID/REAL,        FID/IMAG
##SYMBOL=    X,             R,               I
##VAR_TYPE=  INDEPENDENT,   DEPENDENT,       DEPENDENT
##VAR_FORM=  AFFN,          ASDF,            ASDF
##VAR_DIM=   8192,          8192,            8192
##UNITS=     SECONDS,       ARBITRARY UNITS, ARBITRARY UNITS
##FACTOR=    0.0002768,     1,               1
##FIRST=     0,             0,               0
##LAST=      2.2672688,     0,               0
##MIN=       0,             -165530,         0
##MAX=       2.2672688,     176925,          0
$$ Real data points
##PAGE= N=1
##DATA TABLE= (X++(R..R)), XYDATA
0@%%%%%%%%%%%%%%%%%%%%%%%%%%%%%%%%%%%%kMmMmK%%%%JkLmOoLkJKmQj5K4m1
61b6O4j00J60k62M50q22J709m575K9276J51051j02983j98617M0548J50760p751
76E8882j08934L223P7693P927l5936q168j8832k4620M7802Q0877k6754j09492
88e6332j3169R4141K6858o6409j8091N2975J2713m3388j5564J7067l411R021M7003
101D3414k765p9292k8607P4670N1363m9639m4706L7396L0763l5534k6724K1733
113g928J8391k18R352l710m4384k0263N6669M2170m7589m0076M4723K8758n8585
126b2690l1207P3515M5253p1731m6551O7431L5986p6255l7004Q7628N6059q0841
138d07p1883N3705O2570l2117m1331K6504K8801k3718k1964J3992M512p056K4181
$$ y = [0, 0, 0, 0, 0, 0, 0, 0, 0, 0, 0, 0, 0, 0, 0, 0, 0, 0, 0, 0, 0, 0, 0, 0, 0, 0, 0, 0, 0, 0, 0, 0, 0, 0, 0, 0, 0, -2, 2, -2, 2, -2, 0, 0, 0, 0, 0, 1, -1, 2, -2, 4, -2, 1, -1, 0, 2, -2, 6, -9, 15, -26, 38, -62, 98, -164, 286, -536, 1173, -3402, 25874, 176925, 73942, -124675, -84127, 66633, 58882, -50052, -46829, 30864, 38791, 2855, -5313, -24145, -48765, -963, 79914, 53160, -56332, -69501, 24640, 51498, -14911, -33002, 19973, 32686, -10702, -26266, -9199, -12610, -3589, 43414, 40649, -38643, -67250, 7420, 58783, 9144, -35562, 1834, 32597, -2937, -29661, -7928, 10463, 10245, 19597, 15887, -28497, -48760, 7909, 50079, 2490, -37586, 7137, 35895, -22690, -53897, 19618, 64871, -6860, -53411, 14020, 50006, -26249, -63253, 24375, 80434, -407, -72290, -18585, 43985, 11868, -29463, -2959, 25842, 2124, -19840, -5848, -1336, -8392, 15789]
151A5789J9937l9360m1567L2441N1185k0931m5453K0958L9257k7174m1981K1583
163a5316L9806j0667k5534J1358R940k4360o594L2737J2664k5569j0367J8223
175F321J28k1918N657K8556k216k4185r1J0643r867o157K2448J1441k7785j3603
189b0628K8500P118l5510k716M9414J2875n4896k7349M8109L2675l7298k8775
201b8481L0764K6896k5125k9765J1807K3260J619m474m729j4973m068K2710J4140
214A9581k1496j7729K3884K1605k7015k8048K2688L1714j0679k5232L532J1966
226D771r353m723J7879M141k0193n042J8212K907k0348k482K5238Q148k1302j2046
240a4193R858Q182j50J844L24r701m703J2759M042j6985l244K2276P770k4526
$$ y = [15789, 35726, -3634, -45201, -12760, 38425, 17494, -27959, -7001, 32256, 5082, -36899, -15316, 24490, 13823, -11711, -353, 9587, -14773, -21367, 11370, 24034, -1535, -11902, 6321, 6449, -15469, -9812, 18744, 16528, -7657, -7748, 2895, -6972, -13129, 9319, 20760, -7025, -20628, 7872, 14990, -20520, -23236, 26178, 39053, -15843, -43192, 4917, 37592, 294, -28481, 2283, 29179, 4054, -25711, -13904, 9356, 10975, 6501, 1772, -13201, -17269, 5441, 19581, -1915, -19644, 4240, 25845, -1170, -29218, -6530, 25184, 14505, -10727, -7195, 4771, -4582, -9305, 8574, 12715, -7478, -12520, 5692, 8599, -11749, -14231, 11007, 19155, -2147, -14193, -4335, 3847, 3697, 5541, 5865, -3836, -8539, 4220, 8262, -8723, -11967, 10309, 18079, -6447]
254f447j6469J9604J9138j2427j2593J0571O825j1539o029J1480O953q826k617
267b376Q202l323j1768K983J2881J144r668k593M561k866l112Q220M481q386l288
282d908Q287J604j1811k031J7501O586j7576j0069J1950Q968q205p053P975O106
296G324q085o217L858K830K43L036J093n725n266N679P241m676m776O298L873
311F730p662o416N800P529l728n159L976O02o905n15Q052L122o409l375N698J198
327B538o239N36P130J605m749k942J529M86j257L046K443m402l212K587J486k829
343b244j061N272K880o206m091M639L517k275j037L002J145m673k342M113J822
358B461k018oQ95j781k805O68L741K01k534P94J095j755j271J592K774M01j628
$$ y = [-6447, -22916, -3312, 15826, 3399, -9194, 1377, 8202, -3337, -9366, 2114, 9067, 241, -2376, 5826, 2503, -9265, -6282, 6599, 7743, -1925, -4518, 43, -2823, -5935, 2285, 6766, -1620, -4908, 3379, 4983, -6828, -8859, 8642, 15228, -2348, -12417, -467, 8501, 296, -6757, 1218, 7324, -761, -6978, -3120, -290, -47, 2989, 4082, -1643, -6909, -1230, 6011, 1335, -3441, 2857, 6730, -932, -7348, -1548, 5981, 2253, -2906, 1070, 1672, -5233, -5748, 2304, 5426, -983, -4358, 1340, 2538, -3701, -3165, 3965, 5570, 821, -2121, -592, -106, -1363, 1683, 4126, -276, -3488, -901, 585, -2244, -3305, 1967, 4847, -1359, -5450, -811, 2706, 431, -606, 2396, 3541, -1132, -3474, 639, 2461, 443, 437, 1332, -449, -3254, -2586, 1155, 1356, -1178, -384, 711, -1044, -2315, -723, 2051, 2452, 824]
375H24k30o59k040J798L722p35m045j316L244J258m135j620M416L061k116m525
391c098j453L815M146m9l372l046K495M505j585n155j73N631L073n461o377K357
407c747O083J201l555l066R55K226N74l15j161n95K701K208k219l858m09M734
423A757L403l408m611K35K955J307j866j388J233L69o11L30j77q94L52K180K493
440C659k126n065K75N637L053l692n530R08N320P14l921k624J170L648J680k704
456D02m289j502N525P367k908j0466k355J0745Q684q100j3168L934J4807J648
470A0324j3995q255R870J1790m000j1252k270O637N808j119n268k824J920O034
484C400L358o629q090M220J1673J508j2573p745R843J0747n306j1191K34R404
$$ y = [824, 594, -65, -2105, -307, 3415, 2680, -1365, -2681, 563, 1821, -2314, -3934, 482, 3543, 1427, -3098, -4551, -736, 3410, 3361, -11, -3057, -562, 3943, 2358, -2797, -2970, 2661, 5734, 273, -6104, -3747, 2336, 3537, -18, -3084, -2129, 97, 671, 356, -805, -1400, 1301, 3509, 1290, -2568, -2977, 1757, 5160, 1752, -2859, -2624, 331, 1638, -228, -1616, -383, -14, -625, -295, -472, -1366, -1014, 1166, 3659, 1533, -3532, -3257, 2380, 5433, 1741, -3789, -2881, 2439, 3153, -768, -3392, -2222, 1426, 3106, 402, -3887, -5389, 136, 7503, 4595, -5871, -8226, 2519, 11203, 3103, -10065, -6131, 8676, 10324, -3671, -11926, -2056, 9734, 5734, -5518, -7788, -1151, 4657, 3538, -1730, -4554, -2634, 3400, 6758, 129, -7961, -3741, 7932, 9440, -3133, -10878, -1035, 9712, 4406, -6785, -6551, 2853]
498B853K981p228m172M173L695o81j411l14q13j259K634M437k464o063O84N967
514C019J046n742k643N274K616m811k417L889J732m182j331O868K621r632n159
529h852J0745R438q579j3310N057J5501j102j5254l488J1929P074p519q611K530
543d441O021Q95r05j735l758j31O924M890p390j0016O091J4063j946j5136m037
558a0611J2906R109q992j1396L508R789J145o841m196L503M515J62j956k757j277
573c389L349M543o35n988l005N779N719m251p126J353P493J125q025l421P374
588H95M453o075m752N149N341n152n773N931P010n096p946L238Q583r91q574q41
604d600O932J665m722k234J795J233j92J418M1m660r34O937L505o891o159N546
$$ y = [2853, 5834, -1394, -5566, -1393, 2302, 1621, 210, -104, -917, -2176, 458, 4895, 2431, -3632, -2948, 3019, 4065, -1677, -4320, 954, 3570, -1241, -3658, 231, 1963, -2219, -3550, 3318, 5939, -3693, -8852, 1893, 11331, 2752, -10558, -5501, 10000, 8898, -6356, -9844, 2085, 9159, 1640, -6971, -4441, 1580, 2475, 1570, -165, -3923, -4054, 2870, 7760, 370, -9646, -3555, 10508, 8562, -6574, -10611, 2295, 11404, 2412, -8984, -5476, 4313, 5458, -1383, -5579, -2076, 2439, 2601, 645, -2112, -3389, -40, 4503, 3868, -2120, -5125, 654, 6373, 2122, -5004, -3651, 3842, 4967, -3058, -6479, 895, 5348, -727, -5479, -330, 5011, -141, -5914, 17, 7027, 1931, -6015, -2777, 5806, 4815, -3759, -4600, 2332, 3997, -725, -2959, -1164, 69, -123, 1295, 1336, -3324, -4258, 2679, 6184, -707, -6866, -1320]
620a320Q677k818r363m27P629L396m469n427P42M393K017j826l756j404L692M033
636C769j641n224j325N446M488l427n688M9N354L452l576n869R59N939J680n396
652a010m401M065N481k477n131N99M102Q09k631l68K027o34j330J511J330j553
668C89j809J264K252j379k752J095J862p05r56K27K34p44L36K043l73k697O24
685a089K910K6k477q56K285J390j997j296J066L20n14J00J52m70q94Q42J576j176
703a02j487J153J556j65j258m50J111O85j71l14j158r8J725J38j931r99J508J843
721A586j486k581J321K555m29j939l18J873Q26j445m46J044J44j34j93n50j57
738c29L12N63l07j407K40J446m71j072L44Q98J42p60O2J116l64p72Q62P34p74
$$ y = [-1320, 7357, 4539, -4824, -5251, 2378, 5774, 1305, -4122, -3380, 1013, 3030, 1204, -2552, -3956, -264, 3769, 2128, -3096, -4421, 1025, 5513, 2086, -3602, -3553, 1801, 5253, 1677, -4192, -3233, 2706, 4386, -1010, -5411, -1346, 4135, 1658, -3473, -2874, 1228, 2037, -594, -962, 1065, 431, -899, 612, 1942, 389, -1420, -156, 2096, 717, -2035, -940, 922, 217, -739, -512, -278, -1022, -686, 1357, 984, -1713, -1089, 1821, 1847, -630, -1486, 799, 2189, 192, -1104, -38, 282, -232, -132, 20, -450, -1344, -502, 1074, -102, -1589, -436, 1120, 955, -303, -753, 358, 1043, 872, 558, -600, -698, 1027, 1165, -766, -1765, -257, 1586, 100, -2481, -1160, 1395, 966, -973, -1291, 582, 1408, -37, -483, 561, 705, 571, 378, -172, -329, -17, 546, 239, -1168, -928, 518, 47, -1025, -681, 217, 359, -401, -339, 777, 413, -359, 503, 1237, 463]
757D63j097K70J519l23j836R4J307p4o90p44L98Q62J38k60m98l44J177J006j119
776B49q07M66J206L2j583k96J084J41m70l82l09J51K17L84Q5j020j56J580M27
795I99j172n85Q20J335m51j442J71P87J94k38p82l89N38N42r4j060n90J437J108
814A128j287j155P36J680J1j603j81J481J94p84m58J10N63n4l55l85n03M91R59
833E88o53j119M70J129J36j025l13J355L70q27m7K49K7j86J08L55o04r62Q13Q01
853F65q89q06L42R69q6r16J84O77j40J61M31m33l99L14Q78o2j410r5J243l4r06
874c12l06K21L23j26J21P9r33N1J780K92j752o86J585J596j304j817R39J396m08
893G39q80k70P4Q0L49M73r67j362J346J799q52j902K42K072O11j781o43J251L45
$$ y = [463, -634, -364, 1155, 832, -1004, -910, 397, 323, -367, -1111, -713, 149, 287, 27, -471, -815, 362, 1368, 249, -558, -92, 1114, 1146, -437, -733, 351, 492, 22, -360, -669, -518, -301, 83, 168, -852, -1008, 572, 999, -173, -758, 62, 1397, 946, -496, -325, 462, 656, 418, -364, -753, -215, 327, 233, -827, -1417, 20, 1128, -159, -1314, -578, 1102, 1113, -490, -671, 810, 1004, 220, -238, -128, 435, 381, 26, -359, -862, -371, 588, -65, -1184, -714, 415, 551, -474, -787, 568, 938, 111, 64, 313, 340, 154, 262, 617, 13, -949, -136, 665, -224, -1030, -688, 281, 195, -721, -537, 140, 0, 161, 592, 159, -240, 74, 952, 890, -520, -615, 628, 594, -312, -618, -397, -74, -200, -79, 0, -933, -882, 898, 1190, -562, -1248, 337, 1933, 629, -1188, -249, 1147, 739, -141, -411, -337, -257, 92, 565, -402, -1764, -418, 1381, 529, -1373, -1131, 941, 1552, -229, -872, 379, 724]
912G24k26j20l56l63N6P23K57j447l78J369N1r04Q8N18j06m96R68J061j710j334
932a625K231J763j880k317J283K576r46k629O35J667p80p39Q63K57j687k81L123
949A514P31l972j140M255K145l499l056K646L407j792k872P06J458lm80j31n07
966e90p75Q97K073j057k526N07K697O72k152j512J705J722m23j283j032N08J915
983A346J01k292j031J823J665j753j955J877J562k072q58K434Q53k669j149L611
999A493J640l993j934L897K064l402k559K982K219l041j771L382O06l753j66M525
1015B189N80n339r81N931J796n509k278M455K870l225l018K093K145j470q52Q48
1031B35n49j180J206K024j288l020R46L694j23l074p36K131J783q97j781o70J180
$$ y = [724, 498, 378, 22, -341, -285, 438, 695, -752, -1130, 239, 290, -614, -526, -8, -114, -610, 358, 1419, -291, -1625, 606, 2369, 489, -1828, -545, 2031, 1085, -1544, -909, 758, -22, -761, 102, 359, -1328, -1609, 1514, 2245, -1727, -2867, 1388, 3533, 34, -3022, -376, 3031, 1239, -1633, -927, 531, 528, 48, -83, -590, -1365, -468, 1605, 548, -1978, -1471, 1226, 1898, -254, -1766, -61, 1661, 1238, -45, -1077, -569, 1346, 1447, -845, -1876, -53, 1612, -141, -2096, -219, 1343, -729, -1587, 847, 1700, -969, -2118, 1493, 3133, -860, -2794, 1103, 3167, -235, -2794, 188, 2407, -634, -2405, 977, 1583, -2170, -2336, 2189, 2769, -2570, -3551, 2380, 4176, -1333, -3611, 844, 3714, 489, -2529, -436, 1709, 239, -613, 235, -314, -1494, -288, 1736, 448, -2572, -1626, 2068, 1945, -1129, -1865, 266, 2049, 1152, -629, -1299, -119]
1048a19K117l40l362p73L521J411l091k156K454K244k083j695K211R86k184l03
1064a162K746K64l394l05M284K68m751n41M685O13m652r65M544O22m558%M400
1081B098l29m202M78M291j58m259K94M124m19l495L86K885l77k735O83K333j533
1098F5k171J994J932k035k164J863K446j620k000J566J346j068k48N79l90o10
1114e15J149Q48j909j510K386J641k554j893K115J930j749j908J918J558j972
1129d65p56K187L49k206o8K728o1l418M12L560p90l613O91L184o58l202P52L056
1147A682j119k644J506K317j432j935J612K147j988k015K498J772k728j627K448
1162D94J534k588j618K604J223k701p32K484L16k011OK105l11k094R74K170j351
$$ y = [-119, 1998, 1658, -1704, -2477, 1044, 2455, -636, -2792, -338, 1906, -177, -1872, 339, 1325, -859, -1162, 1584, 1848, -1546, -1851, 2433, 2701, -2050, -2591, 2094, 2707, -1945, -2910, 1634, 2256, -2302, -2302, 2098, 1769, -2433, -1955, 2336, 2178, -2081, -1787, 2337, 1918, -1577, -1191, 1694, 1317, -1418, -735, 1598, 65, -2106, -112, 1820, -215, -2379, -516, 1930, 310, -1690, -124, 1222, 154, -94, 485, 95, -515, 634, 1482, -427, -1937, 449, 2090, -464, -2357, -242, 1688, -61, -1969, -51, 1507, -465, -1221, 966, 1315, -891, -959, 1769, 1708, -1710, -1298, 2262, 1472, -2141, -1450, 1734, 1076, -2126, -1374, 1682, 563, -2081, -575, 1742, 310, -1625, -13, 2134, 146, -1869, 629, 2401, -327, -1954, 494, 2028, -560, -2178, 426, 1649, -1052, -1784, 700, 1016, -995, -989, 1116, 805, -1289, -315, 1855, 504]
1179E04j892J411J705j372j874J287J785j636j727J833J175j788r13J788R43j959
1195g30o93K400L94k288Q4K063j60j877K91J926q54j945J116J730j588j533J510
1212a54J496j519j725J855J645j901j167J982R22j804o84J926P58k312n21K370
1228A167L8k317l3J962J7k118K03K007n19j817R91J491r59j205J147J459j281
1245B33j444J510J224j570j049J369Q27j452r13J529O06j799j41J738l4j588J48
1262h06J716n0j649K83J678n46j322P58R26p90j024R17R15j379j012J663O58j592
1280f56o47J432Q98j434p24J600N20j377p8J311j01j156R1J325m79j451O37J272
1298I83r38j190P85J116p56j185R98J160j142p41J248O17j068n18J166N71j385
$$ y = [504, -1388, 23, 1728, 356, -1518, -231, 1554, -82, -1809, 24, 1199, -589, -1502, 286, 1229, -730, -1423, 977, 1371, -917, -833, 1230, 1070, -807, -516, 1410, 556, -1389, -273, 1457, -131, -1664, -154, 1342, -177, -1902, -47, 1598, -303, -1470, 512, 1434, -370, -1054, 872, 1630, -682, -1203, 1167, 1205, -1112, -1145, 817, 834, -1284, -1081, 926, 407, -1410, -419, 1072, 113, -1092, 55, 1514, 233, -1211, 299, 1523, -47, -1096, 273, 1100, -352, -1265, 264, 870, -929, -1070, 668, 634, -954, -806, 910, 860, -789, -506, 1172, 626, -696, 62, 988, 198, -826, 91, 1006, -373, -1385, 278, 936, -656, -1303, 129, 1027, -407, -1131, 469, 989, -388, -466, 845, 744, -412, -321, 1004, 525, -926, -289, 983, 45, -1145, -360, 756, 0, -1185, -187, 973, -169, -910, 338, 955, -113, -631, 535, 1106, -279]
1315b79m60J401J65j450k27J298J88j347l13J508q6j201K68J065j93q37K96R49
1333G45m13q56O94P94r37n40O79L84o84n54Q14K65r13j83Q51K7o05L0P86J11r15
1354d20K71Q99m67o13N47M49n87n93N69O05r07p16J099N02j141m32R13O69q34
1373a87p09J196M41q89k04P98K23p42k30Q02J20j053pQ54j88o72j59P16J13p24
1393e01J07N57j38k15L02J39j68r4K68K99n32k05N68j42m55M6K46j67k61R2M38
1414A84l79n40P38M43n06l55L76P49l35o62M09N68n67l08K69K21m13n18O45M64
1434D83q19n27P96N22m90p21M22R59k52p15K68M01Q1k53k48K26P8k81R7O7k68
1455a74j31J5K31J73n09n9N27K37j39m94J46P19Qo36j15N37J43m17m76O01J78
$$ y = [-279, -739, 662, 827, -623, -850, 448, 636, -711, -1024, 484, 398, -803, -535, 530, 337, -500, -204, 745, 332, -524, 170, 964, 27, -513, 166, 550, -134, -688, 126, 391, -522, -705, 146, 173, -432, -402, 384, 495, -420, -149, 750, 283, -330, 217, 666, 79, -514, 55, 660, -247, -963, 136, 638, -503, -935, -22, 647, -187, -896, 300, 741, -148, -352, 446, 669, -73, -303, 499, 619, -434, -441, 413, 225, -447, -606, 110, 223, -501, -394, 163, 25, -190, 112, 251, 83, -11, 257, 556, 24, -181, 387, 245, -210, -164, 82, -85, -346, -254, 184, -195, -735, 3, 446, -60, -415, -39, 710, 375, -287, 122, 690, 123, -185, 84, 305, -108, -626, 19, 483, -336, -863, -67, 455, -35, -756, -334, 625, 373, -342, -74, 327, 408, 155, -93, 133, 211, -70, 27, 94, -174, -305, -290, -59, 114, -395, -454, 73, 310, 171, -323, -177, 542, 550, -86, -201, 336, 479, 62, -414, 187, 365]
1476C65o66j39M33J70n28k61O31N52p80m15Q22M66m79n98M25P52m34p50M08N80
1496E54m41o49K84P07l88r25N49Q30m76p34K76Q95O0r83PR36K10p09l41M88M56
1517F06o63l10N58J25o21j49M86J40m28m64P37M48o15l08L69O83k27p85K02R12
1537F96j79q03L1O13m6p26o3O71q0n55kN48J51m70k76P56L42p53k55O66L48m32
1559A82o17N68N22p44l66M72L22m97m44L19O26m71m31L58M64q8n04R8O56m9n25
1580a49J56L83j75l36L1L43j07n22Q4L89j50k54r2L38K91l72k52M32L25k01k59
1601i7J17M46k19l98J82K59k29k08k6K57n0m49J16L52j30k18P8K86J74l91l8O01
1623D15k6m04OK64L4l09j59L85p5l49q9J60Q9k3k69J96K73k33m5K35J23o5j99
$$ y = [365, -301, -440, -7, 163, -365, -626, 5, 557, -223, -638, 184, 650, 171, -427, -2, 750, 316, -434, -26, 554, 113, -536, -252, 455, 67, -858, -309, 521, 45, -689, -413, 482, 542, -441, -434, 502, 712, 3, -338, 150, 606, -57, -367, 191, 316, -305, -454, 32, 172, -256, -720, 17, 465, -150, -458, -89, 594, 367, -418, -216, 696, 517, -286, -255, 358, 312, -414, -477, 194, 114, -441, -443, 105, 256, -214, -490, 266, 608, -145, -400, 266, 614, 182, -435, 133, 655, -89, -455, 17, 339, -158, -602, -283, 343, -128, -559, -201, 263, 175, -329, -231, 425, 376, -149, 7, 390, 215, -121, -90, 253, 146, -376, -292, 97, -53, -307, -399, -61, 230, -142, -394, 38, 363, 162, -97, 20, 466, 247, -151, 31, 290, 61, -147, -173, 84, 34, -415, -299, 53, -77, -295, -217, 69, 243, -148, -186, 415, 389, -15, -9, 255, 289, -20, -179, 206, 131, -218, -307, -147, -58, -81, -350, -154, 119, -114, -159, 76, 199, 134, -65]
1646f5J74K63k39j51K03q1o8j46n9J40O7k97K2P8J19j8j60K03K70j94q8K15kj5
1670A71j17MJ87j68k14J58K2k3k03j23K92M9l36P7K49l0k1m4K41M9j86N0R1m0
1694A35N1j57m2J41j53k12P6J93p0j39j14L07J7k16J55J23Q1q1l3J06J08k67L
1717A2K16j05j20j30M0K06k98k03L14N9j54m3J39K12j47q5K02J26j37m1J7R1k
1740A69k50P4J15j81j04N0M2P6j13j46K45K4m4O9p3K02K5j73Q2P4m5mj12N6O4
1765A22k57R9K2o2o4k9rK39j77r5K96J45j37q1K4K13j7k73J37R8j16j48oQ9j3
1790@j75O4Q4l6r1L3M5J37j03JJ52N1j09P7j1J01o8k38J16K1r0l6j3J2L0j08n3
1817b07J13N8J25j41m7K88J9k36P4J27P4j83j42K17M4l34n1J31J28k10j34K27
$$ y = [-65, 109, 372, 133, -18, 185, 104, 36, -110, -169, -29, 38, -259, -237, -159, -40, -58, -218, -15, 255, 61, -27, 188, 186, 171, 54, 58, 245, 77, -137, 21, 43, 20, -183, -306, -14, 35, -301, -224, 25, -5, -26, -70, 171, 220, 34, 84, 175, 135, 186, 29, -13, 128, -25, -237, -161, 32, -38, -177, -291, 16, 33, -183, -28, 95, 176, 95, 62, 168, 276, 9, 12, 228, 123, 3, -127, -87, 119, -179, -382, -68, -9, -163, -206, -67, 145, -2, -87, 115, 241, 104, 63, 80, 171, 169, -81, -7, 108, -73, -177, -127, -85, -9, -122, -268, -23, 1, -43, 26, -47, 155, 180, 7, 89, 163, 118, 114, 2, 58, 122, -135, -36, -14, -76, -140, -169, -178, 61, -116, -211, 85, 230, 93, 12, 36, 249, 232, -41, 96, 194, 78, -70, -76, 13, 0, -175, -111, -27, -63, -154, -121, -76, 61, -42, -41, 111, 162, 53, 130, 119, 220, 152, -86, 30, 51, -39, -75, -88, -76, -46, -154, -207, -94, -36, 89, -52, -99, 189, 208, -28, 46, 173, 247, 64, -78, 139, 183, -151, -202, -71, 57, -153, -287, -60]
1839f0J82l65n2M78L4j88j20K61K45l46k34M06K7k89r4P9J54j87k89K18K33k41
1861a48lR9R5j8j13J09J99j37N6k4J3N9j18j65J62K3j29r2m7K15l5k84M0L28%
1886H5j41j42L36J58l48r9M55ok48k69L52K18m11l13M32K12n11j18K68L13l02
1907g9l09M37K28k78j78K93K22k13j92J64L00l35k59K32Q0j48j93k6L08p5k14
1928b35J39R2l9K7p5J50J48j42m0M6J55n0k05K4J44p5k27l3J58J65l49j34L93
1951C7J21l70m6L63J77k47k96M54K35m20k39L99J43k74l69L19K79m28k95M24J77
1972A44k91j41J92L77j90l75L69K02j63k01P3K75j11l22J63J94j80j79j5J45P3
1993C9j99m8J34Q9l4n8K5K26j9j96N6J46O5j98j44L10Kl07o9J85M9j74k44K77
$$ y = [-60, 122, -243, -295, 183, 217, 29, -91, 170, 415, 69, -165, 241, 268, -21, -115, -36, 118, -69, -358, -140, 93, -148, -151, -52, 43, 25, -88, 21, 220, 83, 139, 115, 128, 187, 69, -96, 66, 89, -40, -132, -179, 36, 1, -283, -243, 85, 85, -56, -198, 138, 296, -52, -151, 304, 298, 50, -219, 133, 351, -60, -373, 59, 271, -240, -358, -90, 223, -79, -388, 49, 277, -1, -179, 114, 336, 123, -69, 95, 395, 60, -199, 33, 113, -35, -228, -254, 54, -21, -235, -96, -4, -43, -16, -91, 59, 207, 65, 25, 71, 226, 176, -29, -5, 139, 64, -163, -196, -38, 127, -222, -356, 37, 158, -212, -258, 105, 282, 35, -261, 193, 428, 8, -231, 168, 311, 37, -332, -13, 266, -162, -457, -33, 144, -147, -288, -96, 281, 91, -284, 85, 287, 124, -77, -4, 271, 160, -162, 1, 195, 15, -164, -179, -34, 39, -160, -208, -74, 15, -19, -77, -52, 174, 155, -41, 15, 161, 226, 28, -116, 194, 196, -111, -180, 5, 54, -120, -364, -87]
2017h7K81l51j89L93K45l21j53K54L45l31k91M36J12l70j69J96K00k64k61K62
2037f3J70k76j42J84K76j14l17L17K35k16j02K37J3j23q0L9P7j66l0J04j43J01
2059a9j1p9l7J20Ml5%L6K30j14j34J64J26j60j54P2K99k24l37J87J97k54k25K56
2083i2K78l16k84M28K51l29j40L08K36l17k34L54K41l94j78K92N6k47j15J75J50
2104A23k84j79M15M3k89M7J57K06k03m5K48l3k28R2Q6j24o3L3Q4j95j34J87Q3
2127B7k97J56J58o8k04J19L24K2l50J24L73k41l10K17K86k31n33L49M31m19l52
2148d19M10J82l28k17K78M38l93k38M44J90m11n2K87J60l05k59M05J55n72Q2K39
2169G6L9l48m0K96L8l29J58K55j57r4K47J09j20j82K05J46l37k2K27n0k41l5K80
$$ y = [-87, 194, -157, -346, 47, 292, -29, -182, 72, 417, 86, -205, 231, 343, -27, -196, 0, 200, -64, -325, -63, 107, -169, -311, -127, 149, 35, -282, 35, 270, 54, -48, 189, 202, 79, -1, 38, 115, -51, -81, 23, -120, -19, -30, -109, -146, -26, -22, -57, -57, -21, 209, 95, -39, 125, 251, 91, -63, 9, 308, 84, -253, -66, 131, -123, -348, -92, 186, -130, -414, 14, 265, -64, -204, 104, 340, 23, -211, 143, 384, -10, -188, 104, 160, -87, -202, -27, 123, -161, -340, 75, 118, -171, -124, 33, 239, 36, -9, 239, 206, -22, 70, 156, 32, -31, 2, 86, -109, -243, -56, 27, -270, -114, 44, -24, -228, -109, 215, 237, -113, 11, 384, 143, -167, 50, 336, 105, -428, -79, 352, -67, -419, -9, 173, -155, -372, -94, 344, -49, -287, 157, 347, -64, -116, 171, 331, 26, -233, 172, 327, -245, -163, 76, 115, -233, -273, 23, 61, -268, -110, 145, -12, -106, 141, 250, 130, -52, 153, 299, -38, -60, 167, 117, -124, -159, 121]
2192A21n0l89J09L74j82m01M14K82j86l63K79M03k96l66M62K25m49k74K96L16
2212C25m52l30M74J94m26j98M33J49k80k14M79J65l92m2M35p4l14j2L01L6m81
2233b24J02K99j73l06K05J51j30j38J75J59k04p6L32j0k20J04K19n8k46j8L11
2254B54o2m37J46K72j74l37J57L15j23l69L42L22l58k45M31J71k58k32L35K32
2274C82m32j12L69k5l18p5K57J45l73o9L06mk68J00K33j4j81nL28j40k43J81J78
2297B20j68j19R8J26k73j28L19K8l00RK51n0j12m3L37M2m54J61L73j49k19J31
2319H0J97q0l79P5L48k56l48K64K31k09k43J81L79k56k52L82J16k21l3J37J82
2340B95j88k90K88M8k91J9J68o9p7q6J51j0j08J36J50k61J10M7J41j28o1K37k9
$$ y = [121, 71, -318, -209, 165, -17, -418, -4, 278, 92, -271, 8, 411, 115, -251, 211, 436, -13, -287, 9, 325, -127, -457, 17, 211, -215, -413, 20, 169, -111, -325, 154, 319, -73, -115, 320, 246, -68, -80, 221, 257, -224, -122, 177, 4, -302, -97, 54, -76, -214, -39, 120, -84, -160, 172, 162, -58, 46, 265, 207, -39, -57, 254, 192, -245, -99, 173, -1, -338, -181, 134, 11, -358, -16, 306, -52, -297, 134, 305, 47, -185, 150, 382, -50, -162, 207, 182, -136, -211, 46, 191, -182, -251, 55, 51, -217, -117, 116, 102, -79, -84, 244, 104, -139, 42, 220, 52, -67, 31, 157, -116, -244, 75, 103, -197, -188, 63, 13, -99, -142, 195, 237, -217, -56, 317, 168, -51, 80, 277, 197, -182, -107, 241, -15, -363, -99, 132, -77, -320, -139, 240, -16, -268, 114, 230, 9, -24, 113, 295, 107, -183, 105, 153, -138, -119, 49, -20, -97, -183, -32, -42, -150, -14, 136, -125, -15, 32, 173, 45, -16, 221, 192]
2363A92k44M2K01j57k20O3K08o0l03J10L14r7l67K06L11j51k72J95L46j58l12
2384a53J65K31j40k63P8L01j98l34K43K07k28j49J21K10j19j56J74J90k21PK10
2405A76n9j5l5qN0q4o1J12j16r6J24p9j1lR3L2j07J5J79l3j90J62J70j18j34K7
2431iK09j43k66K05J36j96j69J59K12j80k64K55K08k28m4J39J91p5k33J81J92
2452B80k02k24K20Q5j61r7J3J25j36j36K15Kq2M7lJ61o4p1J35Rn5N9l8J4qp6l9
2479b7M6q6J09r0j24R7Q6j26nJ49M5l1j05J33N6j06m2R2P3q4j04J9J27k14n3J26
2505c9K4j12m1J52M7q9j05K44K4j14O0K6N3o0l6R6p3p5l5M8K4m1q9K7P0j84J36
2532f2J32o1k4L9N1N3r9k1J63j25L4kj13L5N3j49N0j1j6K8m5LJ2J8L4Q4l2J10
$$ y = [192, -52, -10, 191, 34, -186, -123, 85, 25, -278, -168, 146, 49, -318, -112, 199, 48, -224, -29, 317, 159, -153, 12, 243, 103, -160, -82, 219, 21, -313, -70, 137, -91, -240, -119, 91, -28, -184, -10, 180, -41, -34, 176, 117, 102, 67, 59, 109, 25, -36, 76, -40, -136, -12, -91, -102, -105, -12, 20, -87, -72, 107, 74, -116, 46, 216, 98, -36, -9, 200, 57, -209, -4, 132, -64, -233, -74, 138, -42, -306, -51, 157, -71, -115, 24, 215, 140, -93, 88, 280, 78, -146, 74, 159, -2, -99, -86, 39, -97, -233, -18, -16, -98, -51, -54, 107, 43, -28, 107, 116, 61, 120, 82, 96, 88, 12, -27, 19, -67, 42, -48, -172, -75, 11, -115, -120, 29, 74, 43, -62, 71, 127, 21, -21, 71, 144, 60, -44, -25, 102, -112, -165, -39, -15, -127, -168, -16, 31, -58, -163, 81, 105, -9, 51, 77, 130, 70, 34, 130, 57, -18, -53, -5, 19, -22, -111, -84, -14, -198, -62, 70, 9, -15, 24, 75, 128, 29, 8, 171, 46, 80, 78, -35, 0, 53, -96, -46, -57, -73, -45, -90, -87, -75, -57, -23, 61, 29, 139]
2560A39l0k9K0k1o1J7J3j4n6j6N0p8n2O9M2l2Rq5J59K1o3R4L4j08M6L9k9M2j19
2589Aj6P1r3j16J40n7m6LM1O7n1PJ11J5j14R5K8L1qj04N8L4j17k8N9Mk4j01jP7
2619c4q2j7J16k7L1k0J10Q3j38qO5M3k6n8p0R2l2j50J9R7j0p9k4L5J39j39L8Q0
2647C4jkL6k1J32p8j29J41Mp4l4p0R3l6k13J14J28n0m5j7J20K9j31L8J58J2r1
2674D7n1R5Q6j90r6J90qj63n9N2J60j22j38J96Mp8L9M6J14j1j55L4J45o5n8k0
2700fL5K4j76J6J10lj46M8N7J04j43p0J50O2l5NK3M6J7j35M2J01j12j00P8N1j7
2727B6j41qJ71Mk19J17P5J8j16j3K35L1j77j5R9P7j04j23O5J72k32r4J54M6q8
2752d0j82J75J33j51p4J48Q5mj56Q1J92j09j54J12J03j03j14qQ9N7k33K3N5N8
$$ y = [139, 109, 80, 100, 79, 18, 35, 48, 34, -22, -38, 12, -66, -118, -49, -7, -39, -30, -115, 44, 65, 2, 96, 130, 22, 68, 107, 78, 120, 1, -15, 56, -37, -153, -13, -70, -116, -113, -72, -5, -56, -49, 62, 77, -37, 58, 86, 117, 109, 5, 63, 97, -20, -48, 11, 15, -9, -110, -111, -34, -116, -133, -17, -44, -13, -33, 77, 160, 22, 14, 79, 122, 96, 38, -32, 60, 28, -122, -103, -6, -16, -95, -119, -84, 55, -84, -46, 34, 33, 31, 67, 46, 178, 100, -29, 112, 116, 42, 8, -62, 31, -5, -218, -104, 24, -26, -71, -88, 32, 61, -70, -32, 126, 138, 47, -4, 91, 177, -13, -109, 81, 73, -90, -149, -97, 63, -59, -197, -1, 3, -75, -36, 10, 124, 113, -42, -8, 137, 72, 14, -6, 29, 53, -123, -107, 3, 0, -146, -98, -41, 63, -80, -150, 0, 62, 27, 32, 55, 101, 118, -17, 25, 126, 14, -86, -8, 43, 26, -115, -123, 48, 52, -167, -50, 25, 43, -73, -86, 149, 180, 3, -12, 87, 164, 60, -63, 2, 174, -58, -152, 2, 48, -40, -222, -47, 86, -65, -139, 9, 94, 90, -66, 15, 207, 98, -56, 56, 159, 56, -58, -66, 23, 80, -153, -130, -75, -17]
2776a7j01JQ2R7l6o9J29K8Oo8PO1q6q6Q5J1j12q8R4Q3jk25Q1J43j7m9j9J31K7
2805I2q8L0L9Q4r9k7K0N3j16r7J29k8jj47J19L8M6j56R9J20q9k1j3J03Q6k20J4
2832c0K03q9j37m8J43K4j46q7J19M5p3n2J39OoLP8K1q0n5Q7L1lj69Q1J28j04j89
2860a60J11Q1k4j48LJ89k8j49M5J41M6o0m0N0N7m6q0J15l3r9j5M0P3j00j66J81
2886a6J12j40q1NK23n1j29N3J33k8p2k2O3J08k32M2J29o7n2j34J41J16k20j03
2910b22K88l1q1j0Q4J01j14j58K21M0q7r6J18J03j10j79O6J80j10j30j1J48M9
2933E9k17K3K48o7j30N3J28K4m4j09J75j7j76NR1Kp5j63J27J16j21q0J38M6k7
2958Ij63J76J13n9j24N6J27l8p2n3J51q3j20M9J8kj54L6J43L3j89O1J74n4l3O
$$ y = [-17, -118, -117, -35, 62, 26, -43, 86, 114, 120, 52, 59, 120, 34, -52, 33, 44, -68, -156, -62, 21, 20, -205, -124, 19, 2, -47, -66, 65, 92, 4, 34, 73, 157, 58, 31, 51, 104, -12, -109, 20, -8, -9, -156, -37, 1, 47, -109, -10, 110, 21, 0, -13, 90, 176, -44, -30, 173, 84, -53, -101, 42, 66, -80, -167, -48, -3, -76, -128, 11, 17, 11, 14, 92, 113, 33, -22, 65, 96, 93, -76, 5, 133, 29, -160, -49, 32, 8, -140, -137, 52, 24, -125, -80, 61, 107, 47, 7, 57, 114, 68, -12, 103, 70, -29, -44, -4, 69, -31, -197, -16, 96, -44, -125, -120, 103, 52, -77, -24, 109, 81, 9, -13, 50, 158, -74, -32, 97, 30, -22, -156, -15, 101, -119, -222, 66, 35, -46, -56, 28, 129, 15, -143, 78, 118, 31, -65, 53, 156, 46, -133, -67, 113, 3, -127, -138, 10, 59, -158, -135, 113, 46, -84, -31, 97, 121, 77, -32, 143, 126, -50, -45, 46, 48, -27, -190, -63, 53, -68, -148, -10, 36, 9, -154, 22, 135, 76, -48, 8, 135, 97, 25, -28, 123, 40, -80, -31, -13, -15, -169, -133, 10, 43, -146, -85, 89, 35, 2, 8]
2984HQ6Q7j64m3R8J06j72m7M7Q4j52j33K22k8j16J0M3Q6lj13J29L9o5l5N7Q1j4
3011I8p3p7J65j30p6M9M6M3j19n2J49L1q2J7L2Q4o6p8J29J6j11R4n0J2l4j6j4
3038a3M5o1k8m1J7M0k3j2Q9Kq0O7N0L2m3j0P9Rq3o3R3o7m3j8MR3j55L3Q0p2L1
3069d8J9Q7J9n9kJ44j08q0J05Po2k7k2J08q8p6L1om3L9N2oPl4Q6j4K8j9nOM4j14
3101c1O4J0n5M1j10J8P5L4n6Mo2M2P4l8o3J27j6o5O8k7O0q1K4N1j19p0J06K9n3
3130a9q3j4J57j08o2J17O7q0pN5J02n5p7Q2M4r2o1J21Mj80M1nP5j75M2J10m2M
3158c9J9j2L3m9J3J60l0o3k4J7M7p1n4P4q5j1J12n7j39Q6J2K7q5J26P1o4m7N8
3186B5O1p8JL2l6K7j23J72q1j00kP8pr8j6R0K29k14q2J71J08j34r1J56J20k13
$$ y = [8, 94, 181, 17, -26, 72, 178, 6, -41, 6, 90, -62, -195, 27, -1, -117, -107, -64, 22, 19, -94, 35, 74, 9, -26, 31, 112, 98, 25, -52, 113, -17, -93, -44, 2, 45, -74, -126, 23, 54, -28, -11, 21, 105, 39, -39, 90, 106, -5, 89, 39, 51, 17, 1, -13, 32, -29, -57, -98, -81, -41, -64, -76, 13, 15, -65, 2, 52, 84, 41, 31, 110, 119, 36, -27, 66, -1, -44, -62, -58, 35, -120, -87, -7, -79, -48, -29, 58, 77, 18, 16, 160, 52, -28, 77, 84, 22, -5, -27, 81, -7, -83, -52, -58, -101, -62, -10, -16, -9, -43, 43, 29, 57, 38, 33, 39, 83, -31, 33, 43, -12, 29, -81, -63, 12, 46, -10, -6, -68, -26, 48, 10, -53, 74, 58, -7, 61, 34, 94, 13, 37, 88, -31, -101, 5, 34, -19, -102, -116, 41, -67, -129, -12, 55, -25, -32, 23, 125, 70, -7, 75, 119, 27, -34, 87, 91, -89, -48, -53, 22, -153, -111, -1, -43, -39, -20, -32, 1, -48, -35, 125, 95, 32, 8, 25, 72, 1, -53, 21, -64, -75, 37, -20, -159, -73, -61, -34, -119, 7, 78, 14, -33, 25, 86, 8, 9, 41, 5, 32, -91, 81, 0, -100, -102, -24, -31, -129, -145, -55, 174, -40, -122, 49, 157, 23, -68, 88, 208, -5]
3212epQ4Mj78qJ72l1j27p6J47%q7O3M4O7m4NJ7L0p9M9O7r1J3pj5q4J1K7P5j22
3243h6l0J49o5oK8l2N6o6J44L4j41j3J66Pk13j4J25M6j83n6J73L3j76j5J40Jp1
3270f5q5K51J4j46M3Q7k2m2j03J66j7j59K9R2oj23N8QL9j23JJ83j18RM4P5n0n5
3298a5Q8O8j21l9J00n2j41Q4O5q3q1M6J12j08j02J74M7n1j3J04K5r8m4J47l1j63
3324h2R4Q4m7j34j8J22M2j78k5J16N1j20M2R0Lr3M8J38o3j24Q1Q3o8j19K5N2l1
3351c1j43J47J%p8O1N4n1J7M6J3r3J63Jk6n4L7l4n5k5P2K2q1l9J43r4j21L1J06
3380a1L1j34K2J61Oj07JJ39Mj46mJ46o5j33K0J38j05m3n8K20j14j66J78J24o9
3405C5p6PJ52N2k26O9J33r6o2L4%J1j04K9kO5j24J4L2L5pl1N4K0L2NQj3ln0q3
$$ y = [-5, -12, 72, 76, -102, -110, 62, 31, -96, -172, -25, -25, -112, -49, -5, 62, 18, 23, 40, 70, -9, 40, 107, 16, 29, 22, 7, -77, -66, -39, 36, -86, -116, 33, -32, -38, -10, -42, 14, -52, 92, 126, -15, -28, 138, 145, -68, -82, 43, 89, -94, -150, 23, 56, -120, -135, 5, 6, -65, -150, 101, 115, -31, 12, 99, 77, 35, -68, 98, 81, -78, -49, 43, 37, -86, -28, -20, 19, -104, -103, 80, -38, -29, 15, 90, 40, -15, 73, 141, 20, -19, 81, 29, -112, -28, 37, -46, -127, -81, 31, -77, -179, -5, 42, -9, -22, 82, 107, 9, -35, 112, 81, -82, 12, 96, 49, -85, -103, 19, 61, -117, -142, -26, 25, -95, -53, 37, 40, -53, -5, 133, 70, -54, 27, 110, 42, -77, -52, 0, -31, -174, -27, -26, -26, -104, -43, 11, -40, -23, 23, 36, -57, 106, 107, 81, 27, 64, 30, -25, -50, 22, 44, -37, -76, 67, -27, -148, -117, -11, 20, -114, -92, 69, 75, -32, -31, 108, 112, -34, -38, 108, 43, -90, -70, 68, -37, -80, -138, 82, -32, -198, -20, 104, 35, -41, -34, 118, 170, -56, 13, 146, 50, -12, 22, 22, 33, -71, -42, -44, 21, -103, -89, -57, -22, -29, -60, -6, 14, 46, 51, 59, 46, 43, -7, -90]
3436i0J37m9j8q9Q3N3o7j73J52J36l7j76J02J42l3k03J57Q3o4q2O9J11m6j76K
3461g6J49r5j15N8R5j2q0o2J68k3j46J18J20J7j28K6R6nk05R8J09p8m6q6P5M5
3487A7o9k7Q1j20R6Jk3J0P2m9O3n8P4m0mO7o5n4jM7M2k1j74N3J15j05l7M0J13
3516D4J4j22M1J27pq6K4R6o4r1kJ03k0j29O7K3k3o1m5J30M2j42N3R8p9k0J07l0
3544D8k0mn0J23j06k9J6m7P8l1n3N0L6l1J2o8N2K4l2O8l6RRL8QJ1o1o2Q7m1l0
3575c2m9N3M1m0j10J15L4PL6p3M7L2n2jR4j09K0jk0J2p6O3Mp2j5O5j8K9n8P0O2
3606E8n4p2J30N9o9rm9Q2kp0l4N9m1p2P1lrn5K0J25o9l6N2mO6l5J5PNr1qN4l4
3639a3j6%L8Ql5j3K7q7Q3j6J6L8m1O1k6O3m2Qp8N2J6r0M1OJ3n3l6L9J7l3KM8M3
$$ y = [-90, 47, -2, -20, -109, -26, 27, -40, -213, -61, 75, 38, -138, -36, 106, 73, -130, 27, 110, 46, -36, 33, 144, 98, -78, -76, 73, -22, -137, -79, 16, 4, -76, -138, 30, 7, -139, -21, 99, 116, -12, 14, 110, 105, -100, -2, 107, 29, -17, -103, -28, 17, -52, -79, 2, -118, -22, -21, -44, -34, 38, -11, 52, -6, 68, 28, 24, 91, 26, -28, -29, 18, 60, 39, -135, -82, 33, -72, -109, -69, 44, 58, -64, -23, 104, 97, 11, 35, 131, 67, -24, -26, 77, 57, -72, -5, 18, -5, -66, -111, 19, 61, -81, -28, 70, -9, -29, 78, 48, 28, 24, -26, 97, -9, -38, -22, -69, 9, -22, -75, -25, 11, -20, -8, -76, -24, 0, -32, 36, 0, 9, 18, 56, 64, 75, 14, -48, 39, -2, -32, -81, -28, 13, -27, -137, -22, 12, 19, 55, -18, 29, 61, 9, 8, 102, -7, 13, 12, -8, 4, -72, -9, -5, -77, -92, -27, -45, -16, -74, -4, 58, 4, -68, 62, 121, 52, 43, -6, 76, 74, 4, -30, 29, -12, -84, -13, -16, -25, -80, -60, 65, -4, -40, 12, 8, 74, 39, 54, 61, 66, -25, -33, 21, -13, -29, -29, 9, 17, -18, -31, -4, -91, -8, -24, -8, 30, -11, 50, 24, 87, 45, 53, -25, 27, 43, -47, -6, 0, 13, -40, -76, -37, -20, -53, -51, -3, 40]
3672D0l0m9P6P2j59J0J21k6j1p5K4J32j19j35J16M7j28rM0R2n7n3P3Q8m6j12J36
3699E8k%j9k4P2r1JnL0n7m6K3O7Oj12J26k5k4Q4j08M3O0n9k3J8P7l7p1L9J2Ln4
3731c8K1j2L4m4j2L5O6ql1k4R0n5n4J20j4r2M5O5n7n1m8L9L4r3k0J08k5m6L8N
3761b4P5k6mL0K2o4J6K7M7r7n5Q4K1r5oO1l3j8j10J45L1q3O0L2K1No2L4N2n5l3
3792bL8m7J0L2q0Jk1kL3NnM6p8P7m2jN1L8l3MN3m4l2O8n1K6k9m8O3j19P3lj1j5
3826d5L1N0ol2K9O9n6jL8n0qq5J28Mj27kN8Lr4J0Q4P4r8kk6N8M3pPm9LM0Qk3j
3861B5j1lo9N0m1LK2o2K5O0k2M3J8n5k7M3Q2r6KR9mj18OP7o4J0Np4J02q4p8J53
3893A7j8l4rK6Q2p2K0Q9L5j47N8QJ8p5l8Q5J2q6q3J09l6N4m0j0J03m9J4N4o4k2
$$ y = [40, 10, -39, 37, 109, -50, -40, 81, 55, 44, -31, -7, 125, 6, -129, -13, 34, -94, -103, -63, 29, -28, -81, -8, 80, 34, -78, 58, 56, 56, 37, 13, 85, -6, -5, -10, 20, -37, -83, -60, 7, 13, -99, 27, 2, -22, 62, -46, -3, 57, -2, -25, -7, 70, 33, -38, 1, 13, 16, -38, -17, -29, 5, -39, -51, -16, 50, 42, 11, -13, 77, 22, -32, 88, 74, -18, 27, 92, 35, -16, -64, -25, 9, -84, -104, 4, -21, -67, -29, -24, 51, 25, 21, 51, 73, 9, 25, 52, 99, 2, -53, 31, 52, -43, -49, 12, -21, -39, -149, -4, 27, -56, 4, 36, 57, 62, 0, 34, 86, 31, -2, 36, -11, -1, 31, -49, -48, -69, -71, -38, -33, -38, 8, -70, 7, -35, -36, 15, 53, 20, 24, 77, 33, 1, 69, 18, 44, 15, -33, 30, -89, -16, -19, -30, -45, -14, 36, 30, -2, 27, 96, 40, 39, 77, 27, 19, -66, 62, 66, -61, -63, -5, -2, -96, -86, -2, 72, -26, -28, -54, 4, 47, 40, 47, -2, 1, 41, 49, 26, 25, 14, 11, -58, -8, -49, -46, -24, -86, -61, -1, -23, 20, 38, -17, -44, -1, 81, -15, -13, 86, 82, -36, -30, 47, -17, -7, -2, -76, 26, -58, -136, 17, -1, -35, -44, -18, 64, -8, 12, 101, 136, -11, 47, 55, 73, -2, -40, 45, 57, -29, -112, -3, -39, 15, -25, -35, 68, 19, 33, 87, 23, 1]
3923AP4o3Q0k9p4J1j6n4N4p0M8Pkk5j0Q9oNp1P7O0o8k3K5Kl4J5M7l3l5J8kj8n4
3957g4jR0j2m9MJ08J7n8l3N4ln0m4Q4K8n3l4k9Q3Jj09N1J3J0m6N1l9J11j48M6
3987c1O4j5Q5q0qJ6Qk8RL3q2K1q8R9Qo8M7J3P7j26jN4O8Ml2Nk0%p7L7P6p8k3L2
4021am9K5o4N0J6m2K0K9N5j5K4l5%M0k0K3J4o7j2M5J0n3p2%J02o2J4J2k9J9J0
4052a3k5N4K4k4j3N1K8l2j10P8J8q7J9j4Q0k2o8j3lP0kj1k3J19m6o7P9oJ4m7K
4083A0j9j7jOM9p8N4ok8kl7j4Q4j2J1N1k4J7Lm7K9Rl7J7pp7N0k5K3OJ8k5RM6k7
4118IlpL8n7P3Q8j40NM8l2k1j5L6j3o7K5OK3J0L0o5K5j1MM5Nk9K6k4J6K4q9Q0
4151D3l2k6l1L0k5KL7RkK3L1o0L5pMoN4J3r0Q4l1k5n7l1L6L1l6L8q1R9n3j0J4
$$ y = [1, 75, 12, 92, 63, -11, 0, -16, -70, -16, -86, -38, -31, -33, -58, -68, 21, 15, 20, -51, 26, 86, 18, -5, 20, 22, -12, 3, 50, 17, -18, 0, -2, -20, -74, -75, 15, 3, -46, -42, 66, 83, 25, -8, 46, 43, -7, -51, 33, 61, 8, -26, -55, 28, 29, -80, -29, -16, -6, -52, -1, -40, 71, -77, -31, 33, 18, 103, 23, 15, 31, 39, 11, 20, 53, -29, -8, -96, 3, 11, -57, -10, 3, 80, -46, -47, 7, 75, 79, 47, 52, 32, 32, -45, -8, 68, -10, -33, -1, -50, -25, -89, -39, -23, -65, -45, -16, 39, 24, 48, 13, 13, 53, 33, 56, 70, 3, -9, 36, 46, -7, -79, -79, 23, -39, -25, -13, -42, -23, -13, -38, 16, 40, 16, 3, 54, 82, 50, -60, 18, 36, -51, -32, -46, 34, 12, -56, -69, -72, -2, -4, -15, -38, 81, 35, -32, 47, 41, 55, 8, 10, -9, -26, -27, -21, 28, -50, 4, -2, -30, -32, -69, -83, 1, -11, 0, 51, 27, 44, 47, 0, 29, 38, 1, 18, 11, -66, -16, -41, -18, -12, 6, -19, -10, 36, 9, 6, -1, 37, -20, 53, 141, 1, 6, 54, 22, 1, -14, 22, 9, -58, -33, -27, -4, 6, 36, -29, -4, -15, -11, 34, 39, 10, 36, 12, 28, 52, -37, 43, 11, -15, -46, -16, -41, -39, -2, 7, 5, 28, 59, -1, 34, 27, 31, 25, 79, 92, 2, 86, 55, 30, -27, -58, -22, 9, -27, 11, -70, 29, -24, -34, -20]
4184b0K7N1o1N4o0Q6J4j01RroP1j6l2k9p2N8K7n3N5rN5n0j4K6Q8o4m3O0K1m1J5
4216C7j3mm2k3O7p8j3J22n0l5k2L0LM3m2L8K1QQ4j26J20j12k3M6J3l9n0O8n7M5
4246A6m6M1l8JJ6L4K9m2j2N6m5L1k9O1p5n0R0m4LOo5j2K0j8Q2J7p5J5R8m0l8K7
4278A4O6j3j39J78k4m4m1j0k9N6oJ4n0j2LK7K3j6k2K5M1o4MQ1l5m1K0l4M4j0j
4309EM9n5q7O8M6Qm9l6M0k5L1RK2j6N8No5L1J9rj1r3N3J1K1n0j6L8rl9L7L7jn8
4343c1L3N7nn9k0KL5pK0M2r3Pm7Q1q0K5K9N5l8p9O7K8q0R4K3n3L0O1o7M9n5M8
4375G2l9pr7Q1N0p3K9M2j3r6J5Q0J7l0n1O2j1m3j0P3k1o7qP0l8m7J01n6%L1l5
4406a9K9K7j5m8N4k8lN6m9J3RJk1K6l6P3j25N3j1KL6m0N7n4n2Q5kj6N2oo1J2R
$$ y = [-20, 7, 58, -3, 51, -9, 77, 91, -10, -1, -10, -16, 55, 39, 7, -22, -94, -36, -9, -62, -7, -16, 39, -11, -25, 1, 89, 25, -18, 42, 63, 22, 37, 24, 20, -22, -45, 22, -56, -69, 53, 3, -32, -54, -24, -21, 22, -20, 18, 39, 47, 131, 5, 125, 13, -10, 36, 49, 10, -40, 28, -29, 16, -30, 11, -27, -26, -10, 24, 53, 11, -1, 55, 10, 41, 12, 73, -2, -52, 38, -6, -3, 3, -62, -74, -54, -72, 10, 27, -48, -33, 65, 25, -13, 14, 80, 67, -72, 106, 82, 38, -3, -13, -42, 14, 8, 22, -28, -40, -37, -10, 13, -3, -25, 0, 41, -23, -19, 62, 27, -14, 6, -28, 16, 6, 5, 54, -1, -88, -20, 26, 34, -15, -51, -11, -36, -5, 4, 26, 10, 68, 73, 8, 39, 58, 49, 38, -55, -2, 9, 30, -20, -36, 2, -7, -46, -9, 28, 27, -31, 2, 59, 54, -5, -25, -23, 12, 5, 25, 67, -26, -19, -66, 15, -65, -40, -11, 44, 6, -73, -6, 22, -58, 36, 59, 6, 36, 97, 30, 79, 24, 72, 33, 26, -71, 10, 60, -13, 16, 58, 45, -51, -36, 44, 61, 31, -20, 42, 31, -12, -22, 51, 30, -37, -45, 25, -13, -60, 41, -15, -15, 16, -19, 10, 37, 22, -26, 28, 0, -3, 53, 4, 17, 26, 27, 6, 32, -4, 69, -56, -3, -14, -12, 24, -16, 41, -13, -65, 20, 18, 2, 54, 48, -13, -1, 8]
4439Hk1M2m6L6Jk7Jnj0N8k0p4O5j5plL0L2M6q8L6l0j7o4J06j4K4o9L6jq0O3k2
4472b9L4%JJ4l2L1k9L4K7p8J43j05k6L8o8N8l7J3k2j8l7K0P6m0QL2M9j5q5M3K6
4503B6j7J2Nj4nKJK4j04K1M5L5k0k5OOM0m9PQ2J9j19K8M7p6L5P2j40P8l2j0Pk9
4536d2J8L7p6ML9L7k1L3o2R4M9r0rJ3K4k9q6K2O7rn6M1m3lK5M0m5J8J7K1k0J2
4568B0m9L1l5Q0n4N0n3L7n1NJ2K3j5q7O5N3n1K2L8j2k7M3J2j8o9J6P7m0k4q7P8
4599a0QK1n6L6O3l5m6j8N5po2N6k4R4m3p5J05n5KrJ8J8j9n8K8L8m9m2P0N6n3j1
4631dK3M9p9P5k8J2o8k2O0PK4n3M7M2j25jlP0J4rq8oJ04p2P1Lk1n2M6K2Klj7j7
4665CJ1L2r8M1rj0K7K1J9j3k9K6L8m3l7K3L5Pr9M1O9l5r6N3oN4m5o3O5M6m7L0
$$ y = [8, -13, 29, -17, 19, 20, -7, -6, -11, -21, 37, 17, -57, 8, -7, -14, -17, 13, 45, 91, 3, 39, 9, -8, -72, 34, 20, 44, -25, 11, 10, -70, -7, -29, 5, 5, 6, 20, -12, 19, -10, 24, 51, -27, 116, 11, -15, 23, -45, 13, -24, -11, -33, -51, -88, -68, 8, -32, -24, 8, 57, 42, -43, 0, 26, 9, 21, 26, 12, 7, 9, 10, 34, -70, -49, -4, 31, 11, -14, -8, -2, 38, -11, -4, 78, 97, -22, 6, 53, -23, 12, 84, -56, 22, -10, -20, -13, -42, -24, 13, -63, -59, -20, 17, -4, 29, -33, 61, 110, 20, 11, 24, 48, 19, -67, -45, 22, 13, -43, -2, -45, -48, -23, 17, -28, -10, 7, 28, 8, 20, -29, 2, -33, 47, -7, 43, -10, 27, -24, -19, -7, 16, 1, -86, -21, 32, -19, 3, 41, 29, 2, 45, 57, 39, -30, -14, 63, 23, -1, -88, -10, -2, 19, -37, -1, 62, 27, -19, -37, 18, 11, -51, 5, -19, 75, 32, -43, 62, 7, 9, 0, 18, 36, 17, -41, -13, 25, -24, -66, 4, 60, 7, -4, 19, 68, -11, 64, 36, 48, -20, -42, 18, 25, 49, -4, 43, 85, -40, -41, -44, 26, 40, 31, -57, -63, 41, -31, 40, 43, 22, -30, 16, 38, 40, 37, 20, 3, 14, 46, -52, -11, -20, -30, -3, 18, 37, 24, -5, 21, 59, 16, -21, 2, 37, 44, -55, -14, 55, 20, -76, -23, -29, 25, -20, -83, -18, 28, -19, 11]
4697A1K0j6rK0Mj0k4K4ql2O5m1j8N3m1j8K2lKm6M0J1L5m6K3Kk9J6M0j7O3j10N8
4730D1o1M5Ml1Kl5O4j13R6n9N9lK3l5j0lL6j9M9N1p4oJ7MM4q9oN4q3K1J5M5r7
4763e4O6J6j06J51j05j3L1K6k6QK3Rn3N5oj7qJ8l0m5P2l7J7M7k8mj0L7k2m4J00
4794F8Nm8on2O8no9l7P2lJ2j6j6J3lN6l9O0n1L7j01R2q1Q1p3N6K1Jn1nN1r9M8
4827a4j1L5k1L9J2n7NN6k2OL1m2qP6j08M1o4M9J9j0l0PKpJ7j1kk2L0M0J5j3L3
4860G1j4j22R0O3q0M4k7o4O8o9M4J4k3j2L2J8M0k7l3J1L2k9K9o8J4l5M8k7M3n0
4890a9j8KM2rm4L9j3OJ8k3N0j1j2k5M7j2k9L6o0O2l0l5RL5oj5J9k1J5J0L0N2r3
4923ck5j0M5k9M3J7J1Pk9m8KM2m2j0L1k2q3P8OL8n5M3M4k3Mk2M8m1Jk4m5J03k4
$$ y = [11, 31, 15, 6, 26, 30, 20, -4, 20, 12, -20, 45, 4, -14, 39, -2, -20, 2, -1, 1, -45, -5, 6, 41, -5, 18, 20, -9, 7, 47, 30, 93, -17, 41, -20, 25, 29, -2, 0, -35, 29, -84, 12, -47, 12, 9, 32, -3, -13, -16, 20, 1, 50, 101, 27, 21, 38, 42, 86, -3, -9, 45, -38, -17, -2, 43, -54, 12, 28, -78, 73, -32, -45, -14, 12, -14, -6, 17, 26, -27, 28, 22, 5, -3, 15, -15, -60, 12, -25, -8, 39, 11, 7, -3, 34, 12, -32, 68, 73, 25, 19, -33, 35, 30, -39, -76, -4, -7, 5, -11, -27, -14, -17, 39, 0, 60, 9, 46, -55, 37, -44, 37, -36, 20, 41, 42, -9, -14, 37, -62, -14, -25, 10, -11, 28, 40, -17, -12, 44, 22, 28, 59, 17, 9, 85, -23, 18, -46, 3, 22, 12, -18, -11, -9, -16, 1, -10, -12, -34, -4, 36, 51, 38, 71, 57, -65, 25, 88, 8, 52, 25, -39, 29, -40, 4, 18, -5, -17, 15, 33, 73, 46, 13, 24, 56, 27, 56, -12, 2, -33, 15, -12, 31, -19, -37, -35, 7, -2, -46, -7, -20, -14, 4, -19, 31, 20, 8, -17, 30, 18, -11, 25, -35, 27, -3, -38, -29, 6, 0, -15, 4, -17, -2, 8, 38, 90, -3, -28, -38, 7, -22, 21, 38, 49, 56, 27, -21, -19, 23, -19, -29, 2, -20, -103, -25, -19, 19, -36, 7, 51, 28, 32, 10, 58, 17, 18, -6, -51, 52, 28]
4956B8p1K4j3M5l0k8Q3p1N3m5P3n3j7L1N3k8o5Q9j8j2n1K7%mn3L8M4j2o1N4k9
4987a9M7k9K5LJ0ln6P6m4K6p9O7j0M1j11Q7l4L4m6M5l1mOK5k8J9n3O2l4n2P0k0
5019a0Rj4L5l5L1m4J2K0o6L8M7m9L6K6Om8K3k6j5K4M2j5j4Jj4O0o6o8N8K8m7K6
5051ioM7n3O1j3n8K7j7O3nl7RPPj8j7L4m9K6j4jJ4pJRO3q6nPL6j0rM6k1on9P0
5088B7J3j7Nn8L4kl0L2lL2K6q2J15o8M3p6O3n5M1J0o0mnK9m1O7p9L6Pkl7k8O1
5121fM4k5km0J24n9rm7O9k3k1M9l1k2l8P5k5P1j41N9L9n6o1O9K5Ql0K5L4p7J1
5152a1L3k2L2j7p3P2k2Or1Q3Ml5LM8j7L1J7o9O7N0p9N7p8K5M8n7k0M9qnk9j5M
5185a9J0o5P5j6kM1Ol9RQ9o9nn6O7l6J4l5L7K7k6m8jO0k7J2nm5M5Kkj2Q0n0J2
$$ y = [28, -43, -19, -32, 13, -17, -45, 38, -33, 20, -25, 48, -5, -22, 9, 62, 34, -31, 58, 40, 28, -23, 4, 4, 0, -53, -15, 29, 17, -44, 10, -19, 28, -1, 24, 27, 37, 34, -22, 54, 10, 36, -43, 24, 14, 55, -56, 31, -3, 31, -15, 30, -1, -5, 1, 26, -2, 17, -36, 26, -8, -60, 10, -10, -1, -15, 20, -15, 16, -28, -16, 4, -62, -24, 23, -26, 10, 36, 42, -6, 17, -9, -24, 0, 42, 27, 13, 14, 0, 60, -6, -74, -16, 12, -35, -9, -15, 32, -21, 40, 27, -31, -4, -21, 42, 37, 0, 9, 16, 23, 5, -12, 22, -27, -1, -15, -16, -2, -9, -8, 1, 64, -22, -27, -20, 16, 6, -3, 43, 22, 16, -43, 27, 40, 23, 28, -30, 4, 2, -28, 4, 1, 33, 59, -23, 92, 24, 67, -9, 54, -1, 40, 50, -10, -14, -19, 10, -31, 36, -43, -7, 0, -2, -39, -67, -6, 38, 13, 11, -29, 95, 36, 27, -20, 49, 26, 5, 54, 23, 1, -37, 38, 13, 84, -57, 2, 41, -15, -76, -7, 18, 26, -4, 21, 55, -22, -11, 22, 0, 32, 15, -58, 14, -8, -2, -93, -10, -6, -41, -38, 10, -7, 24, 41, -28, 39, 89, 10, 67, -11, 14, 62, 5, -15, 34, 26, 21, -8, -23, -19, -9, -74, 1, -15, -17, 24, 30, -9, 0, 89, 20, 15, -41, 26, -10, 4, -31, 6, 33, 7, -41, -42, 18, -9, 3, -2, -47, -2, 0, -2, -14, 66, 16, 28]
5219B8O5j35L7M1k3J1m8j4O3k0%KOj1Mk8L6L0n3JQ4p9Jj0MQ7n3j1J5m0K1l3J9
5252cmk3K9N5rk6p0O4j7L2OJ6j34O9N3m3P2n1qk4OJ0LlRk0m8K9L0J2jN9r6N8m2
5287a0K4k9M0k0K2K4k3l2k3K9Rl4N1k2LO9qp2O6kknn3n5M3K4j6j4qN3o4l3P8o9
5321e9N6N%O3p0L4j9pJ1L3n3M0o0K5KL7j00M4JpJ3J8m8RK1O%N1K7q8K9K9J1m8
5355Fj1J1n8Q1q3J9rL7OJ0J8m5k7M0K3qj3J3K3l0J3%%m7oP0n9J5K3k3L5m8J8k6
5389c2k0P3m2M1l4N0K1k2p6L6J2j5j5j0P6o7M3p4J5L6L0mm7l4R9l2j7l6K2M8N1
5420G6p4M4l3J4l0L8ll1Ll3K4L1k3L0o8K1L7mp6J01j6m7P4o6m9L2RmL0m9K6J4
5452bj1Lm1M6j9M3lOj5%N0p3K8M8j2l8n1M8L6n7n0K4K5M1J0oKk7M8l8MJ6k6l0
$$ y = [28, 93, -42, -5, 36, 13, 24, -24, -38, 25, 5, 5, 7, 13, 2, 6, -22, 14, 44, -9, -8, 76, -3, -2, -12, -8, 79, 26, 15, 30, -10, 11, -22, -3, -7, -30, -1, 54, 45, 19, -51, 13, -4, 28, 34, 50, -84, -15, 38, -5, 67, 16, 8, -16, -10, 0, 3, 0, 9, -11, -59, -30, 0, 12, 11, 70, -26, 32, -10, 14, -15, 25, 5, 27, 51, 28, -4, -27, 2, 11, -23, 28, 6, 9, 78, 70, -2, 64, 62, 60, 55, 2, -53, -10, 14, -2, -16, -24, 29, -35, -68, 10, -59, -3, 2, 2, 65, -5, 29, 10, 3, 14, 47, -6, 34, -26, -1, 1, 38, -62, -18, -17, -24, -11, 7, -41, -32, -11, -5, -5, 46, 73, -15, 14, 43, 54, 6, -5, 6, -52, 29, -54, -35, -44, -7, -1, 9, 27, -18, -45, -5, 18, 10, -3, 10, 33, 3, 16, 16, 16, -31, -37, 33, -26, -11, 12, -11, 24, -24, -6, -32, -52, 21, -21, 20, -14, 36, 57, 35, -41, -5, 7, -8, -23, -33, 43, -24, 19, -55, -40, -4, 26, 22, -25, -59, 40, 8, -9, -45, -23, 25, 76, 2, 46, 13, 27, -3, 35, 32, 1, 4, -29, -5, 26, 3, 33, -35, -14, 23, 19, -57, 44, 28, -19, 55, -11, -60, -28, -19, -23, 7, -42, -16, -2, -13, -10, -51, -5, -24, 19, 16, 22, 7, 7, 57, -16, 12, 60, 48, 10, -41, 7, 43, -14, -64, -40, -15, 26, 36, 30, 32, 5, 53, 15, 19, 35, 9, -21]
5486b1N3l5ok7o4J03j7j6O4l5oJ7nL1m6L6jo7PN5j9M7m0l7kN6oRk6o0P4r8N3k1
5520e0Q0j9n2P8n0M7jK2q7jJ5N8K8o4jk4k4N8m0LNJ8k3J0%jj8L2mOPQ7l5n4pJ8
5556A7K1l9j1l0P5ql6j2M8n0JK6j9j1O0l0j7J2pj7L2l4L4l6P6l1Kl3J4M9l5o0
5588d9N1M9o6j8O1Qn1K7l7K5J2K3pj5J4l8n9Q5j2k1K2j9K1pl2M1J1j1M9j3m9J6
5620A1jlLM4o3j3J8jNj0L7l3ml8O1mk6L7l9L2k6Q3m8k4rM5mJ7l5o9P2k7J1k5j0
5655c6K8l1jP3rn9N4n1L8K9%r8O1k7M6m4K8Ol2KK5K0n7K4k2J07r1O1k9MO4j09
5687b6l2O9Mm1lK7rJ5kLmmq8Q7j8L0L5m2L0J8m6l4P4k2m7K1M2k2l8N0Qk9l1RK0
5722DnM3J6o3L3j2nm4L3M5o6M3njj9k9lP9n3o0Q1J5n8L8J1Mj8M6p0N3Pm5O3J3
$$ y = [-21, 32, -3, -9, -36, -100, 3, -14, -30, 34, -1, -7, 10, 5, 36, -10, 26, 25, -42, -35, 20, 1, 48, 8, -29, -31, 25, 19, 28, 2, -58, 16, -82, -29, -50, 30, 11, -41, 37, -13, 34, 33, 55, -32, -33, -18, 40, 68, 4, 3, -21, -45, 13, -27, -24, -19, -1, -24, -14, -14, -15, -33, -1, -5, 1, 8, 95, 60, 6, -1, 17, 38, -1, -12, -42, 33, 25, -11, -23, 25, -25, -24, 2, -17, -28, 32, 2, -15, -3, -10, -27, 5, -29, 5, -31, 45, 14, 16, -17, -3, 46, 11, -49, 2, 51, -15, -33, 28, 36, -15, 12, -25, 0, 12, 35, 28, 13, 27, -11, -70, 15, 3, -18, 4, -15, 6, -1, -33, 8, 19, 8, 57, 44, -5, 11, 10, 7, 10, 54, -9, -22, -4, -5, 0, -10, 27, -6, -10, -48, 13, 9, -17, 20, -19, 13, -13, 70, 22, -2, -11, 34, 30, 47, 12, -57, 15, -12, -1, -26, -36, -8, -39, -40, 33, 24, -35, 19, -32, 6, 35, 35, -63, -2, -29, 17, -27, 1, 7, -25, -23, 2, 22, -35, -11, -33, 74, -17, 44, 15, 19, 83, -26, -58, 11, 15, -26, -29, -2, -11, 4, 2, 5, 1, -3, -91, -4, -22, 8, 43, 1, 31, 49, 3, -31, 43, 21, -26, -5, 37, 15, -23, 27, 35, 6, -25, -16, 4, -1, 42, 58, -5, 28, 16, 11, -33, 0, 45, -21, 22, 17, 16, -3, -32, -35, 44, -9, -69, 12, 27, -31, 7, 18, 22, 4, 50, -20, 33, 40, -5, 58, 71]
5756G1j5p1kL8k9%k4RM5rk7O1n3J7K8kk9P0q4RL1m2L0k6Rol0oJ6O3q2O0OMKl6
5792dK1k3N7r9R2n2M6mK5k0k4L7j3k7m3L3j1qj7L8J6l2l8K7K6Jj5n7O2k9L1oq
5825a8J6l7jK9L4om6P4j05Q0k7N7Pk3j9l0M7k5K7k4j7jMLK2OK7j9MJ8j12O3k7
5858a9L0m3O4l1l1N5j7Kl9K1l7MM4m5L8K1K3M3o5o4M6J3J1j3qK7p8N7J6Kq7J16
5890E6j4m6N5m4%j3k2nN6j7P4j35Q1n9L4L5k9k7R7q3J4ml0M7J1j9l2Kj6J2O8q8
5922d1N9k8NM7k1l3M2K0k5M6r9N8ol6J4n5M4rK3J1n7O0k5j0kK4N4j01P6j2m7J2
5954a2j6K2M9l9o7O2ql8N1%k9N7n0KO4oo0P0o0J8NJ9KJ3J6n4j0L4k6l3J5J6K9
5987C6Lr0O8l9j8O2L9o1%j4PJ7m1L0J1o1O3p2O6L2o9L1JK6n3O3Qj5J3j4j0J5P
$$ y = [71, 56, -15, -17, 21, -8, -8, -32, -23, 22, 13, -14, 47, -6, 11, 39, 37, 8, 78, -6, 3, 34, -8, 22, -4, 5, -1, -31, -37, -21, 42, -40, 20, 26, 30, 32, -4, 17, -6, 51, -48, 44, -8, 38, 34, 59, 39, 15, 52, 39, 12, -31, 2, -9, -17, -34, 4, 20, -12, -50, -23, 3, 4, -11, -68, -6, -35, -4, -10, -18, -2, -39, -40, -11, 23, 17, -29, 45, -60, 20, -7, 50, 57, 34, 15, -15, 32, 7, 34, 10, -7, -8, -4, -1, 21, 27, 54, 35, 39, 57, -55, 8, -19, 11, -32, 32, 1, -30, 25, 8, 10, -29, -8, -45, -41, 3, -42, -4, 17, 40, 83, 18, -46, 0, 13, 24, 11, 3, 30, -48, 9, 25, 27, -60, 56, 42, -4, 51, 7, 7, -6, -28, -33, 23, 6, 80, -55, 26, -33, 1, 36, 7, -20, 77, -6, 8, 4, -26, 21, 32, 13, -19, -17, -33, -21, 47, -41, 18, -10, -5, 42, 21, -12, 30, 50, 25, 71, -28, 30, 24, -12, 2, -53, -9, -18, 5, 16, -41, 19, -6, -16, -18, 6, 60, -41, 35, 23, -24, -12, -28, -6, 43, 4, -63, -1, -9, -47, 4, 4, -25, 32, -18, -16, 48, 42, -18, 52, -8, 10, 15, 34, 36, 49, 65, 11, 1, 35, 9, -24, -9, 7, 36, 39, -51, 17, -22, -40, 22, 61, 0, 0, -14, -7, 10, -31, -1, 10, -51, 12, -60, 6, 38, -31, 0, 1, 27, -26, 37, 45, 30, 43, 29, 19, 34, 41]
6020D1j0m4M7M0n9n0L8N1m4L5j06Q7n1K8J8L8l7o2L2j4Q6m3j7M6p1N3l1mmj7O
6051a8rNJ4J1k0k0L9L1j4m9L4pk7%O7m8L9N2n5o8L7M3n0K1m4N3Ml1n7K5m0J13
6083C1j8qK7j5j5qM3o9N4om2P7n8J2J7Rl0M8J5k0m4m5L5j1P7n3J4%J3l2J4qk8
6116b4l3J5M9m2K7L7m6j8L7L3k7m4R4j5k3K3J1m9L9r6n7J19N4o8J4l3P0Nn8Mr
6147a1j6j5M9K1Nj6k3m1jO6K7o9K2j6L3J7k3k5J0J2l4k4N1K2K7k9m4K4M6o4kO8
6179D7rk3PM7p4j4N6o6M4m2N6ol8m6O0Pm0J6P3o6M9qOk0l3O4p1L2J8l1rkm9N4
6213a1k3J2K8J5nl3Q6m6j1J9L9q6K4LK9o8O7l6k4j6J0kL0m3N0mJ0Mj2k9M2K3p3
6246c1K2nL3n8O8Nn1O3q8LN8J7q3P5l3l9J05n7k6L9k5pO3j1j0rm2l7P5Lm2pL4
$$ y = [41, 31, -13, 34, 74, 15, -35, 3, 54, 10, 45, -61, 26, -25, 3, 21, 59, 22, -40, -8, -22, 64, 21, 4, 50, -21, 32, 1, -3, -7, -24, -18, -27, -22, -8, 3, -17, -37, 2, 33, 19, -30, 4, -3, -30, -30, 37, -11, 28, 80, 25, -43, -6, 37, -13, 8, -36, 17, 21, -10, -67, -42, -82, 31, 13, 5, 32, 17, 2, -6, 37, -32, 22, 16, -26, 51, -7, 5, 22, 31, 1, 49, 64, 44, 0, -45, -10, -21, 56, 3, 17, 17, 30, -2, 12, 4, -24, -57, -42, 7, -35, -8, 29, -17, -35, 2, 35, 8, -36, 58, 43, 20, 43, 54, 5, 44, -52, -109, 10, 64, -4, 10, -23, 47, 52, -6, -2, -11, -27, -42, 7, 28, 33, 17, -6, -47, -48, 18, 45, -24, -2, -18, 15, 32, 9, -16, -6, 6, -28, -52, -1, 21, 48, 19, -25, -1, 45, -19, -21, 47, 38, 15, 22, 69, -5, -19, 37, -29, 15, -27, 29, 23, -15, -61, -1, 6, -34, -18, 55, -11, 38, 30, 36, 16, -17, 47, -24, 8, 26, -5, -14, -16, -65, -11, -34, -22, 6, 21, 16, -17, 69, 23, 12, 31, 70, -16, 8, 11, 40, -28, 39, 3, -21, -37, -27, -29, 1, -42, 8, 4, 14, 18, 6, -23, 19, 42, -31, -9, -14, 19, -39, 29, 34, -17, 46, -42, -39, 19, 36, -47, 28, -5, -44, 61, 4, -22, 17, -8, -15, 48, 37, 27, 18, -24, -61, 14, 17, -25, -32, 2]
6279BOLQl7K4o3N1%M6J1m0Ok5NJ1K0j6Ol5qK6Pl7M9k8N5k6Qk8QM8p9P1qJ6m1l5
6316a9M0K7o2NLJ0k0QJ7k5O0n4N0n6J7n5M0j0L8Kk2l9N5M6m2l9ML1l4k3JN4jO
6350A3K0rl0M3j4k4K8j9l8Q6q1N5l5L5L5j23N1opK5Ll3J8KL3Nj8k4J1NJ6k5NJ0
6384A3n3L4N4o8L2l4pN5k4k3N6l8N5r7kL0M2J0k2m4N3m0j2MM7k6j8L3Po0P6k3
6416A0L3m0Jj5O4m1m2QJ06n7q5P4n4N6n6M1OkK3o5J00m1n6K4J5qk4K1M3j9j8j
6448An3N5l3L9k3K6m9K6lnK5k5P5o5Mj3RQK4lk8NK2l6oL3K7j8m3j9N7j7Klk5J8
6484a1K7k4M9q7R7J0n8K0K0l1p4L6Q1q7L4j1j2L9l9L4l%k1J4k0P2p3mPM5m1J2
6516AL9l9K1J4n0K2Ol5L8l3J9N1n1N1k2k6MO9p5K2m0j7j7PL5l3M5K3l6K3j4p0
$$ y = [2, 8, 11, 19, -18, 6, -57, -6, -6, 40, 51, 11, 17, -8, -3, 8, 28, 12, 18, -17, -25, 1, 8, -29, 20, -8, 47, 21, 29, 1, 9, 57, -22, 49, 41, 57, 16, -19, 21, 48, -14, -9, -6, 4, -16, -8, 9, -16, 44, -10, 40, -16, 1, -54, -14, -24, 14, 16, -6, -45, 10, 56, 14, -25, -21, 10, -24, -47, -46, 8, 7, 13, 33, 24, -6, 37, 23, -1, 27, 8, -30, 56, -25, 30, -5, 30, 65, -58, -7, -13, -20, 5, 8, -25, -7, -5, 28, 33, 15, -9, 2, 7, 23, -2, 3, 13, -40, -6, 48, -20, 12, -22, -29, 26, 2, -21, 35, -3, 52, -45, -47, -17, 25, 35, 13, -31, 22, -18, -30, -26, 21, -5, -23, 10, 17, -43, 33, 10, 43, 3, 4, -11, 53, 12, -30, -22, 84, 27, -58, 16, -38, 18, -38, 3, 9, 7, 30, -35, 65, 24, -32, -8, 7, -1, -25, -4, 39, 20, 2, 1, -52, 3, -30, 9, -14, 12, -37, -11, -14, -19, 6, -19, 56, -9, -5, -18, -9, -1, 23, 20, -8, -3, 19, -17, -23, 10, 37, 19, -24, -43, 14, -3, -1, -4, -29, -11, 16, -8, 41, -46, 51, 61, 3, 23, 43, 12, -62, -26, 55, -32, 2, -9, -21, 18, -21, 13, 10, 10, -11, 3, -17, 55, -18, -22, -15, 30, -11, 1, 40, 1, 22, 36, -14, 8, 14, -21, 17, -16, 3, 54, 3, 54, 32, 6, 10, 79, 4, 26, -14, -31, -48, -41, -6, -39, 6, 29, -7, 16, 2, -68]
6548f8M7K0L6k3rM0n5Rl2O7K8K7p4j3M2o1L6M0k2j3l3L4n0L7pj6K1j3M4n9M4n7
6580c3N5kj7lJ2J8j8k9LNKk3K8J8L5K2m1r1O0M5n0K8l0OM%m1L4j6K8k7M8q1P3
6614B2q2L5nJ8K4M6o3K6Mk5L2l3m5L7L6l9L7n6K9JO3r4POj7mN2j7lJ0j7J2OK3
6648B6K7j4m6K4j6Po1K0Q6r4L4lK3n9L4J2nJ3Q1p6qm0J5mP5m9j3N6n5L3J3Nl6
6681Em2L1m7P4J9L2j7l8J4n2k0J5rP9j0ok3J2j3j9M3km6N1q1L7N0Nq7j2R5l7n6
6714e5O9l0RJ3k7L5k6L7m4J0J2k9L1N5n4k4OrP1l2k2rpL8l1p%J8k8k0J7K6J6l0
6748b1l2O2k2M7j4k7O7J0j1m1l3L1NOm0l3J1L5K5j4k9M7k4Ln4P7m7k3J1L8J7o2
6780c5M1Rrj1l9L7%J2l2N4k3PnK2m1l3P8k7nL4p1K3k4O1m2jJ5m1L8n3Q4m8NrP9
$$ y = [-68, -21, -1, 35, 12, 3, 43, -12, -3, -35, 32, 60, 87, 13, 0, 42, -19, 17, 57, 35, 22, -11, 23, -27, 10, 3, -13, 8, -5, 39, -20, 24, -33, 22, 20, 3, 0, 12, 30, 12, -17, -14, -9, -7, -30, -2, 16, 51, 73, 32, -59, 1, 46, -4, 24, -6, 0, 4, 4, -37, -3, -19, 9, -18, 30, -51, 22, -60, -25, -30, -12, 12, 58, -5, 21, 25, 0, 32, -1, -46, -9, 27, -12, 25, -31, -2, -1, 62, -32, -25, -19, -36, -40, 12, -5, -8, 2, -15, -3, 3, 26, 53, 39, -7, 17, 1, 8, -53, -33, 53, -41, -7, -10, 13, -46, -12, 0, -5, 8, 89, 13, 5, -35, -20, -24, 51, 2, -11, 45, -10, 23, 36, 41, 5, -37, -6, -53, 21, 40, 72, 55, 17, 31, -21, -41, -26, -35, 44, 34, 28, 5, 17, 4, -15, 28, 26, -20, 31, -50, -13, 37, 42, -45, -57, 38, 1, -55, 14, -16, -7, 6, -21, 14, -12, 25, -19, -9, 3, -26, 5, 60, 6, -18, -12, -21, 50, 18, -4, -13, -20, 18, -13, -20, -20, -2, -30, -50, -33, -7, 9, -21, -53, 9, -13, 34, 20, -7, 60, 70, 59, 18, -15, 16, 21, 27, -13, -46, -35, 0, 25, 11, -18, 29, 5, 8, -46, 31, -16, -39, -28, 10, 27, -35, 6, 15, 6, -5, -44, -7, -7, 5, -27, 27, 4, 11, 6, 28, -13, -46, 32, 5, 0, 34, -37, -14, -38, 23, -19, -20, -5, -46, -8, -61, 23, -25, -20, -29, 50]
6815E0r1N9J2o5P4%jj0k0QJ0K4q8N7m9L7k0J1J7Kj8mj4NPOO4j18O2K6j5q5Q7m
6849A6l7K5k0M6%j2Ol1M3l6j9P0j2k1ll2%J6kM0Or6OM6k5L2m5L8k5L6j6k7K5l4
6883d2O5j8m2K6L6m7oO4k7Qm8M7M5j0n6l8J7k2P4j8j5Pj7O9r1N6m6PN0k5Kk9L2
6916HJ8o0N6M5o0Lm2N2k1j4J4Rq2Q0M4k2mL0q3M6j5l1Q8m8KJm6O9o9Q9k5k8n3
6949d9P1K9k8J4o0P1m3J8l7Q4j07N2l9pO8q0K6jk8K7n1M1L5K6m0q0J92j06%Oj7
6980a3Kj5J6K1J8k3K3k5m1J02q8L2j7J7K3k9l4L5QL0K3n7k5M7k0LNRm7L6qKMk5
7014a1l6O6J7pm0M3l9J8J6NJ8k1K7k8l4J3rkm2L6n8P3k4J5PL2l7J9Jl1j8nO1k2
7048CM4q5J28j42M4LK6L9o6M2o7K6J3J8Qm5LrJ7qR0n9Nk5j4kK1k7J4o9O5N6o5
$$ y = [50, -41, 18, 30, -35, 39, 39, 38, 28, 8, 16, 26, 50, -38, 19, -30, 7, -13, -2, 15, 17, -1, -5, -19, -14, -7, -1, 63, -55, 7, 33, 18, -67, 20, 16, -21, 4, -16, 30, 30, 18, 24, -7, 36, 0, -19, 51, 39, 18, 15, -17, -17, -1, -3, 37, 43, -53, -47, -1, -26, 6, -39, -1, -26, 10, -6, -33, -8, -42, 23, 5, -37, -11, 25, -22, -28, 36, 9, 17, -31, 16, 61, 51, -5, -43, -26, -48, 26, 8, -7, 0, -17, 52, -39, 17, -29, -22, 28, 3, 5, -24, 8, 26, -34, 22, 67, 7, 10, -32, 20, -1, -15, -1, 8, -74, 6, 50, 28, 24, 54, -29, 17, 2, -29, 59, 11, 13, 14, -32, 37, -32, 57, 32, 4, -49, 22, 51, 23, 37, -23, 48, 5, 23, -14, 70, -37, 15, -24, -31, 37, -43, -17, -18, -46, -19, -70, -29, 6, 32, -8, -88, 104, -2, -2, 4, -13, -11, -26, -10, 11, 29, 6, 29, 4, -37, 65, -23, 9, -8, 9, 32, 3, -31, 4, 12, 42, 65, 8, -17, 30, 10, 13, 18, 27, -20, 16, 8, 10, 14, -11, -47, 19, 36, 29, -11, 32, -7, 11, 27, 32, 50, 29, 56, 28, -6, 7, -2, -4, -46, -10, -68, 5, -19, -4, 3, 35, -2, 17, 18, -13, -31, -36, 25, 3, 47, -38, 90, -52, -8, -5, 21, 60, -6, 36, -31, -5, 8, 26, 34, -11, -8, -17, 0, -8, 82, 23, 28, 3, -11, -13, 8, -19, -5, -74, -9, 47, -18]
7081a8K7J6p2M3RrM2o7N6l7nJL1l0M9Nn0Kl6N8l4J1J2j3K8PK7j9o1N1j1o6P7k3
7115AnJ9k4L7om7j8O4m7lM7j5kJ4J2j3kl4K2mN9o5L7Jl8M4nl8K1l4J1N5r6K5N6
7150B9l4J6L8k8m9P8K8n1l2L%l5O2j8l1L3m2K1J4J2j6Qm1OK6k4K9QN4q8j7N6l0
7183a5L5J8o6kjL7l1L6Qq1O8Km1M7K5k4k2LMN1J9o9lNo9J06l5k8L8k7J1N3p0m
7217b2NOoJ5K9q6O5LmoM3n3J3k8K4J4Nj0nL0n2N5m1KK1Rj9J0lj8J1k3N2n1KL0
7253A7j0l5N8k7J5j8j2OJ4o2J8O1qLML6n7n8j4Q9j0l0k3J3L0j9K2jl2L2l7J5J8
7286bL6jl2q0N7L7l0N0r0P6o3L5NM2j5k1k8l2Q4On2pk0kRM6l2K9PJ8k6k4N8ql5
7321eN0p2L8j8O7j6o2k2N8o8J3M0J6mk6L2k7Mqj0rM0j6L7l8j4K7mN7n9J1j0J3
$$ y = [-18, 9, 25, -47, -4, 5, -4, 38, -29, 27, -10, -15, -14, 17, -13, 36, 41, -9, -7, -43, 15, -19, -8, 4, -9, 19, 26, 53, 34, -27, 24, 13, -53, 24, 1, -4, 15, -9, 28, 22, -25, -43, 21, -26, -29, 18, 3, 1, 15, 27, 14, 12, -22, 0, -4, 55, -10, 27, 28, -10, 34, 29, -9, 12, -22, -11, 44, -52, -27, 29, -5, 11, 49, 21, -28, 50, 78, 27, -5, -2, -2, -37, 25, 7, -24, 9, -33, -12, 2, 14, -2, 6, -35, -29, -3, -27, 2, 10, 64, -24, -41, 15, -15, 20, 38, -28, -30, -31, 6, -25, 11, 19, -62, 6, 8, -33, 14, 39, 15, -7, -4, 0, 51, 70, 1, -2, 3, -66, 40, 5, -23, 15, -12, -1, 52, -18, -22, -17, -11, -17, -2, 27, -59, 6, 9, 5, -1, 42, -11, 2, -26, -2, 12, 17, 7, 2, 32, -20, 35, -6, -4, 17, 26, 7, 17, 14, -4, 7, -16, 36, -15, -13, 17, 7, -28, 30, 3, 18, 0, -12, -6, 8, -54, -36, 25, 17, 20, 24, 60, 3, -55, -69, 20, 10, -20, -43, -30, 0, -19, 3, 2, -30, 2, -35, -20, -2, 34, 33, 1, -79, -22, 15, -15, 35, -55, 21, -42, -7, -2, 40, 25, 4, -24, -56, 28, 34, -18, -25, -45, -47, -38, 8, -24, 5, 12, 30, 4, -20, 38, 30, -5, 45, -27, 11, -7, 60, 44, -18, -40, 18, -50, -37, 3, 19, 15, -11, 21, -6, -2, -10, -20, -29, 11, -5, 32, -6, -20, 7, 3, 60, 1, 12, 2, 15]
7354A5J1j1j8kL2J3J4p5N4L8q2l7O6r3Q7K5o0P0p5M4k9M8k5j4k4N5l3lN2l8k8
7385b3Lkj7N3l5P2k8o7QL5l0j9J08l4m3MJ05p2j5L8Jjm7K6J7o0j0NkJ1K2n7O9
7418A5m8RL4j7jnln3J8O2m3J4rL3j5J6k8L3K1l2L8m6j7J5nQO6k7j4q8P9l3L0K4
7452C1n2M3LKj3m6J6j6M0r0Q6k9J5J6J0m0N3j08L0O8j8m1N6k4l9J7M0j4J6J6j0
7483A8K1J2l5M2p5L6K4l9k3mJ4J8Rr8P2J1j5J7l3J5J8k5K6o9Q0nK3J1j8j4Ml4
7515a6KJ3k9j7P0n2Q0m9j3L1L5n2KQj2j6L8n3M3L9n4M8p8P0n8K9l%o2N7pj1J4
7548cL6n0N1m8j5N6l0j3M5l1K0j7pn4L3L7l3l2N7L1j0l6j3L7jl8M1Ml3m1N1mM
7581fl5J8J2L2qk7J9j9l5K9p2J06J3p0J7M9o5P4l9PK8j5J3k1k9L4mk8M1pl4n2
$$ y = [15, 26, 15, -3, -5, 27, 40, 54, -21, 33, 71, -11, -48, 18, -75, 12, 37, -23, 47, -28, 16, -13, 35, 10, -4, -28, 27, -6, -9, 43, 5, -23, -20, -22, -39, 14, -21, 51, 23, -44, -36, -1, -31, -50, 58, 24, -19, -15, 90, 18, 3, 41, 42, 41, -6, 20, 37, -23, -33, -28, -30, -19, 3, -54, 15, -33, -24, 10, -7, -8, -13, -16, -69, -51, 11, -32, -18, -27, 6, -9, 7, -21, 12, 33, 1, 39, -7, -24, -9, -14, -6, 60, 33, 19, -69, 10, -23, 7, 31, -21, 22, 25, 27, 14, -32, -16, -32, 8, -82, 4, -25, -10, 6, 16, -24, 29, -79, -49, 19, 1, -40, 16, -8, -47, -30, 10, -4, 12, 28, 18, 39, 51, 16, 58, -17, 19, 43, 4, -19, -23, -9, 9, 18, -80, -8, 3, -12, 5, -28, -13, 5, -20, 6, -63, 17, 12, 35, 46, 28, 14, 18, -16, -14, -1, -30, -47, 23, -29, 51, 2, -11, 20, 55, 3, 5, 13, 1, -15, 23, -30, 13, 52, -2, 46, -32, 38, -20, 9, 6, 6, -56, 1, -6, -17, -3, 33, -17, 34, -14, -29, 27, -3, -16, 29, -2, 18, 1, -6, -60, -27, 10, -23, -55, 2, 33, 23, -13, -26, 11, 10, -28, 13, 17, -16, -57, -6, -10, -6, -41, -23, -11, 21, 13, -14, 5, -14, -49, -20, -92, 14, 27, -43, -26, 23, -42, 32, -7, 0, 28, 13, 26, 5, -24, 10, 6, -22, 19, 12, -22, -74]
7613g4R3oL7K5l9n1j0P1q7Q5n1j4J8K4N3r5j3K6M3K3r9QK7J4J4L7p3J6j7K2OJ
7645A4j1N0k6m0K1k4J0rL7m8L6N5o8l4PN7pl9oN9r2J8Q8l1l9L1J0l4K0NMl4kM7
7679B5o4K8k8L3o8Q3k0j3P0j01L3L4k2lL6On0J2L3k7L6j7p1N7J8k0J0K7Nk1o0
7710c9L0N4n9L1L3l6kl1L6n8L5o0R0Jn4lOMK9oJ1J3l0N8n7OJ1k9kPL3k8pN4j8
7745B3r0M2K9l1L6j0J8o0J3J4K6k3K0L5l0qn6L8Lk6L3N0n0j8k5Qj6P1Ml2P8j24
7777e8P3Qj5M7q3L9%K0k6m2M8n5M2oK9l0L3k0k9K5j6K9Nrn8K5L6p0Q0k6oj8J1
7810a7qJ1M8n1jK6k0j6N4p4M5J4j6j5mJ1K1J9J0Kn0O9n2K6k2Pn3N2J1m1J4Jok5
7844c0L9Pl7Krm8O3QqL6j9nJ4K7n4k1M0Rn1O6m5M9j6l7M9k5J9k3K1k4l1N8rn8
$$ y = [-74, 19, 13, 50, 75, 36, -15, -25, 46, -41, 44, -7, -21, -3, 21, 74, -21, -34, -8, 35, 58, -41, -33, -6, 8, 22, 59, -14, 2, -15, 7, 13, 14, 3, 53, 27, -13, 8, -16, -6, -15, 22, -26, 10, 65, -3, -37, -30, 27, 20, -19, -25, 34, -58, -40, 48, 17, -22, 9, 19, -15, 5, 10, 14, -20, -22, 25, -39, -11, -39, -6, -74, 9, -11, -24, 46, -55, -22, 12, -10, -13, 23, 29, -21, -9, 24, -3, 33, 16, -55, 2, 20, 0, 10, 37, 42, 21, -39, -9, 45, -14, 17, 50, 14, 12, -19, 17, -41, -6, -66, 24, 25, -29, -32, -26, -22, 7, 1, 12, 25, -5, 53, -4, 2, 13, -16, -18, -11, 22, -6, -13, 41, 23, -67, -25, 4, -27, 9, -1, 17, -43, -30, -16, 10, -13, 7, 42, 12, 4, -52, -14, -11, -37, -4, 46, -4, -22, -47, -39, -55, 16, 20, -12, 66, -58, 15, 23, 8, 55, -28, 11, 11, 31, 5, -37, 11, -44, -2, -8, 21, -9, 24, 4, -25, 0, -16, 13, 18, 9, -49, -24, 12, -58, 22, -4, -10, -28, -17, -25, -14, 34, -17, -18, 8, -12, -28, 26, -48, -3, 11, -5, -20, -24, -13, 8, 27, 37, 39, -11, 58, 6, 32, 10, 17, -36, 16, 27, -14, 0, 1, -5, -30, 9, 16, -21, -19, -28, -76, -13, -5, -13, 23, 4, -1, 13, 40, -14, -35, 5, 14, -37, 29, -16, 33, 17, -20, 29, 4, 23, 0, 21, -3, -34, 24, 15, -43]
7878d3N5pj5RK4p0P8Nn0%m8O6%J4k2%onMK3L1p4LK8j4K5l0K2j4j9L0J6oL2J9r9
7914c8M1k3j2L2m6N9m8K8Ql1J9nM5m0m6J54o8K6q4k0M2K4Qk8M4Nn8k0L6j5k3O1
7946B7m1L9OL5p3mn0O3oK4l3L2J6k4M1j0J1o5nk6R4o2KKL6k8J6o7Q0l3L7l3j0
7979inK8L0p0M2J7l3k1J3MO9p7J7K5l5K0O6p2%k6O3Jn8PK7J6k6Ml2j3M0j0m3M2
8013Arm8L8K0J5k9K5o2M8Nj8J5J2jJ1j0roQj2O5r6K2oM0L1m5L4pk1pjM1k6Lq4
8049f3Q7J0k1J1j4Mk3k1K1K7kl3j8O1j2L7l5j9j0J3j8N2l0j4J9j6P6k2n3N4rk8
8081A1om2P6Kj1j6jk1k1M9j8k6PNL3lnj3J5j6ML1n4M8n6L4K1l5K1k0J5N1l7M4
8115F6p2k9L6o4L5M1j7lL1p4L5L8L7p0%K6Jk3LJ3L7l1m0J4j3M6J1qn2J7K7L5n3
$$ y = [-43, 12, 5, -10, -1, 23, -47, 31, 36, -14, -14, -62, 4, 4, 18, -4, -4, -10, -15, -11, 12, 43, -31, -28, 0, -14, 11, -19, 3, -11, -30, 0, 16, 10, 42, 61, -38, 3, -20, -32, 0, -46, 13, -35, -7, 1, -30, -11, -16, 29, -11, -57, 97, 29, 55, -29, -49, -7, 17, 25, -3, 41, 46, -12, -32, 4, -11, -34, 27, -14, 25, 31, 66, -7, -11, -61, 2, -4, 20, -13, 19, 35, 11, 52, 42, 53, -12, -17, -43, 51, -11, -9, -7, 29, 1, 17, -50, 30, -3, 34, 1, -9, -14, 14, 44, -26, 16, 33, 0, -21, -8, -4, 65, -12, 5, 30, -5, 15, 81, 9, 9, -17, 46, 47, -11, -4, 23, 39, 13, 17, -15, -28, 12, 2, -41, 1, -8, -56, -18, 2, 17, -12, 13, -49, -1, 4, -14, 1, 13, 12, 23, 13, 4, -2, 6, -6, 59, -37, -15, -21, 19, 50, 5, 39, 32, 11, 4, 3, 44, 18, 21, -63, 24, 34, 13, 24, 10, 14, -9, -30, -9, 18, 16, -17, -35, 26, 14, 51, 16, -3, -13, 0, -18, 34, 4, -10, 9, -7, 69, 47, -6, 48, 39, 11, 5, -37, 39, 41, 30, 14, 13, -8, -29, 20, 2, -24, -17, -12, 21, 18, 13, 0, 15, -1, 3, 34, -20, 28, -28, 6, 27, -8, 13, -7, 8, 59, 22, 66, -6, -35, 1, -63, -28, 13, -4, -7, 24, -50, -15, 23, 60, -10, -10, 16, 17, -6, -3, 10, 47, 16, -24, -10, -23, 23, 34, 26, -26, -9, 18, 53, 0]
8148@j7L2J6q0O9J0n5j4K9K7o5J2L1rL1k5J3N8j8l4L6oq5k4J17n1N1p7L1J5j2
8179FK3k7k2M1l1qK2k7%J3q4R4
$$ y = [0, -17, 15, 31, -49, 20, 30, -25, -39, -10, 17, -48, -36, -5, -14, 17, -8, 5, 63, 45, 11, 47, 41, -44, -68, 49, -2, 49, -28, 3, 18, 6, 29, 2, -20, 21, -10, -18, 4, -23, -23, -10, -94, 0]
8191@
$$ Imaginary data points
##PAGE= N=2
##DATA TABLE= (X++(I..I)), XYDATA
0@%%%%%%%%%%%%%Qj6J6j6J6k4L2m0M8n6O4p2Q8j04J20j36J59j83K08k40K72l04
35a60L41l83M29m82N38n98O66p38Q18r06J000j104J219j345J482j633J797j979
53a038K185k414K670k959L291l677M127m664N316o128P176q582J0576j3651J9059
68A1287l1292J08988k2168k32345Q9038J62715q466j36997J1577Q6273O557o4441
80a9274p139M511K39L6483N6111m4634r8223M232J08357K3060p7568k4831N8977
93B0301J2397m8914j6140L2588Q838j516K2757j0604o7906j1366Q1158M3890o2262
106C221n0322M1313L7545l6298k7143L1155K4853j0309o983n714k8183o551N3887
119B0471L3056n3654m4544M3537L3382n0160k7631O7750L8544p4094m7898O8914
$$ y = [0, 0, 0, 0, 0, 0, 0, 0, 0, 0, 0, 0, 0, 0, 8, -8, 8, -8, 8, -16, 16, -24, 24, -32, 32, -40, 48, -56, 64, -72, 87, -96, 112, -128, 144, -160, 181, -202, 227, -255, 283, -315, 351, -387, 431, -475, 525, -579, 640, -705, 777, -856, 941, -1038, 1147, -1267, 1403, -1556, 1735, -1942, 2185, -2479, 2837, -3291, 3885, -4697, 5879, -7772, 11287, -20005, 88983, 66815, -165530, -76492, 86223, 77757, -59240, -47663, 38610, 45167, -19274, -26413, -21902, -21663, 14820, 70931, 26297, -71926, -67694, 40663, 63723, -13845, -38676, 20301, 32698, -16216, -32356, 232, 9070, 7554, 30311, 19707, -48199, -59565, 21593, 65483, 3221, -47101, -5788, 31757, -4541, -31684, -529, 24324, 14015, 7032, 1318, -26865, -33416, 20471, 53527, -127, -44671, -1134, 32248, -17912, -45543, 22207, 60751, -13343, -61241, 7673]
131G673M1933o9698l3341Q3387M5267q7414o6378O8216O9932m1279n2279K7274
143f707L2987k6167k6110J9428J5223q751R962J1370l4368l0623L8481M9113k5363
156A8475m9137J9448M1456k4752m0130K5781M2105j6026l4409Q478J6332j7517
168i896o662L0265R611l0352j2835K1068N995j8233M471K6324m403k7992J37J7442
182D940l796o895J6425P725k6593j4083K7583J0777l1084l566M2495O163n3658
195b3567k0449N3277L1949m2007l0800L3734K7245k8350k8540J9300K8106m639
207A5259j5344n286o592Q94K0209R455k2496j6520K2022J9431k5618k4293K6527
220b352L1249j6734k9524N989J8713n082p282J3880L640k0271n244J8726L908
$$ y = [7673, 49606, -20092, -53433, 29954, 75221, -12193, -78571, -10355, 59577, 18298, -33981, -6707, 26280, 113, -25997, -6569, 8654, -97, 9865, 21235, -13133, -43756, -5275, 43838, 18475, -30662, -11214, 30242, 5490, -34640, -8859, 33246, 17220, -17189, -8711, 7621, -9896, -16558, 13707, 23318, -7034, -19869, 1199, 7194, -11039, -6568, 19756, 15353, -12639, -12502, 4940, 1144, -5751, 10674, 18399, -8194, -22277, 5306, 16083, -15001, -18567, 23928, 30091, -23567, -44016, 9261, 41210, -797, -31597, 2137, 29382, 1032, -27508, -8208, 19898, 15259, -85, -5371, -11963, -11069, 9140, 18595, -3901, -20421, 1601, 21032, -4586, -28879, -2352, 28897, 12163, -17361, -11372, 7341, 2259, -5023, 8857, 12497, -7774, -13018, 5708, 9616]
233I616j8935k211K2957M778k4694j0666J6284J1537l658l064n06o211k438J1686
247D475N106j4523l261J9376M308k4538j2448K2435J8703j5857j6735J0644R096
260F781j0893n649J2206P032r820n110Q251m56r626M128J3030j084j1966k949
274f125O661Q6l617N795L462r023m323P956K481r392j032J5200M327j8179q561
289a4284J5313J0286r458p879P689O200q551o693O181M777j686k04m46n026l246
304g027O022O941m779o033N561M139p063m550P224P606m574o842L338K559n692
319c170j77P528J582p661l939N666K392n820Q5P209M61n999k463L236K378o57
335F51J599J786m195l138L369K282k541j243L659J582o315l929N624M067l102
$$ y = [9616, -9319, -11530, 11427, 16205, -8489, -19155, -2871, 8666, 5008, 1944, 1438, -4773, -7211, 4475, 9581, -4942, -8203, 11173, 15481, -9057, -21505, 930, 19633, 3776, -12959, -2315, 6781, -4112, -9761, 2445, 9477, -343, -5453, 2798, 2342, -7284, -3156, 9874, 8790, -3176, -6125, 536, 622, -2995, 2800, 6262, -2761, -7084, 872, 3353, -6039, -7071, 8129, 12456, -5723, -14284, 1029, 11315, 1857, -6022, 1667, 7867, -684, -7377, -1196, 3581, 1895, 1691, 1245, -3781, -7027, -1005, 5936, 1157, -4876, 685, 4824, -2239, -6789, 435, 8041, 3467, -3375, -37, 2522, -3170, -3347, 4181, 5763, -1898, -5837, -171, 2221, -3599, -3514, 3695, 4156, -1843, -4306, -1070, 1308, 651, 2250, 4036, -159, -3297, 72, 2354, -187, -1430, 2229, 3811, -2504, -6433, -809, 3258, 156]
350A56k070K487R19l751j415M949K582k876r33J108j198j760J279L293k12l636
366a078k71J473j536j012J937K146n38k287n00P45n15J790L256j284l949l51L543
383A569J301l710j511M321J912l899m146K10M425L140k123l958j560L078M230
398C279j835m630J167N577J545n702m977M136O588p47n093k676J756K692j62j410
414d92q82k39K051J430k649k831J448M737K190m139m249J933L948P08k278j771
430a085J258P18j266j78K7o51L98J524Q35k249l780J627N914J584m685m361K347
447b023N827O2m767j730K462L126l4l712l304P05N166M476m800r351O60J1153
463C916N760r426j1128O456J4459j283j4589m927J2246J0500p142j2361M65R019
$$ y = [156, -1914, 573, 1492, -2259, -3674, 1275, 3857, 981, 48, 1156, -42, -1802, -523, 2770, 2558, -1078, -1349, 124, -1412, -2424, -487, 1659, 1121, -1166, -1666, -921, -1436, 354, 3610, 2326, -1623, -1974, 1569, 2870, -840, -2351, 1970, 3882, -17, -4163, -3953, 472, 3612, 1489, -2469, -4029, -951, 3279, 1444, -3186, -2019, 3558, 5103, -599, -5576, -1440, 5148, 4401, -692, -3368, -1612, 1080, 918, -492, -1374, -1613, 438, 1868, -781, -3612, -2164, 2573, 4763, 624, -3625, -1692, 2256, 2964, 686, -1085, 173, 891, -375, -553, -526, -1177, -779, 745, 1580, -669, -4449, -2822, 3092, 4676, -9, -4370, -2023, 3804, 3866, -901, -2631, -169, 2957, 2923, -789, -4093, -3388, 1778, 6254, 1454, -7897, -7237, 3916, 9676, 250, -10878, -4422, 10037, 8754, -5835, -10762, 1484, 11984, 4842, -7519, -7054, 1965]
477A965M385l996o197j164L845M643P01o576n715O025J0381j441j2290m717J1723
492A572R777p732j1285K523J0204J601q659m003N615L964k354k771k15K75j02
507a590K083L051k645n356J930O293L08n631k057N523K701n304k640M064J841
522B571l955j463N116J673q369l624J0582P297r816j1347P163J4809k899j5582
536g844j129J3917N413r887q324M809P580p79l731j867j737J041N625K322p420
551b011p466P249J2459m160j4786q51J4546O927j1142j0563O202J0727j158q539
565b566l104M954M533j692l591j779M39L493L141k212n370j050O297M764n084
580A173o466K916P375q2p845k527P677L821o872m789N348M922n106n505N570O501
$$ y = [1965, 6350, 2354, -3843, -5007, -1162, 3481, 4182, -2394, -8109, -2084, 8297, 6856, -5434, -10151, 1572, 11349, 3617, -7668, -5145, 5059, 6660, -1999, -6002, -387, 3577, 1223, -1548, -1763, -1488, -1590, 493, 3544, 899, -4457, -2527, 3766, 4074, -1557, -3614, 1909, 4610, -694, -3334, 730, 2571, -1384, -2847, 2269, 3942, -4427, -8051, 2531, 9828, 12, -11335, -4172, 10637, 7738, -7844, -8973, 4944, 10357, 470, -7854, -3045, 4535, 3756, 25, -1842, -3579, -2538, 3087, 5409, -2011, -9477, -2228, 10231, 6071, -8715, -9566, 4980, 11907, 765, -9798, -3596, 7131, 5973, -2566, -5670, -716, 3817, 2125, -1466, -3245, -2806, 687, 3828, 1616, -3754, -4804, 1493, 6257, 1173, -5293, -2377, 4998, 4916, -2929, -5456, 2221, 6042, -830, -5619, -271, 4651, -455, -5960, -390, 6111]
596F111n686p369M501Q471j914q545J01P919J325n928k076L147J830r98k59k41
612C89l195m54N996K086p234m754O463P715m152r171J506Q824K090n999m752K575
628b067N259O32l379l208K3L804K722l001m876J85N508L111m542n300K005N893
644B769K000m479m770K348O112M15n779l121M659N005l540n622J345M540J20l247
660a245p57K195M1j565J264J474j482j316J459K128j226k532J206K329r87j565
676e79K71M37n45J2J189l93k495N72K907l06k656k79K619J292k034j290J602Q22
694A146p25r2J26l83o24N04J117j144j672J145J497o23j453j15J453P56o74l56
712a17l50J21J644J47j832o85J758J268j607k363J255K531j046k317%J827O81
$$ y = [6111, 425, -6944, -2443, 6028, 4114, -4431, -4330, 3589, 4914, -1014, -3090, 57, 1887, 889, 630, 389, -2806, -3260, 2736, 4822, -2412, -7166, -703, 7012, 2860, -6311, -4805, 4019, 6109, 110, -4642, -2067, 3192, 3824, 445, -2763, -2740, 1064, 3786, 785, -4091, -3906, 1602, 4713, 171, -5129, -3124, 2769, 4769, 290, -4480, -2132, 3980, 4395, -1384, -4505, 154, 5159, 1619, -4003, -2658, 1882, 2002, -1245, -2002, 193, 234, -1331, -67, 1407, -75, -1391, 68, 2196, 970, -1562, -356, 1973, 986, -579, -308, 129, -416, -404, 785, 392, -2103, -1531, 1376, 1070, -1586, -1865, 754, 2046, 12, -1278, 324, 1146, 421, 329, 455, 72, -552, -48, 1069, -75, -1747, -602, 895, 272, -1181, -1296, 157, 913, 239, -117, -467, -346, 1298, 1445, -387, -1072, 686, 1954, 347, -2016, -761, 1770, 724, -1593, -1593, 234, 915]
729I15j606n52J391M37m65J0k99K32O14K38l63j014J39J396n22j399L80Q16k51
748I7q45j79J040j33q80Q24Q45p88p10O48J350j89j718J82J579j85j071n42M52
767b23P53k67p06m14n8R04P58j168q32R94J049j2j287j57J379L32p86k43n1K04
787A69K32j17j76q22k65J289K78j378m85R88J163n12j386M93J201J39l97n09j52
806b47P26M56m13r21m34J190P71j545j186J000J363k82j660j03J781L02j002k17
824d21M98O29L3n79j53j05L86O58o96j198M23J035j92j092l68J232M25r89j78
843f52O70J21k2Q0L30k79o33P65P95q99r35N81P45l37j034k7Q55k57k96L46l09
864c92k94N64O91p8j014J7J509k5j084j18M47K76j64l49O0o61o3J235M2j745m34
$$ y = [915, -691, -1243, 148, 585, 120, 130, -169, 63, 677, 915, 552, -462, -323, 1073, 551, -848, -468, 348, 97, -748, -927, 113, -20, -900, -76, 769, -19, -729, -81, 1269, 1080, -638, -456, 1123, 938, -133, -675, -223, 530, 263, -443, -857, -915, -11, 747, -421, -1253, -259, 790, 778, -509, -666, 713, 1045, 259, 16, -35, 169, 401, 284, 108, -714, -979, 310, 588, -790, -1275, -287, 876, 364, -1022, -529, 672, 811, 414, -95, -247, 479, 935, 522, -399, -833, 357, 1128, -417, -1603, -603, 760, 478, -1182, -1285, 496, 798, -204, -421, 77, 706, 739, 160, 7, -98, 288, 946, 250, -948, -525, 510, 318, -774, -1142, 90, 515, -474, -652, 18, 139, 117, 197, 527, 248, -385, 380, 1175, 276, -659, -78, 667, 330, -704, -731, 124, -133, -429, -83, -392, -686, -122, 569, 491, -523, -506, 1003, 978, -106, -224, 223, 499, 335, -14, 46, -615, -678, 557, 599, -1146, -1580]
885a580J724J227j301j758J284J788n70j105J27L95L33k1J18p85j012J067J517
902A448j231j929N20J929K35j890o32J632O30n59j83J5l3L44M38J23j154m07J408
921G04J71j265j68O07j59m60M04Q29j358j153K202J593k052j912J649K601r35
938A298k698O47K218o93j257O52K70j297k38K317L71l659q22M124J714l843k537
955c433L162L412k103l155J259K262k58r23k58j08l49N87J350j110k445Q52K649
972A391nk512j046J920J782q54j535j77R58J617r8k248n80K041J369j819k072
989a868J697J776k057j296K199P48k452j023L276J457l775j703M157K139l592
1004c17k350L174K468l010k079L074J109l633l92L963K81n000q56N804J398n856
$$ y = [-1580, 144, 1371, 70, -1688, -404, 1384, 814, -291, -164, 231, 564, 543, 661, -124, -1136, -69, 1448, 217, -1712, -1192, 737, 972, -918, -1550, 82, 712, 153, -30, -15, -48, 296, 734, 857, -297, -704, 704, 875, -390, -558, 49, -110, -570, -166, 663, -695, -1848, 354, 1947, -105, -2017, -368, 2233, 1298, -1400, -753, 1465, 772, -485, 167, 437, -860, -1098, 1219, 1590, -2069, -2891, 1233, 2947, -896, -3433, -271, 3141, 1038, -2117, -858, 1404, 1146, 223, -35, -143, -492, 95, 1445, 335, -2110, -1258, 1391, 1386, -1126, -2172, -252, 1530, 676, -859, -1036, -78, 1539, 1441, -807, -1387, 654, 2023, 204, -1868, -171, 1605, -452, -1748, 451, 1199, -1253, -2276, 1000, 2457, -1318, -3021, 1136, 3275, -317, -2667, 507, 2975, -35, -2114, 960, 2069, -1564, -1956, 2007, 2288, -2712, -3568, 2236, 3634, -2222]
1020b222j956N165K730l727l026K715K841j731j570J075J6r83R35J402j407k669
1036b412J132L429o85l440k20K619J394j418j881K09J732J461p04k779k71L600
1052A766J038l372j980K711K244k319k216K169J285k249o12K419L54k991j27L900
1068B020M17m592k43M816O11m709q89M527Q06m636m02M384l24m320L88M166k13
1085A807m329K52M351l51l718N60L181k60k649M92K457j075k304J719J970k207
1101a04k103J951K237j867k223J534J622j223o52P93N1l83P87P32j484j145K268
1118G91J598k651j773K268J834k039k048J777J663j888j231K106N70k077j01K431
1134A230P4k958M40L519o44l508O70L367p11l214N57L053r52l078J305K487j525
$$ y = [-2222, -4178, 987, 3717, -10, -3036, -321, 2520, 789, -781, 294, 310, -673, 262, 1664, 257, -2412, -1280, 2149, 1464, -1976, -2196, 423, 1817, 399, -1482, -1273, 459, 1920, 1216, -1563, -1834, 1766, 2804, -568, -2548, 163, 2407, 88, -2128, 41, 1326, -923, -1535, 884, 1238, -1753, -1880, 2020, 2437, -2155, -2398, 2418, 3029, -1680, -2569, 1958, 2764, -1872, -2274, 2110, 1786, -2534, -2146, 2020, 1807, -2522, -2270, 2081, 1730, -1988, -1428, 1753, 1493, -1156, -664, 1793, 718, -1586, 133, 2103, -104, -2207, -256, 1981, 114, -2109, -575, 1047, -176, -828, -35, 16, -367, 420, 1152, -332, -1477, 791, 2389, -262, -2035, 233, 2067, 28, -2020, -243, 1420, -468, -1699, 407, 977, -1100, -1201, 1230, 1304, -1654, -1214, 2305, 1661, -1847, -1177, 2190, 1479, -1735, -1178, 1875, 923, -2155, -850, 1637, 112]
1151A12k122J498K111j684k055K366J989k507j643K646J547k475j606K513J434
1166B124k780j047K490M29k236j77J865o0k037N76K271j061k068J478J881j317
1182C31j688J360J892j524j862J776J262j811j082J653Q32j933q58K244N18k329
1198a219l6K176o5j821L42J854m19j941J001J855j460j647J560J403j575j654
1214a646J519J642j844j504K014J004j827p23J815Q53j988n91K467K58k360P9
1230h32K170j79j999q2J994l51k055P35J555j003j295J044J344j122j434J504
1246fJ473j543j121J544R90j337q72J367P42j746m29J670J9j771J04J613j13j664
1264a080J65J743m10j451Q16J161o85r50Q80R88j224r39J460Q68j783p08J404
$$ y = [112, -2010, -512, 1599, -85, -2140, 226, 2215, -292, -1935, 711, 2258, -217, -1823, 690, 2124, -656, -1703, 787, 1216, -1020, -1197, 668, 608, -1429, -853, 1418, 357, -1711, -233, 1648, 331, -1357, 3, 1895, 371, -1491, 285, 1547, -264, -1346, 307, 1139, -794, -1652, 592, 1110, -1219, -1255, 921, 856, -965, -623, 1231, 812, -1129, -128, 1727, 267, -1380, 180, 1583, 8, -1646, -127, 1515, -329, -1833, 181, 1185, -642, -1365, 450, 1303, -685, -1276, 1191, 1449, -911, -832, 1338, 1159, -840, -922, 1072, 721, -1334, -599, 956, -47, -1342, -298, 1046, -76, -1510, -6, 1467, -76, -1197, 347, 1337, 0, -872, 495, 1237, -509, -938, 732, 751, -1020, -916, 697, 584, -1080, -915, 828, 418, -1033, -217, 944, 259, -691, 189, 1177, -47, -986, 474, 1342, -441, -1149, 255]
1281B55P48j472q77J494O43j466k64J426k0j078J87J224j48j414O40J390q42j245
1299h19Q06J007q24j181P84J086j080r75J179O67j050n29J148O41j173n26J553
1316G14L08j456j74J372M9j233k34J273qj394J29J105l35q56K80R02l11r15O59
1335a25Q67p20n39P83M78o38m85O94M47r65k93Q72m9p81m7O65J1q18J71Q94l34
1356H8o53N76N91n28m14M90O97p81o67R95M33j118m47Q83N50r84p62J033O42j061
1376d37l36R21K61o87j41Q35K30r22n9J066j03q91p7O97P7p17j70N44j17l92K17
1397b01J14j39p7K88K35k94k10N72J33m55M7K80n1k64L8L36l68m92M19M09n05
1418a85m40M37N38k43o86L69P50n06k96M77K56l14m00N10M42p95n25P64M28o37
$$ y = [255, 1003, -469, -1346, 148, 791, -675, -939, 487, 467, -611, -424, 800, 652, -762, -122, 1268, 426, -819, -13, 994, 170, -1011, -227, 859, -221, -1196, -17, 650, -400, -929, 219, 860, -313, -839, 714, 1022, -434, -608, 764, 813, -420, -654, 619, 611, -783, -654, 451, 116, -740, -460, 442, 131, -784, -125, 742, 22, -517, 266, 744, 106, -379, 315, 762, -203, -496, 376, 327, -454, -501, 164, 175, -643, -472, 422, 88, -565, 11, 602, 74, -340, 150, 847, 66, -601, 394, 827, -291, -738, 145, 695, -289, -1051, -18, 624, -437, -773, 148, 409, -278, -419, 416, 646, -276, -335, 731, 628, -263, -340, 357, 434, -283, -453, 91, -26, -418, -201, -87, -226, -303, -15, 220, -74, -284, 288, 421, -34, 13, 293, 242, -22, 16, 352, -16, -508, -89, 320, -185, -625, -188, 350, 107, -579, -210, 540, 34, -262, 215, 471, 157, -243, 267, 709, -86, -611, 153, 581, -56]
1438e6o87L14Q36k88p93L06N39J6l01r2L38K03k37K7J59j47j06K5J34O0m71j76
1460c97L86J50k91l87R3P08j6o67O2N85K37m35k75M81M62p23k46O10P9n91k53
1481d28M79M13q56m27P57M44n97m48M24P90l63p68N67O73m55m76L06O20m21q07
1501e73M70P71n75q10L62P41p7r63j26J070J87p87j62N82M87n14l77N81K99o48
1521f2j13M37J93n44m27N97L28p15l94N36M86k33p40K21R58j77o58R1O36Q8o24
1542a16p1O45kp38N8M54M8n92k67O31K45p13j75O31M08n06m15N66N86n70m92O86
1564C01L05m75m85L45N11m48n74L44M06k93m61J73N59o2n64J21N79j19k52Q2L09
1585C02N9n32R8M84j99l41l2K09J48l77k65L75K05k65k81K17M62j12m24K40L95
$$ y = [-56, -743, -429, 407, 119, -674, -368, 171, 187, -114, -206, 132, 335, 98, 125, 284, 137, 31, 56, 190, 250, -221, -397, -11, 139, -152, -539, -446, 262, 246, -421, -359, 226, 463, 28, -247, 234, 696, -27, -273, 337, 416, -175, -428, 51, 464, -392, -819, -62, 382, -215, -663, -239, 551, 188, -580, -13, 660, 205, -271, 35, 655, 234, -573, -103, 668, 93, -717, -355, 386, 309, -654, -780, 290, 477, -310, -472, 110, 597, 83, -294, 287, 586, -62, -175, 262, 455, -89, -516, 81, 409, -306, -700, -164, 322, 89, -651, -430, 528, 351, -307, -216, 420, 508, -116, -187, 458, 456, -282, -224, 230, 278, -314, -581, 50, 295, -418, -593, 38, 446, -60, -475, 91, 677, 107, -385, 301, 606, 131, -354, -9, 502, 54, -520, -176, 230, -63, -524, -351, 208, 146, -418, -297, 282, 163, -89, -7, 302, 361, -171, -73, 411, 212, -129, -161, 48, 196, -181, -446, -71, 134, -131, -412, -195, 267, 155, -269, -29, 366]
1606C66k01j95J17J96l8m47P2M08k09l63O7J88N3l18j12N72N0n63J34L71J42l34
1628d4l8L62P7m09J8K63Qj90j72N1K77l76j54K56R6j23j82J21L39j90r5K36J13
1651B44r7p2K0J21L2k69q5J78k0o9k59O1K61k47j42K94O6r5L7J0K50j08j47K46
1675B10N0j11q4n0J95M0m54KK65j32j40J6R3J17k39O5K45o2J8K6L3Q7k5j97J34
1700A02R7j20j55j08K35l0k59j6K71j07o4j5J50J85j34j23K65Q9j85m7J30K32
1722C93l58j96L24J11m00o8J15J10j26j99J73J46j28l5R2J84oj37N7K27j33j87
1744d1J70j9j5j74o8J54j8j76N7j01J03R8j06O1J50J2Kl9M4J83k07L7J20j05j32
1769a0kj2J40j86k03J75O5j58m1J32J30J9k46J60L12j17r0K8P4L3k15NJ50j38
$$ y = [366, 165, -30, 87, 283, 245, -202, -130, 278, 69, -294, -227, -39, 14, -304, -416, 156, 206, -357, -223, 148, 290, -44, -82, 280, 357, -52, -34, 229, 237, 47, -125, -74, 203, -173, -327, -71, 25, -98, -280, -159, 180, -10, -105, 131, 244, 147, 75, 95, 216, 248, -21, -106, 72, 52, -17, -276, -215, 46, -201, -343, -49, 17, -78, -41, -31, 219, 111, -36, 210, 260, 149, 65, 15, 210, 250, -204, -202, 63, -69, -209, -193, -100, 17, -222, -157, 88, 26, 44, 70, 103, 190, 165, -32, 102, 199, 79, -76, -184, 51, 21, -238, -254, 17, -90, -154, -169, -19, 166, 32, -91, 174, 263, 78, 31, 161, 393, 35, -161, 163, 274, -126, -194, -79, 31, -95, -294, -121, 25, -103, -138, -46, 138, 132, -5, 52, 279, 146, -41, 129, 110, 95, -79, -147, 7, -11, -187, -130, -231, -128, -30, -136, -75, 75, 87, 89, 50, 94, 277, 70, 107, 227, 122, -10, -12, -24, 116, -70, -273, -98, -33, -191, -232, -100, 30, 49, -197, -37, 275, 158, 68, 96, 170, 203, -12, -7, 143, 5]
1793Ej08N0j1K7j00j32K54j7q7O8J52p0J22j15O9N6m6K6n0l1O8o9j47O6k6Nr6
1820a37j31K24M7k17R0K33o8%q3K12R2l02pL11kk68j30J29J82l47j83L65P2l17
1844b35mJ78K16k86o4L32J67l02qJ78J07j28k87J79K26k61j87Q2K9pk08O4K40
1867B1o6j19J47L5Q0L2j72J95M4j05ll2J16K4l20l9K68r9j92m0J20K21k79j99
1891c62M90J05l40j8K45K73l13l08M33K40m81k03K97K42l13l91L25K75l52k69
1911d25L90J91j91k45K70L34j98k71K60K01j71j91K0K53j38k42L7J57j03l6q1
1932a79Q3Q5r7n2J40M2J21j46nK62k4k68M2J97jj94k70L64J00m20j10L01J33k68
1956a64k58L39M05m71j32M73J49k99k06L09L37m27l46M13J53k85l25K10L22k89
$$ y = [5, -103, -53, -64, -37, -137, -269, -15, -32, -119, -51, 101, 31, 153, 38, 107, 163, 117, 143, 93, 62, 130, 61, -86, -20, -46, -41, -137, -268, -44, 3, -214, -124, 109, 41, 41, -42, 170, 262, -40, -47, 264, 262, -6, -136, -7, 175, -172, -355, 10, 82, -235, -239, -61, 155, -131, -195, 137, 304, 2, -6, 172, 279, 151, -136, 43, 269, 8, -179, -97, -68, -75, -283, -219, 21, -45, -164, -17, 18, 98, 130, -42, 153, 197, 92, 89, 57, 173, 197, -123, -162, 106, 7, -185, -225, -105, 116, -163, -362, 128, 233, -107, -125, 120, 393, 80, -228, 205, 445, -36, -239, 58, 300, -13, -404, -79, 196, -156, -425, -35, 156, -35, -280, -10, 324, 126, -145, 115, 316, 145, -46, -26, 227, 89, -153, -116, 41, -62, -98, -179, -96, -11, -108, -160, -20, 22, 143, -3, -8, 254, 230, -38, 4, 201, 200, 6, -264, 100, 200, -220, -330, -29, 104, -164, -422, -83, 322, -149, -281, 192, 341, 42, -164, 145, 482, 55, -291, 122, 275, -10, -335, -125, 197, -92]
1976i2k74J91L14j67j73J68K22rl16J82K34j66r2J7J33j7j99k6P3M1j57o0p4J99
2000d8L3k54J41J83m0qj13K56J81l13o7K94rj77k43K16K15l99k65M24J85l47j93
2023c48L01K80l42k52M33K59l59j46L59J04j54l23K55K41l64j97K20J37k02k17
2043c15J65K33k12o8K32Q1j67lJ21J43j20n3J71j10p4N7j0j43Q1m6l3n7oJ00q3
2068a16j35K18J13p2r2P2K37o2l81L24K50l80j28K04J52k42l48L30L04m30j77
2089c59L02K28l25j10L19L07l34k21M00J13k57k08K69J95l53j95L31R8m08n9K75
2110HMj87r5L08M1l06J94K52j76m3J30J4o3j48K13L6l19N8J26j03j74M1K29Nk89
2135b44P0M27k20k94K84K85j92l15K69M26l82l70L97J94m02k62K92L10l39l55
$$ y = [-92, -366, -175, 139, -28, -201, -33, 189, 180, -136, 46, 280, 114, 22, 39, 172, 155, -44, -70, 3, 44, -113, -173, -247, -48, -15, -269, -128, 55, 15, 7, -106, 150, 331, 18, -49, 245, 236, 59, -184, 32, 247, -152, -417, 7, 192, -155, -348, -47, 233, -109, -361, 72, 331, -28, -174, 185, 289, 135, -188, 67, 308, -56, -253, -33, 104, -98, -315, -150, 83, -129, -197, 35, 116, -51, -54, 67, 210, 90, 37, 208, 98, 24, 81, 71, -72, 9, -37, -70, -127, -133, -33, -116, -251, -33, 80, 8, -84, -12, 225, 163, -218, 106, 356, -24, -152, 52, 204, -38, -386, -56, 248, -182, -359, -57, 171, -154, -264, 55, 362, 28, -193, 207, 320, 63, -145, 124, 319, -34, -229, 102, 200, -208, -267, 8, 12, -175, -270, 38, 79, -227, -33, 219, 43, 0, 130, 144, 81, -67, 146, 182, -137, -79, 47, -56, -230, -189, 40, 45, -244, -174, 253, 33, -261, 23, 308, 116, -199, 70, 496, 114, -256, 141, 335, -67, -329, -37, 273, -66, -421]
2155d21M01K16l55j22L18J89k84k00L92K54m35o1L41j2k77j18K93M9l94OL03j60
2177g7k03K50R6j67p5J74J82j95j04L82m8l33J18K11j1l81N0L35j67l74J57M02
2199B22k54l60J82M49k42l66M74K82m38k52M66K20l27l66M19K49n32j51M36P6
2219A87l49k16L85J96m71o0M00P5l13O2K75Q6l23M3K98j17l32K34J19j40k50J61
2241e0J01j53j84L61J9l48L8K54P2k30j2L41k6l64J76L01j47l33J33K96j73m03
2263c31K37L26l19k86K92K55k41k90L73K64k96j68L41J53k46j95K67J18l36j63
2283b45L90Pl51J1J90Jk17L1K92l3l16K03K39j91o6J86J59k16j24J87J19l98j4
2306a56K80n4k64JK53m4l47J37L62j25k67K20K58j27k36Q0L52j69l49K11K15j73
$$ y = [-421, -20, 196, -159, -281, 37, 226, -58, -258, 134, 388, -47, -108, 233, 221, -56, -174, 119, 168, -226, -220, 83, -77, -280, -30, 66, -101, -176, -2, 180, -15, -119, 263, 215, -118, 0, 211, 200, -181, -131, 204, 37, -337, -180, 222, -32, -392, -210, 239, -3, -369, 105, 387, -51, -303, 163, 383, 56, -310, 109, 358, -174, -325, 111, 187, -162, -378, 7, 203, -268, -328, 72, 147, -166, -104, 171, 257, -66, -23, 275, 158, -174, 60, 179, 39, -211, -50, 51, -102, -286, 75, 94, -254, -216, 38, 110, -120, -132, 209, 183, -181, -5, 296, 149, -184, -51, 245, 72, -331, -94, 232, -87, -373, -81, 174, -67, -357, 16, 280, -16, -184, 157, 310, 64, -131, 136, 254, -82, -245, 145, 152, -199, -188, 2, 3, -214, -183, 109, 76, -240, -37, 202, 11, -55, 131, 290, 74, -50, 137, 256, -142, -156, 124, 70, -194, -193, 60, 16, -331, -194, 168, 43, -224, -4, 254, 127, -109, -29, 323, 154, -195, 16, 231, 58]
2328E8l25K11K33k13l64L09J86k17j17K32K15k31r9K11J22j98m7J73J5j50l9J10
2350G5l0j56M6J22j75o6J36K7j05KJ89L3k14j2L58m3k74J10J75lk83lL77k33l32
2375b79J63K64j64k84J05L46j22l40L00K39j52k71K32K13j31k60J29L24k65k01
2395a54J49J63k02k08J32K00j64j38J93O7j10K2M0J50j12J4L9j2j00K07r7o1p
2418A1K4o6j46N5J29j9k08K03R2m6j50J14K35q6k21J28K24k06j76J71J05k6l65
2441b24J91J66k10k05K44J44j79k03K28K58j83j62K04J37j73j21J10J89j19j83
2461i1J37M3j47r9O4Q3j9j29N5J06j7l7J3M4O2K9l6M1J0km7o2L8M7j55mQ8p3n4
2490a12r8R3J77r6n7P3J04l4k4P4J41k26o8Q9J34k27K1N3M9j84j02K47Mj51L7
$$ y = [58, -267, -56, 177, -36, -400, -91, 95, -122, -239, -7, 208, -23, -122, 89, 211, 13, -34, 139, 154, 4, -35, 75, 45, -111, -65, 57, -118, -184, -48, -21, -126, -124, 65, 98, -116, -128, 230, 187, -87, 23, 198, 195, -88, -91, 286, 53, -279, -116, 148, -16, -300, -195, 151, 29, -311, -11, 228, 76, -195, 37, 250, 119, -141, -12, 312, 47, -154, -5, 158, -44, -252, -120, 80, -84, -222, -29, 38, -72, -50, -10, 140, 28, 42, 81, 69, -31, 176, 79, 18, 11, 35, -31, -177, -122, 7, -12, -220, -17, 75, 29, -121, -7, 228, 142, -79, 49, 273, 67, -109, 62, 167, 141, -224, -33, 133, -77, -282, -38, 106, -73, -276, -48, 210, 27, -135, 69, 206, 33, -88, 22, 211, 92, -91, 46, 89, -58, -157, -93, -10, -29, -158, -103, 3, -14, -51, -38, 6, 68, 97, 61, 102, 112, 110, 63, 1, 39, 86, -69, -73, 15, -58, -112, -210, -117, 60, -36, -93, -20, 84, 50, 26, 100, 241, 15, -53, 36, 170, -57, -36, 17, 66, -118, -220, 27, 31, -120, -83]
2515h3J04nm4k9J23J50k24J02P7j5j17l7J4Q3j74q4J45k2q1P4l9J7J6l5J23n6
2541a7N2M7rJK8j7K1n1q8P3p9j0K4r5M2j0j2Q0R5j51K5R3%P2q3jL7p4Q9pj16N9
2573A8M3j63O9o2M1n2m1P2Q7j21P3P8l2L4o8P1R3j08J0J7o6M2p1N6L6q0j43J31
2601c6np4J3R1K3l9n4J24J01j16J5J07p7J2m9k1R8j16j12L5P1j06j6l9J87r5j03
2628a81K40Pm1o9M8O2Q0j11LO0l0p0q3Q8O8j07j08P3K3m8J1L8O5l7j1j5J40j8
2656G7j4m0R2J2j52k7J55j30j06k7J46Qj53M3J65o4l5l9P3J89r4j22J12J62k15
2681A6p7J05P4o3j75P5J11j69j5P0N0pj51J13J48m4j47J41O6N7j09l0J58o4j63
2706c0j7Q3k6r2q7J07Q6j33L6j9J06l3p9L3J83o6p0O6P3j7j00m4J80l8k01J05
$$ y = [-83, 21, 16, -28, -57, 66, 216, -8, 94, 171, 156, 39, 2, 16, 99, -75, -159, -14, -36, -117, -43, -82, -65, -49, -84, 39, -17, 35, 82, 73, 74, 102, 85, 106, 55, -33, 40, -39, -49, -25, -120, -78, -88, -100, -20, 75, -76, -51, 42, 42, 114, 31, 30, 67, -7, 82, 75, -41, 18, 61, -102, -33, -95, -54, -106, -147, -75, 12, -109, -36, 42, 10, 44, -24, 47, 140, 32, 42, 59, -7, 35, -36, 20, 56, -24, -167, -36, -41, -115, -102, -11, 12, -27, -81, 43, 144, 28, 43, 150, 73, 85, 36, 15, 113, -3, -115, -80, -9, -115, -131, -170, 17, -78, -181, 59, 66, 25, -44, 4, 66, 146, 35, 38, 98, 68, -2, -85, 3, 71, -36, -144, -71, -48, -96, -85, -47, 18, -19, -30, -45, 95, 77, 63, 23, 115, 127, -25, -52, 103, -27, -133, -160, -14, -6, -159, -116, 49, -15, -50, -89, -16, 173, 79, -43, 69, 231, 16, -61, 44, 118, 55, -120, -45, 66, -103, -118, -48, 2, -5, -156, -43, 105, 61, -86, 55, 121, 178, 69, 39, 197, 133, -30, -47, 36, 10, -82, -169, -62, 24, -109, -73, -92, 14, -19, -98, -65, 118, 52, -18, 48, 121, 104, 4, -40, 140, 102, -99, 6]
2732Fl6M8j26r5J38J22j39l8J25P8l8r8M5K37j98q9J88Nj73l6N4M5p1j71J57Q0
2758B0q2n7L4J75l2j39P3J41m3p1m0J48M6j16r2J42J1j82Qm0J52j67k0J58J2j09
2784g0OJ01M0q2p1J37J29j69j1PM3O8k02MJ00m2r7mN5Jm8K9L9R8o6L9J3R1o2r3
2814a7P7J03j20l2j0J07j02j36M8J49j06q9L1Q7L3j29kJ77R5k21Q7J22k2j06n5
2839c1P8j1p3r6J31j2n8p5Q6J03j09k8R8O8j20P3M1J15m7j85J02P4j02l0k9J38
2865A01k0j92qJ37l9j01qJ03P6n7l5J47Mr4n4M4J89r1k28J56P6q0j39L4P1K3j65
2892a50N2J91j17p8N3J64l3j25M3J08K3j36j4P6P5k25j7R7O3j76pN3J19j20p7
2917a58J05R9o5j46J86J53p5j99P9J31o9q2kP6L9j81k9J98l1j62L7J05K2p6k7
$$ y = [6, -30, 18, -108, -203, -65, 57, -82, -120, 5, 83, 45, -53, -8, 229, 31, -58, 130, 135, -38, -74, -20, 25, -46, -217, -60, 20, -62, -119, -85, 90, 58, -81, -8, 133, 90, 19, -21, 127, 173, 57, -35, 107, 118, -64, -56, -96, 56, -111, -131, 27, 39, -70, -64, 37, 77, -5, -76, 61, 190, 21, 10, 17, 60, 128, -74, -70, 30, -12, -109, -113, -58, -57, -105, -76, -37, 61, -5, 34, 47, 138, 76, -17, 60, 163, 43, 11, 1, 108, 6, -130, -82, 67, -39, -128, -97, -10, 23, -106, -108, 69, 164, -57, 30, 152, 130, 24, -31, 47, 36, -37, -133, -2, -14, -72, -147, -61, 42, -67, -95, 3, 71, -49, 24, 65, 180, 133, -52, 50, 124, 22, -8, -37, 101, 81, -111, -119, 18, -21, -122, -130, -27, 49, -8, -43, 104, 108, 14, -40, 4, 193, 102, -126, 30, 106, 26, -113, -79, -8, 15, -150, -98, 93, -24, -102, -49, 115, 82, -43, 0, 108, 131, -5, -19, 57, 132, -93, -110, -13, 50, -126, -133, -80, 39, -81, -158, -53, 46, -19, -165, 21, 174, 99, -100, -21, 110, 41, -41, -43, 33, 72, -109, -138, 60, 29, -133, -96, 9, 31, -45, -72]
2942g2J15J00j88j6J99j4p4j43J66O6j63j26J24N2r2j20P5K00j06k08J88R5q2
2965b4p8K3K29r9j24Q5J08k9j61kJ56qj56RJ20j6j53M1Q3O2q8qJ27J07k63N0J25
2992A16M8r9j57P7J42j43r1M9PM0j16K8J25r7j2M7L2ql0j4J71lj15J8M4L5q2r4
3020h2J17Mj15ML7PN7j15L7O2k2L7LJ6J9p8Q9N2j40j0M7L6l2j18J0L3J3j00N3
3049g9O9j8J0j0O5M0j11P4L3k3K1p3R2n1j01K2J09r2k1N2J7m9p4O9N6k1m2J4J16
3078I4n4l3kR5k4j04J05k6p9r1J03l8m5j8P5K0j05Q2N7k2QK3l8J16n6RM3k0p0
3107EJ06p9m9m8M2L0r0rP1l9m7M9R2PNl7R4m9j04J70rj10o0L8Q6o0j31Q6O6j25
3137i9n8Q3P1M7j74J42J10j14l9J29J16j60m3J4J34k06j1J09o6m5N7m8O3n4n8
$$ y = [-72, 43, 143, -45, -61, 138, 124, 50, -93, 73, 139, -24, -150, -26, 26, -66, -186, -111, 89, -17, -225, -37, 58, -24, -102, -79, 150, 51, -73, 12, 120, 91, -70, -72, 84, 76, -80, -71, 49, 33, -120, -79, 4, 66, -22, -30, 97, 204, -59, -9, 116, 164, 65, -92, -15, 127, -16, -107, -58, -51, -11, -127, -99, 26, -71, -83, -36, -4, -12, -42, -56, 115, 112, -3, 15, 59, 94, 12, -82, 35, 39, -76, -72, -35, -28, 29, -86, -49, 13, -9, 28, 31, 47, 66, -12, 77, 129, -11, -21, 26, 62, 30, -88, -78, -45, -32, -132, -79, -10, -28, -18, -28, 37, 77, -34, 40, 73, 50, 71, -2, 90, 39, -62, -40, 69, -23, -44, 8, 25, -24, -98, -29, 27, 6, -36, -22, 94, 40, 7, 5, 100, 76, -28, 77, 51, -28, -119, -16, -54, -99, -117, -42, -22, -127, -45, 12, -10, -2, 21, -17, 99, 43, 52, 95, 75, 5, 111, 32, -17, -65, -23, 7, -83, -92, -21, -60, -107, -58, 34, 41, 46, 9, 103, 54, -50, 120, 111, 1, -59, -21, 65, 5, -126, -40, 26, -99, -157, -74, -3, 44, -130, 12, 122, 8, -31, 98, 214, 54, 11, 25, 159, -47, -58, 51, -15, -60, -3, -51, 12, -42, -100]
3162a00Q8L2n2K8M4mL1m7K7j3o5P7M2j57O3K7o7m5o6J33lj55J16J27j02K0J25
3189A04j8r0M0N7J35k99j2J99j4j21o3O8J39j65j23J80R2j79l5J04Q9r8n3J35
3213G2j1q8l9J64k0o9m6O6j9j13N5O6q6J2o8O0R6o8N0R2j03JJ21j12L0pQ5Jj77
3242e5J8J26j43j1J1J3k9k8O4L8o7r3K39N6k09QJ34Q2j46j10J52O9j50J6RJ7o9
3269e8k9J00O3j98MK59r8j68J43N9K8j39K3J39m7j44J43j4o6n7M5RJj27R0R3j10
3296e6j4Q2Q6r0l5P5lq9J17k1p6j2L5N5l7r1O7N7j42j2J14np6j8J31O7j66QJ92
3325A43m4j09o5K26J9k27q1J91qj50J8O4Jr4K0J23J1j45J17J13j29J0K3R9jj39
3351a4O8J3p5qj3J2l0K0l7J02j23mJ41k4r0O3P0k9q5Q3J07j79K6L1j7j8l1N1M2
$$ y = [-100, -12, 20, -32, -4, 40, 36, 67, 20, 47, 34, -31, 46, 88, -69, -6, 21, -46, -91, -157, -24, -27, -182, -66, 61, -41, -21, 104, 86, -4, 36, 93, 228, -71, -83, 116, 102, -19, -82, -14, 125, -40, -163, 17, 109, -70, -105, -1, 88, -10, -63, 72, 61, -27, -66, 98, 78, 9, -37, 29, 10, -103, -48, 18, -68, -56, -124, -64, 32, -36, 14, 106, 3, 4, 125, 13, 43, 36, 121, 122, -55, -37, 89, -54, -65, -54, -41, -70, -98, -34, 4, -63, -156, 83, 139, -70, -62, 72, 154, 8, -102, 50, 119, -31, -15, -6, 11, -58, -87, 13, 76, -122, -118, 141, 43, -125, 18, 77, 105, -34, -11, 128, 81, -63, 80, 66, 0, -57, -12, -3, -2, -129, -39, 54, -56, -70, 12, 98, 8, -27, 48, 45, -44, 73, 52, -24, -36, -1, 54, 17, -74, -7, 50, -92, -104, 10, 5, -71, -89, 42, 109, -57, -49, 143, 99, -10, -75, 151, 170, -57, -138, 53, 45, -105, -87, -23, -22, -116, -96, 27, 38, -107, 10, 123, -6, 4, 27, 126, 125, -14, 54, 67, -8, -16, -29, -17, -47, -27, -64, 38, -85, -89, 52, 28, -62, 1, 71, 42, -43, 40, 147, -32, -6, 25, 8, -10, -41, 10, 52]
3380E2j60K0J16j4k17P7J82J3j00r6K49l3j81P8J67o0j26J1J41m5j84jJ83n5j74
3405a57R9R8L9j33K2J13q0k9J9Q7l1K2n6O3n2q0L7K2o8M5n7m4J07n8O4l7J6N3
3433B4o8J0P5JM6o6L8J06q2j49R5K0r9o4L0J32m1j49J03J31p9r1K5J62k6j15l
3460c4K58p4j83J4N6K1j82N2J08p8j05R4L5m1kNJ42qp8RJ21q0j9n6J18L5j17j8
3488gK7m5Jj3JK7l6k7j3P1%K7ql4P0k4N1J4Nl0j38R2K6l9j09J42k6j9j24P3J12
3519D7p1n4Q9J12j10m5J02l3Mj9pP7m0j17N8M1p2k8QJ04j84R9K6RL6l2k4J07k1
3548F2j15R6Jk1Qj14Q8M4p1Ro3JJ4j2P2L7j12L9P9l7J0%k9R6L6j12J6J3L7M6k32
3579a14R4M6o5m5PN5L0l6kP8m7k5Q1PK4r8N4M4o8o7P5l8L6p7k3L6L0j02P6O6m4
$$ y = [52, -108, -88, 28, 14, -203, -126, 56, 69, -31, -127, 122, 89, -92, -14, 153, 93, -33, -22, 119, 74, -110, -111, 72, 17, -157, -58, 40, 79, -54, -32, 81, 1, -28, -9, 78, 47, 69, 13, 76, 24, -56, -19, 3, -65, -20, -77, -121, -14, -72, -8, -45, -29, 24, -44, -34, 41, 42, 88, 22, 60, 166, 84, -65, 30, 50, -49, -113, -83, 49, 8, -141, -38, 93, 14, -77, -52, 110, 84, -31, -34, 224, 150, -33, -19, 37, 58, -124, -72, 36, -42, -147, -53, -18, -59, -61, -56, 86, 78, 0, 9, 130, 50, 31, -25, 93, 128, 11, -7, 20, -25, -24, -37, -36, -9, -45, -72, -85, -14, -14, 13, 5, -29, 41, 17, 68, 82, 87, 57, -81, 11, 37, -2, -111, 31, 5, -14, -138, -65, 47, -24, -78, 11, 123, 13, -32, 70, 37, 41, 22, 15, 92, 52, -65, -7, 34, -38, -66, -58, 46, -138, -39, -13, -4, 32, 0, -24, 83, 62, -53, 43, 44, 23, 31, -83, 5, 49, -22, -13, -76, -75, -61, -73, -1, 36, -76, -37, 42, 5, 15, 15, -14, 82, 118, 6, 22, 35, 72, 118, -114, -20, 26, -39, -84, -77, -22, 8, -28, -30, 48, 1, -24, 57, 64, 88, -10, 44, 88, 20, -47, 28, -10, 26, -51, -74, -38, -8, -110, -34, 32, -12]
3610a2M7l3J6K0l0%J07j00PNj2ro1rJ44j10m7ON7K5l7j1L9%j6RLP4L4j12O1K7
3642H2q5rKL7k3q6k1N6KM2pm0P7mj0N8kp3O2M0k1o8l8N9J5r6l6O7l6L3n6K3N8
3675Bl0o6O3O7o4N3n4J19o8q3J41J0j02o3Q5M3r9o3L3J05q0l6M7P1lm7K3L4ln
3705C0O5k1l4j1q1J11n2n8K4O2j20K6j8P9Oq2K4mJ9K4K2RL9pk4j0M3n5Lj7l6M1
3737cPK8m6pN3p5N2J6j6j6R8o1Pm6O1M9p4j02J08k1Jm4J0ql6o0J05j1K5l1j5O4
3769A2qLO1j4q9N3N3M2j24m9N4K8n8l5R3p8Kj5P7oK2q9J52l7o6O4j4j6K2o4O9
3800D5pq2M4Mj20J00n2L3N5p9O1j8k6N0O5n3k5O6nk5Nj1J5o4oMO0k1p4J3O9l2
3832a1j9k1P3n0QO7k9n2K8O8kj01rQ9l3lj14O1R2j61O4J0O6l3oQ2r7N1k9P0m5
$$ y = [-12, 35, 2, 18, 38, 8, 8, 115, 15, 22, 27, 15, 6, -55, -64, 80, -30, -77, -71, -14, 11, -26, -37, 2, 2, -14, -5, -2, 72, 106, -6, 55, 82, -3, -12, -10, 27, 4, -82, -103, -47, -45, -3, -10, -50, 27, 23, 13, 71, 69, -4, 58, 98, 77, 9, -29, 30, 45, -51, -87, -20, -56, -23, -79, -56, 2, -28, -94, -31, 36, -28, 25, -29, 90, 22, -61, 80, 90, -12, -75, 10, 53, -46, -109, -76, 29, -51, -87, -40, 31, 28, -19, 4, 38, 35, 30, 95, 74, 40, 29, -52, 59, 7, -51, -27, 35, -85, -59, -77, 2, 8, -74, -50, -54, -35, -11, 11, 20, 59, 52, 28, 18, 61, 6, 9, -8, -44, -3, 4, 32, -14, -21, 32, -43, 9, 25, 9, -7, 91, 30, 37, -9, 52, 101, 27, -75, 33, 12, 13, -31, -21, -29, -65, -125, -20, -31, -6, -37, -52, 12, 4, 7, 68, 54, -35, 18, 71, 113, -11, -60, -6, 22, -36, -71, 22, -56, -54, -69, 8, 2, 24, -65, 87, 50, -16, 48, 34, 18, 40, -24, 45, 38, -44, 0, 4, -116, -16, -68, -35, 20, -59, 2, -16, -42, 8, 73, 20, -5, 61, 56, 31, 36, 25, 40, -24, -30, -26, 34, 13, -61, -48, 21, -11, -30, -51, 22, -28, -20, 47, 18, -34, -6, 62, 60, -41, -50, 39, 6, 3, -111, -50, 42, -119, -55, -45, 21, -12, -18, 64, -33, 18, -11, 59, 14]
3863A4Qk7J7N1n9k8qK1k9J4j17L7J01J3K6m6M0j7l7j4P1J5Op4K8P3r6rMj8J1n1
3895h0P8l7Kq1J23N5q0n6J40L3j15j7O2M4l8l6lK6m7k8L3N0n9lj4K3l6O9m0L7
3925EJ3k4O7m1K6Lm8j8J3op0Q7p9M7k7pJ4J3qL5N0Pj4rL1ll1l3O8k7J7p2N1J04
3959A34j96%N4nl0J2m6O3ln0J35jm6m4M9Q8r2o1K9M2p6O0k2q2Q5K5r3M2j4K3k7
3990d7L3JJ3pO3j5l9K4J7k0K1r3j2M2M1n8k2J3Nok6PR3Kl8J18n8o5pL6Pn6j2m
4024d9JM8m2J8k4l3n8J59J7j5jl2R4n5j1qK1M7n2m7R5p9n6O3m8K5%n3N8lqRJ9
4057@m3R8j12N1N1k1Rm2M2J8m2j3J5l8mJ2k9J5k2KJ09kp4O5j8L2j1J3j4m3m5Q5
4089D4K3m5p5L6m9L3n8j2R0k0LOM1q6J00j8K7k0J8p7J2J22r6P5p0k1oj7mn4J04
$$ y = [14, 22, -5, 12, 63, 4, -24, -32, -11, -40, -26, -143, -106, -5, 8, 34, -12, 28, 11, -26, -40, 31, 46, 52, -22, 6, 79, -17, -26, -22, -40, -29, -80, -2, -39, -37, -118, 5, 60, -20, -76, 64, 97, -18, -35, 27, 71, 33, -3, -6, 20, -27, -55, -22, 28, -31, -34, -48, -25, -61, 8, -32, 5, 18, -6, 61, 20, 46, 49, 1, -17, -4, -10, -80, 7, -72, -25, -52, -59, -45, -32, -40, -5, 45, 52, 38, 29, 60, 57, 26, -7, 61, 34, 51, -21, 30, 134, -62, -62, -8, -13, -43, -31, -77, -14, -17, -67, 68, 67, 21, -23, 26, 114, 22, -39, -10, 32, -44, 16, -6, -88, -3, 22, -71, -29, -43, -20, -47, -14, -13, 0, -7, 56, 41, 2, 26, 43, 23, 44, -49, -61, -19, 22, -36, -58, -45, -40, -46, -72, -65, 28, 30, -8, 110, 52, -13, -20, 16, 23, -33, -45, -49, -48, 0, -42, -24, -48, -81, -139, 20, 37, 22, 21, -11, 83, 28, 17, 9, 30, 77, 25, -22, 73, -6, -62, 1, -47, -22, -22, -75, -17, -20, -28, -19, 0, -43, 55, -57, -6, 45, 24, 33, -9, 33, 51, 9, -4, 11, -27, -31, -19, -48, -33, -55, -53, 56, 54, -20, 45, 27, 59, 48, 61, 47, 4, -41, 44, 67, 22, -53, -17, -66, -33, -91, -103, -13, -33, -30, -24, 17, -69, 31, 13, 40, 20, 38, -39, -27, 95, -1, 74, 4, -17, -23, -40, -44, -98, 6]
4120Fj7m5P6k9%O8n5j3LOK3l1l8Q4k8m1K2o1K0P0q6K8K3q1O6m9O6Q5j30L5N3j
4152B9q0L8K3%k2PK6j8p2L5N2l6K9k8NK4p1O9L0J5j8l4j3N8Jo8l8L9J8n3J1K3
4184a9j7j1KqJ7J0j1Q1n5RK6OPo9J7M1Ok8m0N9p2J4j9j6O5m6N4j9M8l3K4rNJ2
4218C1k0M1m4l0J3K8j8j0j8JL2o8O0k4L6jn5L8j1l1O3Q2r7J5N5l3k6m2N1k4j1
4249a7J5P2j25j9P4K5m9M2m0O7k1l8M0lm1nL1L8j2o5L3m8k3J5O8k5k3l%J1qP6
4281D2kkJ1rj9k0Jk9Q9o5N0o3Pj6j7J5M1j05K5J25j07j1L5M1oj3k0P5N2j61J0
4312d6L8m0P0m2K0j9n4P5K3p6K5Q1K1p8k0L9N8p2m7J08j03J3N0N0r7l5j9Q5l9
4341c1K6l1L4k9K6Mk7K0p8M0O6RJ1j8K3l8l0N4kq0K1J7J7k4k9L6Kok5O8J0l4M2
$$ y = [6, -11, -56, 20, -9, -9, 59, 4, -9, -6, 0, 23, -8, -46, 38, 10, -31, -9, -70, -50, 20, -66, -38, -15, -96, -30, -79, -13, 72, -58, -23, 30, 29, -51, -13, 10, 10, -12, -5, 21, 3, -69, -34, 18, -18, 11, -17, -12, 12, -59, 10, 40, 55, 37, 3, -10, 48, 49, -19, -57, -18, 0, -53, -42, -19, -36, -47, -45, -53, -36, -26, -37, 44, -11, -2, 24, 30, 37, -32, -15, 26, 32, 4, -36, 23, -49, -35, -54, -70, -5, -51, 3, -16, 32, -1, 23, 14, 19, 31, 11, 52, 8, -22, -9, 19, 1, -9, -27, -26, 6, -62, -2, -26, 10, 9, -46, -8, -19, -50, 13, 95, -2, 13, 68, 35, 9, -33, 18, -6, -17, -2, 70, -55, -74, 0, 25, -24, 18, -22, 45, 24, -14, 26, 23, -18, -23, 8, 46, 34, -31, 2, -46, -69, -54, 14, -11, -34, -37, -37, -26, -34, 42, 40, 38, 49, 40, 21, 1, 2, -27, 62, -3, 47, -16, -9, -25, -42, -27, 14, -91, -66, 59, -48, -59, -24, 17, 11, -2, -22, 53, 105, -56, -46, -8, -48, 22, -20, 0, -19, -73, 2, 25, -51, -26, 55, 76, -2, -22, 17, 75, 3, -44, 64, -39, -26, 24, 74, -23, -58, -77, 8, -31, -5, -36, -2, -31, -5, -1, -28, -8, -86, -46, 20, 29, 40, 22, 45, 7, -23, 31, 29, -51, -30, -13, 4, -20, -49, -13, -11, -17, -42, 26, 36, 2, 44]
4374D4J3k0l3O1j9q1J4M8j9m0L3j2l0L2o0J14j6n9KO1jk4m7R3kr2L3k4mP7o4l1
4406e3P4r0L9J8l2%N3n7M5J7L9K6p1JK2qm4O4n3J7j2%n9PpK8M3o2N0j1PJ2j4M0
4440B9N0k3j5jj8j0m6O4K1r1L0N9o4K9m5L1M0n7N8n5j0O6Nk4J6rko2O3n7N4k0
4472Fk6qn6L0j2J02j12J04l1OK8K8m8K1L0k0q0O6lj22J26k5o8N8Mj9M1k8M4k7
4502Irqj2M3Rj0M3l9l0j6M8m4K2op4P7m6J6K9Rm8J8l3O4k4l1O1k2NM2o4J4J7m0
4536c0M0L2k2J6n6L5j8Mn1O9m5J4L6Mjm8J6L4J1l7L0Mq2Q0o1l3N8k1k8j3M2K7
4568Fn5K6J7L3J5j9k4j7N7m1K0Mj3J1K1n5M9l4Om8M3n8M9OJ0M1o5K9j3J6K8j5
4600C0p7M3Q9q7m8j5J19j68P8J8K7l8j4J4J2P3n1M5m0J9Pm0O6p3k4M2J9J1k5m5
$$ y = [44, 57, 37, 4, 65, 46, -35, -21, 27, 8, -32, 1, -11, -41, -9, -69, 45, 29, -30, -28, 33, 32, 8, -39, 54, 52, -40, -7, -31, -35, 42, -22, -53, 21, -69, -30, -12, -44, -44, 9, -48, -3, 14, 53, 79, 8, 9, 31, 23, -21, 43, -10, 7, -5, -5, -64, -57, -64, -36, 7, -55, -5, -16, -9, 3, -11, 29, 79, 56, 41, 40, 22, 12, -34, 30, 51, -40, -10, 49, -15, 14, -31, 0, 40, -17, 41, -14, -24, 42, 47, 23, 39, 30, 28, -34, 29, -28, 26, 6, -20, -28, -84, -54, -66, 36, -76, 28, -3, 3, 31, 59, 11, 32, 62, 42, -38, 28, 25, -97, 29, 4, -64, -6, -2, -21, 20, -8, 36, 9, 0, -8, -20, 23, 32, 22, 65, 26, -4, -20, 28, -16, 6, 0, -74, 3, -43, -27, 2, 11, -37, -19, -52, 12, -12, -43, 18, -4, 1, 43, -21, -7, 10, -30, 10, 42, 20, 36, -20, 15, -3, 1, -50, 19, -26, -12, 24, 28, 27, -21, -5, 29, 40, 3, 33, 37, -45, 35, -26, -59, -1, -22, -50, -63, -21, 6, -49, -23, -6, 27, 42, 23, -1, -18, 39, -2, 18, 22, 9, 20, 41, -14, 35, 1, 7, -41, 2, -56, -7, -1, 9, 50, -15, 14, 1, 17, 45, 30, -47, -4, 85, -2, -50, -65, 54, -114, -36, -18, 9, -29, -43, -29, -17, 56, 5, 50, 10, 29, 36, -4, 62, -11, -35, 7, 26, 37, 12, -33]
4630c3O0j3k5k9j6K4L1Pk4Q3o3l7Q7J4j20J09q6RM1q8M3M7p2M6l6O4Lr2M2M4J8
4661C8m8K2N4J6n9m7Q5k4m5L8m8j8Ol3m5J33j5o4M2J8j5mJ7JK4%K5l3kk%j0j3
4694fol9K6K9l5j2N8pj2k2L7K7j2L9m7P6n2o6L8Pn4K7ORj1K4j3l4L0Qp7K6M4l8
4728c2j7L8j1M5n1K1L4q9P9j5m7J4J4j6j7L4l4O9Nm8jK1J6L6ql2M4k9J3l8LN5
4760E6j01K5J2o7M3Qk7K4J3rk4N2%K9k4k7K8K5Mk3kn2JJ5M3n3n2N4L2L4l5o0P8
4793B0L5n0j9P2k1Mn0O0k7m6K2K0K7n7j7o5O9J1J1k1L5knj7N0Jp9N2j9L3Kk9j3
4826a3M5n2Nj0J5pj9P0n6L7n3Q2n7jj0OQ3o1J6opl3o1Q2NL7j13P2m5M3L0n5M5
4859A4p4K5k2L6K1J1kjN7m4oOk4Nk3j8k5N8K2K0k3k3%LJ6j8J5J4L2m3o3M8n3J7
$$ y = [-33, 27, 14, -11, -40, -56, -32, -1, 6, -18, 65, 2, -35, 52, 66, -54, 55, -31, -22, 19, -69, -26, 21, -51, -5, -41, 23, 26, -66, -24, 20, 38, -10, 12, 66, 82, 23, -24, 61, 37, -8, 30, -18, -36, -30, -63, -108, 25, 10, -54, -12, 6, -9, -13, 4, 5, 29, 29, 54, 21, 19, 17, 17, 7, -6, -12, -51, -25, 4, -31, -43, 15, 8, -4, -26, 11, 38, 26, 65, 18, 94, 42, -24, 14, 21, -33, -6, 0, 9, -2, 22, 9, -25, 5, 13, -64, -38, 6, -32, -49, -11, -22, 23, -28, -7, 27, -62, 17, 2, -45, -31, -17, -33, -50, -16, -50, 19, 24, -24, -25, -4, 12, 48, 40, 8, 52, 23, 36, -2, 1, 56, -45, -20, -8, -75, -32, -24, -51, -27, -14, -23, -47, 5, 5, 34, 10, -17, 11, 36, 40, 17, 15, -37, -36, -21, 22, -31, -83, -29, 3, 37, 2, -58, 20, 55, 5, -14, 58, 37, 41, -9, 51, 24, -22, 0, 20, 47, -10, -27, -92, -23, -12, -1, -22, 13, 11, 6, -11, 39, 40, -39, 13, -6, 27, 29, 0, -13, 32, -20, -15, -25, -10, -17, -36, 34, -22, 15, -38, 44, -13, -14, -24, -18, 65, 4, 20, 14, 7, -26, -87, -5, 0, 37, -76, -4, -49, -6, 24, -31, 14, -60, -35, -57, -21, 0, 11, 9, 8, 65, 21, 15, 21, -3, 2, -21, -39, -64, -6, 16, 36, 13, -10, -10, -7, 9, -9, 6, 20, 52, 9, -54, -6, -59, -42]
4893d2J6m8L4j7M8qp5R0j3M3l7J6m1K9N5j01j0P8J3j6k4QpJ9J8j7k9l8K3j9J5
4924c7O9j5m4O0J9n2j8Q1l2k2NK9qK8o2j05J00K8n8k1K8M4K2n0K4J3k1m1M9lJ6
4955B6ll9P6l5j0n0k1P4n3N0K0o0j2L9J1m6K1J4j1K6QJRj3K3j3q3K5K8rK%M9r0
4989d6KN0k4MMO8k7jK6m2Ln1Q1k3l0L9k1m1O7k7nqn5M8L1o7M2Lj2M4l5l2M6Jm2
5024c0M2k8O2n0j0j1j6Q2n3k3L6%k3jPkK7M0RK0l1lk0j1L3l8k0Kj1m3M0k9O6J4
5058B7p0O1l6M0k3K5J0L7j2m7ol0J7N3m9K0l6N9j20L4mO2jn6Q9k6J5lQ%m8K6J3
5091B9j7J1mOJ4o5j5J1O4m7L5J4n5RK2l0K2L6m0jJ3M7m5j3j0J7M9k5k4J6j11Q0
5123glkl0M6j7J00q8j6RP3n1o7P8J3k8j5j4nnJ7K1Lk3J4m3K7qN7n1K8Q4j10N0
$$ y = [-42, -26, -74, -40, -57, -9, -17, -92, -2, -15, 28, -9, 7, -34, -5, 50, -51, -61, 17, 30, 14, -10, -2, -9, 10, 28, 11, -18, -56, -33, -52, -37, 32, 17, -27, 33, 52, 0, -18, 63, 31, 9, 14, 43, 35, 63, 1, -104, -4, 24, -34, -55, -27, 17, 39, -11, 13, 26, 5, -36, 13, 10, 26, 23, -16, 60, 25, 15, -35, -56, 18, -35, 15, 35, -25, -37, 2, 13, -33, -12, 2, -9, 17, 25, 26, 35, 22, 45, 32, -51, -26, 2, -7, -5, -5, 44, -46, -44, 6, -18, -14, -10, 58, 31, 30, 56, 14, 17, -34, 47, 24, -6, 33, 12, -29, 38, 11, 6, -2, -57, -9, 22, -45, -3, 0, -12, 32, -3, -35, 11, 12, -30, 12, -16, 46, -4, -14, -25, -41, 41, -12, -35, 1, 1, -22, -23, -16, -18, 9, 49, 58, 78, 47, 44, 24, 13, 46, 8, -12, -10, -21, -64, -24, -53, 13, 27, -43, 18, -18, 22, -1, 24, 34, 71, 59, 12, 6, -24, -7, 46, -3, 17, -19, 40, -80, -46, -50, 12, 11, -45, 44, 18, 33, 30, 38, 38, -10, 16, 29, 12, 23, 19, 25, 39, -26, -41, -30, 34, -13, 22, 36, -19, -10, 12, -18, 4, 40, 0, -1, 12, 59, 14, 1, -9, 8, 57, 32, 8, 24, -87, -7, -10, -12, -42, 4, -13, 87, -1, -17, -8, 65, 14, -53, 25, 38, 10, -5, -19, -24, -29, -12, 9, 12, -11, 3, -40, -13, -21, 36, -15, 13, 97, -13, 37]
5156C7o5N6pj8J5lk5K0k5O6m9m4M1N0m6o4O1O8l7l5m8N6j5j5J2L5l3lJ4rN3p5
5188c2J9p2Q5j4J3j8O0o2M2J5J6K4j09L5J7n1RQ0m4j5K1rn4k9O7J6k9O0n8L1K2
5219C6n3K8J8l2K3On9J7J2L9k7n7N0m8L6k0N6n3ppL4K7j4K7j1j8J2Kk1N5K7p8
5251@k3L9oj0jk0qLJ6K1k6J1K8PqM9m3m4Q3p8L9n1M9l7K6l1L6m9j5J0lK9nK2M4
5286E4pj8m9M8jN4r5j5j0%M9jj3m4L8O1l1l3J5kL3J9oo7L6l3ML7j0J6p9N1L0o9
5320c8k0O6pj8J00j12lLK1j4k3M5J6k5N2J4k6L4l5%ln6QJ8j8jK8m4NK8kO0n5k2
5354b4j0N0Rl1j9kM8K4l5k8j6J22j05k9O7q0L1LmJ5j1O8K6k3Pq9L4K4qok7N0l1
5387@j4J1J8j01J6P6j4k6Q1j6j7j4j7N7j9p5L7O0k7k2L4m8j7K2j0K6k5J6l7N6
$$ y = [37, -28, 28, 21, 3, 18, 15, -10, 10, -15, 51, 2, -42, -1, 49, 3, -61, 0, 68, 31, -4, -52, 4, -11, -26, -14, 21, -12, -15, -1, -10, 43, -32, -13, -85, 0, -14, -1, -19, 41, -21, 21, 36, 52, 76, -33, 2, 19, -32, -23, 57, 13, -2, 19, 10, -44, -73, -6, 10, -19, 41, -17, 14, 36, -17, 11, 29, -3, 20, 26, -33, -16, -4, 35, 8, -49, 1, -47, -11, -31, 25, -28, -35, -42, -8, 19, 5, 32, 21, 3, 15, 17, -4, 51, 78, 0, -23, 16, 10, 0, -1, -21, -29, -26, -10, 11, -15, -4, 24, 31, 23, 72, 29, -15, 68, -10, 29, -22, 27, -10, 16, -15, 21, -28, -43, -33, -36, -7, -12, 10, 54, 47, 29, -20, 28, 27, 81, -14, -29, -39, -39, 10, 9, -4, -48, -10, 51, 20, -13, 2, 0, 33, 52, 46, -21, 15, -18, -14, 23, 13, 29, -50, 1, 31, -38, -58, 8, 1, -17, 83, -29, -32, -29, -8, -22, -45, 0, 16, -9, 43, 57, 31, 65, 30, 30, 27, -29, -21, -3, -21, -22, 6, -38, -33, -5, -7, 53, -2, -24, -34, 16, 25, -6, -25, -27, 21, 45, 10, -18, -34, 88, -17, -46, 21, -59, -28, -25, -29, -14, -25, 43, 69, 46, 53, -36, -2, 22, 14, 8, -19, 31, 0, -14, -3, 15, -86, -70, 6, -8, -34, 47, 31, 14, 0, -17, 40, 21, -54, -17, 43, 16, -6, 28, -20, -37, -15, -25, 1, -24, -8, -45, 11]
5417A1J2Qk9N4l7m3N5l4K7l5M6k3k7kKjL1j8n8Q4m1oJ8k0L3o3O5j4j2Q4q2O4k9
$$ y = [11, 23, 31, 2, 56, 19, -24, 31, -3, 24, -11, 35, 12, -15, -17, -15, -16, 15, -3, -61, 23, -18, -24, -6, -26, 7, -56, 9, -5, -17, 67, -15, 49, 20]
$$ [...]
8191b0
##END NTUPLES=NMR FID
##END=
