##TITLE=1H_DE-80H_X3
 200.13MHz, d2o
 8 sc
 
 19ns.26.2.2025
##JCAMPDX= 6.0         $$ Bruker NMR JCAMP-DX V2.0
##DATA TYPE= NMR SPECTRUM
##DATA CLASS= NTUPLES
##ORIGIN= UXNMR, Bruker Analytische Messtechnik GmbH
##OWNER= pz
$$ XWIN-NMR		Version 3.5
$$ Thu Jul 23 14:01:16 2026 Russian Standard Time (UT+4h)  Yarkov@DPX200
##.OBSERVE FREQUENCY= 200.1313
##.OBSERVE NUCLEUS= ^1H
##.ACQUISITION MODE= SIMULTANEOUS
##.ACQUISITION SCHEME= undefined
##.AVERAGES= 8
##.DIGITISER RES= 18
##SPECTROMETER/DATA SYSTEM= spect
##.PULSE SEQUENCE= zg30
##.SOLVENT NAME= CDCl3
##.SHIFT REFERENCE= (INTERNAL, CDCl3, 0, 15.5012)
##AUDIT TRAIL= $$ (NUMBER, WHEN, WHO, WHERE, WHAT)
$$ ##TITLE= Audit trail, XWIN-NMR		Version 3.5
$$ ##JCAMPDX= 5.01
$$ ##ORIGIN= Bruker BioSpin GmbH
$$ ##OWNER= Yarkov
$$ C:/Bruker/XWIN-NMR/data/yarkov2/nmr/H-C/1/pdata/1/auditp.txt
$$ ##AUDIT TRAIL=  $$ (NUMBER, WHEN, WHO, WHERE, WHAT)
(   1,<2026-07-23 14:00:19.50 +0400>,<Yarkov>,<DPX200>,
      <created by zg, POWCHK disabled, PULCHK disabled
       configuration hash MD5:
       00 E9 B6 7A A2 85 ED C7 34 08 36 98 17 FE 4E 26
       data hash MD5: 16K
       52 B9 0F 3B 89 BB 66 7B 71 C8 A2 36 35 AC F7 C2>)
(   2,<2026-07-23 14:00:30.56 +0400>,<Yarkov>,<DPX200>,
      <Start of raw data processing
       efp BC_mod = 2 LB = 0.25 FT_mod = 6 PKNL = 1 PHC0 = -7254.183 PHC1 = 2.82197 SI = 16K 
       data hash MD5: 16K
       13 E4 C1 78 55 95 31 AB C4 7C 75 68 3B 7A 42 9D>)
$$ ##END=
$$ 
$$ hash MD5
$$ B7 CC 0A C8 8F 37 72 D6 CB 8E EB 5E 3B 01 EE EF
##$RELAX= 
##$RELAX= 
##$RELAX= 
##$RELAX= 
##$RELAX= 
##$RELAX= 
$$ Bruker specific parameters
$$ --------------------------
##$DU= <C:/Bruker/XWIN-NMR>
##$EXPNO= 1
##$NAME= <H-C>
##$PROCNO= 1
##$TYPE= <nmr>
##$USER= <yarkov2>
##$AMP= (0..31)
100 100 100 100 100 100 100 100 100 100 100 100 100 100 100 100 100 100 
100 100 100 100 100 100 100 100 100 100 100 100 100 100 
##$AQSEQ= 0
##$AQ_mod= 1
##$AUNM= <au_zg>
##$AUTOPOS= <>
##$BF1= 200.13
##$BF2= 200.13
##$BF3= 200.13
##$BF4= 200.13
##$BF5= 200.13
##$BF6= 200.13
##$BF7= 200.13
##$BF8= 200.13
##$BYTORDA= 1
##$CFDGTYP= 0
##$CFRGTYP= 5
##$CHEMSTR= <none>
##$CNST= (0..31)
1 1 145 1 1 1 1 1 1 1 1 1 1 1 1 1 1 1 1 1 1 1 1 1 1 1 1 1 1 1 1 1 
##$CPDPRG= <>
##$CPDPRG1= <>
##$CPDPRG2= <>
##$CPDPRG3= <>
##$CPDPRG4= <mlev>
##$CPDPRG5= <mlev>
##$CPDPRG6= <mlev>
##$CPDPRG7= <mlev>
##$CPDPRG8= <mlev>
##$CPDPRGB= <>
##$CPDPRGT= <>
##$D= (0..31)
0 0.7 0 0 0 0 0 0 0 0 0 0.03 0 0 0 0 0 0 0 0 0 0 0 0 0 0 0 0 0 0 0 0 
##$DATE= 1784800818
##$DBL= (0..7)
120 120 120 120 120 120 120 120 
##$DBP= (0..7)
150 150 150 150 150 150 150 150 
##$DBP07= 0
##$DBPNAM0= <>
##$DBPNAM1= <>
##$DBPNAM2= <>
##$DBPNAM3= <>
##$DBPNAM4= <>
##$DBPNAM5= <>
##$DBPNAM6= <>
##$DBPNAM7= <>
##$DBPOAL= (0..7)
0.5 0.5 0.5 0.5 0.5 0.5 0.5 0.5 
##$DBPOFFS= (0..7)
0 0 0 0 0 0 0 0 
##$DE= 6
##$DECBNUC= <off>
##$DECIM= 32
##$DECNUC= <off>
##$DECSTAT= 4
##$DIGMOD= 1
##$DIGTYP= 9
##$DL= (0..7)
0 120 120 120 120 120 120 120 
##$DP= (0..7)
$$ [...]
##$SUBNAM2= <"">
##$SUBNAM3= <"">
##$SUBNAM4= <"">
##$SUBNAM5= <"">
##$SUBNAM6= <"">
##$SUBNAM7= <"">
##$SUBNAM8= <"">
##$SUBNAM9= <"">
##$SW= 18.0517328524113
##$SWIBOX= (0..15)
0 0 2 0 0 0 0 0 0 0 0 0 0 0 0 0 
##$SW_h= 3612.71676300578
##$TD= 16384
##$TD0= 1
##$TE= 0
##$TE2= 300
##$TE3= 300
##$TEG= 300
##$TL= (0..7)
0 120 120 120 120 120 120 120 
##$TP= (0..7)
150 150 150 150 150 150 150 150 
##$TP07= 0
##$TPNAME0= <>
##$TPNAME1= <>
##$TPNAME2= <>
##$TPNAME3= <>
##$TPNAME4= <>
##$TPNAME5= <>
##$TPNAME6= <>
##$TPNAME7= <>
##$TPOAL= (0..7)
0.5 0.5 0.5 0.5 0.5 0.5 0.5 0.5 
##$TPOFFS= (0..7)
0 0 0 0 0 0 0 0 
##$TUNHIN= 0
##$TUNHOUT= 0
##$TUNXOUT= 0
##$USERA1= <user>
##$USERA2= <user>
##$USERA3= <user>
##$USERA4= <user>
##$USERA5= <user>
##$V9= 5
##$VALIST= <valist>
##$VCLIST= <CCCCCCCCCCCCCCC>
##$VD= 0
##$VDLIST= <DDDDDDDDDDDDDDD>
##$VPLIST= <PPPPPPPPPPPPPPP>
##$VTLIST= <TTTTTTTTTTTTTTT>
##$WBST= 1024
##$WBSW= 4
##$XGAIN= (0..3)
0 0 0 0 
##$XL= 0
##$YL= 0
##$YMAX_a= 163899
##$YMIN_a= -266815
##$ZGOPTNS= <>
##$ZL1= 120
##$ZL2= 120
##$ZL3= 120
##$ZL4= 120
##$ABSF1= 0
##$ABSF2= 0
##$ABSG= 0
##$ABSL= 0
##$ALPHA= 0
##$AQORDER= 0
##$ASSFAC= 0
##$ASSFACI= 0
##$ASSFACX= 0
##$ASSWID= 0
##$AUNMP= <proc_1d>
##$AZFE= 0.1
##$AZFW= 0.1
##$BCFW= 0
##$BC_mod= 2
##$BYTORDP= 0
##$COROFFS= 0
##$CY= -3
##$DATMOD= 1
##$DC= 0
##$DFILT= <>
##$DTYPP= 0
##$F1P= 0
##$F2P= 0
##$FCOR= 1
##$FTSIZE= 16384
##$FT_mod= 6
##$GAMMA= 0
##$GB= 0
##$INTBC= 1
##$INTSCL= 3.241238e-09
##$ISEN= 128
##$LB= 0.25
##$LEV0= 0
##$LPBIN= 0
##$MAXI= 10000
##$MC2= 0
##$MEAN= 0
##$ME_mod= 0
##$MI= 1.114404
##$NCOEF= 0
##$NC_proc= -8
##$NLEV= 6
##$NOISF1= 3.799351
##$NOISF2= 2.8
##$NSP= 0
##$NTH_PI= 0
##$NZP= 0
##$OFFSET= 15.50119
##$PC= 1
##$PHC0= -7254.183
##$PHC1= 2.82197
##$PH_mod= 1
##$PKNL= yes
##$PPARMOD= 0
##$PSCAL= 0
##$PSIGN= 0
##$REVERSE= no
##$SF= 200.130004105419
##$SI= 16384
##$SIGF1= 3
##$SIGF2= 2
##$SINO= 0.751879
##$SIOLD= 32768
##$SREGLST= <19F.Aceton>
##$SSB= 0
##$STSI= 16384
##$STSR= 0
##$SW_p= 3612.71676300578
##$SYMM= 0
##$S_DEV= 0
##$TDeff= 16384
##$TDoff= 0
##$TI= <>
##$TILT= no
##$TM1= 0
##$TM2= 0
##$TOPLEV= 0
##$USERP1= <user>
##$USERP2= <user>
##$USERP3= <user>
##$USERP4= <user>
##$USERP5= <user>
##$WDW= 1
##$XDIM= 16384
##$YMAX_p= 498761825
##$YMIN_p= -3089795
$$ End of Bruker specific parameters
$$ ---------------------------------
##NTUPLES= NMR SPECTRUM
##VAR_NAME=  FREQUENCY,     SPECTRUM/REAL,   SPECTRUM/IMAG
##SYMBOL=    X,             R,               I
##VAR_TYPE=  INDEPENDENT,   DEPENDENT,       DEPENDENT
##VAR_FORM=  AFFN,          ASDF,            ASDF
##VAR_DIM=   16384,         16384,           16384
##UNITS=     HZ,            ARBITRARY UNITS, ARBITRARY UNITS
##FACTOR=    0.220516191357247, 1,           1
##FIRST=     3102.25325547238, 0,            0
##LAST=      -510.463507533403, 0,           0
##MIN=       -510.463507533403, -3089795,    0
##MAX=       3102.25325547238, 498761825,    0
$$ Real data points
##PAGE= N=1
##DATA TABLE= (X++(R..R)), XYDATA
$$ [...]
6566B116454J90278P7228j25383J88883k33082J67260j72302N68145k43722k47246
6556B286513J54677j64401K14147K16970j17140m859k99564j27352N1982K54473
6546B465446o4822L83892n5163n18102j19450p8917n1254L36723R5454M3716K23819
6535B661342J20237j21144p3647l35986J79100K37543R2924k47880J16307p0625
6525B558171j01721l92761K35236K14812K68275k15538j01973l59159J1424J84856
6515B301622J84408J50509j04019l73581Q5211J47970n9528M4202M56245j66336
6505B666703j49622k49625k3918m7442N3334M78867Q1938j19327k30623q775N4328
6494B505838k68356K78852J47102j15160N5561k67885n1783r7851q1716J29726
$$ plain form
6566 2116454 2306732 2383960 2258577 2447460 2214378 2381638 2209336 2777481 2533759 2286513
6556 2286513 2441190 2276789 2490936 2707906 2590766 2585907 2286343 2158991 2210973 2465446
6546 2465446 2400624 2784516 2729353 2211251 2091801 2012884 1961630 2298353 2393807 2437523 2661342
6535 2661342 2781579 2660435 2586788 2250802 2429902 2667445 2760369 2512489 2628796 2558171
6525 2558171 2456450 2063689 2298925 2513737 2782012 2566474 2464501 2105342 2116766 2301622
6515 2301622 2486030 2636539 2532520 2158939 2244150 2392120 2332592 2376794 2833039 2666703
6505 2666703 2517081 2267456 2243538 2196096 2249430 2728297 2810235 2690908 2460285 2451510 2505838
6494 2505838 2237482 2516334 2663436 2548276 2603837 2335952 2284169 2186318 2104602 2234328
6484B234328Q8774J1364J66738k39235J12137L06721K09063J6600m92971o2901
6474B350618J47046K42062P8406k20491j31170L48321j60012m04796j78869K94124
6464B365239j94370j8146K03990K80639J10577Q0863j05533m50572l3062J18611
6454B358236M28460Q67p6612k33767J5766k20855N20516L02199m4211j02839j73500
6443B774260l09260k47035p5166K70971J60068J28700k15162N1254k40135O1693
6433B360188K58775L51234J18287l27670j32963k40926K5669M7516M7854L30902
6423B838866P2019j54245n15622k06898M63044J12125j34586K99838j0313q6679
6413B677549k9309j73268n9446L89160m8902L08604k81297j83161k44440J33754
$$ plain form
6484 2234328 2323102 2334466 2501204 2261969 2374106 2680827 2889890 2906490 2413519 2350618
6474 2350618 2497664 2739726 2818132 2597641 2466471 2814792 2654780 2249984 2071115 2365239
6464 2365239 2170869 2152723 2356713 2637352 2747929 2828792 2723259 2272687 2239625 2358236
6454 2358236 2786696 2787563 2710951 2477184 2492950 2272095 2792611 3094810 3050599 2947760 2774260
6443 2774260 2465000 2217965 2142799 2413770 2573838 2702538 2487376 2538630 2298495 2360188
6433 2360188 2618963 2970197 3088484 2760814 2627851 2386925 2412594 2460110 2507964 2838866
6423 2838866 2910885 2756640 2241018 2034120 2497164 2609289 2474703 2774541 2764228 2677549
6413 2677549 2648240 2474972 2415526 2804686 2755784 3064388 2783091 2599930 2355490 2489244
6403B489244k12162L68212N97966l62083k85784J52734j70364Q0404J34858J78991
6393B972016m6545K13106K64932p43184k27486K49766J13494N2982K69529n9342
6383C059268l28351m17268J1275K94721L94120K20021k61242p2263K37683j25704
6373C012260k46963J42329O0684N70525n3698o5299l0596l59972p1424J29177
6363C087023J40122j13753k68789P7839k6206l27426L29686J40115O0450Q4526
6353C183587k00972q9585k41122k19300M53545N6098O08913o0763k51608l62398
6343B876395Q4736J35485k09684L79032M47455p1354l9620l75423l74951K03714
6333C055785L64420L66741J1379k15367k88429j40787j86002J91125L89653L26563
$$ plain form
6403 2489244 2277082 2645294 3243260 2881177 2595393 2748127 2577763 2658167 2793025 2972016
6393 2972016 2925471 3138577 3403509 2660325 2432839 2682605 2796099 2849081 3118610 3059268
6383 3059268 2730917 2313649 2324924 2619645 3013765 3233786 2972544 2900281 3137964 3012260
6373 3012260 2765297 2907626 2968310 3538835 3485137 3419838 3389242 3029270 2957846 3087023
6363 3087023 3227145 3113392 2844603 2922442 2896236 2568810 2898496 3038611 3099061 3183587
6353 3183587 2982615 2893030 2651908 2432608 2886153 2942251 3551164 3490401 3238793 2876395
6343 2876395 2961131 3096616 2886932 3265964 3713419 3642065 3602445 3227022 2852071 3055785
6333 3055785 3420205 3786946 3798325 3582958 3294529 3153742 2967740 3158865 3548518 3875081
6323C875081m1042l47804l49305J89739j0772j11005J57966m6529r9111O7943
6313C285161P8317N6071L27440o4668L04539l10995l7783j84051L29062J74990
6303C958083k27691P1009L79604j80754k79938j84167J34116R7817m5893J61440
6293C883626M45979j79687n39373l1504l65075L62987M94509J28630k66692l95828
6283C537572j38049m64191K99583P17807q8063L75561j5493k94486l0096O5846
6273C965991j07704R2579N8916k14488j49222j43506N45893K30364N4808L225
6263D336856M79514q822j98774n05407R805J23676M65793J99617P0468j57139
6253D815587l40707l01243q0503J67417N72929K5420n6107M4108k72060O9531
$$ plain form
6323 3875081 3834039 3486235 3136930 3326669 3315897 3204892 3362858 3316329 3217218 3285161
6313 3285161 3363478 3419549 3746989 3682321 3986860 3675865 3638082 3454031 3783093 3958083
6303 3958083 3730392 3801401 4181005 4000251 3720313 3536146 3670262 3768079 3722186 3883626
6293 3883626 4329605 4149918 3610545 3579041 3213966 3576953 4071462 4200092 3933400 3537572
6283 3537572 3399523 2935332 3234915 3952722 3864659 4240220 4224727 3930241 3900145 3965991
6273 3965991 3858287 3950866 4009782 3795294 3646072 3502566 4048459 4278823 4333631 4336856
6263 4336856 4816370 4807548 4608774 4103367 4113172 4236848 4702641 4902258 4972726 4815587
6253 4815587 4474880 4173637 4093134 4260551 4833480 4858900 4802793 4846901 4574841 4644372
6243D644372O3508L86710J98080K81965j90391l57718M9273k43235L30395J71588
6233E334547k44926M19138j87071O0460j52459j9090Q8660M40213J51271j12669
6223E778074J94349l79076l19833K74145p0757L66704N3179j60099l50349m8849
6213E337488K33518K29819M5473O6003k04494M8233j00536K129j29524p1789J17037
6202E573357M20859L10172n2547N6899J83291k40745K79407j348N470j77726p1894
6191F285195J69609j18254J39262N7404J39627J24812j63183Q3318m88616K38783
6181F467957J56235j55467P1410P1305K4562k63089J30239m2894K11833k4430
6171F647661m6867R194p4447J8769N3811L47295K48540O1402m7629l86736k34685
$$ plain form
6243 4644372 4707880 5094590 5292670 5574635 5384244 5026526 5075799 4832564 5162959 5334547
6233 5334547 5089621 5508759 5321688 5382148 5229689 5210599 5299259 5739472 5890743 5778074
6223 5778074 5972423 5593347 5273514 5547659 5476902 5843606 5896785 5736686 5386337 5337488
6213 5337488 5571006 5800825 5846298 5912301 5707807 5756040 5655504 5657633 5528109 5456320 5573357
6202 5573357 5994216 6304388 6251841 6308740 6492031 6251286 6530693 6529345 6534815 6357089 6285195
6191 6285195 6454804 6336550 6475812 6533216 6672843 6797655 6634472 6717790 6229174 6467957
6181 6467957 6624192 6468725 6540135 6611440 6636002 6372913 6503152 6460258 6672091 6647661
6171 6647661 6600794 6609988 6535541 6554310 6608121 6955416 7203956 7265358 7217729 6830993 6596308
6160F596308r2163M3949M25199r7181l0414N6887o944Q6234K69279K47137j6356
6149G481935l00850K72196k92767K63116l32190j1749N92514l42919N8676J10483
6139G498445R1506K09514M3608k63115M3040K0649L54851J22119l6481j02187
6129G981949J87670k89595J90101L23010r982k03874L23084J18473m0986M1573
6119H621423J12971M89568P8409j42702R2151K86974k02574P1538K55219k89180
6109I373797J97403j81462K87503O5965J87375l76836k64913J25340J44601l04881
6099I253892M03920J80573j61212j66542j91841o0046J56982K09763J09229n9501
6089I675217K07933n2701J33970j33972j26838K55026L23502l23337J65476j97977
$$ plain form
6160 6596308 6504145 6548094 6973293 6876112 6845698 6902585 6895641 6981875 7251154 7498291 7481935
6149 7481935 7181085 7453281 7160514 7423630 7091440 7079691 7672205 7329286 7387962 7498445
6139 7498445 7589951 7799465 7843073 7579958 7622998 7643647 7998498 8120617 8084136 7981949
6129 7981949 8169619 7880024 8070125 8393135 8383153 8179279 8502363 8620836 8579850 8621423
6119 8621423 8734394 9223962 9302371 9159669 9251820 9538794 9336220 9407758 9662977 9373797
6109 9373797 9571200 9389738 9677241 9743206 9930581 9553745 9288832 9414172 9558773 9253892
6099 9253892 9657812 9838385 9677173 9510631 9318790 9258744 9415726 9625489 9734718 9675217
6089 9675217 9883150 9830449 9964419 9830447 9703609 9958635 10282137 9958800 10124276 9926299
6079I926299J50888J44902j80776j8299j13946J71626L29487K11356J33606m6933
6069A0708210o088K66817J9288K47980l17380L02523J12507J61471L66373M9939
6059A1911640k0146q6179k87837K07675K76297J46065K99896L38172P0031m6603
6049A2809011j80411l6957J30393N22284J30238j0336K33439j04186O5529K22729
6039A3781733J3207N54387j06693J5371K54234K31509l87191N13214K11668J96046
6029A5277485K31180L27997m01776J08496L00664L79183L02522J54444N34773
6020A7214968p6835K49431M32766j04698L13885N40991J84016M0601P2383J77371
6010A9044879j30737M39823O50121N58863K13930M58173L97645M21594j42968
$$ plain form
6079 9926299 10077187 10222089 10041313 10023014 9909068 10080694 10410181 10621537 10755143 10708210
6069 10708210 10702122 10968939 10988227 11236207 10918827 11221350 11333857 11495328 11861701 11911640
6059 11911640 11891494 11805315 11517478 11725153 12001450 12147515 12447411 12785583 12855614 12809011
6049 12809011 12628600 12591643 12722036 13244320 13374558 13364222 13597661 13493475 13559004 13781733
6039 13781733 13794940 14349327 14242634 14258005 14512239 14743748 14356557 14869771 15081439 15277485
6029 15277485 15508665 15836662 15434886 15543382 15844046 16223229 16525751 16680195 17214968
6020 17214968 17138133 17387564 17820330 17715632 18029517 18570508 18754524 18795125 18867508 19044879
6010 19044879 18914142 19353965 20004086 20562949 20776879 21235052 21632697 22054291 21911323
6001B1911323J91528L76939M98488L00329J94101J75015K38002L67863K62482
5992B4516070N07484M02854M72712K23082L02008K89235K36100O51481Q07434
5983B8408460N34936L74690L04662M45679M01702O72610R41454O25568J89182
5974C2898943K03908O42311M28246N33233O60504O34589P10988L57540O06463
5965C7676725O19411N99865N99364Q26750Q90671L81597Q13564M41198M36945
5956D3286090P72479O68746P22263Q16678Q62401K81590J71742P38345R67807
5947D9288141R01025O29993L72346R29100O27937K01104M84425Q78133Q07058
5938E5119262O10575L48689L25300N72667M78027P01450M27296L71112L24587
$$ plain form
6001 21911323 22102851 22479790 22978278 23278607 23472708 23647723 23885725 24253588 24516070
5992 24516070 25023554 25426408 25899120 26122202 26424210 26713445 26949545 27601026 28408460
5983 28408460 28943396 29318086 29622748 30068427 30470129 31142739 32084193 32709761 32898943
5974 32898943 33102851 33745162 34173408 34706641 35367145 36001734 36712722 37070262 37676725
5965 37676725 38296136 38896001 39495365 40322115 41212786 41594383 42407947 42849145 43286090
5956 43286090 44058569 44727315 45449578 46266256 47128657 47410247 47581989 48320334 49288141
5947 49288141 50189166 50819159 51191505 52120605 52748542 52949646 53434071 54312204 55119262
5938 55119262 55729837 56078526 56403826 56976493 57454520 58155970 58583266 58954378 59278965
5929E9278965M31260L2484K23295L9799J80661M42388r1450P3781K45236J00166
5919F0956585l40242j34467j54423p4140j36406l02440l15022l2323j58592l56670
5909E8951860n39881k88309m06514k52462k41140p39762o81794P0384n68205m26123
5899E4878054l16599n32502p39566n54684k08236n24116k46857n77979m60051
5890E0717464n38784k06730p27601q55758l05547j61172o70607m82091l06121
5881D6463053l41350r70189k13436q8961l77514o47495m52263l42300l81600k53929
5871D2394016k06735l41663k93689j00821l81704k04264m13359m06977K509J53875
5861D0201188j51896L318j85626p0768k95974J1756j95750j29520K46358l58838
$$ plain form
5929 59278965 59710225 59742709 59966004 60005803 60186464 60628852 60537402 60611183 60856419 60956585
5919 60956585 60616343 60481876 60327453 60253313 60116907 59814467 59499445 59467122 59308530 58951860
5909 58951860 58411979 58123670 57717156 57464694 57223554 56483792 55801998 55872382 55304177 54878054
5899 54878054 54561455 54028953 53289387 52734703 52526467 52002351 51755494 51177515 50717464
5890 50717464 50178680 49971950 49244349 48388591 48083044 47921872 47251265 46769174 46463053
5881 46463053 46121703 45151514 44938078 44849117 44471603 43824108 43371845 43029545 42647945 42394016
5871 42394016 42187281 41845618 41551929 41451108 41069404 40865140 40451781 40044804 40047313 40201188
5861 40201188 40049292 40052610 39866984 39796216 39500242 39511998 39316248 39186728 39433086 39074248
5851C9074248J27037J41709L13260P9771J96042K46925j24937J61277J21451j58100
5841D0178683K07452q5167O26813P23805q3091K65987M92956L33111M65999M62596
5831D3589144J094443L84886O39862M06739Q36880Q84024O14246J169438O43305
5822E0262967R67087R45783R15828J279153J189032J214914J586501J658496J413192
5813F1432953J332306K062940K095522K088710K243202K292992K544617K622751
5805G8715993K927417L669941L516469L879936M566181M527745M887168N931116
5797A12621966N735477N895359P245596P579327P932224Q931160R575527J0087626
5789A75604262J0341920J0934859J1258558J1777908J1115932J1327710J0286486
$$ plain form
5851 39074248 39201285 39342994 39656254 39736025 39932067 40178992 40054055 40215332 40336783 40178683
5841 40178683 40386135 40300968 40927781 41651586 41568495 41834482 42327438 42660549 43126548 43589144
5831 43589144 44683587 45068473 45708335 46115074 46951954 47835978 48450224 49619662 50262967
5822 50262967 51230054 52175837 53091665 54370818 55559850 56774764 58361265 60019761 61432953
5813 61432953 62765259 64828199 66923721 69012431 71255633 73548625 76093242 78715993
5805 78715993 81643410 85313351 88829820 92709756 97275937 101803682 106690850 112621966
5797 112621966 118357443 124252802 131498398 139077725 147009949 155941109 165516636 175604262
5789 175604262 185946182 196881041 208139599 219917507 231033439 242361149 252647635
5782B52647635R065347P559564O354379L554232J532014o72740k879216n115318
5774B72045897o738977q267033r342920r920100j0739022j1441701j1004075j0874323
5766A93717746j0607275j0063474j0108199q947956q455693p913503p504658o879033
5758A23237955o686905n834240n311691n367004m638068m095510l773243l679791
5750H3851503l429355l217094l075555k742398k535008k371958k369102j750862
5742F2360171j508160k015508j732264j444684j115701j447704j243727j148150
5734E0704273j075011j049992q66576o35980o44662r57748o03272n73834p58375
5725D3538823l77685l75780l83182p18582k13424n04614o15364o56146n64769
$$ plain form
5782 252647635 261712982 269272546 275626925 279181157 280713171 280040431 277161215 272045897
5774 272045897 265306920 257039887 247696967 237776867 227037845 215596144 204592069 193717746
5766 193717746 183110471 173046997 162938798 153990842 145535149 137621646 130116988 123237955
5758 123237955 116551050 110716810 105405119 100038115 95400047 91304537 87531294 83851503
5750 83851503 80422148 77205054 74129499 71387101 68852093 66480135 64111033 62360171
5742 62360171 60852011 58836503 57104239 55659555 54543854 53096150 51852423 50704273
5734 50704273 49629262 48579270 47712694 47076714 46432052 45474304 44871032 44297198 43538823
5725 43538823 43161138 42785358 42402176 41683594 41470170 40965556 40350192 39694046 39129277
5716C9129277n54107n06686o88555l44356q81881j85232q95505l58595m98141
5707C4216219l23439o47821p47086l66891o71521m71875k62664r2267K06797m6818
5697C0792634l77232p6000l17018j72602j52124M07292M95735K06243P2392J15088
5687C0994408L82452K16460j03718m5440L18821j55456j1748m27010j91793o28228
5677C0348748J86018m52131l98585m81736p64165k87472l29968l59499j56289
5668B7304921l67286n02679j97417j20593q3967p4134J36662l60734J82000K62930
5658B6179703J59361j00528K35389k3285M41303J56049P0364j35383l30076o47522
5648B6005375j99529o46092m21305k5711l55471n83584q27639n81045p85112n83894
$$ plain form
5716 39129277 38575170 38068484 37379929 37035573 36153692 35968460 35072955 34714360 34216219
5707 34216219 33892780 33244959 32497873 32130982 31459461 30987586 30724922 30632655 30839452 30792634
5697 30792634 30415402 30339402 30022384 29849782 29697658 30104950 30600685 30806928 30879320 30994408
5687 30994408 31376860 31593320 31489602 31444162 31762983 31607527 31595779 31168769 30976976 30348748
5677 30348748 30534766 30082635 29684050 29202314 28438149 28150677 27820709 27461210 27304921
5668 27304921 26937635 26434956 26237539 26116946 26032979 25958845 26095507 25734773 25916773 26179703
5658 26179703 26339064 26238536 26473925 26450640 26891943 27047992 27118356 26982973 26652897 26005375
5648 26005375 25805846 25159754 24738449 24712738 24357267 23773683 22946044 22364999 21579887 20995993
5638B0995993k24144m00907l43327l95088o53718l90654l39870j11450k07110
5629A7929725l81607o8278Q7523l44080k60612k990l23457J55834k67668J39226
5619A6663616o26085o52489r3598J53944k44877n63527m06165J5055m89763k92508
5609A3463603m53640l07904p29341k47377M7904l68126j90274l10055k25707k78261
5599A0400822k78288r1134K6565k97947j24303j47567o6191k27207p8322k26743
5589H889685k16853l36094j21278j13607k37906J3227J53733l67655M2100N3243
5579G758595L4766j40694P0661k31977j46407K65108l65955n6626J21606j14419
5569G194658r1819L43706j3022j81497r5372Q1291k61333k21301m14038K89832
$$ plain form
5638 20995993 20771849 20370942 20027615 19632527 18978809 18588155 18248285 18136835 17929725
5629 17929725 17548118 17479840 17567363 17223283 16962671 16959681 16636224 16792058 16524390 16663616
5619 16663616 16037531 15385042 15291444 15445388 15200511 14636984 14230819 14245874 13756111 13463603
5609 13463603 13009963 12702059 11972718 11725341 11773245 11405119 11214845 10904790 10679083 10400822
5599 10400822 10122534 10031400 10057965 9760018 9635715 9488148 9421957 9194750 9116428 8889685
5589 8889685 8672832 8336738 8215460 8101853 7863947 7877174 8030907 7663252 7705352 7758595
5579 7758595 7793361 7652667 7723328 7491351 7344944 7610052 7244097 7187471 7309077 7194658
5569 7194658 7102839 7446545 7433523 7252026 7156654 7237945 6976612 6755311 6341273 6631105
5559F631105K70968k3259k27139m56883l86991k9610N43816j07617n4265l29782
5549E830343K67408l9461K2306q0466J05182k58103K75149N4729l72152K1572
5539E826507K26215k73970k21187n6851j45358k5938K7076j63986l07814J20272
5529E004966M26172J84528p3455l9609o3253j7140m42095k4717J18823p1718L80490
5518E382992j05620j06444J52234q0166J14661q5740k31850K90081O5039j7072
5508E378115m32691J63640j41905J84792K13979l47449j53812j11230N9962l804
5498D809597K97373L55839k58109j56199P7519k56844Q8385N3629L68902k36902
5488E143190q4116Q607J56730k48387j11128J14594j9030o0438J76532J7353J45578
$$ plain form
5559 6631105 6902073 6878814 6651675 6194792 5807801 5778191 6322007 6214390 6160125 5830343
5549 5830343 6097751 6058290 6080596 6000130 6105312 5847209 6122358 6177087 5804935 5826507
5539 5826507 6052722 5778752 5557565 5500714 5355356 5329418 5356494 5192508 4884694 5004966
5529 5004966 5431138 5615666 5542211 5502602 5439349 5422209 4980114 4955397 5074220 5002502 5382992
5518 5382992 5277372 5170928 5323162 5242996 5357657 5271917 5040067 5330148 5395187 5378115
5508 5378115 4945424 5109064 4967159 5151951 5365930 5018481 4864669 4753439 4813401 4809597
5498 4809597 5106970 5462809 5204700 5048501 5126020 4869176 4957561 5011190 5380092 5143190
5488 5143190 5059074 5067681 5224411 4976024 4864896 4979490 4960460 4900022 5076554 5093907 5239485
5477E239485o7368J70757R5943k09871J94829j09935j13856Q5996L27638k83359
5467E330259Q1903M43365J25620j29250J21095L59834J680J8586K57203K29162
5457F839457k63488J28185L30094J5329j00917L23328L39287L94559j43544J12508
5447G974798J90584J44930K09131O22720J28748J5387k13073K13301j64085j5133
5437I107308P7559k99368N14155n5544m52387l51687k2972q6523k40736J90197
5427H380002r3830m25437k58039k25601k86462k27143o6992p2143p7269n2290
5417F594796k34671n49943j95209k21726L82084k68237j8490o5092j18270M3902
5407E349144k06806o2387j45888K16855J75329l33872P8127m57451J98790j85727
$$ plain form
5477 5239485 5172117 5342874 5438817 5228946 5423775 5313840 5199984 5285980 5613618 5330259
5467 5330259 5412162 5855527 5981147 5851897 5972992 6332826 6334506 6353092 6610295 6839457
5457 6839457 6575969 6704154 7034248 7049577 6948660 7271988 7611275 8005834 7862290 7974798
5447 7974798 8165382 8310312 8519443 9142163 9270911 9286298 9073225 9286526 9122441 9107308
5437 9107308 9184867 8885499 9399654 9344110 8891723 8540036 8517064 8430541 8189805 8380002
5427 8380002 8286172 7860735 7602696 7377095 7090633 6863490 6796498 6724355 6647086 6594796
5417 6594796 6360125 5810182 5614973 5393247 5775331 5507094 5488604 5423512 5305242 5349144
5407 5349144 5142338 5079951 4934063 5150918 5326247 4992375 5070502 4613051 4811841 4626114
5397D626114j31990M27597k02745l52285k21612L31521N6973J91346R8081k69880
5387D553120K40926j00952k82805l2804j80500P2249L52176q4134n8391J10564
5377D589449j05931k87370J16321j19976K8886l0758j37901j2325N8302K37235
5367D335932Q3838k75869m74291K30341k3348M1351j9097J82824j76255K30762
5357D136188j87854p7414R6745J23582j07066j15183J48096r3965L9983n6838
5347C906274M448r8294k05761m888Q3586J36729M9484p4601K32531l59965L92142
5336D061685L07703j27648o0248j23284j62612k31179L40091M4360J5642N0609
5326D115119j93228l43103o7549O0072L21440k78185J3100n0184k7169M0891n6407
$$ plain form
5397 4626114 4494124 4921721 4718976 4366691 4145079 4476600 4533573 4724919 4823000 4553120
5387 4553120 4794046 4693094 4410289 4377485 4196985 4269234 4621410 4537276 4478885 4589449
5377 4589449 4483518 4196148 4312469 4192493 4221379 4190621 4052720 4040395 4098697 4335932
5367 4335932 4419770 4143901 3669610 3899951 3876603 3917954 3898857 4081681 3905426 4136188
5357 4136188 3948334 3870920 3967665 4091247 3984181 3868998 4017094 3923129 3963112 3906274
5347 3906274 3910722 3812428 3606667 3601779 3685365 3822094 3871578 3796977 4029508 3669543 4061685
5336 4061685 4369388 4241740 4181492 4058208 3895596 3664417 4004508 4048868 4064510 4115119
5326 4115119 3921891 3578788 3511239 3571311 3892751 3614566 3627666 3577482 3550313 3591204 3534797
5315C534797k45606M0713J91407r054j29069K68778P872k24812L8878k4906N31794
5304C980792k37541K02607q1415j47932l1089R3262k8232p6806N4395J01082j14843
5293C714280J6708j23318K43062J73670k15518J27515M8832n46062Q6853J55157
5283C681179n6519j89056l6201K01982N632K45994k84072j98933m4599K53591
5273C578998J58942m05482L51406k9617k41588m0867J31643L79270o7788j2407
5263C802510j20245q5357o439M9571K50890k19718L2818K7615j40589j14543o7314
5252C409199J51863O9770L5357K97650K3578q274l183l6949J04613R664j28853
5241C924435n05347Q5512J4146J86885l30504J21252M45744r5996k65865l0385
$$ plain form
5315 3534797 3289191 3329904 3521311 3512257 3383188 3651966 3659838 3435026 3473904 3448998 3980792
5304 3980792 3743251 3945858 3864443 3716511 3685422 3778684 3750452 3673646 3728041 3829123 3714280
5293 3714280 3730988 3607670 3850732 4024402 3808884 3936399 3985231 3439169 3526022 3681179
5283 3681179 3624660 3435604 3399403 3601385 3607017 3853011 3568939 3370006 3325407 3578998
5273 3578998 3737940 3332458 3683864 3654247 3412659 3371792 3503435 3882705 3814917 3802510
5263 3802510 3682265 3596908 3590469 3640040 3890930 3671212 3704030 3731645 3591056 3476513 3409199
5252 3409199 3561062 3630832 3666189 3963839 3987417 3979143 3975960 3939011 4043624 4053288 3924435
5241 3924435 3419088 3504600 3518746 3705631 3375127 3496379 3942123 3846127 3580262 3549877
5231C549877k26940k0798N05010J04456m92827L68039J27882k18145j09782j91602
5221C395170J78467P6055K10923J43741n4185J22299l97909J76165J53951j90405
5211C814272J42699P5855l13221m05898O50J01990J83083L84012p8367K3737k64389
5200C664423P2802J66336O8314k253K09959N3255j11381R4285k19394j02748K14935
5189D108533J70368j07896L9201L17678l58429k10729M3415j86316J53405Q2449
5179D051679r637j90275q9618J51886M90413j73632l12992l92981J40401R880
5169C675124Q4962K01098J13520k5101m6789k37465L76958m7345j7845l30659
5159C746458j95466N30402R9409k3712K36637o6085r0626l06111M59704K55995
$$ plain form
5231 3549877 3322937 3302139 3807149 3911605 3418778 3786817 3914699 3696554 3586772 3395170
5221 3395170 3573637 3649692 3860615 4004356 3950171 4072470 3674561 3850726 4004677 3814272
5211 3814272 3956971 4032826 3719605 3313707 3314357 3416347 3599430 3983442 3905075 3928812 3664423
5200 3664423 3737225 3903561 3971875 3969622 4179581 4232836 4121455 4215740 3996346 3893598 4108533
5189 4108533 4278901 4171005 4210206 4527884 4169455 3958726 4002141 3815825 3969230 4051679
5179 4051679 4042042 3851767 3762149 3914035 4404448 4230816 3917824 3524843 3665244 3675124
5169 3675124 3760086 3961184 4074704 4049603 4002814 3765349 4142307 4094962 4077117 3746458
5159 3746458 3550992 4081394 4180803 4157091 4393728 4327643 4237017 3930906 4390610 4646605
5149D646605l42122m7108o6057k4161l29266L02750J973j56935j02193m4179K09424
5138D048731J37360M29895j44579l87247J57015J6855j64750J261J13338J57647
5128D365526J43829j52826k30497M98445l2260q1740q2396k04949K93462J82728
5118D699322J24879k73171j8599J02377p2159k0358p2838J95490K77660l6994
5108D905609j66925m98319L39957k3981J20733J26849k03678K07826j88201L41856
5098D961726j95971R0732P0026Q9849R4176k61687J02146N8626j44051R2966l5341
5087D923197K62474l454m8522j08621J49492N57637q1142j9191j013O2331q0830
5076E612358j26721K43919N301m86735j03432M76911J77323k54381J09839j12841
$$ plain form
5149 4646605 4304483 4257375 4191318 4167157 3837891 4140641 4142614 3985679 3883486 3839307 4048731
5138 4048731 4186091 4615986 4471407 4084160 4241175 4258030 4093280 4094541 4207879 4365526
5128 4365526 4509355 4356529 4126032 4624477 4592217 4510477 4428081 4223132 4516594 4699322
5118 4699322 4824201 4551030 4532431 4634808 4562649 4542291 4469453 4664943 4942603 4905609
5108 4905609 4738684 4240365 4580322 4556341 4677074 4803923 4600245 4808071 4619870 4961726
5098 4961726 4765755 4856487 4926513 5016362 5110538 4848851 4950997 5009623 4865572 4958538 4923197
5087 4923197 5185671 5182217 5133695 5025074 5174566 5732203 5651061 5631870 5630857 5693188 5612358
5076 5612358 5485637 5729556 5734857 5248122 5144690 5621601 5798924 5544543 5654382 5541541
5066E541541O5985M3852J51963n15624K05679L54795L03354j28947m74450J5452
5056E563600M45084L65233R6892n28485p6016Q8638K55235k25418j00895K30068
5046F113936P4351j43402J70530M45383m54711j4017l7832j68821J51051j4704
5036F121764K43407j46378l71532N7112j28448K28513R1340J84507K11031j99220
5026F292096Q7601j84393L2446K13853j19303j15247j14394J09334K19522J7195
5016F438710k18438k36522K61311J96833P2615J20526j41713o7742j1625K69383
5006F683338M494j48353k20482J80622O6853n1428L46492O3345k0542J51968l85027
4995F671280K1668j08297K45680j03501J0710J72690j12383K78428k14331j56869
$$ plain form
5066 5541541 5607526 5651378 5803341 5287717 5493396 5848191 6151545 6022598 5548148 5563600
5056 5563600 6008684 6373917 6470809 5942324 5866308 5954946 6210181 5984763 5883868 6113936
5046 6113936 6188287 6044885 6215415 6660798 6206087 6192070 6154238 5985417 6136468 6121764
5036 6121764 6365171 6218793 5847261 5904373 5775925 6004438 6095778 6280285 6491316 6292096
5026 6292096 6379697 6195304 6227750 6441603 6322300 6207053 6092659 6201993 6421515 6438710
5016 6438710 6220272 5983750 6245061 6441894 6514509 6635035 6493322 6425580 6413955 6683338
5006 6683338 6687832 6539479 6318997 6499619 6566472 6515044 6861536 6924881 6904339 7056307 6671280
4995 6671280 6692948 6584651 6830331 6726830 6737540 6910230 6797847 7076275 6861944 6705075
4985F705075K5510Q6061L33241K66622l6808j64721J40435k28288J50025J18218
4975G395370l83925N073J46059L20955J88777J7170L93345j58378j33416m42245
4965G348785j05078J93978L72237R1194k03038j10632J84213l67369K22916O211
4955G633417k49029J78040r8870L33821j32536m0661Q9363O3110j38935Q5778
4945G723498J39339J80960O4644K32349J23677k06319k32040L57675J23638k32829
4935H274592k54012k1759j03767K70446M10456l2710K8886j33764K40976j81140
4925H498204J5888O2222O284M2302L8604J98901k12387k07439L48411L87311K30288
4914I408589l7358K50118k29890k43981K23380M4343L50277j01154Q5293m00703
$$ plain form
4985 6705075 6730585 6816646 7149887 7416509 7379701 7214980 7355415 7127127 7277152 7395370
4975 7395370 7011445 7016518 7162577 7483532 7672309 7689479 8082824 7924446 7791030 7348785
4965 7348785 7243707 7437685 7809922 7901116 7698078 7587446 7771659 7404290 7627206 7633417
4955 7633417 7384388 7562428 7463558 7797379 7664843 7624182 7713545 7776655 7637720 7723498
4945 7723498 7862837 8043797 8108441 8340790 8464467 8258148 8026108 8383783 8507421 8274592
4935 8274592 8020580 7998821 7895054 8165500 8575956 8543246 8572132 8438368 8679344 8498204
4925 8498204 8514092 8576314 8582598 8624900 8663504 8862405 8650018 8442579 8790990 9178301 9408589
4914 9408589 9371231 9621349 9391459 9147478 9370858 9415201 9765478 9664324 9749617 9348914
4904I348914O7199M90360q3192j77727K79835j0287J59272J37131J48861Q6892
4894A0447258O171K67265j36055k57432N26800o6068l2783q5660M81060K16077
4884A1366633l5396K09643K06401p8655j52613j08026L77295O93077l893M48523
4874A2922989k87582l2436O9126K76194N20585J62504J05968m88265K070O05482
4864A3856635J56842j096K71320R2218j82902K38589O21198j2084o146O6002O07100
4853A5707676K07985K84275J47401O1076K89656K47143L93340L03514J22573L82044
4843A8146683R452k61916M93021O88432R11468p5351M63472J72966K72338N95274
4833B1415839O45363J15022O62124M95075L90744N71797L62724Q27984M72517
$$ plain form
4904 9348914 9416113 9906473 9823281 9645554 9925389 9915102 10074374 10211505 10360366 10447258
4894 10447258 10453429 10720694 10584639 10327207 10854007 10787939 10755156 10669496 11150556 11366633
4884 11366633 11331237 11540880 11747281 11668626 11516013 11407987 11785282 12478359 12474466 12922989
4874 12922989 12635407 12602971 12672097 12948291 13468876 13631380 13737348 13249083 13251153 13856635
4864 13856635 14013477 14012381 14283701 14375919 14193017 14431606 15052804 15040720 15034574 15100576 15707676
4853 15707676 15915661 16199936 16347337 16408413 16698069 16945212 17338552 17642066 17764639 18146683
4843 18146683 18156135 17894219 18387240 19075672 19987140 19911789 20375261 20548227 20820565 21415839
4833 21415839 22061202 22176224 22838348 23333423 23724167 24295964 24658688 25486672 25959189
4824B5959189O17511P40371Q50459P27351P79543O81293N11474J207315J534586
4815C3609092J065055J089281J105402J064020J214006J482988J755040J189566
4807D3574450J625299J453192J503845J708128K139748K502735J975216J798104
4799E8280717J972506J854374K116906K305784K742378K016612K181227K038975
4791G5509479K199176K610533K239397K197794J816438K334212K636246K470883
4783I4014158K303528K365009K307874K322134K546011K775497K287267K676504
4775A13597982K462184K560085K489607K572863K254462K563580K344096J139763
4767A31984622J424433J256940J294480Q13523M54578L5327k72194j00011r16469
$$ plain form
4824 25959189 26576700 27317071 28167530 28894881 29674424 30355717 30867191 32074506 33609092
4815 33609092 34674147 35763428 36868830 37932850 39146856 40629844 42384884 43574450
4807 43574450 45199749 46652941 48156786 49864914 52004662 54507397 56482613 58280717
4799 58280717 60253223 62107597 64224503 66530287 69272665 71289277 73470504 75509479
4791 75509479 77708655 80319188 82558585 84756379 86572817 88907029 91543275 94014158
4783 94014158 96317686 98682695 100990569 103312703 105858714 108634211 110921478 113597982
4775 113597982 116060166 118620251 121109858 123682721 125937183 128500763 130844859 131984622
4767 131984622 133409055 134665995 135960475 136773998 137228576 137263903 136991709 136891698 135975229
4758A35975229o68205q31758j351830n87963j383884j226379j427712j679177
4750A26818321j616120j727639j147341j019177j385119k036104k214401j949604
4742A13722816j992881j705734j314847k121386j528705k090216j818751j543107
4734I9607189j735866j728110j421023j218101j432204r13251q26421r38289o26261
4725H8767663l39570r5234l87800J34280N7093J24391L77953N33413J247728R80487
4715I1400404J370264Q12946N35161J215615J481396J399990J727106J705656
4707A01648538J260408J142869J302952J656892J493932J327333J432543J179399
4699A12444866J409546J420361J262303J576400J151053J379920J128889J211005
$$ plain form
4758 135975229 135307024 134475266 133123436 132535473 131151589 129925210 128497498 126818321
4750 126818321 125202201 123474562 122327221 121308044 119922925 117886821 115672420 113722816
4742 113722816 111729935 110024201 108709354 106587968 105059263 102969047 101150296 99607189
4734 99607189 97871323 96143213 94722190 93504089 92071885 91158634 90332213 89393924 88767663
4725 88767663 88428093 88332859 87945059 88079339 88136432 88260823 88638776 89172189 90419917 91400404
4715 91400404 92770668 93583614 94118775 95334390 96815786 98215776 99942882 101648538
4707 101648538 102908946 104051815 105354767 107011659 108505591 109832924 111265467 112444866
4699 112444866 113854412 115274773 116537076 118113476 119264529 120644449 121773338 122984343
4691A22984343Q90538Q78826Q31860N54149N57792J23833j76374N8360n18112
4682A26185215o03945l72049p79826m17400j519250j209635j598711j913376j730355
4673A16040668j630665j403708j896025j648227k032467k123251k043060j716182
4665A01547083j897598k368764j641916k035839j731597k159463k095280j943423
4657H5673203k210641j932775j776024j757449k293130k014696k120286k034146
4649F9534056j798191j909576j613386j875153j907988j973116j818633q52994
4641E5785019j486332j281877j773651j421449j100442j839260p01870j216488
4633D4963650j207763j116992j287033p87565j287438q94121p25344q25713n66892
$$ plain form
4691 122984343 123874881 124753707 125585567 126139716 126697508 126821341 126644967 126703327 126185215
4682 126185215 125581270 125209221 124429395 124011995 122492745 121283110 119684399 117771023 116040668
4673 116040668 114410003 113006295 111110270 109462043 107429576 105306325 103263265 101547083
4665 101547083 99649485 97280721 95638805 93602966 91871369 89711906 87616626 85673203
4657 85673203 83462562 81529787 79753763 77996314 75703184 73688488 71568202 69534056
4649 69534056 67735865 65826289 64212903 62337750 60429762 58456646 56638013 55785019
4641 55785019 54298687 53016810 51243159 49821710 48721268 46882008 46180138 44963650
4633 44963650 43755887 42638895 41351862 40564297 39276859 38382738 37657394 36831681 36264789
4624C6264789q50434n81201o76858r82514n14702q18950p42205m04754m20426
4615C0272745m34289n31931o30901l49589m29592l45148n25047p03151l72674
4606B5950423k95331m71684j85510m31244M7621k33123l74812k39586p01734l8395
4596B3026625k31049j19845o18013n69687k38993l76095J48478k51883n05846
4587B0263692m8574q2461l37341m44563j89374l66339M9053k33617J07054O295
4577A8723825n23038j18628l67734j45944J1470p3343J72329j59078m26445R3751
4567A7187165n263j25088j11064j47613r4158K7757q8953J8063L1944j19592l29829
4556A6243369k28543K38430j85084o5482r2318R948q6554J89915m1165K08892
$$ plain form
4624 36264789 35414355 34833154 34156296 33173782 32659080 31840130 31097925 30693171 30272745
4615 30272745 29838456 29306525 28675624 28326035 27896443 27551295 27026248 26323097 25950423
4606 25950423 25655092 25183408 24997898 24566654 24614275 24381152 24006340 23766754 23065020 23026625
4596 23026625 22795576 22675731 22057718 21488031 21249038 20872943 21021421 20769538 20263692
4587 20263692 20215118 20132657 19795316 19350753 19161379 18795040 18844093 18610476 18717530 18723825
4577 18723825 18200787 18082159 17714425 17568481 17579951 17506608 17678937 17519859 17093414 17187165
4567 17187165 17181902 17056814 16945750 16798137 16703979 16731736 16642783 16660846 16692790 16573198 16243369
4556 16243369 16014826 16253256 16068172 16002690 15910372 15920320 15833766 16023681 15982516 16191408
4546A6191408k56487m65008r2311K46591j8344K66344m13473J1023m2584k05961
4536A5221198K51082K70905j81336j47536J05076l707M76492K45418K7026K7704
4526A6292322l49476l55569Q9954M8536K76894j49092l35547r3618N0464J89477
4516A5664345j05642K60104J57490K5325M46987k44223p2875l96914Q8882P3887
4506A5897366k36447M53096P407J98744O0500k36270N0945J5880K0730P0318L09732
4495A6612001o43050K70871m7307q1909m3364O3807r5664J30262l1303J65317
4485A6299661j66807J30941q1003J72111N4936N89288J50498m99479l119j55124
4475A6491903J05359J92488P9273l07736l57103o8218J34839L30352M56011R4115
$$ plain form
4546 16191408 15934921 15469913 15377602 15624193 15605849 15872193 15458720 15469743 15427159 15221198
4536 15221198 15472280 15743185 15561849 15414313 15519389 15515682 15992174 16237592 16264618 16292322
4526 16292322 15942846 15587277 15677231 15725767 16002661 15853569 15518022 15424404 15474868 15664345
4516 15664345 15558703 15818807 15976297 16001622 16448609 16204386 16131511 15734597 15823479 15897366
4506 15897366 15660919 16114015 16121422 16320166 16380666 16144396 16195341 16211221 16231951 16302269 16612001
4495 16612001 15968951 16239822 16192515 16110606 16067242 16131049 16035385 16165647 16134344 16299661
4485 16299661 16132854 16263795 16182792 16354903 16409839 16999127 17149625 16650146 16647027 16491903
4475 16491903 16597262 16789750 16869023 16561287 16204184 16135966 16270805 16601157 17057168 17151283
4465A7151283m5356k18488J58274k03394k10177K10128J28656J1241R8640M23500
4455A7504307j49938k05290j16636L8478J97042j8516L04397J02378k40567J30020
4445A7545675M06181J39157l01969O9965K00188k78622K261M2781Q569R5737L30731
4434A8260654j41053k33454k16445J55062R4740L50548K65989m5413l11915J14763
4424A8293476J50958J96648j9102K85822K85135l6871M84927J0740k11610j53893
4414A9286230R2942K60522J8121N21282n2045l78567J10653L75799M12688j55371
4404B0492254L86607J81432l34449j64032K09475M14243n9923L53743K21588q4949
4394B1615989K46851J38340K7373J77384L70606J83707l76655O6147n7247M05879
$$ plain form
4465 17151283 17105927 16887439 17045713 16842319 16632142 16842270 16970926 16982167 17080807 17504307
4455 17504307 17354369 17149079 17032443 17070921 17267963 17249447 17553844 17656222 17415655 17545675
4445 17545675 17951856 18091013 17789044 17859009 18059197 17780575 17782836 17825617 17834186 17929923 18260654
4434 18260654 18119601 17886147 17669702 17824764 17919504 18270052 18536041 18490628 18178713 18293476
4424 18293476 18444434 18641082 18621980 18907802 19192937 19156066 19640993 19651733 19440123 19286230
4414 19286230 19379172 19639694 19657815 20179097 20127052 19748485 19859138 20234937 20647625 20492254
4404 20492254 20878861 21060293 20725844 20561812 20771287 21185530 21125607 21479350 21700938 21615989
4394 21615989 21862840 22001180 22028553 22205937 22576543 22760250 22383595 22449742 22392495 22798374
4384B2798374j40020L37232L47635j7006J87243l48911l92013K62421K18160N82508
4374B3835623J13919K70804r3305M9721J06495n8016L40592R1364L39332L06836
4364B5303365N70266O24082O96131M55002j0254k2073k83724l47770o8215k00722
4354B6716088l47048m84175m6753m50499m4224k58224l3986K65910n655J14755
4344B5426189j35324J01737M07328j45494k9622p0771l901N27591J1986M9969
4334B6139688j32323j38207J78140q765J24225n4772K75754r4320K09730K02967
4324B6702117K7376j16110n0594K84349N31354k18231q8139J18887L78838K59464
4314B7829311J02111L16397J17523j08787J27889M47351J40510L16115J75849
$$ plain form
4384 22798374 22658354 22995586 23343221 23326215 23513458 23164547 22772534 23034955 23253115 23835623
4374 23835623 23949542 24220346 24127041 24176762 24283257 24225241 24565833 24657197 24996529 25303365
4364 25303365 25873631 26497713 27193844 27648846 27638592 27616519 27332795 26985025 26916810 26716088
4354 26716088 26369040 25884865 25838112 25387613 25343389 25085165 25051179 25317089 25311434 25426189
4344 25426189 25290865 25392602 25799930 25654436 25624814 25554043 25550142 26077733 26089719 26139688
4334 26139688 26007365 25869158 26047298 26038533 26162758 26107986 26383740 26289420 26499150 26702117
4324 26702117 26729493 26613383 26562789 26847138 27378492 27160261 27072122 27191009 27569847 27829311
4314 27829311 27931422 28247819 28365342 28256555 28384444 28831795 28972305 29288420 29464269
4305B9464269K53513k61080j35036J36975L43371M88728J24431L96881J00236
4296C0912288M45278M72766J58671J0319p5440O63706K83426P86624M92426j99834
4286C3950230O45290K40599J94994O20301M21292P50195N61975k922L87488L96291
4276C8165733O92125P14783N37625K61685N41967O32725Q73704Q60467R49767
4267D4230581J134766P64455P44048Q90181J085234J121074J151350J461819J199161
4258E3782669J279178J841744J539660J656801J732786K108820K018310K495587
4250F8455555K604346K451074K161322K666969L075083L015892L279715L417673
4242I1127629L606070L867801L801234M075646L752845L925584M401007M370493
$$ plain form
4305 29464269 29717782 29456702 29321666 29458641 29802012 30290740 30415171 30812052 30912288
4296 30912288 31357566 31830332 31989003 31999322 31923882 32587588 32871014 33657638 34150064 33950230
4286 33950230 34595520 34836119 35031113 35651414 36072706 36822901 37384876 37381954 37769442 38165733
4276 38165733 38857858 39572641 40110266 40371951 40913918 41546643 42420347 43280814 44230581
4267 44230581 45365347 46129802 46873850 47764031 48849265 49970339 51121689 52583508 53782669
4258 53782669 55061847 56903591 58443251 60100052 61832838 63941658 65959968 68455555
4250 68455555 71059901 73510975 75672297 78339266 81414349 84430241 87709956 91127629
4242 91127629 94733699 98601500 102402734 106478380 110231225 114156809 118557816 122928309
4234A22928309M935754M645952M978506M626209M846758M754230M936247M919428
4226A61571393M660978M758047M607350L966850M491180M049934L448594L587594
4218A95141920L202270K978579K651190K724229K203524J760795J176457O36528
4210B12475492J04783j533j43572l05889p55996j492723k019858k461149k716333
4201B02683222k610389k962536l573596l597743m018539m077141m376010m233978
4193A73233290m636814m655553m508738m812536m686228m542169m678673m764263
4185A35948316m969322m195302l969300m385787m555867m200035m095293l940494
4177A01636916l115265l705129l458804l155843k855385l264091k764661k817716
$$ plain form
4234 122928309 127864063 132510015 137488521 142114730 146961488 151715718 156651965 161571393
4226 161571393 166232371 170990418 175597768 179564618 184055798 188105732 191554326 195141920
4218 195141920 198344190 201322769 203973959 206698188 208901712 210662507 211838964 212475492
4210 212475492 212580275 212578742 212435170 212129281 211373285 209880562 207860704 205399555 202683222
4201 202683222 200072833 197110297 193536701 189938958 185920419 181843278 177467268 173233290
4193 173233290 168596476 163940923 159432185 154619649 149933421 145391252 140712579 135948316
4185 135948316 130978994 126783692 122814392 118428605 113872738 109672703 105577410 101636916
4177 101636916 98521651 94816522 91357718 88201875 85346490 82082399 79317738 76500022
4169G6500022k506583k044648k610499j905381j875409k290261j758194j827023
4161E9682024j404794j656010j359563j374263j193287j217915j213347j271590
4153D8991255j092603o26272o46279p77991q87927o21994p44507r19865n10325
4144D2163492p33381o41347k68886o58084m92313l37285o40814p3575o08951n91844
4134C7117012p08162P4604m08425k23251n44042l68708j61825J08804j22420l15032
4124C4448555K7910k03871k22570p2790N2383o7525n47833k89570q6664J48804
4114C3186829J96024k71449J27101r0552k87824k79184k81112M6242r2871k82230
4104C1970974N54181o0285k20003l88064Q0219k61515j76211j84938P6776J2986
$$ plain form
4169 76500022 73993439 71948791 69338292 67432911 65557502 63267241 61509047 59682024
4161 59682024 58277230 56621220 55261657 53887394 52694107 51476192 50262845 48991255
4153 48991255 47898652 47272380 46626101 45848110 44960183 44338189 43593682 42673817 42163492
4144 42163492 41430111 40788764 40519878 39861794 39369481 39032196 38391382 38317807 37708856 37117012
4134 37117012 36408850 36483454 36075029 35851778 35307736 34939028 34777203 34886007 34763587 34448555
4124 34448555 34476465 34272594 34050024 33977234 34029617 33962092 33414259 33124689 33038025 33186829
4114 33186829 33382853 33111404 33238505 33147953 32860129 32580945 32299833 32346075 32253204 31970974
4104 31970974 32525155 32464870 32244867 31856803 31937022 31675507 31499296 31314358 31391134 31404120
4094C1404120m8688K5105k74683p8166l18770L7609J41671o17599k05004l10407
4084B9755188L53084Q5377k15013K0528q2036k56021j60669k70271K00908L0057
4074B9461132J9697k83051N43294L54824k97408l47445k91285k23733K82158J87696
4064B9405879L83709L6514l30028k42627J64796j34714M39511j11628N8967K66922
4054B9937301m03130L06037j59871J48107L03626j93982M81888N5158j58366R4541
4044C0411309K53615M25524j35132O87839L15258j22484J60201j53686L93209
4035C2235653l2760M71795K62538L02462l14651m8702L19829K91442N77330J88886
4025C4253822M81607M6613J14135J86535Q5839O40972O18138N61045N3210J94086
$$ plain form
4094 31404120 31355432 31380537 31105854 31027688 30708918 30746527 30888198 30270599 30065595 29755188
4084 29755188 30108272 30193649 29978636 29999164 29917128 29661107 29500438 29230167 29431075 29461132
4074 29461132 29480829 29197778 29741072 30095896 29798488 29451043 29159758 28936025 29218183 29405879
4064 29405879 29789588 29826102 29496074 29253447 29418243 29283529 29723040 29611412 29670379 29937301
4054 29937301 29534171 29840208 29680337 29828444 30132070 29938088 30419976 30475134 30316768 30411309
4044 30411309 30664924 31090448 30955316 31643155 31958413 31835929 31996130 31842444 32235653
4035 32235653 32202893 32674688 32937226 33239688 32925037 32876335 33196164 33487606 34064936 34253822
4025 34253822 34735429 34782042 34896177 35082712 35168551 35809523 36427661 36988706 37041916 37236002
4015C7236002O23361Q6031M25334N11641M45227L99109O90802L16356L70933L18171
4005D1422967N13208N11574Q13696J035314P80033J5640O67826Q55331M69933
3996D7085522R94800R86020K83600P38940R12875R83576Q10953J406165P70728
3987E4973179Q98328J044634J051033J095099J165791Q48326J398107J264804
3979F3739301J299686J199382J403914J278565J520427J251259J498719J700775
3971G4892028J849906J285121J462122J367350J873812K096819J655000J787669
3963H8269827J902629J401299J784163K405229K217422K344977K181508K335600
3955A04842654K110196K212654L314072L000158K638012L127979L478235L477369
$$ plain form
4015 37236002 37859363 37945394 38370728 38882369 39327596 39726705 40417507 40733863 41104796 41422967
4005 41422967 41936175 42447749 43261445 44296759 45076792 45092432 45760258 46615589 47085522
3996 47085522 48080322 49066342 49349942 50088882 51001757 51985333 52796286 54202451 54973179
3987 54973179 55871507 56916141 57967174 59062273 60228064 61076390 62474497 63739301
3979 63739301 65038987 66238369 67642283 68920848 70441275 71692534 73191253 74892028
3971 74892028 76741934 78027055 79489177 80856527 82730339 84827158 86482158 88269827
3963 88269827 90172456 91573755 93357918 95763147 97980569 100325546 102507054 104842654
3955 104842654 106952850 109165504 112479576 115479734 118117746 121245725 124723960 128201329
3947A28201329L447108L835667L951086M340887M606875M753828M863729N068557
3939A63069066M932635N072961N437954O343794N973379O233365O491813O484361
3931B10039328O458328O795439P023718P526825P534213P435727P651472P166062
3923B67631112P121644P542762P496209P808004P374442O989383O715888O958654
3915C25638098O627585O231811O126522N702531N762801N653445N149736N024232
3907C71916761M788707M134565L976770L862668L125411L258875K714590L035972
3899D00814319K495035K343698K701720K386703K107036K523734K823779K817707
3891D21013731L024960L692926L376493L849002L943421M471671M389176M794093
$$ plain form
3947 128201329 131648437 135484104 139435190 143776077 148382952 153136780 158000509 163069066
3939 163069066 168001701 173074662 178512616 184856410 190829789 197063154 203554967 210039328
3931 210039328 216497656 223293095 230316813 237843638 245377851 252813578 260465050 267631112
3923 267631112 274752756 282295518 289791727 297599731 304974173 311963556 318679444 325638098
3915 325638098 332265683 338497494 344624016 350326547 356089348 361742793 366892529 371916761
3907 371916761 376705468 380840033 384816803 388679471 391804882 395063757 397778347 400814319
3899 400814319 403309354 405653052 408354772 410741475 412848511 415372245 418196024 421013731
3891 421013731 424038691 427731617 431108110 434957112 438900533 443372204 447761380 452555473
3883D52555473M686121N047810N391774M722995M705102M443212M118273L267642
3875D88938402L049115K526606J713550J651978Q82174l52990j07957j213534
3867D97087344j928663k607553k977052l723397m542247m990854n422281n811014
3859D65084283n884006o461661o757669o796424p121739p077898o924135o416424
3851D11644327o206451n917217n276448m992565m606505m078353l601576k641533
3843C74323679j660195q70168j39029O2193J401174J784795K521737K850925L677909
3834C83953020M647241M794744M800372N348052N637278N675548O115003O298519
3826D27269777O085445N326222N456062M641628M348736L706934L248186K362504
$$ plain form
3883 452555473 457241594 462289404 467681178 472404173 477109275 481552487 485670760 488938402
3875 488938402 491987517 494514123 496227673 497879651 498761825 498408835 498300878 497087344
3867 497087344 495158681 492551128 489574076 485850679 481308432 476317578 470895297 465084283
3859 465084283 459200277 452738616 445980947 439184523 432062784 424984886 418060751 411644327
3851 411644327 405437876 399520659 394244211 389251646 384645141 380566788 376965212 374323679
3843 374323679 372663484 371793316 371654287 371716480 373117654 374902449 377424186 380275111 383953020
3834 383953020 388600261 393395005 398195377 403543429 409180707 414856255 420971258 427269777
3826 427269777 433355222 438681444 444137506 448779134 453127870 456834804 460082990 462445494
3818D62445494J596943J024996J70743q48052j455045k076574k658443l166936
3810D55033126m152244n129988n849489o678035o762459p141946p693687q360661
3802D03264617r051499r613137r861420j0133148j0450124j0468267j0645921
3795C33041101j0763580j0727856j0880334j0944179j0758723j0899162j0576101
3788B57491166j0156042r689975r969072r745576r672966r321354q493227q451828
3780A81991126q172707p538591o956333p103995o409505n994661n268779m901606
3772A29644949m467161m572412l849970l705924l144542k873343l060755k282336
3764A01688506j864555j805204k063233j148195j254601j566864p99292q01224
$$ plain form
3818 462445494 464042437 465067433 465238176 464390124 462935079 460858505 458200062 455033126
3810 455033126 450880882 445750894 439901405 433223370 426460911 419318965 411625278 403264617
3802 403264617 394213118 384599981 374738561 364605413 354155289 343687022 333041101
3795 333041101 322277521 311549665 300669331 289725152 278966429 268067267 257491166
3788 257491166 247335124 237645149 227676077 217930501 208257535 198936181 190442954 181991126
3780 181991126 173818419 166279828 159323495 152219500 145809995 139815334 134546555 129644949
3772 129644949 125177788 120605376 116755406 113049482 109904940 107031597 103970842 101688506
3764 101688506 99823951 98018747 95955514 94807319 93552718 91985854 91186562 90385338
3756I0385338j237068q01455o23994p56245q55333n93913p88750o28668r36890
3747H3163022n79224q95115r95008j076609j019597j054398r39861j471962j713577
3738G3417671j725515j436639j506161j639251j638147j593819j713736j768203
3730F0396200k132726j702746j869133j523723j677031j563937j441222j439917
3722D7045765j751019j561491j308149q43556j446126j309242q52776j173876
3714C6799530r80090q10372j287421o24777o59235p61704n74797r95969p76391
3705B9328774q05333m22208l98659m63979o35533q33816n09723n84151o89395
3696B3985977l67083n20925k75667m3942o20692l92738m67233o11594k37147k65735
$$ plain form
3756 90385338 89148270 88346815 87722821 86966576 86111243 85517330 84728580 84099912 83163022
3747 83163022 82583798 81688683 80693675 79617066 78597469 77543071 76603210 75131248 73417671
3738 73417671 71692156 70255517 68749356 67110105 65471958 63878139 62164403 60396200
3730 60396200 58263474 56560728 54691595 53167872 51490841 49926904 48485682 47045765
3722 47045765 45294746 43733255 42425106 41581550 40135424 38826182 37973406 36799530
3714 36799530 35819440 35009068 33721647 33096870 32437635 31675931 31101134 30105165 29328774
3705 29328774 28523441 28101233 27702574 27238595 26603062 25769246 25259523 24675372 23985977
3696 23985977 23618894 23097969 22822302 22778360 22157668 21764930 21297697 20686103 20448956 20183221
3686B0183221j1495J22264j95416m63415p53879n66576Q3827k50534k08789k67281
3676A7671927l90327l96730j19125m21796K10275J12116l16495n15522l66072
3667A5468251k69991k03649J2373j72128k46770J18577j02778l44491n93403k26935
3657A3439056n3222J40218J93260K43802o70255l72145k22960R4956o6094N2493
3647A2779109m00k87481m95125K51103k07063k30883k16448j36437J58968J55184
3637A1770527m10800l27541K29958M0319j62057k42826l95157M346J9077m7931
3627A0477915l32879M7399L15720K70017k24862l05913n69887j48385Q6985R2520
3617I708630J27832J93122j64676l63364k25544n1150P367K68938M4128K7896
$$ plain form
3686 20183221 20171726 20293990 20098574 19635159 18881280 18314704 18398531 18147997 17939208 17671927
3676 17671927 17281600 16884870 16765745 16343949 16554224 16666340 16349845 15834323 15468251
3667 15468251 15198260 14994611 15006984 14834856 14588086 14706663 14603885 14259394 13665991 13439056
3657 13439056 13385834 13526052 13719312 13963114 13292859 12920714 12697754 12792710 12726616 12779109
3647 12779109 12778709 12491228 11996103 12247206 12040143 11809260 11592812 11456375 11615343 11770527
3637 11770527 11359727 11032186 11262144 11302463 11140406 10897580 10502423 10506769 10525846 10477915
3627 10477915 10145036 10192435 10508155 10778172 10553310 10247397 9677510 9529125 9616110 9708630
3617 9708630 9836462 10029584 9864908 9501544 9276000 9224850 9232217 9501155 9545283 9573179
3607I573179o0338k91464K5948P5802N3062k23031J99686K04020l1951J38697
3597I663610j70235m5477o6922K77074L42406k52879j97080l94927J03029k03496
3587I055103K2160K99910K40847l40734j89412m92220K62377L8193M81710P0794
3577I448728j32984j19240l09534m12834K73352K03555K41496l2537L308p6566
3567I086744k82613J19143p4438l18768Q3182M65158J42133o23990j46603J14845
3557H564793m8119K5483K69920Q5172L2636j52811Q1217O9580P9255N4551p8110
3546H983567p8380M4232j45415k65862P950J90067K35344k4093P1774J23049k82699
3535H859534K70452L21982K16892K71152K66081j40587J75691K9897j60410K36876
$$ plain form
3607 9573179 9512841 9221377 9247325 9323127 9376189 9153158 9352844 9556864 9524913 9663610
3597 9663610 9493375 9447898 9380976 9658050 10000456 9747577 9550497 9155570 9258599 9055103
3587 9055103 9077263 9377173 9618020 9277286 9087874 8595654 8858031 8896224 9377934 9448728
3577 9448728 9315744 9196504 8886970 8474136 8747488 8951043 9192539 9160002 9163310 9086744
3567 9086744 8804131 8923274 8848836 8530068 8613250 9078408 9220541 8596551 8449948 8564793
3557 8564793 8516674 8542157 8812077 8897249 8929885 8777074 8858291 8927871 9007126 9061677 8983567
3546 8983567 8905187 8949419 8804004 8538142 8546092 8736159 8971503 8947410 9019184 9142233 8859534
3535 8859534 9129986 9451968 9668860 9940012 10206093 10065506 10241197 10271094 10110684 10347560
3525A0347560O53148m306k01433l61183k01077j14422p3923J98992Q1286k51731
3515A0072911l24571o9656J8283m14085J17322K40104L16450k78731k76857J48371
3505I549541j04815P7705j64265M88477J82573j25133K45436k69269j99150L19979
3495A0001079L27391N92162j48755R8567m64841m9206J11277M59418J80581L22754
3485A1430427l9266r4271m43890K784N40469N15991J96738O11250L19797L9042
3475A3079071k37868K59020N65439M81868N33707N26164P00907N96382N06710
3466A7011400N07526O29864Q93755J334747J112742J201570J399587J217309J659929
3457B6968429J867601K315650K364505K090241J886598J794612K219748K526815
$$ plain form
3525 10347560 11000708 10996402 10794969 10433786 10232709 10118287 10044364 10243356 10324642 10072911
3515 10072911 9748340 9678684 9696967 9282882 9400204 9640308 9956758 9678027 9401170 9549541
3505 9549541 9444726 9522431 9358166 9846643 10029216 9904083 10149519 9880250 9681100 10001079
3495 10001079 10328470 10920632 10771877 10870444 10405603 10356397 10467674 10927092 11107673 11430427
3485 11430427 11391161 11296890 10853000 10855784 11396253 11912244 12108982 12720232 13040029 13079071
3475 13079071 12841203 13100223 13665662 14147530 14681237 15207401 15908308 16504690 17011400
3466 17011400 17518926 18148790 19042545 20377292 21490034 22691604 24091191 25308500 26968429
3457 26968429 28836030 31151680 33516185 35606426 37493024 39287636 41507384 44034199
3449D4034199J960607K112215J477588J009620J041806N84825K22106p1210j70068
3440E2201688m96116n23018q68128p40711n43797n51121m67411r3192j51275K0549
3430D7787468k6856K45910M51183Q73411J112006J000287J068962J210510Q58961
3421E4581842L43722k14785p83699j060348j523008k156072k367320k235702k473328
3412D2111302k476415k097362j888867j658657j425038j263778j518194j477801
3404B8305190o52497r00586n37553k58522m30259l40425m49133j83156o4159J32586
3394B4621486O76718J59080k79790k99842l25359o79194n39373k22903p02357
3385B2408466j254087j010853j507194j237673j019104o79560r03238j368830
$$ plain form
3449 44034199 45994806 48107021 49584609 50594229 51636035 52220860 52442966 52371756 52201688
3440 52201688 51705572 51182554 50314426 49573715 49029918 48478797 48011386 47918194 47766919 47787468
3430 47787468 47760612 48006522 48457705 49331116 50443122 51443409 52512371 53722881 54581842
3421 54581842 54925564 54710779 53927080 52866732 51343724 49187652 46820332 44584630 42111302
3412 42111302 39634887 37537525 35648658 33990001 32564963 31301185 29782991 28305190
3404 28305190 27652693 26752107 26214554 25956032 25525773 25185348 24736215 24553059 24488900 24621486
3394 24621486 25298204 25457284 25177494 24877652 24552293 23873099 23333726 23110823 22408466
3385 22408466 21154379 20143526 18636332 17398659 16379555 15699995 14796757 13427927
3377A3427927p44277q96969o53065p47345o50599l45689m76967p08631l58832
3368G845553m98756o23087j79366m76260O1655k664k54862j70756n69080l03662
3358D828715k90119j10580j29769O0016j06545k58779l67683j27104k87326r4401
3348C116425K32398r4020N8058J22895j08907j83332j38682l02169j51179L98903
3338B950390K09763j61078l60632k14100M2732O0508k38451J32149j84265k48916
3328A988100K63135J63392r4741k22155L6329r168l99874J06241M0165k43672
3318A627752J46903j33480Q3003k37686l97782M01429j18754m3710J84443J0413
3308A522531k18567J91576j09549J04126k8392k7010j7181p0693J33925p9912
$$ plain form
3377 13427927 12683650 11786681 11133616 10386271 9735672 9389983 8913016 8204385 7845553
3368 7845553 7346797 6723710 6544344 6068084 6129739 6127075 5872213 5701457 5132377 4828715
3358 4828715 4538596 4428016 4298247 4358263 4251718 3992939 3625256 3498152 3210826 3116425
3348 3116425 3348823 3254803 3312861 3435756 3326849 3143517 3004835 2702666 2551487 2950390
3338 2950390 3160153 2999075 2638443 2424343 2467075 2527583 2289132 2421281 2237016 1988100
3328 1988100 2251235 2414627 2319886 2097731 2134060 2124892 1725018 1831259 1871424 1627752
3318 1627752 1774655 1641175 1724178 1486492 1088710 1490139 1371385 1327675 1512118 1522531
3308 1522531 1303964 1495540 1385991 1490117 1461725 1434715 1417534 1346841 1480766 1400854
3298A400854l08362j19566m9117L74754Q756p462l53447l49223l05351J66244
3288D58080K53312k8348r6296J13103o8695l5222o1499J6195j67095L49505j41752
3277E91288R38J94907N095j21532l18117J73762J97522Q1988J73759l21653k46676
3266D11281n8847l17572L89758K4136J44910N2699j68383k01719j95102O0062
3256A41223J22314o655K03049m29575J31749J39348n8435J15283j0695j78352
3246A69254p5694n901J21988j93788q5506N473N34293J18496k38522J005k4302
3235C26796o44448K19650R8760L39435k99847k58271k25841O6245L32174K68009
3225B22662j32970j35872q81k65568N4755K90171J6245J70335j49786j29090j11489
$$ plain form
3298 1400854 1092492 972926 923809 1298563 1307319 1299857 946410 597187 291836 458080
3288 458080 711392 683044 586748 699851 631156 595934 534435 550630 383535 733040 591288
3277 591288 592226 787133 792228 670696 352579 526341 723863 805851 979610 657957 411281
3266 411281 352434 34862 424620 448756 593666 646365 477982 276263 81161 141223
3256 141223 263537 256882 459931 30356 162105 301453 243018 358301 347606 169254
3246 169254 93560 87659 209647 15859 -69647 -64174 470119 588615 350093 351098 326796
3235 326796 -317652 -98002 758 340193 40346 -217925 -443766 -377521 -45347 222662
3225 222662 89692 -46180 -47061 -312629 -257874 32297 48542 218877 69091 -59999 -171488
3214a71488J83227K20887k5843m83188O407J23577l5413K35289j8905k2842j13489
3203a01781j24553N42915l25201J9946j28555k33819J28844K28149J2748q6587
3193f7894r666l4531m6827J8111M0677L86290l6308n8884J5690k97013P962P4020
3181h373m2210j23486k0036j81616L17655J17908l228k21921n1280l5187L21530
3170F9756J43133J55990k29461j84516J73943K05905k238L04095k60096j7388
3160C59123m4225j5346j42768k0571Q1631J18539Q3544J57761j62038J24677j43603
3149C96724M40708P1217k19060L00146j28064O3359k99740Q003J66378L01352
3139A101023N36481j48025K35530r8553Q4509L74896J11431l14972J76031k1844
$$ plain form
3214 -171488 11739 232626 206783 -276405 -269998 -146421 -181834 53455 34550 11708 -101781
3203 -101781 -226334 316581 -8620 11326 -117229 -351048 -222204 5945 18693 -67894
3193 -67894 -77560 -112091 -158918 -140807 -100130 286160 249852 190968 206658 -90355 -82393 -8373
3181 -8373 -50583 -174069 -194105 -375721 -58066 59842 56614 -165307 -216587 -251774 69756
3170 69756 212889 368879 139418 -45098 128845 334750 332512 636607 376511 359123
3160 359123 314898 299552 156784 136213 217844 336383 419927 577688 415650 540327 396724
3149 396724 837432 908649 689589 989735 861671 925030 625290 633293 799671 1101023
3139 1101023 1637504 1489479 1725009 1626456 1710965 2085861 2197292 1882320 2058351 2036507
3129B036507J79556m6293K69686j86567j21755K9753k13231k68610M38935K88682
3119B406663R4860j40252l69297K50339J69957P3347N0513o7230M63410J31125
3109C063435L62122N51849N0473M20758p2755q009J09507j1486k10005j21029
3099D134860k50952n13076l40444J03k75462l16489J13379m04168n90581K98978
3089A856148J25570j10091n8994L3925k4146j10681N6896J27187p2899L88562
3079B211477K72594Q6659O8284k24382J138k49337k80821J69991k01925j13637
3069A740041k04616j28955O4960m79l90612k90875l0485L60916m2003k81441k20314
3058E76137K96600k18937k34650K40806q8354O8027J6308k01024K98828j12680
$$ plain form
3129 2036507 2216063 2169770 2439456 2252889 2131134 2160887 1947656 1679046 2117981 2406663
3119 2406663 2501523 2361271 1991974 2242313 2412270 2485617 2536130 2468900 2932310 3063435
3109 3063435 3425557 3977406 4027879 4448637 4375882 4367873 4477380 4465894 4255889 4134860
3099 4134860 3883908 3370832 3030388 3030491 2755029 2438540 2551919 2147751 1557170 1856148
3089 1856148 1981718 1871627 1812633 1846558 1822412 1711731 1768627 1895814 1822915 2211477
3079 2211477 2484071 2570730 2639014 2414632 2415770 2166433 1885612 2055603 1853678 1740041
3069 1740041 1535425 1406470 1471430 1470951 1080339 789464 758979 1119895 1077892 796451 576137
3058 576137 872737 653800 419150 659956 571602 639629 655937 454913 753741 641061
3048F41061k45035J9540k54175P4238j27410O7018j08250n5245K92074j90492
3038A13324j01534K40776l9276l41763J57059P0004l08742J88772J48029q6120
3028D0529k831l86637J14072l65384L81020J17799K8914J45228j66271k02557
3018b96118J2834o1849j93048j09593O0680J25653k60742k2654K00915j4968k46923
3007h05813K70258P8813j59343j15774R2937K05304J16755k335j77252p5035K87281
2996b84204j2150k92930n4252L36446N9249k5675r0338k79091J80408m12088P9274
2985g95351N6222P4519M7848J73878Q678l41770N00056R8668k39857k29050M8304
2974e97855O4781J15272J99546j41992m2138k91547j58781K60943l05829K17264
$$ plain form
3048 641061 396026 415566 161391 235629 108219 175237 66987 11742 303816 113324
3038 113324 11790 252566 213290 -128473 28586 98590 -210152 -21380 126649 40529
3028 40529 37698 -348939 -234867 -600251 -219231 -101432 -72518 72710 -93561 -296118
3018 -296118 -283284 -345133 -538181 -647774 -587094 -461441 -722183 -744837 -543922 -558890 -805813
3007 -805813 -535555 -456742 -616085 -731859 -638922 -433618 -316863 -319198 -496450 -571485 -284204
2996 -284204 -296354 -589284 -643536 -307090 -247841 -273516 -363854 -642945 -462537 -874625 -795351
2985 -795351 -739129 -664610 -616762 -442884 -434206 -775976 -275920 -177252 -417109 -646159 -597855
2974 -597855 -533074 -417802 -218256 -360248 -402386 -693933 -852714 -591771 -897600 -680336
2964f80336J99726q646j43817k95757J36328J53515N1755j78665M0729L15529
2954d09639p1794J50761J06821n29830j22728j86177j98456L91791J82061K80171
2944d07019k3527k83200k6000M4658J67144k39318j79498K81108o9058j44001
2934h78711J03708m8659Q2576j40951J82967N8109p0077J72952j80370p294n1945
2923g77695L11772J27566k31107Q245k83125k43157L47995K71874J53770l65303
2913f79165k5450j89631o4867k70102J00286L41688j91504J78640o5990l8971
2903i05066j4475r0134j37989j80580J55591K99976L17648Q710k18388O5898L580
2892f95229L088J64455M5541K9055l07673n2542M338M63470M211j03983m30210
$$ plain form
2964 -680336 -480610 -489256 -633073 -928830 -792502 -638987 -587232 -765897 -725168 -409639
2954 -409639 -481433 -330672 -223851 -753681 -876409 -1062586 -1261042 -869251 -687190 -407019
2944 -407019 -430546 -713746 -739746 -695088 -527944 -767262 -946760 -665652 -734710 -878711
2934 -878711 -775003 -823662 -741086 -882037 -699070 -640961 -711038 -538086 -718456 -725750 -777695
2923 -777695 -465923 -338357 -569464 -561219 -844344 -1087501 -739506 -467632 -313862 -679165
2913 -679165 -704615 -894246 -959113 -1229215 -1128929 -787241 -978745 -800105 -866095 -905066
2903 -905066 -919541 -1009675 -1147664 -1328244 -1172653 -872677 -555029 -546319 -764707 -698809 -695229
2892 -695229 -692141 -527686 -482145 -453090 -760763 -813305 -808967 -345497 -341286 -445269 -875479
2881h75479l3042N7306q1402Q960K72478m7851j35097l571n3745n0097J73243
2870g68297j60839k7642m9502j9338J93768J2721k5215k59701j11043L06051L74744
2859e34293k9844L6870k25146O9249L8110k3018o7393j49603K35008k7401O6147
2848f11314o589p4293j22791J48590k12104k50965J24635L9637K69550M6871R4328
2837e54445L6393j3033j62936k57409j88830J73417K07529P6863j74938j03541
2827i60930J9074j93513J82306J18631j29528L7871r3597J15516k85463K82145
2817i07488M46528m4264k30537m2711k04864K90670M7425M46268l72634k82206
2807h53813n0843j92908K54917K25711n5637k68518k91727L38937K7991L76599
$$ plain form
2881 -875479 -908521 -851215 -932617 -923657 -651179 -699030 -834127 -837698 -891443 -941540 -768297
2870 -768297 -929136 -956778 -1006280 -1025618 -831850 -819129 -844344 -1104045 -1215088 -909037 -534293
2859 -534293 -564137 -527267 -752413 -683164 -645054 -668072 -735465 -885068 -650060 -677461 -611314
2848 -611314 -617903 -692196 -814987 -666397 -878501 -1129466 -1004831 -965194 -695644 -648773 -554445
2837 -554445 -518052 -531085 -694021 -951430 -1140260 -966843 -759314 -682451 -857389 -960930
2827 -960930 -941856 -1135369 -953063 -834432 -963960 -926089 -1019686 -904170 -1189633 -907488
2817 -907488 -460960 -505224 -735761 -778472 -983336 -692666 -645241 -198973 -571607 -853813
2807 -853813 -904656 -1097564 -842647 -616936 -672573 -941091 -1232818 -893881 -865890 -489291
2797d89291m3947j69339j79567K11621R5800J29221p8519j44849p8590o3492J33759
2786f77193o2811p0248k8047L7538L3356K9958j7687R9067q500j85995J48223
2775g02339j65365k3399j4308J06753j98206n1551j50529r7035L3045K81507L8834
2764i42593P4106K36068l9923q213j22118k7002K0007J10725J90598K62070k72380
2753e18655P7619k22896j74336L8121J33726n856q1880k7265J0869l40476J4011
2742a097018R9077M12198l864J59995k53522J42136J8028q5166o37975j1026L07490
2731i49647K07668j32877J48772p3504l07763K90J27207K55407J477j8794J31189
2720f10575k53561n1990R5135J38220k29579j33984l22359K06555L51991K31990
$$ plain form
2797 -489291 -533238 -702577 -882144 -670523 -574723 -445502 -524021 -668870 -747460 -810952 -677193
2786 -677193 -740004 -810252 -838299 -800761 -767405 -737447 -755134 -656067 -664567 -850562 -702339
2775 -702339 -867704 -891103 -905411 -798658 -996864 -1048415 -1198944 -1295979 -1262934 -981427 -942593
2764 -942593 -868487 -632419 -672342 -680555 -802673 -829675 -809668 -698943 -508345 -246275 -518655
2753 -518655 -441036 -663932 -838268 -800147 -666421 -672277 -754157 -781422 -770553 -1111029 -1097018
2742 -1097018 -997941 -585743 -589607 -429612 -683134 -540998 -522970 -608136 -1246111 -1257137 -949647
2731 -949647 -741979 -874856 -726084 -799588 -1107351 -1107061 -979854 -724447 -722970 -741764 -610575
2720 -610575 -864136 -916126 -820991 -682771 -912350 -1046334 -1368693 -1162138 -810147 -578157
2710e78157o3791o9832o2067L3598j3415J36301K33942j9760J2386K3891l27231
2699f94135J28007J66960J86561m12177m525J94007m85675L6672M5109R3688j51579
2688h97087L9023j63369J4115p8081m4562J8449K37376J59176L04409j83410k85134
2677h79095l20942k88200M69194M83492J04699K97479j86398p86861m6310R2508
2667a060434P0420K76817o2285L35796J72834j66703l76880j98606j42932J22274
2657a029699K48443M67582j17574m01423n03469J84591J53921L15479l1729J87645
2647e26233j25215o0484Q6332J56974k4486J28985l78955K997j07176j85619K53633
2636g79247j70587P0226P3754J63696n6135J06777k24407j3046K57950j72083
$$ plain form
2710 -578157 -641948 -711780 -773847 -740249 -753664 -617363 -383421 -403181 -390795 -366904 -694135
2699 -694135 -566128 -399168 -212607 -624784 -629309 -435302 -920977 -884305 -839196 -745508 -897087
2688 -897087 -858064 -1021433 -1007318 -1085399 -1129961 -1111512 -874136 -714960 -410551 -593961 -879095
2677 -879095 -1200037 -1488237 -1019043 -535551 -430852 -133373 -319771 -1106632 -1152942 -1060434
2667 -1060434 -990014 -713197 -775482 -439686 -266852 -433555 -810435 -1009041 -1151973 -1029699
2657 -1029699 -781256 -313674 -431248 -832671 -1336140 -1151549 -997628 -682149 -713878 -526233
2647 -526233 -651448 -711932 -625600 -468626 -493112 -364127 -743082 -740085 -847261 -1032880 -779247
2636 -779247 -949834 -879608 -805854 -642158 -698293 -591516 -815923 -828969 -571019 -743102
2626g43102N1536M64425k61142j81671k18176o0612J38293K24640j35357k10799
2616i31965J50100j66330J43959n6945n6378K79781J14j34090k54469K0712K48707
2605g56804J89971o6996L9354l35806j8999J18351o2756k7024K35384J24054J49987
2594d11284n3089k22208m5243k5284K31503J65014l0612K52693j61730k24926
2584e25166k39624J04654K66692K97476Q4699L063j03187J52461r1512j26785
2574a77229R3777M45131n7693m17417J31548j14543n30674p9944J85686l92138
2564i13496J70416j07827J82535k39390M0574J35715K35529j4309P6154r272k01873
2553f45244j24987n6807J91778L81121J07222k76917m92807l154K37064J491L75006
$$ plain form
2626 -743102 -691566 -227141 -488283 -669954 -888130 -948742 -810449 -585809 -721166 -931965
2616 -931965 -781865 -948195 -804236 -861181 -917559 -637778 -637664 -771754 -1026223 -1005511 -756804
2605 -756804 -566833 -633829 -594475 -930281 -949280 -830929 -893685 -920709 -685325 -561271 -411284
2594 -411284 -464373 -686581 -731824 -757108 -525605 -360591 -391203 -138510 -300240 -525166
2584 -525166 -764790 -660136 -393444 -95968 -11269 -8206 -111393 41068 -50444 -177229
2574 -177229 -83452 361679 303986 -113431 18117 -96426 -627100 -707044 -521358 -913496
2564 -913496 -743080 -850907 -668372 -907762 -867188 -731473 -495944 -510253 -434099 -443371 -645244
2553 -645244 -770231 -827038 -635260 -254139 -146917 -423834 -916641 -919795 -682731 -681240 -306234
2542c06234p5320j02773l66679K35568k1373j57623l1428l0150K53102R7830r5728
2531f00808l50962j15129K48210k3105K0318J08785j06356Q1511q7120J22238
2521g02418j75546N61424k83139M4928J38172m77492K03313J67176J20941l6779
2511d39420k74175K03768k45851K56316L2916j6468o6718k3047J83159k44483
2501f34003l13731p6997M18955n1397L5871J56353J30280J08148k31349k27819
2491f85689J61891j0821K07520l3408Q0236l67753K7764J34865k03852K87414
2481d01833J6234P1725j72534K2090J64865k09480L40760k9497J7500l38681k05194
2470g24045K66796O5218j10564J53607j66691R1747j04739r1508q7404K4802k99497
$$ plain form
2542 -306234 -381554 -484327 -851006 -615438 -636811 -794434 -825862 -856012 -602910 -505080 -600808
2531 -600808 -951770 -1066899 -818689 -841794 -821476 -712691 -819047 -737536 -824656 -702418
2521 -702418 -877964 -316540 -599679 -554751 -416579 -894071 -690758 -523582 -402641 -439420
2511 -439420 -713595 -509827 -755678 -499362 -466446 -482914 -549632 -572679 -389520 -634003
2501 -634003 -947734 -1024731 -605776 -657173 -621302 -464949 -334669 -226521 -457870 -685689
2491 -685689 -523798 -534619 -327099 -360507 -280271 -648024 -620260 -485395 -689247 -401833
2481 -401833 -385599 -313874 -486408 -464318 -299453 -508933 -168173 -197670 -180170 -518851 -724045
2470 -724045 -457249 -392031 -502595 -348988 -515679 -423932 -528671 -620179 -707583 -682781 -982278
2459i82278M79618K36602J56599R9684l28080k79720n7443K47645K00179J4158
2449b13036k8879k56482l48229L04911K45170j07353k70614J21861n6725J41523
2439d67853K16470j60202K49624m20263k69625J40911J85265J36597J4605K60945
2429a13526o7032j9921m4889K31598l13011k38963J16743K80987J73013j28793
2419a23794L06252j01093j33847k30837M9790J80079j55297j7434L22968k9049
2409F7738j72623j13293N52444Q3449k24086n2456K207N03266k22087j07035l09080
2398H444Q5355J46450j40916J2308J39554j64542j90284J70620M55543k31699
2388B90833Q7398j38067n5938m1102M8009K92464N194J50124R7096l41455J67397
$$ plain form
2459 -982278 -502660 -266058 -109459 -9775 -337855 -617575 -675018 -427373 -227194 -213036
2449 -213036 -241915 -498397 -846626 -541715 -296545 -403898 -674512 -552651 -609376 -467853
2439 -467853 -251383 -411585 -161961 -582224 -851849 -710938 -525673 -389076 -374471 -113526
2429 -113526 -180558 -200479 -245368 -13770 -326781 -565744 -449001 -168014 4999 -123794
2419 -123794 182458 81365 -52482 -283319 -233529 -53450 -208747 -226181 96787 67738
2409 67738 -104885 -218178 334266 417715 193629 141173 143380 646646 424559 317524 8444
2398 8444 93799 240249 99333 111641 251195 86653 -103631 66989 522532 290833
2388 290833 378231 240164 184226 143124 191133 483597 488791 638915 736011 394556 561953
2377E61953Q5766j7147J86618J12760O6823J29779J98244k69590o3797M9074j4978
2366A025505J81401J52473L40924k91630J74249j67436P46K39959L34753j03772
2356A887172j4550J82363j7048m8010J09271M1237K76694k78458q0371J32382
2346B190682L16373K56692n1925J84934K22685M74315k5399n744J19665P8119
2336C760397K82188N29146K2231N26124N48118L22436K18928P28896P78064J264621
2326H981149J269640J303757J441952J268519J180295J172254J397190J546945
2318A9561701K190731K866136L201151M501590P175847J2371631J9803619K7283011
2310I8955417L0933748K3697501Q159686k350932o739263j3341470j7268509j8613956
$$ plain form
2377 561953 647719 630572 817190 929950 996773 1126552 1324796 1055206 991409 1040483 1025505
2366 1025505 1206906 1359379 1700303 1408673 1582922 1415486 1416232 1656191 1990944 1887172
2356 1887172 1872622 2054985 2037937 1989927 2099198 2140435 2417129 2138671 2058300 2190682
2346 2190682 2507055 2763747 2711822 2896756 3119441 3593756 3568357 3562613 3682278 3760397
2336 3760397 4042585 4571731 4593962 5120086 5668204 5990640 6209568 6938464 7716528 8981149
2326 8981149 10250789 11554546 12996498 14265017 15445312 16617566 18014756 19561701
2318 19561701 21752432 24618568 27819719 32321309 39497156 51868787 71672406 98955417
2310 98955417 129889165 153586666 161746352 159395420 152656157 139314687 122046178 103432222
2302A03432222j9103185j6572795j4286676j1066724q454165n558855l515781
2295B4874041k588412j956564j895599k011546j469423k111569j305155j309132
2287A0226641j705261q97603q38890m40032n18752m11674k15445l45832l29378
2278D523774k72419j76043o70574l17923j94646Q7505k6862l00821j71868k12482
2268B267641k75847j75138J3883J80632m8603M6018l19941m45049r6280J78745
2258A326061p1700o4622J46084p1397k73874k67208J28084k3656j89929k88328
2248C49515j60530N1999J36584l89964J54134J10968L7071p6879O517l73300j80011
2237c33896K52112M7223J13428J64764j32713J52820m03633N1863O4728j16521
$$ plain form
2302 103432222 84329037 67756242 53469566 42402842 33948677 28389822 24874041
2295 24874041 22285629 20329065 18433466 16421920 14952497 12840928 11535773 10226641
2287 10226641 8521380 7623777 6784887 6344855 5826103 5414429 5198984 4853152 4523774
2278 4523774 4251355 4075312 3404738 3086815 2892169 2979674 2952812 2651991 2480123 2267641
2268 2267641 1991794 1816656 1830539 2011171 1962568 2008586 1688645 1243596 1147316 1326061
2258 1326061 1254361 1189739 1335823 1264426 990552 723344 851428 827772 637843 349515
2248 349515 188985 240984 377568 -12396 141738 252706 289777 212898 219415 -153885 -333896
2237 -333896 -81784 -34561 78867 243631 110918 263738 -139895 -88032 -23304 -139825
2227a39825l6145R2123K21121L67998l63651m30140j47640j90162j7795K79674
2217c64442Q1824Q5120Q9962n37801J15739l9553p0108J25259L32142Q8685j09933
2206b03106l20602P0309j42964K1625L70587l85375l29977k7907Q548o388q3999
2195a029249K39504J2110j11982J79567j94431l78714K33318P11791J5456O7496
2185b55134p7222m27080j63463Q6007M15617r5305J18381k8234j36474o5843k95211
2174i23961k95961m2380K04538L02907o4410j71232J04545R3119j94662j19046
2164a106543K24797k40641M6137P1054j07953J41933M44433J87873m05299m64265
2154a208474n5579Q4455J46499K41444l2313M3392J31188j28352j99044j14907
$$ plain form
2227 -139825 -175970 -83847 137274 505272 141621 -288519 -436159 -626321 -644116 -364442
2217 -364442 -282618 -197498 -107536 -645337 -529598 -569151 -639259 -514000 -181858 -93173 -203106
2206 -203106 -523708 -453399 -596363 -574738 -204151 -589526 -919503 -947410 -938862 -945250 -1029249
2195 -1029249 -789745 -777635 -889617 -710050 -904481 -1283195 -1049877 -338086 -322630 -255134
2185 -255134 -332356 -759436 -922899 -836892 -421275 -516580 -398199 -426433 -562907 -628750 -923961
2174 -923961 -1219922 -1262302 -1057764 -754857 -819267 -990499 -885954 -792835 -987497 -1106543
2164 -1106543 -881746 -1122387 -1076250 -1005196 -1113149 -971216 -526783 -338910 -744209 -1208474
2154 -1208474 -1264053 -1179598 -1033099 -791655 -823968 -780576 -649388 -777740 -976784 -1091691
2144a091691k52317M12798J14291J31252K19132o56258Q6266q316N8227J13512
2134h73104k33370K00975j14567P4456R2766O1239n27167O1594M29323p869j17899
2123i53623j5205n0460J20937K5421M2215O0580l29432J3562J47682r0376l09317
2112a338016K53421k108J92418k2738J15941q818k60669p7883l1506J10911L42677
2101g26370k11416J08841k34590R3446K08576k27942J69483k43476k01308j59814
2091a424570j40126k7467j0770K58293J76021J33352J84423J46880k33342l82446
2081a319752J78O6154J93553J70054o1255N5223J85600O8491k22436Q4058O7152
2070g12980J17217j93695k17527j73333J55799O5466j18643l7204K11504p4795
$$ plain form
2144 -1091691 -1344008 -931210 -816919 -685667 -466535 -1122793 -1036527 -1044843 -986616 -873104
2134 -873104 -1106474 -905499 -1020066 -945610 -852844 -791605 -1318772 -1257178 -827855 -835724 -953623
2123 -953623 -968828 -1019288 -898351 -872930 -830715 -770135 -1099567 -1086005 -938323 -1028699 -1338016
2112 -1338016 -1084595 -1086703 -894285 -917023 -801082 -809900 -1070569 -1148452 -1179958 -1069047 -726370
2101 -726370 -937786 -828945 -1063535 -970089 -761513 -989455 -819972 -1063448 -1264756 -1424570
2091 -1424570 -1564696 -1592163 -1602933 -1344640 -1168619 -1035267 -850844 -703964 -937306 -1319752
2081 -1319752 -1319574 -1253420 -1059867 -889813 -951068 -895845 -710245 -641754 -864190 -780132 -712980
2070 -712980 -595763 -789458 -1006985 -1180318 -1024519 -959053 -1077696 -1114900 -903396 -978191
2060i78191n8545n642J67820J89637k19302M9246q6230k72838l99113K70818N39780
2049h02560J31115l50099J31802j64052k89969j82400L71324M09812M14148O1394
2039b69485J70561k61771j09101P3349l2605P8135j93377j63320r3695k1012J69962
2028f52359k95862J83380q083n0109l6295J77429k35604k60072K00930K3598K12063
2017g40984L5723k6762k34524n30043K8562O688L35895K74943R3009j62574n58208
2006a478275J0691k04429K34130M83846P492j09823k0094Q9086k37150k1796m5617
1995a291939L54221Q9049l73898L32092R0630R0965j23145k28443j71934R3412
1985a138990K66559l18036j80467p7123j42676O57593K21332j99446k79501j56949
$$ plain form
2060 -978191 -1036736 -1042378 -874558 -684921 -904223 -854977 -941207 -1214045 -1613158 -1342340 -802560
2049 -802560 -671445 -1021544 -889742 -1053794 -1343763 -1526163 -1154839 -745027 -330879 -269485
2039 -269485 -98924 -360695 -469796 -396447 -429052 -350917 -544294 -707614 -801309 -822321 -652359
2028 -652359 -948221 -764841 -772924 -823033 -859328 -681899 -917503 -1177575 -976645 -953047 -740984
2017 -740984 -705261 -732023 -966547 -1496590 -1468028 -1461340 -1125445 -850502 -757493 -920067 -1478275
2006 -1478275 -1467584 -1672013 -1437883 -954037 -946545 -1056368 -1076462 -987376 -1224526 -1246322 -1291939
1995 -1291939 -937718 -848669 -1222567 -890475 -799845 -708880 -832025 -1060468 -1232402 -1138990
1985 -1138990 -872431 -1190467 -1370934 -1448057 -1590733 -933140 -711808 -911254 -1190755 -1347704
1975a347704J73642J76465Q5411K7781j5160m0411m3114m7228M276j19529k03691
1964a349262N88565O0554O3861Q9194n60388k64132J51769K69839J58167p7803
1954h69636N2735n10466j32859J52231M42187j95115k06518L9947k88838l2746
1944a549078K32964Q6937O9187Q5518J39824k78130J39790Q9169j10700o0106
1934a154625O2501J4588q5610J66726j19219N9851J03698K15676R4432j05652
1924g47634K70368j77429m20704M5204j21795M75311j8385l266O3477o65k05358
1913h40876j7233r4897j54492N6882N4843J44547k5413j77170o5064j81181M17081
1902h82973J57997l05009K15614k16102l0738l21400M8070O42871J18238k18325
$$ plain form
1975 -1347704 -1174062 -997597 -912186 -884405 -899565 -939976 -983090 -1030318 -1026042 -1145571 -1349262
1964 -1349262 -760697 -700143 -636282 -547088 -1107476 -1371608 -1219839 -950000 -791833 -869636
1954 -869636 -816901 -1327367 -1460226 -1307995 -865808 -1060923 -1267441 -1227494 -1516332 -1549078
1944 -1549078 -1316114 -1229177 -1159990 -1074472 -934648 -1212778 -1072988 -983819 -1094519 -1154625
1934 -1154625 -1092124 -1077536 -1163146 -996420 -1115639 -1055788 -952090 -736414 -641982 -747634
1924 -747634 -477266 -654695 -1075399 -1030195 -1151990 -676679 -695064 -698330 -634853 -635518 -840876
1913 -840876 -858109 -953006 -1107498 -1050616 -995773 -851226 -876639 -1053809 -1118873 -1300054 -882973
1902 -882973 -724976 -1029985 -814371 -1030473 -1061211 -1382611 -1334541 -691670 -573432 -791757
1892g91757k18630J16478k36445o5474J75452j84275r4321J10799J98280J27968
1882h61925j76688L02219j78856J03108j39627r539Q7046j82033k73664j65916
1872a495875P5675L34367K86440k205k00491l20092n06042M59774N21811k5465
1862h72103K55226J23885m3390p01884J91972j03266J57384j41563J7064K58655
1852h58020L53317O9026j36167k20210N7699m2262k20701J15799L88084j15978
1842f09413j23383l0493n32881P9191k66767O6172M4239K10594M81037r7176l09320
1831a088200k02672J26408J08357k5414M9918n3383R975L07392J32515j01014
1821g36118j40889N597j26214Q5873L4590L88248j76112j90858l00160l78411
$$ plain form
1892 -791757 -1010387 -893909 -1130354 -1195828 -1020376 -1204651 -1298972 -1188173 -989893 -861925
1882 -861925 -1038613 -736394 -915250 -812142 -951769 -961308 -874262 -1056295 -1329959 -1495875
1872 -1495875 -1420200 -1085833 -799393 -801598 -1002089 -1322181 -1828223 -1368449 -846638 -872103
1862 -872103 -616877 -492992 -536382 -1238266 -1046294 -1149560 -992176 -1133739 -1116675 -858020
1852 -858020 -504703 -435677 -571844 -792054 -734355 -776617 -997318 -881519 -493435 -609413
1842 -609413 -732796 -763289 -1296170 -1216979 -1483746 -1417574 -1373335 -1162741 -681704 -778880 -1088200
1831 -1088200 -1290872 -1164464 -1056107 -1081521 -1031603 -1084986 -1075011 -767619 -635104 -736118
1821 -736118 -877007 -871410 -997624 -911751 -877161 -488913 -665025 -855883 -1156043 -1534454
1811a534454r3203K13771J46724K10040K67743q6052k91683K8528J81600K67125
1801f89861K05630p75000l122N8877J34141K04671k23159j21363J78181j8370
1791a049375j70066O0790L68872p7950J00836j10105j92035N7662k41831j44698
1781a397900n7540K00965K68508L79859k2383N9118k7968p47643P3441j50473
1771a422016K49302L02763K49712j9011l98015l5485K16679j50266j80007M8072
1761a138272M12088L8452j57300j42415j18692K2859j21028O7398p5378k57830
1751a470118K61303o5359j16050M15990L25639l05708j00965L70512l20470K31721
1741g73505N5947L9110K082j53170K14327l61195K08593K62328k69669m04254
$$ plain form
1811 -1534454 -1627657 -1413886 -1267162 -1057122 -789379 -875431 -1167114 -1138586 -956986 -689861
1801 -689861 -484231 -1259231 -1262353 -1203476 -1069335 -864664 -1087823 -1209186 -1031005 -1049375
1791 -1049375 -1219441 -1158651 -789779 -867729 -766893 -876998 -1069033 -1011371 -1253202 -1397900
1781 -1397900 -1455440 -1254475 -985967 -606108 -628491 -569373 -597341 -1344984 -1271543 -1422016
1771 -1422016 -1172714 -869951 -620239 -639250 -1037265 -1072750 -856071 -1006337 -1186344 -1138272
1761 -1138272 -726184 -687732 -845032 -987447 -1106139 -1083280 -1204308 -1136910 -1212288 -1470118
1751 -1470118 -1208815 -1274174 -1390224 -974234 -648595 -954303 -1055268 -684756 -1005226 -773505
1741 -773505 -717558 -678448 -676366 -829536 -615209 -976404 -767811 -505483 -775152 -1179406
1731a179406J07986J14368l00541r4065R3963J91589L3914J49351l946r1586j1329
1720i89702j06399N3672Q8257k6569k75088j93339L03300J799j11127K33699M18501
1709f02996M3336m49331j81938j06064k1199p395J77610K04084k6991l27304J56810
1698a141378m2486k54893K5678P8682K51324L36824K150k52459j11132J59359
1688i48331N7727j53449J49308j75633k005m83344O7371O2121J19829n1081J87919
1677a169568o243R7457l3309j29859P167K09270k07661Q9029J35382P8839j19163
1666a048659k73168J0552R8493R6103L14856Q3993O9632l17260j43661M8276J27061
1655i33782o7081k19449J24270k73342j12492M42053K62440M66831j94470k41391
$$ plain form
1731 -1179406 -1071420 -957052 -1257593 -1351658 -1257695 -1066106 -1032192 -882841 -886787 -978373 -989702
1720 -989702 -1096101 -1042429 -954172 -980741 -1255829 -1449168 -1145868 -1144069 -1255196 -1021497 -602996
1709 -602996 -559660 -1008991 -1190929 -1296993 -1318192 -1325587 -1147977 -943893 -970884 -1298188 -1141378
1698 -1141378 -1183864 -1438757 -1413079 -1334397 -1083073 -746249 -744099 -996558 -1107690 -948331
1688 -948331 -890604 -1044053 -894745 -1070378 -1072383 -1555727 -1488356 -1426235 -1306406 -1357487 -1169568
1677 -1169568 -1175811 -1078354 -1111663 -1241522 -1234355 -1025085 -1232746 -1143717 -1008335 -929496 -1048659
1666 -1048659 -1321827 -1311275 -1212782 -1116679 -801823 -717830 -648198 -965458 -1109119 -1060843 -933782
1655 -933782 -1000863 -1220312 -1096042 -1369384 -1481876 -1039823 -777383 -310552 -505022 -746413
1645g46413k80780M8140J13934l80382K3407N6431N2246R8671Q3126j87461j03002
1634a222083q762j98606K50527N63486m2721m4479L9473j50506N2928j33570k39984
1623a134297K44153l01813m1235j23456K22217J09826P4419K81728j83199l43267
1613a194924j19781m1720L36974M41341k200l38800P384k70384l23002n6110O88602
1602h72620o1530k28230M13335n0164k10959k67456J25825R192L66564k5461k64808
1591a066312K73838j68676K96090J98004j08926m50604k10203J2557L63477J37952
1581g22803j61083m7009k21643k55061L62186K32281J09656l65090k43595J09527
1571a202634J02149j50741K41629P0619j60023J702n6989n386j53886p2570M54708
$$ plain form
1645 -746413 -1027193 -979053 -865119 -1245501 -1222094 -1165663 -1113417 -1014746 -931620 -1119081 -1222083
1634 -1222083 -1230845 -1429451 -1178924 -615438 -658159 -702638 -663165 -813671 -760743 -894313 -1134297
1623 -1134297 -890144 -1191957 -1233192 -1356648 -1134431 -1024605 -950186 -668458 -851657 -1194924
1613 -1194924 -1314705 -1356425 -1019451 -578110 -580310 -919110 -911726 -1182110 -1505112 -1561222 -872620
1602 -872620 -934150 -1162380 -749045 -799209 -1010168 -1277624 -1151799 -1142607 -776043 -801504 -1066312
1591 -1066312 -792474 -961150 -665060 -467056 -575982 -1026586 -1236789 -1224232 -860755 -722803
1581 -722803 -883886 -930895 -1152538 -1407599 -1045413 -813132 -703476 -1068566 -1312161 -1202634
1571 -1202634 -1100485 -1251226 -1009597 -938978 -1099001 -1097299 -1154288 -1159674 -1313560 -1386130 -931422
1560i31422k22059j96088j48189J6316M94432K29322J38141N3909j44183m6089
1550g55910m1837o2029j9218j78360N9886K03863J51932j06930N054k54428l07192
1539a305169k5460q2275L16572J63348J32777j80903K4018R2118k01725m9230
1529a115929O8366N99188j29021P205k06547l09380J02719k28979J14101q1471
1519a179748j86456M74133N4127r3134k0774Q7532p9724j77651N7560k01795J25692
1508a140238Q2778J11012j11574K39349J42990j74882K55678r2480K04618l23511
1498h06260q3852J5365J96506l8164j51033r6260J82115m85215l9967K6970L24594
1487i55201j10050l12224j5417j1207L41826J95371K21602O8127m11595K21580
$$ plain form
1560 -931422 -1153481 -1349569 -1497758 -1481442 -987010 -757688 -619547 -565638 -709821 -755910
1550 -755910 -797747 -859776 -878994 -1057354 -997468 -793605 -641673 -748603 -743549 -997977 -1305169
1539 -1305169 -1330629 -1412904 -1096332 -932984 -800207 -981110 -957092 -864974 -1066699 -1115929
1529 -1115929 -1047563 -448375 -577396 -570191 -776738 -1086118 -983399 -1212378 -1098277 -1179748
1519 -1179748 -1366204 -892071 -837944 -931078 -951852 -864320 -944044 -1121695 -1064135 -1265930 -1140238
1508 -1140238 -1057460 -946448 -1058022 -818673 -675683 -850565 -594887 -687367 -482749 -806260
1498 -806260 -890112 -874747 -678241 -716405 -867438 -963698 -781583 -1266798 -1306765 -1279795 -955201
1487 -955201 -1065251 -1377475 -1392892 -1404099 -1062273 -866902 -645300 -577173 -988768 -767188
1477g67188R0585k32213j47159p2158J86795k2811k71144J20335K90044l44928
1467a169842P5464L59311k95156k19723L35255L05241j78378k62068p0605j68921
1457a289422Q4991R173K04775J35413J47768L2564k18997j83635n6514M31935
1447g01949k6249k33214R8071R8289j36801J49392j0711j24508O2413M39351k36771
1436f22687p2931j19944n8149p0262P256J7379k25727L55235k00358Q8999j81359
1425a082548J75303J56673j60635R8041m0781l786m00940o5899L21588j03717
1415a106701J82741K86055J07586m14080k25324M00055M1907n5720J76059J63890
1405d43532m51981l43275j680J89932J27617R3847k13464p8411R5306K41511p6183
$$ plain form
1477 -767188 -676603 -908816 -1055975 -1128133 -941338 -964149 -1235293 -1114958 -824914 -1169842
1467 -1169842 -1094378 -735067 -1030223 -1249946 -914691 -609450 -787828 -1049896 -1120501 -1289422
1457 -1289422 -1204431 -1195258 -990483 -855070 -707302 -674738 -893735 -1077370 -1133884 -701949
1447 -701949 -728198 -961412 -863341 -765052 -901853 -752461 -763172 -887680 -825267 -385916 -622687
1436 -622687 -695618 -815562 -873711 -943973 -936717 -919338 -1145065 -789830 -990188 -901189 -1082548
1425 -1082548 -907245 -750572 -911207 -813166 -853947 -857733 -1258673 -1324572 -1002984 -1106701
1415 -1106701 -923960 -637905 -530319 -944399 -1169723 -769668 -727761 -783481 -607422 -443532
1405 -443532 -895513 -1238788 -1240468 -1050536 -922919 -829072 -1042536 -1120947 -1025641 -784130 -860313
1394h60313K58787j50502l51313j07498j87941J36770n6985N49660j7579m1119
1384h28033p1629J48553l06096K17985J22323j96986k39471K12991M5770O5185
1374h29408k36585j68823O8730j30554N86968K6891j11144J18393l99299J373
1364a073458k1386K5695J59279O2266j45196k8862j1700m9169J35765K16104j84374
1353i15036o4696J07633m33393k63333L73705M6596J76221O8841M1460n69024
1343a431026p7852L49157L7546J53429M19970M0033k99605m10336J68496L14622
1333g35566K6087N254K65165k4139l01685n5099j82645j7031Q0844j18966K03144
1322h54637j40990L66487k73821k03107J22475j31484L68631j50803J92594o9728
$$ plain form
1394 -860313 -601526 -752028 -1103341 -1210839 -1398780 -1262010 -1318995 -769335 -786914 -828033
1384 -828033 -899662 -751109 -1057205 -839220 -716897 -913883 -1153354 -940363 -894593 -829408
1374 -829408 -1065993 -1234816 -1166086 -1296640 -709672 -682781 -793925 -675532 -1074831 -1073458
1364 -1073458 -1094844 -1069149 -909870 -847604 -992800 -1021662 -1033362 -1082531 -946766 -730662 -915036
1353 -915036 -979732 -872099 -1305492 -1568825 -1195120 -1148524 -972303 -903462 -862002 -1431026
1343 -1431026 -1508878 -1159721 -1122175 -968746 -548776 -508743 -808348 -1218684 -1050188 -735566
1333 -735566 -709479 -704225 -439060 -463199 -764884 -819983 -1002628 -1019659 -938815 -1057781 -854637
1322 -854637 -995627 -629140 -902961 -1106068 -983593 -1115077 -746446 -897249 -704655 -774383
1312g74383m64383J07214O9130K21599J54056K02771m05448m61568L56669j7724
1302a012067M17150J33326k87845m27223r5121J8766k48322M64094L03514j728
1292g35456k82616l16186Q0698m7146L63638k9838K61628j65069j87201l6804
1282a094352n50J40336j21370l66970M35466j376J36362k13470k074l7277K01632
1271i23643m36625K96693J80114l66171j34541Q9590L54908L77238l00671L13768
1261e49340p546k89533j32577p3834J74625p6534K09263J91374p4147k56251o25044
1250a509544J35239L86250M31697Q8906L4245k56831l79519q6660L15021O1695
1240g79501M0346j41077K40526l4676j36660r8938j44138l7106K86873o4379l68748
$$ plain form
1312 -774383 -1238766 -1131552 -1062422 -840823 -686767 -483996 -889444 -1351012 -994343 -1012067
1302 -1012067 -594917 -461591 -749436 -1176659 -1271780 -1253014 -1501336 -1037242 -733728 -735456
1292 -735456 -1018072 -1334258 -1253560 -1300706 -937068 -966906 -705278 -870347 -1057548 -1094352
1282 -1094352 -1094902 -954566 -1075936 -1442906 -1007440 -1008816 -872454 -1085924 -1087998 -1125275 -923643
1271 -923643 -1360268 -1063575 -883461 -1249632 -1384173 -1294583 -939675 -562437 -863108 -549340
1261 -549340 -556886 -846419 -978996 -1052830 -878205 -954739 -745476 -554102 -628249 -884500 -1509544
1250 -1509544 -1374305 -988055 -556358 -467452 -433207 -690038 -1069557 -1156217 -841196 -779501
1240 -779501 -739155 -880232 -639706 -674382 -811042 -909980 -1054118 -1091224 -804351 -868730 -1237478
1229a237478j1271k00053L63668O2924L16887k9756k91761L36304o1771k06032
1219i58339L4949K40279j10126k72554L35167q4735P7927l86098j98706M0397
1209a281839Q7830N14734n0756o30518R466J41092M9839K11226L48443j66051
1199g66534k63226p4700M05855K8703k73438P2827K5506m36481J23248k80633
1189a438873M33298k8022J93461J96272k83554l07681j99823R1155O41763m5102
1179g47106K30142J74530j12648m15323k02741J87079R9605J33259J73400j78137
1169f57940k32659j76026K95191J13196M8541l63614J65497k86634n5918j45606
1159a295972j3084J22140k17120N70279l2395j8060j73208j02064J50898l40480
$$ plain form
1229 -1237478 -1248749 -1448802 -1085134 -1022210 -705323 -735079 -1026840 -690536 -752307 -958339
1219 -958339 -923390 -683111 -793237 -1065791 -730624 -815359 -737432 -1123530 -1322236 -1281839
1209 -1281839 -1194009 -679275 -730031 -1360549 -1351083 -1209991 -1160152 -948926 -600483 -766534
1199 -766534 -1029760 -1104460 -698605 -669902 -943340 -870513 -845007 -1281488 -1158240 -1438873
1189 -1438873 -1005575 -1033597 -840136 -643864 -927418 -1235099 -1434922 -1343767 -702004 -747106
1179 -747106 -516964 -342434 -455082 -870405 -1073146 -886067 -786462 -653203 -479803 -657940
1169 -657940 -890599 -1066625 -771434 -658238 -609697 -973311 -807814 -1094448 -1150366 -1295972
1159 -1295972 -1309056 -1186916 -1404036 -833757 -866152 -884212 -1057420 -1159484 -1008586 -1349066
1149a349066L76836K82543l42635j61835N7597l6447K41559L16690K1607k68077
1139h61228k07247r0969J29535J69007K05816R0901j11216n3309m87261L4427
1129a181544j63674J70593L52460K51058j01626k26190j0204M1500j99786J5454
1119a051959j02793J87605p6568j439M2022K04039n9455J80053j70196O5159j5433
1108g98965R693P3711k11713j91646k012J45083J18727l47251l00625l3555O9754
1097a468799M20920J41372O5412J03354k17678L6638k5477r2226K67269K90865
1087d78350j49950j64002k89108k53929P2005j30269L47120J12606j67881J77808
1077i23950l60862p1436L5273L67559J57929J58389O9701j59876j5707k04819
$$ plain form
1149 -1349066 -972230 -689687 -1032322 -1194157 -1136560 -1173007 -931448 -614758 -593151 -861228
1139 -861228 -1068475 -1159444 -1029909 -860902 -655086 -564185 -675401 -728710 -1215971 -1181544
1129 -1181544 -1345218 -1174625 -822165 -571107 -672733 -898923 -909127 -867627 -1067413 -1051959
1119 -1051959 -1154752 -967147 -1043715 -1045154 -1003132 -799093 -858548 -678495 -848691 -783532 -798965
1108 -798965 -789272 -715561 -927274 -1118920 -1120932 -975849 -857122 -1204373 -1504998 -1538553 -1468799
1097 -1468799 -1047879 -906507 -841095 -737741 -955419 -918781 -944258 -1036484 -769215 -478350
1087 -478350 -628300 -792302 -1081410 -1335339 -1263334 -1393603 -1046483 -933877 -1101758 -923950
1077 -923950 -1284812 -1356248 -1320975 -953416 -795487 -637098 -567397 -727273 -742980 -947799
1067i47799J83588J59123m7951O0778k48445J98709k6037m9154P7191k21683O7575
1056g94105J24401k13106l34397J96806J219n0552J64657M1093j27872l69981
1046a361837j55539L02644j18680L23198L0719L40866q1236m57610J21843l93188
1036a448820J03340L40034L79422K28340j20925o5824j38967k11131J62772J8761
1026g52998L16985m84068l75154j91907J93811L38274o4378N6692l03606j48001
1016a414350r3043N166j1531M9529R7841K23194j75486k25446K24337J23735J40651
$$ plain form
1067 -947799 -764211 -605088 -653039 -592261 -840706 -641997 -668034 -717188 -639997 -861680 -794105
1056 -794105 -669704 -882810 -1217207 -1020401 -1019182 -1069734 -905077 -863984 -991856 -1361837
1046 -1361837 -1517376 -1214732 -1333412 -1010214 -979495 -638629 -719865 -1177475 -1055632 -1448820
1036 -1448820 -1345480 -1005446 -626024 -397684 -518609 -584433 -723400 -934531 -771759 -752998
1026 -752998 -436013 -920081 -1295235 -1487142 -1293331 -955057 -1019435 -962743 -1266349 -1414350
1016 -1414350 -1507393 -1502227 -1513758 -1464229 -1366388 -1143194 -1318680 -1544126 -1319789 -1196054 -1055403
$$ [...]
##END NTUPLES=NMR SPECTRUM
##END=
