##TITLE=1H ikalashn
4174N
17.10.2024
##JCAMPDX= 6.0         $$ Bruker NMR JCAMP-DX V2.0
##DATA TYPE= NMR FID
##DATA CLASS= NTUPLES
##ORIGIN= UXNMR, Bruker Analytische Messtechnik GmbH
##OWNER= root
$$ TOPSPIN		Version 1.3
$$ 2024-10-17 09:57:17.546 +0400  Irina@DPX200
$$ Compression mode = diff/dup
##.OBSERVE FREQUENCY= 200.131392401
##.OBSERVE NUCLEUS= ^1H
##.DELAY= (6, 6)
##.ACQUISITION MODE= SIMULTANEOUS
##.ACQUISITION SCHEME= undefined
##.AVERAGES= 64
##.DIGITISER RES= 18
##SPECTROMETER/DATA SYSTEM= spect
##.PULSE SEQUENCE= zg
##.SOLVENT NAME= CDCl3
##.SHIFT REFERENCE= INTERNAL, CDCl3, 1, 17.95386
##AUDIT TRAIL= $$ (NUMBER, WHEN, WHO, WHERE, WHAT)
$$ ##TITLE= Audit trail, TOPSPIN		Version 1.3
$$ ##JCAMPDX= 5.01
$$ ##ORIGIN= Bruker BioSpin GmbH
$$ ##OWNER= Irina
$$ $$ F:/spectra/data/iren/nmr/1H/4/audita.txt
$$ ##AUDIT TRAIL=  $$ (NUMBER, WHEN, WHO, WHERE, VERSION, WHAT)
(   1,<2024-10-17 09:47:57.000 +0400>,<Irina>,<DPX200>,<TOPSPIN 1.3>,
      <created by zg
	started at 2024-10-17 09:43:43.984 +0400,
	POWCHK disabled, PULCHK disabled
       configuration hash MD5:
       BE 6D 3F 07 2A EA 11 49 91 17 2B D3 AF B3 58 0D
       data hash MD5: 16K
       08 0D 0F C6 D4 55 7A E1 0C 97 56 18 46 04 5E F1>)
$$ ##END=
$$ 
$$ $$ hash MD5
$$ $$ 86 F5 10 68 05 CB 74 CA CF D6 75 06 EE 30 D1 0E
##$RELAX= 
##$RELAX= 
##$RELAX= 
##$RELAX= 
##$RELAX= 
##$RELAX= 
##$RELAX= 
##$RELAX= 
##$RELAX= 
$$ Bruker specific parameters
$$ --------------------------
##$DU= <F:/spectra>
##$EXPNO= 4
##$NAME= <1H>
##$PROCNO= 1
##$TYPE= <nmr>
##$USER= <iren>
##$AMP= (0..31)
100 100 100 100 100 100 100 100 100 100 100 100 100 100 100 100 100 100 
100 100 100 100 100 100 100 100 100 100 100 100 100 100 
##$ANAVPT= -1
##$AQSEQ= 0
##$AQ_mod= 1
##$AUNM= <au_zg>
##$AUTOPOS= <>
##$BF1= 200.13
##$BF2= 200.13
##$BF3= 200.13
##$BF4= 200.13
##$BF5= 200.13
##$BF6= 200.13
##$BF7= 200.13
##$BF8= 200.13
##$BYTORDA= 1
##$CFDGTYP= 0
##$CFRGTYP= 5
##$CHEMSTR= <none>
##$CNST= (0..63)
1 1 145 1 1 1 1 1 1 1 1 1 1 1 1 1 1 1 1 1 1 1 1 1 1 1 1 1 1 1 1 1 1 1 
1 1 1 1 1 1 1 1 1 1 1 1 1 1 1 1 1 1 1 1 1 1 1 1 1 1 1 1 1 1 
##$CPDPRG= <>
##$CPDPRG1= <>
##$CPDPRG2= <>
##$CPDPRG3= <>
##$CPDPRG4= <mlev>
##$CPDPRG5= <mlev>
##$CPDPRG6= <mlev>
##$CPDPRG7= <mlev>
##$CPDPRG8= <mlev>
##$CPDPRGB= <>
##$CPDPRGT= <>
##$D= (0..63)
0 2 0 0 0 0 0 0 0 0.06 0 0.03 0 0 0 0 0.0002 0 0 0 0 0 0 0 0 0 0 0 0 0 
0 0 0 0 0 0 0 0 0 0 0 0 0 0 0 0 0 0 0 0 0 0 0 0 0 0 0 0 0 0 0 0 0 0 
##$DATE= 1729144075
##$DBL= (0..7)
120 120 120 120 120 120 120 120 
##$DBP= (0..7)
150 150 150 150 150 150 150 150 
##$DBP07= 0
##$DBPNAM0= <>
##$DBPNAM1= <>
##$DBPNAM2= <>
##$DBPNAM3= <>
##$DBPNAM4= <>
##$DBPNAM5= <>
##$DBPNAM6= <>
##$DBPNAM7= <>
##$DBPOAL= (0..7)
0.5 0.5 0.5 0.5 0.5 0.5 0.5 0.5 
##$DBPOFFS= (0..7)
0 0 0 0 0 0 0 0 
##$DE= 6
##$DECBNUC= <off>
##$DECIM= 32
##$DECNUC= <off>
##$DECSTAT= 4
##$DIGMOD= 1
##$DIGTYP= 9
##$DL= (0..7)
0 120 120 120 120 120 120 120 
##$DP= (0..7)
150 150 150 150 150 150 150 150 
##$DP07= 0
##$DPNAME0= <>
$$ [...]
##$SW= 21.9925939549014
##$SWIBOX= (0..15)
0 0 2 0 0 0 0 0 0 0 0 0 0 0 0 0 
##$SW_h= 4401.40845070422
##$TD= 16384
##$TD0= 1
##$TE= 300
##$TE2= 300
##$TE3= 300
##$TEG= 300
##$TL= (0..7)
0 120 120 120 120 120 120 120 
##$TP= (0..7)
150 150 150 150 150 150 150 150 
##$TP07= 0
##$TPNAME0= <>
##$TPNAME1= <>
##$TPNAME2= <>
##$TPNAME3= <>
##$TPNAME4= <>
##$TPNAME5= <>
##$TPNAME6= <>
##$TPNAME7= <>
##$TPOAL= (0..7)
0.5 0.5 0.5 0.5 0.5 0.5 0.5 0.5 
##$TPOFFS= (0..7)
0 0 0 0 0 0 0 0 
##$TUNHIN= 0
##$TUNHOUT= 0
##$TUNXOUT= 0
##$USERA1= <user>
##$USERA2= <user>
##$USERA3= <user>
##$USERA4= <user>
##$USERA5= <user>
##$V9= 5
##$VALIST= <valist>
##$VCLIST= <CCCCCCCCCCCCCCC>
##$VD= 0
##$VDLIST= <DDDDDDDDDDDDDDD>
##$VPLIST= <PPPPPPPPPPPPPPP>
##$VTLIST= <TTTTTTTTTTTTTTT>
##$WBST= 1024
##$WBSW= 25
##$XGAIN= (0..3)
0 0 0 0 
##$XL= 0
##$YL= 0
##$YMAX_a= 1562821
##$YMIN_a= -732161
##$ZGOPTNS= <>
##$ZL1= 120
##$ZL2= 120
##$ZL3= 120
##$ZL4= 120
##$ABSF1= 10
##$ABSF2= 0
##$ABSG= 5
##$ABSL= 3
##$ALPHA= 0
##$AQORDER= 0
##$ASSFAC= 0
##$ASSFACI= 0
##$ASSFACX= 0
##$ASSWID= 0
##$AUNMP= <proc_1d>
##$AXLEFT= 0
##$AXRIGHT= 0
##$AXTYPE= 0
##$AXUNIT= <>
##$AZFE= 0.1
##$AZFW= 0.1
##$BCFW= 1
##$BC_mod= 2
##$BYTORDP= 1
##$COROFFS= 0
##$CY= 7568.61572265625
##$DATMOD= 1
##$DC= 2
##$DFILT= <>
##$DTYPP= 0
##$F1P= 17.9538593292236
##$F2P= -4.03888763876832
##$FCOR= 0.5
##$FTSIZE= 32768
##$FT_mod= 4
##$GAMMA= 1
##$GB= 1
##$INTBC= 1
##$INTSCL= 1
##$ISEN= 128
##$LB= 0.02
##$LEV0= 0
##$LPBIN= 0
##$MAXI= 945.577
##$MC2= 0
##$MEAN= 0
##$ME_mod= 0
##$MI= -402.1523
##$NCOEF= 0
##$NC_proc= 0
##$NLEV= 6
##$NOISF1= 8.587773
##$NOISF2= 6.764455
##$NSP= 1
##$NTH_PI= 0
##$NZP= 0
##$OFFSET= 17.95386
##$PC= 1
##$PHC0= 108.4072
##$PHC1= 21.53094
##$PH_mod= 0
##$PKNL= yes
##$PPARMOD= 0
##$PPDIAG= 0
##$PPIPTYP= 0
##$PPMPNUM= 100
##$PPRESOL= 1
##$PSCAL= 0
##$PSIGN= 0
##$REVERSE= no
##$SF= 200.13
##$SI= 32768
##$SIGF1= 18.5376
##$SIGF2= -6.396296
##$SINO= 400
##$SIOLD= 32768
##$SREGLST= <1H.CDCl3>
##$SSB= 3
##$STSI= 0
##$STSR= 0
##$SW_p= 4401.40845070423
##$SYMM= 0
##$S_DEV= 0
##$TDeff= 0
##$TDoff= 0
##$TI= <>
##$TILT= no
##$TM1= 0
##$TM2= 0
##$TOPLEV= 0
##$USERP1= <user>
##$USERP2= <user>
##$USERP3= <user>
##$USERP4= <user>
##$USERP5= <user>
##$WDW= 1
##$XDIM= 8192
##$YMAX_p= 0
##$YMIN_p= 0
$$ End of Bruker specific parameters
$$ ---------------------------------
##NTUPLES= NMR FID
##VAR_NAME=  TIME,          FID/REAL,        FID/IMAG
##SYMBOL=    X,             R,               I
##VAR_TYPE=  INDEPENDENT,   DEPENDENT,       DEPENDENT
##VAR_FORM=  AFFN,          ASDF,            ASDF
##VAR_DIM=   8192,          8192,            8192
##UNITS=     SECONDS,       ARBITRARY UNITS, ARBITRARY UNITS
##FACTOR=    0.0002272,     1,               1
##FIRST=     0,             0,               0
##LAST=      1.8609952,     -79,             235
##MIN=       0,             -732161,         -732161
##MAX=       1.8609952,     1562821,         1562821
$$ Real data points
##PAGE= N=1
##DATA TABLE= (X++(R..R)), XYDATA
$$ [...]
2225E44m03j49m56K20N68q46O78M76r15n80R44L15k195J107J085l45r08M45L51
$$ 544 141 -8 -464 -244 324 -522 156 632 -283 -863 81 396 -1799 -692 393 48 -860 -415 -64
2244f4J96p5k43N43M58j253r3J595k63k029K062M70j396k82J408o26l88K26M27
$$ -64 132 57 -186 357 815 -438 -531 1064 801 -1228 834 1304 -92 -374 1034 408 20 246 673
2263F73k06Kj030L86P31n85p30Q07J28j077J021J068j682%O74k49m2N25o64K87
$$ 673 467 469 -561 -175 556 -29 -759 48 176 -901 120 1188 -494 -494 180 -69 -111 414 -250 37
2283C7O06p72l77J293m26j412J774O78k122L21Q03n67L67rj40K6l41l25J35P72
$$ 37 643 -129 -506 787 361 -1051 723 1401 -721 -400 403 -164 203 194 54 80 -261 -586 -451 321
2303C21l63l22Q32p52o45R29R38j545J85M89l27J06j44M89P9K79j171J51R58n63
$$ 321 -42 -364 468 -284 -929 0 938 -607 -422 67 -260 -154 -298 191 270 549 -622 -471 487 -76
2323g6k12Q41K55j572M43N16l35l01O27n91k16J032p66K02O35p11o28J419q59
$$ -76 -288 553 808 -764 -321 195 -140 -441 186 -405 -621 411 -355 -153 482 -229 -857 562 -297
2342b97m05J268K2p96J0J016j251K5P09k27J47N57n43k80R97p03p79J232j3j012
$$ -297 -702 566 588 -208 -198 818 -433 -408 301 74 221 778 235 -45 952 249 -530 702 689 -323
2362c23L72Q09j165M31N40n27Q5j28k43M02K40p62L4R76n87q76Q43L5n62L32O8
$$ -323 49 858 -307 124 664 137 222 94 -149 253 493 -269 -235 741 154 -722 121 156 -406 -74 -6
2383fm93K77N09n89J75M36j161M40N57r60k26J490j45j288J240m11l22L61J35
$$ -6 -499 -222 287 -302 -127 309 -852 -412 145 -815 -1041 449 304 -984 256 -155 -477 -116 19
2402A9l62k01O98n28J38Q70p19l50J249q57n13J537o72o55Q53O1n42L63M36l50
$$ 19 -343 -544 154 -374 -236 634 -85 -435 814 -43 -556 981 309 -346 507 568 26 389 825 475
2422D75j25L81m65k88J154p45q87R66k23m24N82P07j489M28M62m59P92n90l71
$$ 475 350 731 266 -22 1132 387 -500 466 243 -181 401 1108 -381 47 509 50 842 252 -119
2441a19l52J018r62O89K57k39j090Q69K81q46L52Q67j204K78N20o35L04p4p78
$$ -119 -471 547 -415 274 531 292 -798 71 352 -494 -142 725 -479 -201 319 -316 -12 -86 -864
2460h64P84P01j710J34J163n24l62N95m15k11k54J147o53J87O53p38n8N46j72
$$ -864 -80 621 -1089 -955 208 -316 -678 -83 -498 -709 -963 184 -469 -282 371 -367 -425 121 -51
2479e1p8Q74r28j79M07M3n80P80l7l43L74J26n54J29J014r28pP16o53m96P79l25
$$ -51 -129 745 -183 -362 45 88 -492 288 251 -92 282 408 -146 -17 997 69 62 778 125 -371 408 83
2501H3J9N1j74k77P86k72j52J24N77p68O1M49o52K96q2k77n6N60l10m57N89K51
$$ 83 102 153 -21 -298 488 216 64 188 765 -3 58 507 -145 151 69 -208 -264 296 -14 -471 118 369
2523C69r58Q76r17l19P43M06p27P14l90j59k57Q64l83j49Q20m19l51K52l80k42
$$ 369 -589 287 -630 -949 -206 200 -527 187 -203 -362 -619 245 -138 -287 533 114 -237 15 -365 -607
2543f07M43J216j320K9N81q04J20Q96m80k44Q29o23J12L95l52n92P74k04n98Q36
$$ -607 -164 1052 -268 -239 342 -462 -342 554 74 -170 659 36 148 543 191 -401 373 169 -429 407
2563D07O15j195O31J76n33m95N79K20p11P35k17o57M95j2r19P12Q98j619Q59M15
$$ 407 1022 -173 458 634 101 -394 185 405 -306 429 212 -445 50 38 -881 -169 729 -890 -31 384
2583C84q85P22Rl70l45O26m87l7L10o11K33J84j2l22L77N37j287O12M91j09m40
$$ 384 -501 221 230 -140 -485 141 -346 -383 -73 -684 -451 -267 -279 -601 -224 313 -974 -362 129 20 -420
2604d20O66q9m04P97p23O0P19l30j90M4L10r83M57O92p27N48P49j126k98N51j39
$$ -420 246 157 -247 550 -173 -113 606 276 86 130 440 -543 -86 606 -121 427 1176 50 -248 303 164
2625A64jJ10k32k91Q54k75p24P18J91n75k48N45q63N59J11O0l04O84j087L94M04
$$ 164 163 273 41 -250 604 329 -395 323 514 -61 -309 236 -627 -68 43 103 -201 483 -604 -210 194
2646A94q18m34J314n21l92K42M24r90L49N35k49K37j71J05k91P77n71M06l33Q2
$$ 194 -624 -1058 256 -265 -657 -415 9 -981 -632 -97 -346 -109 -280 -175 -466 311 -260 146 -187 -105
2666a05r15J456j04n77j9J52j09O63p4k75J05J06QP3J98r07N86O6J13o90K84N88
$$ -105 -1020 436 332 -245 -264 -112 -221 442 368 93 198 304 312 385 583 -324 262 328 441 -249 35 623
2688F23p93N57K11k84j54Q2J93l68j72l0J71k62K21n35Q90j95r17Q30K65o61l99
$$ 623 -170 387 598 314 160 242 435 67 -105 -135 36 -226 -5 -540 350 155 -762 68 333 -328 -727
2709g27R39m90k04Q01q90O18L61p51j17Q17p36m20R01j13m87J22Q74o99n8O14
$$ -727 212 -278 -482 319 -571 47 408 -343 -460 357 -379 -799 102 -11 -498 -376 498 -201 -259 355
2729C55n30k87O34l44Q0N88p01k75Q14l15l05N94j07q80K75P45q0k69j20M00o69
$$ 355 -175 -462 172 -172 -92 496 -205 -480 334 19 -286 308 201 -679 -404 341 261 -8 -128 272 -397
2750c97K24k05J33R95k30p81O48k02l96N12M59p99k17M98K5m23M79k58l21L54
$$ -397 -173 -378 -245 750 520 -261 387 185 -211 301 760 -39 -256 242 267 -156 323 65 -256 98
2770I8j09m26Q24n63m99O46k8m35j1J040o85k45R44q45p2O41m17K7N41l33n81
$$ 98 -11 -437 387 -176 -675 -29 -57 -492 -503 537 -148 -393 551 -294 -366 275 -142 -115 426 93 -488
2791d88J040n17j365J304M59p72L99k39K68k72R1M2J36K13k27o89Q38%k95N87
$$ -488 552 35 -1330 -26 433 -339 60 -179 89 -183 -92 -50 86 299 72 -617 221 221 -74 513
2811E13K05j573R91L27p43J82k17O69j11r9k47N13L56q72j2Q07m02o38N06k12
$$ 513 718 -855 136 463 -280 -98 -315 354 243 144 -103 410 766 -106 -118 689 287 -351 155 -57
2831e7j63J14N91o75m19J226r89J22R8l08L45K24j10p81J262m55q46J247m23m34
$$ -57 -220 -106 485 -190 -609 617 -372 -250 -152 -460 -115 109 -1 -782 480 25 -821 426 3 -431
2851d31L13M95q08K21N05q08L69M12p84m4O95l25J00j20M74q64P93K31o25J50
$$ -431 -118 377 -431 -210 295 -513 -144 268 -516 -560 135 -190 -90 -210 264 -600 193 424 -201 -51
2871e1K73k29N3J91m14L38J80k79k63N64p0o29P25M74m99m80M99l43k6J1L61J77
$$ -51 222 -7 46 237 -177 161 341 62 -201 363 293 -336 389 863 364 -116 383 40 14 25 386 563
2893E63O2k6p01Q64q91m15Q96k51j97L80Jl50j76L15K06q21P49k88j28K58o60
$$ 563 625 599 -102 762 -129 -544 352 101 -96 284 285 -65 -241 74 280 -541 208 -80 -208 50 -610
2914f10OP54o53n25J165j13j08J24K7n55L29O16j038M35N75q40P30l12K36l30
$$ -610 -604 150 -503 -1028 137 24 -84 40 67 -488 -159 457 -581 -146 429 -411 319 7 243 -87
2934h7O3N40q73J90M56n17L32p07M82j6k9K61p0K77r81M96M64k24k86P26k36j116
$$ -87 -24 516 -357 -167 289 -228 104 -603 -121 -137 -166 95 25 302 -679 -183 281 57 -229 497 261 -855
2956h55J014J18p02k18Q99l97l51m5L35K55r1l79j57Q23m70j39Q15l11o55L04
$$ -855 159 277 -425 -643 256 -141 -492 -537 -202 53 -38 -417 -574 249 -221 -360 455 144 -511 -207
2976b07M12m52J26N55o09R3O99o07l05Q15l53j97J08J80n31P07r5j21J01Q3l34
$$ -207 205 -247 -121 434 -175 -82 617 10 -295 520 167 -30 78 258 -273 434 339 218 319 402 68
2997F8k54N72n76M9Q08q73K7P24n51k24N54N90r41K87q8l59k20M29K69m27L51
$$ 68 -186 386 -190 -141 667 -206 -179 545 -6 -230 324 914 -27 260 172 -187 -407 22 291 -136 215
3018B15n89K47P30j23j326J086k57o46Q27l36l4M70l34n24M48J3n50Q22n3j31
$$ 215 -374 -127 603 480 -846 240 -17 -663 164 -172 -206 264 -70 -594 -146 -133 -683 139 86 -45
3038d5k2K47j001L66N91K97q37L39j33n20M58K54o99J033j46j56n5N91j97j168
$$ -45 -67 180 -821 -455 136 433 -404 -65 -198 -718 -260 -6 -705 328 182 26 -29 562 365 -803
3058h03R73r9n41K07Q79j143J001l1r27O21k4J76Nk23k6K80P1k30O1Q1J56n66
$$ -803 170 71 -470 -263 616 -527 474 443 -484 137 113 289 294 71 45 325 396 166 227 308 464 -102
3080a02N68j53n60M51L01m72J37j01l84L54J07N93o13M35o38K02L4J37r72J163
$$ -102 466 313 -247 204 505 33 170 69 -315 39 146 739 126 561 -77 125 159 296 -676 487
3100D87m99l30j98M82j81L93L95r32M60n52L02n45J054l34l70K38K37m44J02l0
$$ 487 -12 -342 -540 -58 -239 154 549 -383 77 -475 -173 -718 336 2 -368 -130 107 -337 -235 -265
3120b65L85l55L05m32j12O14j01k66K37j27l36K53J96j07N8%j50m7M29k27J83
$$ -265 120 -235 70 -362 -474 140 39 -227 10 -117 -453 -200 -4 -111 -53 -53 -203 -250 179 -48 135
3141A35P6j99n79J241p50L44N40r53L34j03o1p6O07j13r01J9N98j0n3J76l35M03
$$ 135 211 12 -567 674 -76 268 808 -145 189 86 25 -51 556 443 -458 -439 159 149 96 272 -63 340
3163C40L1m99l17P54n7o42j58N95n45M38L31j37o17J63K54M33K4m36j71M13p76
$$ 340 371 -128 -445 309 252 -390 -548 47 -498 -60 271 134 -483 -320 -66 367 391 -45 -216 197 -579
3184e79L8J008p16J87L78k74L4N1M24n47O28n69n12M62J96k52l65N77n05M11j45
$$ -579 -541 467 -249 -62 316 42 76 127 551 4 632 63 -449 13 209 -43 -408 169 -336 75 -70
3205g0j21j09K94k68N53j95j94p5k74P93n12K4J89K42r69J238p88J38l8J90n54
$$ -70 -191 -300 -6 -274 279 84 -110 -185 -459 334 -178 -154 35 277 -692 546 -242 -104 -142 48 -506
3226e06L81N94p49q8O34n01L22M95o54l26M65l77o9L59M3j34Q8K29j60J27K09
$$ -506 -125 469 -280 -368 266 -235 87 582 -72 -398 67 -310 -379 -20 23 -111 -23 206 46 173 382
3247C82p87K27N1M3N85l24m62L35K08l05n0J61n74N29K47M6n06M4J35P1nj18J12
$$ 382 -405 -178 -127 -84 501 177 -285 50 258 -47 -97 64 -510 19 266 312 -194 -150 -15 56 51 -67 45
3270D5O1J45m31Q5M02j31q75O33N86n85O45j57m72Q6J7m40P36K40o07k17M26L62
$$ 45 106 251 -180 -95 307 176 -699 -66 520 -65 580 423 -49 37 54 -386 350 590 -17 -234 192 554
3292E54p54K31K12n63K46M9p21R09n12R0M0M24k38Q9K4m24K66O93m50l69K89j73
$$ 554 -200 31 243 -320 -74 -25 -746 163 -349 -259 -219 205 -33 56 80 -344 -78 615 165 -204 85 -88
3314h8l36K13K11n74P96j98j64L88k05j94Q0M71n19K23n8K5j88M9M77l47P8k2
$$ -88 -424 -211 0 -574 222 24 -140 248 43 -151 -71 400 -119 104 46 71 -117 -68 409 62 140 118
3336A18k23N48o74K86m54J45M93j4K8j41k21j15O21o59L22J08kJ27M7n79K26K62
$$ 118 -105 443 -231 55 -399 -254 239 225 253 112 -109 -224 397 -262 60 168 166 293 340 -239 -13 249
3358B49o44m07R48r2k55q4K38l6l26L61K67l99K75M8m99P03k36J17R7m46k52L14
$$ 249 -395 -802 146 54 -201 -285 -47 -83 -409 -48 219 -180 95 143 -356 347 111 228 325 -121 -373 -59
3380e9K06jm42J05l7J00K45n61L79J37o5K20L6l10K62l14K99l09N52l06p04O58
$$ -59 147 146 -296 -191 -228 -128 117 -444 -65 72 7 227 263 -47 215 -99 200 -109 443 137 -567 91
3402I1K87k80N4L8k0L11m33N52o19k4L4J40l23J37n4P5M95k32k54J80q41M19J51
$$ 91 378 98 152 190 170 481 48 600 -19 -43 -9 131 -192 -55 -109 -34 461 229 -25 155 -686 -267 -116
3425a16p3K68k44N9J46Q3K79o98K35J47k32M72r22N40k17L66lK02j57ok53K84
$$ -116 -189 79 -165 -106 40 123 402 -296 -61 86 -146 326 -596 -56 -273 93 90 292 135 129 -124 160
3447A60K83n19J25n4R3k95j02J23n0L96nJ36o3r7K23j28o84K74j17N61j07j21
$$ 160 443 -76 49 -5 88 -207 -309 -186 -236 160 155 291 228 131 354 226 -458 -184 -301 260 153 32
3469C2m25O03j39K57O2m1k78l9M42l85n60O13J84j050M97J5k8R7L15l89J58j65
$$ 32 -393 210 71 328 390 349 71 32 474 89 -471 142 326 -724 -227 -212 -240 -143 172 -217 -59 -224
3491b24N96o18J39q6K08J84m42L12qJ43k26M82k41k24l1L35J61m84N73l17k28
$$ -224 372 -246 -107 -193 15 199 -243 69 61 204 -22 460 219 -5 -36 299 460 -24 549 232 4
3512DK51J74p1l6N6n7n03J55p2J34k25J73K3J59O09j266J51L32k41J51L44o30
$$ 4 255 429 358 322 378 321 -182 -27 -99 35 -190 -17 6 165 774 -492 -341 -9 -250 -99 245 -385
3534c85J47P1j8L91l8M32l37m62M36k69J38p33M64K68o5l55J58K12m70K45J17
$$ -385 -238 -167 -185 206 168 600 263 -199 237 -32 106 -627 -163 105 40 -315 -157 55 -415 -170 -53
3555e3K9K20p9k24L16k02J43l09O7k70K39L5l8J87k02J45k02L50o08O20k06N21
$$ -53 -24 196 117 -107 209 7 150 -159 -92 -362 -123 -88 -126 61 -141 4 -198 152 -456 164 -42 479
3577D79p20N9L27n3l66Q6N53k8l19L1J19l07Q6r9L28J47o93L93J29o87K22Q4L20
$$ 479 -241 -182 145 92 -274 -188 365 337 18 49 168 -139 -53 -152 176 323 -370 23 152 -535 -313 -229 91
3600I1j63R4R7J35k94J10n52J35L70k26O86n92L23k93K4J7N82P1k46q78L75j85
$$ 91 -72 22 119 254 -40 70 -482 -347 23 -203 483 -109 214 -79 -55 -38 544 615 369 -509 -134 -319
3622c19K67o2K02m2m71O86k45K51l73k55L26J23n73q1O51J08o9k12mk11M41m49
$$ -319 -52 -114 88 46 -425 261 16 267 -106 -361 -35 88 -485 -566 85 193 124 -88 -92 -303 138 -311
3644c11K56j22K21J75L5Q0p12L53J52n05L81P1j04J22m0o7J61J50o41M28L60l04
$$ -311 -55 -177 44 219 254 334 -378 -25 127 -378 3 74 -30 92 52 -15 146 296 -345 83 443 139
3666A39o01K60O56p09M70k74k06L38Q7N22j026J82K97k04Q3l12J21K72J27m56
$$ 139 -462 -202 454 -255 215 -59 -265 73 160 682 -344 -162 135 -69 14 -298 -177 95 222 -234
3686b34P03m02l0j07K46l57J49j48N2Pm62R80l68K13l37pM33l53J06j08J91o3
$$ -234 469 67 37 -70 176 -181 -32 -180 -128 -121 -583 397 29 242 -95 -102 331 -22 84 -24 167 104
3708A04j77M17j65J10l99m4J95K56k11K49j4o21N17j06q0N10l37q42O18p0N71
$$ 104 -73 344 179 289 -110 -154 41 297 86 335 321 -300 217 111 31 541 204 -638 -20 -90 481
3729D81o24j14M44j36l99O10N6p39K42L76q91O06o8K52J76o38K81k90M30m04J88
$$ 481 -143 -257 187 51 -348 262 318 -421 -179 197 -694 -88 -156 96 272 -366 -85 -375 55 -349 -161
3750a61J20O8R5k26K16k08N21o43L93r8J68k69k65N68j29J0l02K2K03JL9l56q4
$$ -161 -41 27 122 -104 112 -96 425 -218 175 77 245 -24 -289 279 150 160 -142 -120 83 84 123 -233 -317
3773c17L32K0J59l7l80L12k09J57K26k32l98L75j68l16N25k28L65K81q67K06N31
$$ -317 15 35 194 157 -223 89 -120 37 263 31 -367 8 -160 -476 49 -179 186 467 -400 -194 337
3794C37n89J36j07j06M70j17K22m95M38l48k74R68n34O12n97j79N49o35j5O60
$$ 337 -252 -116 -223 -329 141 24 246 -249 189 -159 -433 535 1 613 16 -163 386 -249 -264 396
3814C96k96l15J3O69m23J17j60m35P12L17q2n86p1K56n89P09n28O24L24r50k92
$$ 396 100 -215 -202 467 44 161 1 -434 278 595 513 -73 -144 112 -477 232 -296 328 652 -298 -590
3835e90J02O18j90R8J34k18o7J71m73M39J91m69M58Jn82J00Q98m91k92m5O1K19
$$ -590 -488 130 -60 38 172 -46 -113 58 -415 24 215 -254 204 205 -377 -277 621 130 -162 -207 -146 73
3857G3Jj71M79p44O51j61k61N76n10J41K91l77M4J06m9j52K83j41l22N5k41M45
$$ 73 74 -97 382 -362 289 128 -133 443 -67 74 365 -12 32 138 89 -63 220 79 -243 -188 -429 16
3879A6k37k0P78n16J52N6k12k81M24n56Q09q9l78L25j19k60O62l97j15k92O56
$$ 16 -221 -241 537 21 173 229 17 -264 160 -396 413 324 -54 271 152 -108 554 157 42 -250 406
3900D06l62m77N3M00l7Q1j56j10K64K95J76p49L77j24L99N0m24r4M62p67L01n1
$$ 406 44 -433 -380 20 -17 64 -92 -202 62 357 533 -216 161 37 436 486 62 -32 430 -337 -36 -87
3922h7j16J48K18m99N4M00k97K42n6j96K66j71K03n15k0L63J73j60N37p91M05
$$ -87 -203 -55 163 -336 -282 118 -179 63 7 -189 77 -94 109 -406 -426 -63 110 -50 487 -304 101
3943A01pj05J1n74Q36n53L70k61J72p2L20j94J4O5j89k05J5p0P85n46N45p49L21
$$ 101 94 -11 0 -574 262 -291 79 -182 -10 -82 238 44 58 123 -66 -271 -256 -326 459 -87 458 -291 30
3966C0L24n79K59K64k19l74J62j0K48J42J06j08P5j47n65O51j76J9k9q3j26L27
$$ 30 354 -225 34 298 79 -295 -133 -143 105 247 353 245 320 173 -392 259 83 102 73 -10 -136 191
3988A91j78N7J94l42J82j59L23n42J53M29m52R3k82K94K11j02l38QN30K5n22J45
$$ 191 13 70 264 -78 104 -55 268 -274 -121 308 -144 -51 -333 -39 172 70 -268 -260 270 295 -227 -82
4010h2J77l83P65p41p6K28J71P6p39L09L86m06M66j18k05K27N40r09N09J70l72
$$ -82 95 -288 477 -264 -340 -112 59 135 -604 -295 91 -315 151 33 -172 55 595 -314 195 365 -7
4031gQ0n8O8m30M93m43M4N70p7n78j86L95k73J74Q00j26l33l56O79%l28Q1n87
$$ -7 73 15 83 -347 146 -297 -253 317 240 -338 -524 -129 -402 -228 572 446 113 -243 436 436 108 189 -398
4054c98O85l12l11J09K35K8m34Q05l49k81l7J95m51R12m64l46K13J22j5K32m49
$$ -398 287 -25 -336 -227 8 36 -398 407 58 -223 -260 -65 -516 396 -68 -414 -201 -79 -94 138 -311
4075c11M17j50k06j75M61J03j14k71J87j46J71lk23L01L40j04o23L12o4J66m13
$$ -311 106 -44 -250 -425 36 139 25 -246 -59 -205 -34 -37 -260 41 381 277 -346 -34 -98 68 -345
4096c45P39l61m6K5l12K9M13k30Q2r0O7j39k03P75l08k13J83j53J21l30L60J09
$$ -345 394 33 -13 12 -300 -271 142 -88 -6 -96 -29 -168 -371 404 96 -117 66 -87 34 -296 64 173
4118A73L30m44j43K97l64K57J98k45l60M57j93K57k43M20l62k28O39l29j51L20
$$ 173 503 59 -84 213 -151 106 304 59 -301 156 -37 220 -23 397 35 -193 446 117 -34 286
4138B86l02R9K98j84K97n56j00k23O53J43l29o3J32k15q3M98o71K69j35L30k24
$$ 286 -16 83 381 197 494 -62 -162 -385 268 411 82 19 151 -64 -147 351 -320 -51 -186 144 -80
4159h0J21M4o53M56nj52N44k22n00N23j78p9P6J56l7J66J70m39L30L69q09J75
$$ -80 41 85 -568 -112 -117 -269 275 53 -447 76 -102 -181 -105 51 14 180 350 -89 241 610 -199 -24
4181b4J31k04k08P48m48K05o51N06K77j23O0k58j39L05R5o32N87j21o08K81K48
$$ -24 107 -97 -305 443 -5 200 -451 55 332 209 269 11 -128 177 272 -360 227 106 -502 -221 27
4202B7K69l14J66o33J87l4K95J77n80L41N3l44N03J22lK09j052J50N29l10J48
$$ 27 296 -18 148 -485 -298 -332 -37 140 -440 -99 -46 -390 113 235 232 441 -611 -461 68 -242 -94
4223i4J21R7j96K32k05J26K71l04j31j89L77L9m2L2l6r5K58k16J69k89j86K01
$$ -94 27 124 -72 160 -45 81 352 48 -83 -272 105 144 102 134 98 3 261 45 214 -75 -261 -60
4245f0M24m92m38J140o8q22M02k37j12N78q4l2q9L86j006L96j38L13l96N28l88
$$ -60 364 -128 -566 574 506 -316 86 -151 -263 315 231 199 110 496 -510 -114 -252 61 -335 193 -195
4266a95m2L25j31j02k12N16k10K31j92K88k51o9L00q82N52k61J63M57n2l78J44
$$ -195 -237 88 -43 -145 -357 159 -51 180 -12 276 25 -44 256 -626 -74 -335 -172 285 233 -145 -1
4287aK30j91K28k74n7l2q3J61j73P41m96J59N0q9j44P2L24p74N27j96L86n36M52
$$ -1 229 38 266 -8 -65 -97 -180 -19 -192 549 53 212 262 173 29 101 425 -349 178 -18 368 -168 284
4310B84k77k04M60m67J72l5j15N69m48J17n18J21Q74q39K72N2J24m10K44k44K83
$$ 284 7 -197 263 -204 -32 -67 -182 387 -61 56 -462 -341 533 -306 -34 18 142 -268 -24 -268 15
4331A5J35l85j51M61K41o81M79o5o5q1M2M1J38Po38R11o37O75q78K70O6r5M43
$$ 15 150 -235 -386 75 316 -365 114 49 -16 -97 -55 -14 124 131 -507 404 -233 442 -436 -166 -100 -195 248
4354B48o3p3o82J263q79n27J032k63L6L68l99k14j79Q50q43K86k54j88O58j45
$$ 248 185 112 -570 693 -186 -713 319 56 92 460 61 -153 -332 518 -325 -39 -293 -481 177 32
4374C2M4k89M38j12l58N12n36N24J49m23J8j64N84o45L89Q5j4m5k57M14j5j71
$$ 32 76 -213 225 113 -245 267 -269 255 404 -19 -1 -165 419 -226 163 248 234 189 -68 346 331 160
4396A60r4k03N84o34O2L73j89m0K17l43j62J70K5k55L83k60K45N3L8J3j79K71
$$ 160 66 -137 447 -187 -125 248 59 19 236 -107 -269 -99 -74 -329 54 -206 39 92 130 143 -36 235
4418B35K05o06K8N4j02P59n25p4r7j3k4j37M06j36J26k6k35L06k37k36L16k9J22
$$ 235 440 -166 -138 -84 -186 573 48 -26 -123 -136 -160 -297 109 -27 99 73 -162 144 -93 -329 -13 -42 80
4441H0m50K37k58L9K9R70r40M72L48l21k70K84j8m91k19K05L82j67j20P31m8o37
$$ 80 -370 -133 -391 -352 -323 647 -293 179 527 206 -64 220 202 -289 -508 -303 79 -88 -208 523 475 -162
4463a62j17pN27l79N02l62j12j49N3J39N5l37K96P0L53k24J29l32P2k7L79j99
$$ -162 -279 -286 241 -138 364 2 -110 -259 -206 -67 -12 -349 -53 17 370 146 275 -57 15 -12 367 168
4485A68k46k5O4k65L60L37n68J08P8J12J4L04m29l78M86k03J43N0m6J02l26L98
$$ 168 -78 -103 -39 -304 56 393 -175 -67 11 123 137 441 12 -366 120 -83 60 110 64 166 -160 238
4507B38k36K19J9o74L39m08R90p37M44K26o7n4J10j09K53p99J00K66O3K7o82O22
$$ 238 2 221 240 -434 -95 -503 487 -250 194 420 353 299 409 300 553 -246 -146 120 183 210 -472 150
4529A50k61j8r9K09r6L09L2l91J27OK08j56k02J83n34M94M76l02j63j64p7K06
$$ 150 -111 -129 -228 -19 -115 194 226 -165 -38 -32 176 20 -182 1 -533 -39 437 135 -28 -192 -269 -63
4551f3j01l8L20k47L72l75J70K47l70R0J10K9o3j78l44N85k12KQ8l08P0K05J94
$$ -63 -164 -202 118 -129 243 -132 38 285 -85 5 115 144 81 -97 -441 144 -68 -66 22 -286 -216 -11 183
4574A83n73M32m25L74Q6Kl23j40M31k80J99K79K15n51J49m13K03O52m84K58n23
$$ 183 -390 42 -383 -9 77 79 -244 -384 47 -233 -34 245 460 -91 58 -355 -152 500 16 274 -249
4595b49L90l64L49J69l07j03J91J25o88O39j98R1o00N79k8m8K31P8M7q9k35K76
$$ -249 141 -223 126 295 -12 -115 76 201 -487 152 -46 45 -555 24 -4 -52 179 257 304 215 -20 256
4617B56k29l29K45nk06K92j41J13m68L25J09K53m69K37J84K36j8k56n7K21k83
$$ 256 27 -302 -57 -62 -268 24 -117 -4 -472 -147 -38 215 -254 -17 167 403 385 129 72 293 10
4638A0L94j12n18M95j46k52q54J021p6J97k4J98l46j04N91o13OK87K46n92N17
$$ 10 404 292 -226 269 123 -129 -983 38 -38 159 135 333 -13 -117 474 -139 -133 154 400 -192 325
4659C25q32M20K10N5k94m2Q77o37n5K66k87Q3J94k44L78p16K5k66M65n6r3L25
$$ 325 -507 -87 123 178 -116 -158 719 82 27 293 6 89 283 39 417 -299 -274 -540 -75 -131 -224 101
4681A01J36l48L16j58k57K63l89K63J78J88q02O44k39k78J45M64P3o83O40l46
$$ 101 237 -111 205 47 -210 53 -336 -73 105 293 -509 135 -104 -382 -237 227 300 -383 257 -89
4701h9L23K88q6m91l71P80o87K46L32k00m95N83K8k00j97K91k01K08J92j7o27
$$ -89 234 522 436 -55 -426 354 -333 -87 245 45 -450 133 161 -39 -236 55 -146 62 254 237 -390
4722c90J69KQ5N67q56N14K75m88m67N13l0l33L47J44p72P77n4j43p1K39K03mJ0
$$ -390 -221 -219 -134 433 -423 91 366 -122 -589 -76 -106 -439 -92 52 -720 57 3 -140 -211 28 231 227 237
4745B37O0j53M3l62K01J71k77N8L82J02r18N05L01k37k7l22M38J29M8l13j93M12
$$ 237 297 144 187 -175 26 197 -80 -22 360 462 -456 49 350 113 86 -236 202 331 379 66 -127 285
4767B85m22J62m41P22k80k62L71O7j51rl86J33J88M98j067P60p0j73J75p37M41
$$ 285 -137 25 -416 306 26 -236 135 202 51 42 -344 -211 -23 475 -592 168 98 -75 100 -637 -196
4788a96M2Q7l09K22P8j97J62k12K71N87q61M45n09P11o07K84K28l71j0j69L27
$$ -196 -154 -67 -376 -154 -76 -273 -111 -323 -52 535 -326 119 -390 321 -286 -2 226 -145 -155 -324 3
4809Cm67P76r2k73j84M33k32k70J94M50m29K59l53Q8K44L60m82L31no06O77n90
$$ 3 -464 312 220 -53 -237 196 -36 -306 -112 338 -91 168 -185 -97 147 507 25 356 351 -255 422 -168
4831a68J07L38j22p16Q17R0l35n05M48kn47N69J12l48j34K41K52k70L58j36l46
$$ -168 -61 277 155 -561 256 346 11 -494 -46 -48 -595 -26 86 -262 -396 -155 97 -173 185 49 -297
4852b97O85k62k68K66om66K55k35O39j46n61L94L37m35j09K91j45L26l66L82L79
$$ -297 388 126 -142 124 118 -348 -93 -328 311 165 -396 -2 335 -100 -209 82 -63 263 -103 279 658
4873F58p77J10M06p28L66K57m5k23L08o78j2O87o34M77l53q0o7O91q7j78j95L3
$$ 658 -119 -9 397 -331 35 292 247 24 332 -346 -358 329 -305 172 -181 -261 -328 363 276 98 -97 -64
4895f4o00P07J60k40rJ23R2o9Rk23l01J64M61p46P64j90l4q7K48q8L99m82l09
$$ -64 -664 43 203 -37 -46 77 169 100 109 -114 -415 -251 210 -536 228 38 4 -83 165 77 476 -6 -315
4918c15O96J55q47P07o57K27N3J23o1L49l00j37K51p1k28l5K05q3K23j47K73K09
$$ -315 381 536 -311 396 -261 -34 19 142 81 430 130 -7 244 173 -55 -90 115 32 255 108 381 590
4940E90p97L67l4k12J73J6r88P17r0N39m64M89m36O44o78l83N71n9K9m18N26l04
$$ 590 -207 160 126 -86 87 103 -885 -168 -258 281 -183 306 -130 514 -164 -547 24 -35 -6 -424 102 -202
4962b02r2L19l8j97J29L29k65K24J76r49R43k15n88M70j11k27L25J62k40k45M07
$$ -202 -294 25 -13 -210 -81 248 -17 207 383 -566 377 162 -426 44 -67 -294 31 193 -47 -292 115
4983A15k83K11P0j46l19N24N2l64L75o8j08l36O11l10o00L79K47K17k2m72k79
$$ 115 -168 43 113 -33 -352 172 224 -140 235 167 59 -277 334 24 -576 -197 50 267 245 -227 -506
5004e06N52j40k65N74J26k68j23K05l2m48P13l03L16k61n66K21L99j86n4K05p0
$$ -506 46 -94 -359 215 341 73 -50 155 123 -325 388 85 401 140 -426 -205 194 8 -46 159 89
5025H9p5K64m55K54k50M32J76n10k89J90j67L18R6J82n52M22m24M26j51J12j2
$$ 89 14 278 -177 77 -173 259 435 -75 -364 -174 -341 -23 73 255 -297 125 -299 127 -24 88 76
5046G6o30P91k49P3k51N5K4k79O56k47Q5k2r1j3m8%N30l71o61K14K92J96j10M1
$$ 76 -554 237 -12 61 -190 -135 -111 -390 266 19 104 82 -9 -22 -70 -70 460 89 -572 -358 -66 130 20 61
5070F1k84N79p62L91l6J37m13L40N5K61k5j18n21J6O43m74K2K97P7j45k35N14
$$ 61 -223 356 -406 -15 -51 86 -327 13 68 329 304 186 -335 -319 324 -150 -128 169 246 101 -134 380
5092C80m83L42j36l24M20m20O42m45j73M2M7K47k94N25l43P8m26l10P88l09K73
$$ 380 -103 239 103 -221 199 -221 421 -24 -197 -155 -108 139 -155 370 27 105 -321 -631 157 -152 121
5113A21j48J9J1n40M90k54M34k22j30L31j55j69K25L23l80J61O9J57l90j81RL95
$$ 121 -27 -8 3 -537 -47 -301 133 -89 -219 112 -43 -212 13 336 -44 117 186 343 -47 -228 -219 176
5135A76m38L95m17j21L57L32n21J56q0K11o7k15J18k03M67J20m39N7QM67j88K67
$$ 176 -262 133 -284 -405 -48 284 -237 -81 -161 50 -17 -232 -114 -317 150 270 -169 -112 -104 363 175 442
5157D42j02m12N1k51kj89M92J96k05l63P85p05L04k35P2J07K88N1M4m37k91j53
$$ 442 340 -72 -21 -272 -274 -463 29 225 20 -343 442 -263 41 -194 -122 -15 273 324 368 -69 -360 -513
5179e13J040l15n00J71K96P2j67K38o82M10M11j18l47L12k26j39jK88l44O99q47
$$ -513 527 212 -288 -117 179 251 84 322 -360 50 461 343 -4 308 82 -57 -58 230 -114 585 -262
5200b62kj07M55j10q8J79l94J99O75o82J30q8o3O16j24k42m58N92m04L11N69j006
$$ -262 -264 -371 84 -26 -114 65 -329 -130 545 -137 -7 -95 -158 458 334 92 -366 226 -178 133 702 -304
5222c04J7j73K53j47K89j28K16m23N53j20k33N16n8j82M50K05n94j24L4k24R1
$$ -304 -287 -460 -207 -354 -65 -193 23 -400 153 33 -200 316 258 76 526 731 137 13 47 -177 -86
5243h6J73l64M19J52m07N20m66k20q9O09o2o17N24J89m74m11K49K99J58p73J08
$$ -86 87 -277 142 294 -113 407 -59 -279 -368 241 179 -438 86 275 -199 -610 -361 -62 96 -677 -569
5264e69N96M4m33K18L05k22P1K7%J38J36j46j05o6J84j48J22j04J07O8j18j26
$$ -569 27 71 -362 -144 161 -61 10 37 37 175 311 165 60 -6 178 30 152 48 155 223 105 -21
5286b1J74J72L0p0m9r3J76m71R0m87M09K08l66K77J24p99P84m73O23k24K71k20
$$ -21 153 325 355 285 236 143 319 -152 -62 -549 -140 68 -298 -21 103 -696 88 -385 238 14 285 65
5308F5kK07n34J96j92P0K88Jk52K33J15L89n71p1L78k6o08N06k24N82r81O52o83
$$ 65 63 270 -264 -68 -260 -190 98 99 -153 80 195 584 13 -58 320 294 -314 192 -32 550 -431 221 -462
5331d62K54L40j5l34L05JJ29J0j09L7K45j84m02J62o4Q5J23o67K36K53M41m70
$$ -462 -208 132 117 -217 88 89 218 228 119 156 401 217 -185 -23 -87 -2 121 -546 -310 -57 384 -86
5353h6l47O75k60k49K98j22j10K32k44m5J76L47o2J08M6m55M98k45o28N24J06
$$ -86 -433 242 -18 -267 31 -91 -201 31 -213 -258 -82 265 203 311 357 -98 400 155 -473 51 157
5374A57k76k14N11r5R0J03o87J93L70L79j84k31M30m45J71L27o85r1M00k06K20
$$ 157 -119 -333 178 83 173 276 -411 -218 152 531 347 116 546 101 272 599 -86 -177 223 17 237
5395B37L39n55k99L29n6k46M05K26p40K85O3Pj02j7J31P2k89k93L99M14m79J60
$$ 237 576 21 -278 51 -5 -251 154 380 -360 -75 -12 -5 -107 -124 7 79 -210 -503 -104 310 -169 -9
5417iL33k45K54m96L40r1m91N67o0K1l05J6R2q1K81m62J42M87p29L14j01L26O8
$$ -9 324 79 333 -163 177 86 -405 162 102 123 -182 -166 -74 -155 126 -336 -194 293 -436 -122 -223 103 171
5440A71K75r70K08L93K14J10k72M53k30n80J64k66K25P22p35J67J54l48P5L39
$$ 171 446 -524 -316 77 291 401 129 582 352 -228 -64 -330 -105 617 -118 49 203 -145 -70 269
5460B69Q7k43Kq4L1J8n64Q7N30J09l01r4M33k0k82q7j12N86K76n76k62NJ72j39
$$ 269 356 113 115 31 62 80 -484 -397 133 242 -59 -153 280 260 -22 -109 -221 365 641 65 -197 -192 -20 -159
5484a59M81n32O09m53J21r8J96j7K01r6o39K51K42K91o89M55k24J82j04L4o3j38
$$ -159 322 -210 399 -54 67 -31 165 148 349 253 -386 -135 107 398 -291 164 -60 122 18 52 -11 -149
5506a49J04J68j93Q0Q9K73n00J69o4L80K66m96ko39K80P46q75J64j98Q67k58o94
$$ -149 -45 123 -70 10 99 372 -128 41 -23 357 623 127 125 -514 -234 512 -363 -199 -397 470 212 -482
5528d82N45p2K52p76N81n2O9k01p6j26L76K41l08J6mR32r78M07m72L7J70M4k03
$$ -482 63 -9 243 -533 48 -4 65 -136 -212 -338 38 279 -29 -13 -17 915 -63 344 -128 -91 79 123 -80
5551h0J49k84P4L45k64K66j4l99J48K18j95J11K63m68j58M65j94k98J2L04o3j43
$$ -80 69 -215 -141 204 -60 206 192 -207 -59 159 -36 75 338 -130 -288 177 -17 -315 -303 1 -62 -205
5573b05m5K93m38L26J7j08L78N4m37J88R4m1K80l04j33N71m86l41j09O15k86j04
$$ -205 -250 43 -395 -69 -52 -160 218 272 -165 23 117 76 356 52 -81 490 4 -337 -446 169 -117 -221
5595b21M23o2l29j34J81L25j76J09o00N28l37L85M28q10N35n56R3N05n35K76K6
$$ -221 202 140 -189 -323 -142 183 7 116 -484 44 -293 92 520 -290 245 -311 -218 287 -248 28 54
5616E4k99L67N29r06j17N03m2m00J53K16L37j015Q16j98k8J64l41Q0o8L50j79
$$ 54 -245 122 651 -255 -372 131 89 -311 -158 58 395 -620 196 -2 -30 134 -207 -127 -195 155 -24
5637b4M35q89L68k54N4j49q1M12J9m1j02J83K62j55M9K39m6o35M13O72j294K76
$$ -24 411 -478 -110 -364 -310 -459 -540 -128 -109 -150 -252 -69 193 38 87 326 280 -355 58 730 -564 -288
5659b88J063j098j61J38L16j36o7K51m8k72O73k56m34j38Q94m93N29j042N41n6
$$ -288 775 -323 -484 -346 -30 -166 -233 18 -30 -302 371 115 -319 -457 437 -56 473 -569 -28 -84
5679h4K58P7j24K40j233R17K11l64r6N52p56K27K21Jj7m66J08J55M21N9k92k01
$$ -84 174 251 127 367 -866 51 262 -102 -198 354 -402 -175 46 47 30 -436 -328 -173 248 307 15 -186
5701a86N8J1Q1M01j05j54o28K12L56L94p69R1O31k76l54K45M38j83N0j102O97
$$ -186 -128 -117 -36 365 260 106 -522 -310 46 440 -329 -238 393 117 -237 8 446 263 313 -789 -92
5722i2Q1j05pr1K33j13k74P23M1o72L06K7j79K07J81k27N55n84R8m84L76r7K73
$$ -92 -11 -116 -123 -214 19 -94 -368 355 396 -276 30 57 -122 85 266 39 594 10 108 -376 0 -97 176
5745A76m86O7K98j82J83m55M20Q7q2o3j02O5L98k82j78pK42J74q1J61m89n2m07
$$ 176 -310 -243 55 -127 56 -399 21 108 26 -37 -139 -74 324 42 -136 -143 99 273 192 353 -136 -188 -595
5768e95M31J26J63n02L1N98l4m13L85o41N17k77K08j0k09J46J21L31l17j05m8
$$ -595 -164 -38 125 -377 -346 252 218 -195 190 -451 66 -211 -3 -13 -222 -76 45 376 59 -46 -94
5789i4Q7Q3J21m02K67k98K28O5n2J28q6M5j67l4l80N73n24N99p72L82J30M3j42
$$ -94 -7 76 197 -205 62 -236 -8 57 5 133 47 92 -75 -109 -489 84 -440 159 -613 -231 -101 -58 -200
5812b00N71J17k17k74k61N10p6o8o0j59j96L43j86q7M32o63M85l00p6N89m6o06
$$ -200 371 488 271 -3 -264 246 170 102 42 -117 -313 30 -156 -243 189 -474 11 -289 -365 224 178 -428
5834d28N93L7m0J64o43j64J02K50j6J59l77j1N09J13n9j92k48M58k35K4k89N08
$$ -428 165 202 162 326 -317 -481 -379 -129 -145 14 -363 -374 135 248 189 -3 -251 207 -28 -4 -293 215
5856B15k86J06J80k99j3L11l97L74n3L8K39o57L56L40m47k51M41n04M97q1k46
$$ 215 -71 35 215 -84 -97 214 -183 191 138 176 415 -242 114 454 7 -244 197 -307 190 109 -137
5877a37K60K3j15r5j14N91m01j3n2J42L58n87l9k22L43N9j2K41l74K38J8j6l1
$$ -137 123 146 31 -64 -178 413 12 -1 -53 89 447 -140 -179 -401 -58 1 -11 230 -144 94 112 96 65
5900F5l08K12M26k64N89j037K64J23l57J38J13j00r7N10o15L35j64K30k19L03
$$ 65 -243 -31 395 131 720 -317 -53 70 -287 -149 -36 -136 -233 277 -338 -3 -167 63 -156 147
5920A47m68K78k9M13l99L65k51k09M96j24l40l01N29p6j32j01R4k5K64n5k03K46
$$ 147 -321 -43 -72 341 -58 307 56 -153 343 219 -121 -422 107 31 -101 -202 -108 -133 131 76 -127 119
5942A19n50P34m98M86k98n9k34L19r5N3L13m41K01K07o1r1J33m68K01j21qj6K48
$$ 119 -431 303 -195 291 -7 -66 -300 19 -76 -23 290 -151 50 257 196 105 238 -230 -29 -150 -158 -174 74
5965G4K45J67k67q2j7j14J10k20q0o7n03O65k42M30j58j28m0M34p85P80K63o43
$$ 74 319 486 219 137 120 6 116 -104 -184 -251 -754 -89 -331 99 -59 -187 -227 207 -578 202 465 -178
5987a78L17m17J83M12l77K1k66K16L22l39L53K24q8n81J9Q10n16j04o2N25j037
$$ -178 139 -278 -95 317 -60 -39 -305 -89 233 -106 247 471 383 -198 -179 631 115 11 -51 474 -563
6008e63P53o4Q4k62l31K84q8N7N17n98J60K45L16l49o3o0K33J18k97J31k50K84
$$ -563 190 126 210 -52 -383 -99 -187 -130 387 -211 -51 194 510 161 98 38 271 389 92 223 -27 257
6030B57m40L80K05k15j47k08J20j40J43ll76N26J13J45n63n00M72P29j54K22o57
$$ 257 -183 197 402 187 40 -168 -48 -188 -45 -48 -424 102 215 360 -203 -703 -231 498 344 566 -91
6051i1J60K28n10J89o4M98o72J99J62K10n41M60n09J74Q7p0L58m23qO7K59m29
$$ -91 69 297 -213 -24 -88 410 -262 -63 99 309 -232 228 -281 -107 -20 -90 268 -155 -163 -96 163 -266
6073b66L32j75R7K67nm78M51k8m55K58J58l03j34L47O5P3k02R4K01m42M91m66
$$ -266 66 -109 -12 255 250 -228 223 195 -260 -2 156 -147 -281 66 131 204 2 96 297 -145 346 -120
6095a20Q9M4K2j6j17m14N14L25n37L37P4j59J11J13l98j10L30l70M56m17Q95k88
$$ -120 -31 13 35 19 -98 -512 2 327 -210 127 201 42 153 266 -132 -242 88 -282 174 -243 652 364
6117C64l36j06M69r0m13L21K17o14J64J58l48K42q9Q6k05N28o09L65k67M91j76
$$ 364 28 -78 391 301 -112 209 426 -188 -24 134 -214 28 -61 25 -180 348 -261 104 -163 328 152
6138A52J57oo24L07j98L39j54l27N81j1n35O75p01J47L69K06p49L08Lj24j02N47
$$ 152 309 303 -321 -14 -212 127 -27 -354 227 216 -319 356 -345 -198 171 377 -372 -64 -61 -185 -287 260
6160B60k10K17J18o15M12j05o69O10q5l2L22j40p9J49j15QK05j56R4Mr3J52k62
$$ 260 50 267 385 -230 182 77 -592 18 -67 -99 223 83 4 153 38 46 251 95 189 193 100 252 -10
6183a0l56M58K99l45K52m13n40K09J47P16K74m03J14j62l76l81L83l2N50k81l11
$$ -10 -366 92 391 46 298 -115 -655 -446 -299 417 691 288 402 240 -136 -517 -134 -166 384 103 -208
6204b08n66P64L42q36K08O99n36qK74j08j29N13k27l82K41J81j93n5k99M54n94
$$ -208 -774 -10 332 -504 -296 403 -133 -141 133 25 -104 409 182 -200 41 222 29 -26 -325 129 -465
6225d65M98l01L3J21L44o16J19J02n9J22J29J91L4k74k50L87n0k85J79j86L14
$$ -465 33 -268 -235 -114 230 -386 -267 -165 -224 -102 27 218 252 -22 -272 115 65 -220 -41 -227 87
6246H7j78k8j30O9k06J02J58J00j12M73l71j26L59m83L01L16n82M72p7j21R19
$$ 87 -91 -119 -249 -180 -386 -284 -126 -26 -138 335 -36 -162 197 -286 15 331 -251 221 144 23 942
6267I42p15k22l06M08n35N40J78j80k01J0r3P19q54J02N3M95K6l07k65k48L69
$$ 942 227 5 -301 107 -428 112 290 110 -91 -81 -174 545 -309 -207 -154 341 367 60 -205 -453 -84
6288h4L24L6J42k11Q0l53p21P84j60r9J17N2K33k97K02n2l35P55o75J77L40K08
$$ -84 240 276 418 207 287 -66 -787 -3 -163 -262 -145 -93 140 -157 45 -7 -342 413 -262 -85 255 463
6310D63q8n10K8j7N00m87oJ6J78m15j37O43k15O1L22m87L63m67m4o1M36L63o39
$$ 463 375 -135 -107 -124 376 -111 -117 -101 77 -338 -475 168 -47 14 336 -151 212 -255 -299 -360 76 439 -200
6333b00j54L87K81J71n44n77R42K94m14m48j9k92J79J57J17K26o56P04l0j62J48
$$ -200 -354 33 314 485 -59 -636 306 600 186 -262 -281 -573 -394 -237 -120 106 -550 154 124 -38 110
6354A10l31lL18j19l91K23J85J71K05k71k91N3L70P4k70k5j48M00Rl49k60J76
$$ 110 -221 -224 94 -25 -416 -193 -8 163 368 97 -194 -141 229 303 33 8 -140 260 269 -80 -340 -164
6376a64L2L59l57M24k70M8kJ15l69O17p51qP6K11p2J06J62m8M11l32n11N6N75
$$ -164 -132 227 -130 294 24 72 70 185 -184 433 -318 -326 -250 -39 -111 -5 157 109 520 188 -323 -267 308
6399C08r9J57k73J68l87l5K40p2M1J36k59K0K54o84N08K77n71N64n12J92j4M6
$$ 308 209 366 93 261 -126 -161 79 7 48 184 -75 -55 199 -485 23 300 -271 293 -219 -27 -41 5
6421Ej86M43o4p14L14K59k09K63J14m57J43J41r8L0N20l45m9j68J65l27l65J96
$$ 5 -181 262 198 -516 -202 57 -152 111 225 -232 -89 52 -46 -16 504 159 110 -58 107 -220 -585 -389
6443c89Q97o79Q01l17j97L05l45j6o7p3L3n2m35L63J96k01nL16k90M37m00n6L68
$$ -389 508 -171 630 313 116 421 76 60 -7 -80 -47 -99 -534 -171 25 -176 -181 135 -155 282 -118 -174 194
6466A94k70J92J20k5j87K6k20J77l5M5O9J45p68P15l9Q2j94L00k92j67L1J58L99
$$ 194 -76 116 236 211 24 50 -170 7 -28 17 86 231 -537 178 139 221 27 327 35 -132 -101 57 456
6489D56j4l44k22l39N18l26K34J8L8n74Q66L3j20O2m52J31j11N22n86K46j46M77
$$ 456 442 98 -124 -463 55 -271 -37 -19 19 -555 311 344 224 286 -166 -35 -146 376 -210 36 -110 367
6511C67l93j00M59n23K0J37k98J09O05o55M41k75P8j65L25m6L9m62L61M5r4k0
$$ 367 -26 -126 333 -190 -170 -33 -331 -222 383 -272 169 -106 -28 -193 132 86 125 -337 24 69 -25 -45
6533d5l3N65p83L91k05J50J28m06M08k84k99M93k55m3N38j27j81K88k25k06M68
$$ -45 -78 487 -296 95 -110 40 168 -238 170 -114 -413 80 -175 -218 320 193 12 300 75 -131 337
6554C37p32Q02m42nJ9L64J21n02L53p18J37j23K62l39N23M2m99N23J22J79p72
$$ 337 -395 407 -35 -40 -21 343 464 -38 315 -403 -266 -389 -127 -466 57 99 -400 123 245 424 -348
6575c48J54l06M03k0J26l11M49k02kR0j86P2K4K39k81K79K43o65j04M86j27j27
$$ -348 -194 -500 -97 -117 9 -302 147 -55 -57 33 -153 -81 -57 182 -99 180 423 -242 -346 140 13 -114
6597a14J09P3QJ22l73J96j84M48r7l49J79j11J41L78q69N08r2l27k01O73m11L40
$$ -114 -5 68 76 198 -175 21 -163 285 188 -161 18 -93 48 426 -443 65 -27 -354 -555 118 -293 47
6619D7k7k77P03n79j44k8J80M8K61o8l28j6K71j49J45o26Q22M4L2q8l75J87J20
$$ 47 20 -257 446 -133 -277 -305 -125 -77 184 116 -212 -228 43 -106 39 -587 235 279 311 223 -152 35 155
6642A55K16k22j05j18L75l78K80m67k17R07n24O2K47l96K57J28l82K23m5o23N52
$$ 155 371 149 44 -74 301 -77 203 -264 -481 426 -98 -36 211 -185 72 200 -182 41 -4 -627 -75
6663g5K34P4l08N97q04j96M19l90k9R1N31o92L77K15p5M85m55j18N2n35N58J26
$$ -75 159 233 -75 522 -282 -478 -59 -449 -478 -387 144 -548 -171 44 -31 454 -1 -119 -67 -602 -44 82
6685H2m8k38J17Q3q6L27l42O12m51k83K15J09K17J30p5o17K28J20M5m73P92o20
$$ 82 34 -204 -87 -4 -90 237 -105 507 56 -227 -12 97 314 444 369 -248 -20 100 145 -328 464 -156
6707a56L48p81R88m13l96N03j12J98k35M39n82l12N9O01Q1n16M22Q0l50j55j21
$$ -156 192 -589 399 -14 -410 93 -19 179 -56 383 -199 -511 -452 149 230 -286 136 216 -134 -289 -410
6728d10Q7N42o59N62J39j24j9L65m56J8L05o52L77k91l7M77j91k41M2j33N09l26
$$ -410 -323 219 -440 122 261 137 118 483 27 45 350 -302 75 -216 -253 224 33 -208 -166 -299 210 -116
6750a16J43K39J69K4p00Q9P6K08r6o0J77n45M41l94N27NJ53m4n95M97m37K39k02
$$ -116 27 266 435 459 -241 -152 -76 132 36 -24 153 -392 49 -345 182 187 340 296 -299 198 -239 0 -202
6773b02K69j45p3j26L13m01l68J006m80J3J03L81J5q22L28L25P6m89L05L2j24
$$ -202 67 -78 -151 -277 36 -365 -733 273 -207 -194 -91 290 305 -517 -189 136 212 -277 28 60 -64
6794f4K09j84L40j97j63l92P67m87N44n11R3k82L42m2L78n29K79J56l94K41l48
$$ -64 145 -39 301 104 -59 -451 316 -171 373 -138 -45 -327 15 -27 351 -178 101 257 -137 104 -244
6815b44M15j13J11o16K56P2M62m20j43K28j28P3J8K87l78N70M4n67j04j7K74n7
$$ -244 171 58 169 -447 -191 -119 343 -77 -220 8 -120 -47 -29 258 -120 450 494 -73 -177 -194 80 23
6837B3j73K76o0m81P74K25o7n13j23K69m53J8J73J38J33j74J92k36l8J27n2n35
$$ 23 -150 126 66 -415 359 584 517 4 -119 150 -303 -285 -112 26 159 -15 177 -59 -97 30 -22 -557
6859e57R3O05J0j84L8k89L60m29L4R8j55M64Nj24j84R8J81j61K07j2j0N5k07Q3
$$ -557 -464 141 151 -33 5 -284 76 -353 -319 -221 -376 88 93 -31 -215 -117 64 -97 110 98 88 143 -64 19
6883A9K43m36K97j49k83K96R6O8m97K20P54q51J62N66o95M23j61N7K01m91L49
$$ 19 262 -174 123 -26 -309 -13 83 151 -346 -126 628 -223 -61 505 -190 233 72 129 330 -161 188
6904A88o84O27J0k43J79l70J73n2K16j38o44K45Q67n01k54N0K66k2L44m5n77R7
$$ 188 -496 131 141 -102 77 -293 -120 -172 44 -94 -738 -493 374 -127 -381 -331 -65 -87 257 212 -365 -268
6926b68L24l47M70j25l93L65l10N30p65L14p2l67O13K34Q0K09r77N41o57L48J50
$$ -268 56 -291 179 54 -339 26 -284 246 -519 -205 -277 -644 -31 203 283 492 -485 56 -601 -253 -103
6947a03o12Q78J39j28J12o70N37k58R0N49o64J97J77r4P0K69n77K98M64m05l74
$$ -103 -715 163 302 174 286 -384 153 -105 -15 534 -130 67 244 150 220 489 -88 210 674 269 -105
6968a05k42J12M10n61N03k41K6J29r3L54p62O24m49J20M68n34L94k03l15O37k70
$$ -105 -347 -235 175 -386 117 -124 -98 31 -62 292 -470 154 -295 -175 293 -241 153 -50 -365 272 2
6989Bm42L80O08j48n89RJ07p8K55j87l15R48p61R7K07K80o9l09J29k95N29o46
$$ 2 -440 -60 548 400 -189 -180 -73 -151 104 -83 -398 550 -211 -114 93 373 304 -5 124 -171 358 -288
7011b88M81j20J35l80m4L79k6K78j56k72J5l75M92m59r8J79L37n31K1P74n46k3
$$ -288 193 73 208 -172 -216 163 137 415 259 -13 2 -373 119 -340 -438 -259 78 -453 -432 342 -204 -227
7033b27k37J049o22M57m99Jl38P73n53J67jn9j56L89k37J09j35O4k75Q20k89k67
$$ -227 -464 585 -37 420 -79 -78 -416 357 -196 -29 -30 -89 -245 144 -93 16 -119 -55 -330 490 201 -66
7055f6k79k01J83K03K84K44m78P59n45k93L42j87N4l64M20k31J73j39K19l02J21
$$ -66 -345 -546 -363 -160 124 368 -110 649 104 -189 153 -34 20 -344 76 -155 18 -121 98 -204 -83
7076h3J93l13K43l6J60R2l2m78L80J3O0Lp7L60k41O8j46J54O9l70n6k61M89o8
$$ -83 110 -203 40 4 164 256 224 -254 126 139 199 202 125 485 244 312 166 320 389 19 -37 -298 191 123
7100A23K12n25K03k88p2K83j18K27l23L95k0k24L40J07k01k13k0K81k73L35k10
$$ 123 335 -190 13 -275 -347 -64 -182 45 -278 117 97 -127 213 320 119 -94 -114 167 -106 229 19
7121A9k98L1r1K17J02K6k43R8M64l95L28J64k23l1J32j81k27j97M14j40l3L48
$$ 19 -279 -248 -339 -122 -20 6 -237 -139 325 -70 258 422 199 168 300 119 -108 -305 109 -31 -64 284
7143B84m76K79J68j71k61j10J86K53j07n4q4K38l90k43N64J99k40l71M04k02Q1
$$ 284 -192 87 255 84 -177 -287 -101 152 45 -9 -93 145 -245 -488 76 275 35 -336 68 -134 -53
7164e3J36k90O71p55K46R0l66K96K5J03j33n1q3n9l1M97j06j12K16p30M96M5l27
$$ -53 83 -207 464 -291 -45 45 -321 -25 0 103 -30 -81 -164 -223 -254 243 137 25 241 -489 7 52 -275
7187b75n2L45k28J67O0j45l73P57j54l73K64N3L20n80K80j73L05m51J90K75m05
$$ -275 -327 18 -210 -43 17 -128 -501 256 102 -271 -7 46 366 -214 66 -107 198 -253 -63 212 -193
7208a93N07j12J95m88O1j43K59j18K03m68K63R9m51O84j68m56L55J00L32n55K27
$$ -193 314 202 397 -91 -30 -173 86 -32 171 -297 -34 65 -386 298 130 -326 29 129 461 -94 133
7229A33j21l4K09k37J48L91k63M5o12J01J23K07m60O02k18j18J70K33J91o22J1
$$ 133 12 -22 187 -50 98 489 226 271 -341 -240 -117 90 -370 232 14 -104 66 299 490 -132 -121
7250a21j12L82j21K94l56Nnk73k70N00P6J77j32r9J08J8M74m16l25J72k29L24
$$ -121 -233 149 28 322 -34 -29 -34 -307 -577 -77 -1 176 44 -55 53 71 545 129 -196 -24 -253 71
7272G1k99K29K50l07K64r5j81o7j30J48N1m08N99j88J45p29P94m02j09P5l10K82
$$ 71 -228 1 251 -56 208 113 -68 -135 -265 -117 -66 -474 125 -63 82 -647 147 -255 -364 -289 -599 -317
7294c17M07j12Q6L06m30K03m25M02k11K27r0K06Q5o81p3N71l82N77k73%L12m13
$$ -317 90 -22 64 370 -60 143 -282 120 -91 136 46 252 337 -344 -417 154 -228 349 76 76 388 -25
7316b5K05r5j20L9K44n48N34l25R2Q9p55O42K09m97O43l9O6j7k41J85j98j52P5
$$ -25 180 85 -35 4 248 -300 234 -91 1 90 -665 -23 186 -311 332 293 359 342 101 286 88 -64 11
7339A1K0J13k95K64K8J72oP0m93J46k35J05N20j148J026l90k8r3L17l69M63m19
$$ 11 31 144 -151 113 141 313 307 377 -116 30 -205 -100 420 -728 298 -92 -120 -213 104 -265 198 -221
7361b21L86j00L13j78l79L82m01M20m94J20L8L49o93M70m94J54K2N8N15j69j14
$$ -221 165 65 378 200 -179 203 -198 222 -272 -152 -114 235 -458 12 -482 -328 -306 -248 267 98 -16
7382a6j42J97n3OL96p26Q31k69l89j26MK28j04j69J92j43L27K07l55J67j57j95
$$ -16 -158 39 -14 -8 388 -338 493 224 -165 -291 -287 -59 -163 -332 -140 -283 44 251 -104 63 -94 -289
7404b89k8L12j86J80k66j35k23J152o68nj5k47M35N88r60L34r5r2L81J9P4m10
$$ -289 -317 -5 -191 -11 -277 -412 -635 517 -151 -156 -171 -418 17 605 -355 -21 -116 -208 173 192 266 -144
7426a44j4K88J40k85J3o3p1K44n93O90J61m53K49l58L79l90l72N70j7J66k45J06
$$ -144 -158 130 270 -15 -2 -65 -136 108 -485 205 366 -87 162 -196 183 -207 -579 -9 -26 140 -105 1
7448AJ1m9M56l40R7p99O86k7n44L02n30N94k29O44l0k14m34M83m39L33J31l33
$$ 1 12 -37 419 79 176 -623 63 36 -508 -206 -736 -142 -371 273 243 29 -405 78 -361 -28 103 -230
7470b30N14k31J4r5n0l2K75j77M48q61K91L20J31k1m76k03K57K62K83n25k56Q8
$$ -230 284 53 67 -28 -78 -110 165 -12 436 -425 -134 186 317 296 -180 -383 -126 136 419 -106 -362 -274
7492b74K81L08k70R9q2j98l50O7Q68o83J77J28l43k3M26J46r1n9j84J44J38n05
$$ -274 7 315 45 144 62 -136 -486 -419 449 -234 -57 71 -272 -295 131 277 186 127 -57 87 225 -280
7514b80lK15M25j64m02M07Q3m52L54k81L93k09l15M70J07m05L69o76J96k06O09
$$ -280 -283 -68 357 193 -209 198 281 -171 183 -98 295 86 -229 241 348 -57 312 -364 -168 -374 235
7535B35j22%L18k12m69N94l10K10o9l36J66L66m57J32j10j5J6j85L20m53L47K69
$$ 235 113 113 431 219 -250 344 34 244 175 -161 5 371 -86 46 -64 -79 -63 -248 72 -381 -34 235
7557B35j84l69K87K28l63n2j3K81r6j21l45N05J97j80L03l40O06j104O11j00K66
$$ 235 51 -318 -31 197 -166 -218 -231 50 -46 -167 -512 -7 190 10 313 -27 579 -525 86 -14 252
7578B52n10K31n1O92l31m7j50j24j05l1m8J64k64N83n81N98n25M19q9k74j94L39
$$ 252 -258 -27 -78 614 283 236 86 -38 -143 -174 -222 -58 -322 261 -320 278 -247 172 83 -191 -385 -46
7600d6O8n93O30M2r2o3k93L29J14n26M72K19k53k95O37k48o04N49P1l65P8N34
$$ -46 22 -571 59 101 9 -54 -347 -18 96 -430 42 261 8 -287 350 102 -502 47 118 -247 -169 365
7622C65l49J33j95K99n30J31M19m71J37K50o34N99k86L6J40K02k66j77L3O53P4
$$ 365 16 149 -46 253 -277 -146 273 -198 -61 189 -445 154 -132 -96 44 246 -20 -197 -164 489 563
7643E63n73k01K27N46m40n01L73J15l24L28j1n41M51N6N2K34m48j76L59j64j79
$$ 563 -10 -211 16 562 122 -379 -6 109 -215 113 102 -439 12 68 120 354 -94 -270 89 -75 -254
7664b54M55o89M02L8j88q6p7O96n28KkL43j36K65n94L65M8K04q9m05J19j99L38
$$ -254 201 -488 -86 -48 -236 -322 -399 297 -231 -229 -231 112 -24 241 -353 12 60 264 175 -230 -111 -310 28
7687B8j90K89k99M45j51Q0l12O82p12K67N36p73J09K09l76M50Q7q21M12j64L87
$$ 28 -162 127 -172 273 122 202 -110 572 -140 127 663 -110 -1 208 -168 282 369 -452 -40 -204 183
7708A83J16k21k97K49J28j2n61K71j56Q19n67j97j0J6K83L8J04j10K93l67k14
$$ 183 299 78 -219 30 158 146 -415 -144 -300 519 -48 -245 -255 -239 44 82 186 76 369 2 -212
7729b12J30J8j41O59m1k53j2l07L68j27K8J9p0K07j16M93n56m62K77o2K88k47
$$ -212 -82 -64 -205 454 413 160 148 -159 209 82 110 129 59 266 150 643 87 -375 -98 -160 128 -119
7751a19K34l35K36l63M00k5k80K23k23O62j033O55p8K13j95M47o53L51m12M45
$$ -119 115 -220 16 -347 53 28 -252 -29 -252 410 -623 32 -46 167 -28 419 -234 117 -295 150
7771A50l42k90J60K54O7J65k29K28J48n30K97j56J9J24k27L00l34j68J010q20
$$ 150 -192 -482 -322 -68 -1 164 -65 163 311 -219 78 -78 -59 65 -162 138 -196 -364 646 -174
7791a74J56l7k04N04M0Rn80P51n94j3K62J72k36n38R55k42m75L05J27l9j49l84
$$ -174 -18 -55 -259 245 285 294 -286 465 -129 -142 120 292 56 -482 473 231 -244 61 188 149 0 -384
7813c84M61j35J69j36Q6L33o92M88j3m96L80Nm6m13L81j61l96K62j31N51kl40
$$ -384 77 -58 111 -25 61 394 -298 190 177 -319 61 66 20 -393 -12 -173 -569 -307 -438 113 111 -229
7835b29K91J96K80r55L50J65P5L2k37o7J74K20k66K53J11k30j91m35O06m19J55
$$ -229 62 258 538 -417 -67 98 173 205 -32 -99 75 295 29 282 393 163 -28 -463 143 -276 -121
7856a21L1n4K46k83J23q8J14k48j23P0N10l67k11N14k48J7m43R93o03R5o0k69
$$ -121 -90 -144 102 -181 -58 -146 -32 -280 -403 -333 177 -190 -401 113 -135 -118 -561 432 -171 -76 -136 -405
7878d05L18J93J43o50P57J8n07K99k98j99P6M64p09L29MK38l4L88k13m55N08j99
$$ -405 -87 106 249 -401 356 374 -133 166 -132 -331 -255 209 -500 -171 -167 71 37 425 212 -243 265 66
7900F6Q0l30M24j98j92M28l79K04l20K14P8l19K67J85n05M29R4l75j78N28n62
$$ 66 146 -184 240 42 -150 278 -101 103 -217 -3 75 -244 23 208 -297 132 226 -149 -327 201 -361
7921c61L49L09k64o70M74L51p25L47M14k16Q7k08j07M76q9j3l55L95j18P80r56
$$ -361 -12 297 33 -637 -163 188 -537 -190 224 8 95 -113 -220 256 167 154 -201 194 76 856 -100
7942a00N39j46j13J27o33O23k48j64N90l5l71Q2l10OJ74j44K75J75m47O96j57
$$ -100 439 293 180 307 -326 297 49 -115 475 440 69 151 -159 -153 21 -123 152 327 -120 576 419
7963D19o71P6m9L05P6l15Kl90Q29k78l48L33J46p7l73M76k55L19j78J47l4l81
$$ 419 -252 -176 -225 80 156 -159 -157 -547 282 4 -344 -11 135 58 -315 161 -94 225 47 194 160 -221
7985b21L06J80K85p18n2M85l94p3N36P0p75M54O9J38k78j3j51L7q0rL4k28K51
$$ -221 85 265 550 -168 -220 265 -129 -202 334 404 -371 83 152 290 12 -1 -152 -115 -195 -204 -170 -398 -147
8008a47j76N58P3p43N59J96q03K55K65k79L23m00O25o2l09L58l96J34n33O45k60
$$ -147 -323 235 308 -435 124 320 -483 -228 37 -242 81 -319 306 244 -65 293 -103 31 -502 143 -117
8029a17Q0j54N9L13o37M39J59l86j31O03l33L38j89Q3m19L22Q4l29J12oJ60k34
$$ -117 -37 -191 -132 181 -456 -17 142 -244 -375 228 -105 233 44 127 -292 30 114 -215 -103 -109 51 -183
8051a83M66L5R6l42J74n87o5L57K79m26J01j97O28k55L01k01l31j49K35j05k33
$$ -183 283 318 414 72 246 -341 -406 -49 230 -196 -95 -292 336 81 382 181 -150 -299 -64 -169 -402
8072d02N44r6m73N20K46q50J8M37L62k34r5J58M96p53j41M71L5l76Q5l55j9M36
$$ -402 142 46 -427 93 339 -511 -493 -56 306 72 -23 135 631 -122 -263 208 243 -133 -48 -403 -422 14
8094A4O3M41j30n03L01l05J07Q7o15Q65l48j84M08j59N9J72k46k1k52P89j266
$$ 14 77 518 388 -115 186 -119 -12 75 -540 325 -23 -207 201 42 101 273 27 6 -246 543 -723
8115g23O03m5K2K24k6n34M75l0j85K26r2J00k8l9J59l77j01M17l99J07K16K03
$$ -723 -120 -165 -143 81 55 -479 -4 -34 -219 7 -85 15 -13 -52 107 -270 -371 46 -353 -246 -30 173
8137A73n80J04J84J28l09O05N09n37m52M73r2l25N45n29j1r4P67q27J47K47n82
$$ 173 -407 -303 -119 9 -300 305 814 277 -175 298 206 -119 426 -103 -114 -208 559 -268 -121 126 -456
8158d56J25P71p50J37n0J60L43k87N8j02L0O9Om05M21m34O7M3nO34k18n37P74
$$ -456 -331 440 -310 -173 -223 -63 280 -7 51 -51 -21 48 54 -351 70 -364 -297 -254 -259 375 157 -380 394
8181C94m74j93l34N40J69l07J94n30P39k77
$$ 394 -80 -273 -607 -67 102 -205 -11 -541 198 -79
8191g9
$$ Imaginary data points
##PAGE= N=2
##DATA TABLE= (X++(I..I)), XYDATA
0@%%%%%%%%%%%%%O4j28J28j28J28j92K56l01L65m47N11n76P04q32R60j088J218
$$ 0 0 0 0 0 0 0 0 0 0 0 0 0 0 64 -64 64 -64 64 -128 128 -173 192 -255 256 -320 384 -448 512 -576 642
30F42j402J599j801K052k320K627k956L305l697M130m602N116n680O294o962P692
$$ 642 -760 839 -962 1090 -1230 1397 -1559 1746 -1951 2179 -2423 2693 -2987 3307 -3655 4037
46D037q493R368j0327J1380j2535J3810j5223J6790j8546K0523k2765K5331k8304
$$ 4037 -4456 4912 -5415 5965 -6570 7240 -7983 8807 -9739 10784 -11981 13350 -14954
59a4954L1801l5981M1073m7445N5701o6853Q2846j07844J52769k58468R44166
$$ -14954 16847 -19134 21939 -25506 30195 -36658 46188 -61656 91113 -167355 776811
70G76811P86010j602747l45476M05321K55126k87887Q1975M1807k86901m03562
$$ 776811 1562821 -39926 -385402 19919 275045 -12842 69133 110940 -175961 -579523
80e79523L15672N73715n4191n93438M6747M53516m3059m09415j6357J21937L8411
$$ -579523 -263851 309864 255673 -337765 -291018 162498 119439 -289976 -306333 -184396 -145985
91a45985J39306J42758k12164k53886Q0859K94238R6838j40145r5518O3767q8194
$$ -145985 -6679 136079 -76085 -329971 -249112 45126 141964 1819 -93699 -29932 -118126
102a18126j53508J90170K58227k16924k25827K53931J36157l73861j55548M20665
$$ -118126 -271634 -81464 176763 -40161 -265988 -12057 124100 -249761 -405309 15356
112A5356K98014k84207l53414J04646K62415o6151r8470K67031J30534l96504
$$ 15356 313370 29163 -324251 -219605 42810 -23341 -121811 145220 275754 -120750
122a20750k10242L93331K61586k38593j37734J88992O1549j93063q6318J72419
$$ -120750 -330992 62339 323925 85332 -52402 136590 198139 5076 -81242 91177
132I1177J54172q7040j20532L2808k9635j25167R6538K03896q6091j99679J9304
$$ 91177 245349 158309 37777 70585 40950 -84217 12321 216217 130126 -69553 -50249
143e0249M9357o1080M2050J14903n5319j38521J7140J21860j4660j48412K5348
$$ -50249 -892 -61972 -19922 94981 39662 -98859 -81719 40141 25481 -122931 -97583
154i7583K37002K0170k63211m3575K13325l887j39893J30224J65210j79748k41313
$$ -97583 139419 159589 -103622 -147197 66128 62241 -77652 52572 217782 38034 -203279
165b03279R7386K51083J0234j86945k9462J25180o3762j74306J08000K24049q3991
$$ -203279 -105893 145190 155424 -31521 -60983 64197 435 -173871 -65871 158178 74187
176G4187j95633L5069P7116o2358O85J21460L3308j10917q6661N4007R7323l420
$$ 74187 -121446 -86377 -9261 -71619 -70934 50526 83834 -27083 -113744 -59737 37586 34166
188C4166k7664M7173j0421r2153L8265J07471o6812q4667J13547Q1537j28219
$$ 34166 6502 53675 43254 -48899 -10634 96837 30025 -54642 58905 140442 12223
199A2223r9429O9803O5571l5652k5508N7060J470j52531p4198J85125J32853j58215
$$ 12223 -87206 -17403 48168 12516 -12992 44068 45538 -106993 -181191 3934 136787 -21428
211b1428j26509J05727M7692j01704J0602J27964P658j09734l3452Q2862M4863
$$ -21428 -147937 -42210 5482 -96222 -85620 42344 50002 -59732 -93184 -10322 34541
222C4541o5339j2482J11763J9870j30057k6351J01449J0919l9041M6996J3550
$$ 34541 -30798 -43280 68483 88353 -41704 -68055 33394 44313 5272 52268 65818
233F5818q9827l8202O5979M9787k1342l8918J640J3871l8534j8655P3001K7674
$$ 65818 -24009 -62211 3768 53555 32213 -6705 -5065 8806 -29728 -48383 24618 52292
245E2292q0771k779Q1698l3536q6430N5396R9861k4154o8384M678L6322r124k9059
$$ 52292 -28479 -31258 50440 16904 -69526 -14130 85731 61577 -6807 -2129 34193 25069 -3990
258c990M3364P0054n3434j11139L7199R9462l7337o4828M5518K4764o7235k9952
$$ -3990 39374 109428 55994 -55145 -17946 81516 44179 -20649 24869 49633 -17602 -47554
270d7554M0782K1536k5389k0665J9679J2159n1595l3354O6998M6324n3235k3390
$$ -47554 -6772 14764 -10625 -31290 -11611 548 -51047 -84401 -17403 28921 -24314 -47704
282d7704L5287j9617k6333N5194M1774m0299l4561J9321K4584k223j5943J3249
$$ -47704 -12417 -32034 -58367 -3173 38601 -1698 -36259 -16938 7646 5423 -10520 2729
294B729L1025k4770m1614L2474K8704n0209r559O6981j706p3412j1991M5647J8013
$$ 2729 33754 8984 -32630 -156 28548 -21661 -31220 35761 34055 -39357 -51348 -5701 12312
307A2312j3437r800N744k31k6338K394N7209J0691n8439j239N1576p446k9331
$$ 12312 -1125 -10925 -5181 -5412 -31750 -29356 27853 38544 -19895 -21134 30442 22996 -6335
320f335K3615K0475j6051k784J0667k721j3692q005J8680K8709k1512m7332Q843
$$ -6335 17280 37755 21704 18920 29587 26866 13174 5169 23849 52558 31046 -16286 -7443
333g443K6585j5100r06K2954k7339m0364J9614L2619o322j9810q602N816J3425
$$ -7443 19142 4042 3136 26090 -1249 -41613 -21999 10620 4298 -15512 -24114 -18298 -4873
346d873o006p601J6472k102k0853K2098K7964l1880k7736L0419K3794r687p584
$$ -4873 -10879 -18480 -2008 -4110 -24963 -2865 25099 -6781 -34517 -4098 19696 10009 2425
359B425q797r241Q204J0348N010J009k3372k1147K5724K2229k4171j1986J4730
$$ 2425 -6372 -15613 -7409 2939 7949 8958 -14414 -35561 -9837 12392 -11779 -23765 -9035
372i035o186p997J7006J718j3617J527J0914P036N250j2032r011K2326J4651j3148
$$ -9035 -15221 -23218 -6212 -4494 -18111 -16584 -5670 1366 6616 -5416 -14427 7899 22550 9402
386I402J504Q344j3574J604K3356k111j6404K208K031k150N170m592p928P101
$$ 9402 10906 19250 5676 7280 30636 28525 12121 14329 16360 14210 19380 14788 6860 13961
400A3961k192j3809P063O337j5817K20J3198q722q388R158j177l398P266k775
$$ 13961 11769 -2040 5023 11360 -4457 -4237 8961 239 -8149 1009 -168 -3566 3700 925
414I25n340Q986k07r681Q805O815j0713J819O869r809k866R114l899n742K376
$$ 925 -4415 4571 4364 -5317 3488 10303 -410 1409 8278 -1531 -4397 4717 818 -4924 -2548
429b548p473l687J1692m671j4578O556M613r912L291O808j0601r32J0185k05n69
$$ -2548 -10021 -13708 -2016 -6687 -21265 -14709 -10096 -20008 -16717 -9909 -20510 -21442 -11257 -11462 -12031
444a2031K357n546M474J5257n399q208J2100L303r051R947Q890j2571m109J0473
$$ -12031 -9674 -15220 -10746 4511 -888 -9096 3004 6307 -2744 7203 16093 3522 -587 9886
458I886L416j665m052q803M879J0820q644o135P684o518q966J5494O137j8979
$$ 9886 13302 11637 7585 -1218 3661 14481 5837 -298 7386 868 -8098 7396 13533 -5446
472e446l004J2646J729l448j492j698M195M715m780L937N499j3174l366K1427
$$ -5446 -8450 4196 5925 2477 985 -713 3482 8197 3417 7354 12853 -321 -3687 17740
486A7740O90j9828J382J0782n371l040M202k698o835j219R95P364k701j6727K994
$$ 17740 18430 -1398 -16 10766 5395 2355 6557 3859 -2976 -4195 -3200 4164 1463 -15264 -12270
501a2270J8385q430j5983J1808P073j2130J425J2082m459p153K780Q098N967n967
$$ -12270 6115 -2315 -18298 -6490 583 -11547 -10122 1960 -2499 -9652 -6872 1226 7193 1226
515A226q814R399J0444j1753k942J6065n248j6350J1495J3002j3349j0970Q373
$$ 1226 -7588 1811 12255 502 -2440 13625 8377 -7973 3522 16524 3175 -7795 578
528E78O071l502p554j302O773j587j0509O683J1525j5630j0533J9272P476j7572
$$ 578 6649 3147 -4407 -5709 1064 -523 -11032 -4349 7176 -8454 -18987 285 7761 -9811
542i811j643J3599j660p582M231O361j048q103r34J4641K329k0493o3K0803m820
$$ -9811 -11454 2145 485 -7097 -2866 3495 2447 -5656 -6590 8051 10380 -10113 -10176 10627 5807
557E807j7552Q680J0161j2890m432J2204K160j1262n072Q481J0653p823j3773
$$ 5807 -11745 -3065 7096 -5794 -10226 1978 4138 -7124 -12196 -3715 6938 -885 -14658
570a4658J0429J3600j2432n856J7086M22j7228O807J8663n413j3402L255J1664
$$ -14658 -4229 9371 -3061 -8917 8169 8591 -8637 -1830 16833 11420 -1982 1273 12937
583A2937J879r228l768J1144N43j3166N446J3946j4308j5083J7353J2156j8368
$$ 12937 14816 5588 1820 12964 13507 341 5787 19733 5425 -9658 7695 19851 1483
596A483j0106J0407N191o874m046M256L107q511n320J3989N077j9201l463K2225
$$ 1483 -8623 1784 6975 101 -3945 311 3418 -5093 -10413 3576 8653 -10548 -14011 8214
610H214n07j9069K273J3811n062o883O813M365q440q231P255J4571o780j9929
$$ 8214 7707 -11362 -9089 4722 -340 -7223 -410 3955 -4485 -12716 -5461 9110 2330 -17599
624a7599P286J7234j1110j2295J3161N615j4525L1J3367k511j2661J086J4873
$$ -17599 -10313 6921 -4189 -16484 -3323 2292 -12233 -12202 1165 -1346 -14007 -12921 1952
637A952N607j4153q643J4435Q528j1223O80J5238q932j4724J3836J5793j1338
$$ 1952 7559 -6594 -15237 -802 7726 -3497 -2817 12421 3489 -11235 2601 18394 7056
650G056j2425Q301R398m520q262K792Q674m895q538R800O169j9120o307K3360
$$ 7056 -5369 2932 12330 7810 -452 2340 11014 6119 -2419 7381 13550 -5570 -11877 11483
664A1483M841k0885m472J2710J526p888K323O646k262j0394O36J5368j571j7027
$$ 11483 16324 -4561 -9033 3677 5203 -2685 -362 6284 4022 -6372 -5736 9632 8061 -8966
678h966L787J8307p597j5071P178Q771p646k886J0160k93j3174m951J2001J0586
$$ -8966 -5179 13128 5531 -9540 -2362 6409 -1237 -4123 6037 5744 -7430 -12381 -380 10206
692A0206r908j2626Q116P512j1552j118J5860k779j6100L986J3778m706r224M966
$$ 10206 298 -12328 -4212 3300 -8252 -9370 6490 3711 -12389 -8403 5375 669 -8555 -3589
706c589R748k298j0394J250J1444k055j0581Q268J1452j2247j2160J3525Q326
$$ -3589 6159 3861 -6533 -5283 6161 4106 -6475 1793 13245 998 -11162 2363 10689
719A0689j0529l821Q959L50r431k694Q564O034p885o781Q618K277j2333J701J5585
$$ 10689 160 -3661 5298 5648 -3783 -6477 2087 8121 236 -6545 2073 4350 -7983 -6282 9303
734I303m000j2660L849P995n301m586P280N308n448p842L232Q738m009p553R029
$$ 9303 5303 -7357 -3508 4487 -814 -5400 1880 7188 1740 -6102 -2870 5868 1859 -5694 3335
749C335O508j3593o284J2923M057j0416P56P982l284j0306K601J0037K286j0004
$$ 3335 9843 -3750 -10034 2889 6946 -3470 -2714 5268 1984 -8322 -5721 4316 6602 -3402
763c402l468Q995O77j0884M362J2644n900j0468N796P026o881l299P355M620m866
$$ -3402 -6870 2125 2802 -8082 -3720 8924 3024 -7444 -1648 5378 -1503 -4802 2553 7173 2307
778B307o016K276N338m144k052Q421J251j2721k750J1728J519p316K421L872n875
$$ 2307 -3709 -1433 3905 -239 -2291 6130 7381 -5340 -8090 3638 5157 -2159 262 4134 -1741
793a741n853N926N959j357o595P71P040m200q263P538J0379q507p739O137L764
$$ -1741 -7594 -1668 4291 2934 -3661 -2890 4150 -50 -8313 -775 9604 1097 -6642 -505 3259
808C259o931K80Q103J375p228n266N951N496n181l251P435K093j0469j511Q857
$$ 3259 -3672 -3392 4711 6086 -1142 -6408 -457 5039 -142 -3393 4042 6135 -4334 -5845 3012
823C012j212m517L987L124o471m533M229N982O13n189n87K344l234j929Q239L498
$$ 3012 1800 -2717 1270 4394 -2077 -6610 -2381 3601 4214 -975 -1562 782 -2452 -4381 3858 7356
839G356r766l009Q231k34o237J907O241j068n426n67L356L4m491K854P930m005
$$ 7356 -2410 -5419 2812 2578 -3659 -1752 4489 3421 -2005 -2572 784 818 -3673 -819 7111 3106
855C106j0604J460R700j236m510L199J491o132j601N136M365k408m197Q32L784
$$ 3106 -7498 -6038 3662 2426 -2084 1115 2606 -3526 -5127 9 4374 1966 -2231 -1399 2385
870B385l620k679N989L220n947r07K975j634k922M060M780l979m087R3L097M72
$$ 2385 -1235 -3914 2075 5295 -652 -1559 1416 -218 -3140 920 5700 1721 -2366 -2273 824 1296
886A296j456J363K931m608m825M446N708o039k592O732N12o605r54M475K567j995
$$ 1296 -160 1203 4134 -474 -5299 -853 4855 -1184 -3776 2956 3468 -3137 -4091 384 2951 956
902I56j931J571j13m552j6Q219J450p461j883L909j52j690K714J395l004j386
$$ 956 -975 596 483 -4069 -4085 4134 5584 -1877 -3760 149 -3 -1693 1021 2416 -588 -1974
918a974M4J954K89j922K125K917l572l725K260K735j578J092L529l894m635J841
$$ -1974 -1930 24 313 -1609 516 3433 -139 -3864 -1604 1131 -447 645 4174 280 -4355 -2514
934b514M825P96k917j170O26M54j644J752L631k398m755L590L689m001l113L764
$$ -2514 2311 3107 190 -980 -354 100 -1544 208 3839 1441 -3314 276 3965 -36 -3149 615
950F15K627j901k152k04P08P03r7K117Q27m749k397L358L067j439j283J356k195
$$ 615 3242 1341 -811 -1015 -307 396 299 2416 3243 -1506 -3903 -545 2522 1083 -200 1156 -1039
967a039j061K018J243r52l06m91M36p08j295R48L173j583k720K075N81k919Q70
$$ -1039 -2100 -82 1161 209 -97 -588 -152 -860 -2155 -1207 1966 383 -2337 -262 319 -2600 -1730
984a730L944j057k986J40P94O34k3P4J767o8l356j061M128K49k807J211J210k096
$$ -1730 2214 1157 -1829 -1689 -895 -261 -284 -210 1557 1489 -1867 -2928 1200 1449 -1358 -147 1063 -1033
1002a033l49J164J209m22l19r1P92l01j886R24J989j94j678N50m17j344K150K425
$$ -1033 -1382 -218 991 569 250 159 951 650 -1236 -312 1677 1483 -195 355 -62 -1406 744 3169
1020C169j940k131M26K91O61J163m91p23o36j172R33K399j911k060K546J550k788
$$ 3169 1229 -902 -476 -185 476 1639 1148 425 -211 -1383 -450 1949 38 -2022 524 2074 -714
1037g14j042J039N01O00O44j600q29M0o85K602K076k947k379K129R13m64O41j60
$$ -714 -1756 -717 -216 384 1028 -572 -1401 -1361 -2046 556 2632 -315 -2694 -565 348 -116 525 365
1055C65r55R3O12o37j18Q61p91J352N34j357j300J624N29l32J096j748j832J572
$$ 365 -590 -497 115 -522 -640 221 -570 782 1316 -41 -1341 283 812 480 1576 -172 -2004 -432
1073d32K126j018m73M77r00L44J123j253N96O99p57l56J830j612r49R03J290p26
$$ -432 1694 676 203 680 -220 124 1247 -6 590 1289 532 176 2006 394 -555 348 1638 912
1091I12m41p92k84J467O23j013m13K77j580M82J572n76j176L85j71n85L58K06
$$ 912 471 -321 -605 862 1485 472 59 336 -1244 -762 810 234 -942 -557 -728 -1313 -955 -749
1109g49r05J506J4j703K64N20k77M02J556j585j91Q20j223M25J445k39j432J106
$$ -749 -1654 -148 -134 -1837 -1573 -1053 -1330 -928 628 -957 -1148 -328 -1551 -1126 319 80 -1352 -246
1127b46r9o13J219L54j263M22N60q06l50J980p13p68O60j63n24O34J97J78N26
$$ -246 -345 -958 261 615 -648 -226 334 -472 -822 1158 445 -323 337 174 -350 284 481 659 1185
1146A185m02j649J510Q17j092J72J501r24r27R11k9r02J304n43M4L84j221l34
$$ 1185 783 -866 644 1461 369 541 2042 1118 191 1102 1073 171 1475 932 976 1360 139 -195
1164a95J727j03k017J214l47q28m3J368m95j81J48j302q1J028m80l74J622j378
$$ -195 1532 1429 -588 626 279 -549 -592 776 281 100 248 -1054 -1135 -107 -587 -961 661 -717
1182g17j250J959J98j675Q42J257q95o82O30J10j00P19r87N45L15j239l45K132
$$ -717 -1967 -8 190 -1485 -643 614 -281 -963 -333 -223 -323 396 -591 -46 269 -970 -1315 817
1200H17m90j587M90J307k107L20K136j191k3P5K71j04K47j249J038Q67n97r10
$$ 817 327 -1260 -770 537 -1570 -1250 886 -305 -328 -253 18 -86 161 -1088 -50 817 220 -690
1218f90J923k36j586J202J416j058j208Q32o8m08N01j64J29J68k149J406K028
$$ -690 1233 997 -589 613 2029 971 -237 595 527 119 620 456 585 753 -1396 10 2038
1235B038k149j616K204J60j728L48J269j525p28J721K27o99l02o34J399J570j958
$$ 2038 -111 -1727 477 637 -1091 -743 526 -999 -1727 -6 221 -478 -780 -1414 -15 1555 -403
1252d03k54J844j161j572K713J048l321J50J944N15j256j000L77Q11L82j315M6
$$ -403 -657 1187 26 -1546 1167 2215 -1106 -956 988 1503 247 -753 -376 435 817 -498 -452
1269d52J146k298M48K691p09k722L66K611j402n75J512o85M8L9n3J405r6k407
$$ -452 694 -1604 -1156 1535 826 -1896 -1530 1081 -321 -896 616 -69 -21 18 -35 1370 1274 -1133
1287a133P64L104j752k288K393O45k152rJ956n10j985L98J118O64j164k107J738
$$ -1133 -369 2735 983 -1305 1088 1733 -419 -428 1528 1018 -967 -569 549 1213 49 -2058 -320
1304c20J577k775j45K965j505l137K762J997k536p54J362O14l75l69K40J062k18
$$ -320 1257 -1518 -1663 1302 -203 -3340 -578 1419 -1117 -1871 -509 105 -270 -639 -399 663 445
1321D45j347J094K144k718j924L247P04k798P02J205j256l22N10Q81q30m70j180
$$ 445 -902 192 2336 -382 -2306 941 1645 -1153 -451 754 -502 -824 -314 567 -263 -733 -1913
1338a913K569M99k856M35K543j115j753K540K87k343K03K216L13j161o81N87J645
$$ -1913 656 1155 -1701 -1266 1277 162 -1591 949 1236 -1107 -904 1312 1625 464 -217 370 2015
1355B015q36j042N25K075l263l32L320p50l133J245J549r57j651O06R87p21n94
$$ 2015 1179 137 662 2737 -526 -858 2462 1712 -1421 -176 1373 416 -1235 -629 358 -363 -957
1372i57j96J554o28k852J942L242k638k313L120O19k438K41K039j12j327j79J353
$$ -957 -1153 401 -227 -3079 -1137 2105 -533 -2846 274 893 -1545 -1304 735 623 -704 -883 470
1389D70M76j463j133K360J009l278k05L570j566k484J710K014k728q98J764P41
$$ 470 946 -517 -1650 710 1719 -1559 -1764 1806 240 -2244 -534 1480 -1248 -2146 -382 359
1405C59p49j046R93J888j205j546J405K826l463j089L921J6k750R98J925m79j093
$$ 359 -390 -1436 -443 1445 240 -1306 99 2925 -538 -1627 2294 2310 -440 558 2483 2004 911
1422I11j04J155M7j258q61J786Q18l386M75K593j266k963K362R12k390n70J897
$$ 911 807 1962 2009 751 -110 1676 2494 -892 -417 2176 910 -2053 309 1221 -1169 -1739 158
1439A58J45o60o34M24J300j481k137K570K261l265j733M100m35k206O78J688j527
$$ 158 303 -357 -991 -567 733 -748 -2885 -315 1946 -1319 -3052 1048 613 -1593 -915 773 -754
1456g54j262Q90J246m40j240l84J986m29k517J055K858k247k381L496M09k951
$$ -754 -2016 -1126 120 -320 -1560 -1944 42 -387 -2904 -1849 1009 -1238 -3619 -123 286 -2665
1472b665M73K445k33q82k21P26J884r51j184K441L86k761Q89K641q28k723J996
$$ -2665 -2192 253 20 -862 -1083 -357 1527 576 -608 1833 2219 -542 347 2988 2160 -563 1433
1489A433J863k136n04M66L91oo41m40J334r86j762J644J800k895j358K639K08
$$ 1433 3296 1160 656 1122 1513 1507 866 426 1760 774 -988 656 2456 -439 -1797 842 1050
1506A050j586N30P90l72o63Q1Q30Q35j289j114K102O86k960j43L091j055k157
$$ 1050 -536 -6 784 412 -251 -170 660 1495 206 -908 1194 1880 -1080 -1223 1868 813 -1344
1523a344J790N1k022J5J653M13j381j447n2K290q30j517J333J059k200k84K701
$$ -1344 446 497 -1525 -1510 143 556 -825 -2272 -2324 -34 -864 -2381 -1048 11 -2189 -2473 228
1540B28q31j819J164K107j143j039M51O74J242k03r49Q24j79k189J418L186k858
$$ 228 -603 -2422 -1258 849 -294 -1333 -882 -208 1034 831 -118 706 527 -1662 -244 2942 84
1557H4j807J835J088j869j17Q99n3j17p43N03M63j092q58K281J533l595n29K914
$$ 84 -1723 112 1200 -669 -786 113 60 -57 -800 -297 166 -926 -1784 497 2030 -1565 -2094 820
1575H20n96q42J579k9j326J87N81J99O14p33q16J964j36k456L12K735j398j481
$$ 820 224 -618 961 932 -394 -207 374 573 1187 454 -362 1602 1466 -990 -678 2057 659 -822
1593h22K076j259j435J336J240q20o74l73n0R66P0n01J179N3j635J170J326j372
$$ -822 1254 -5 -1440 -104 1136 316 -358 -731 -781 185 255 -246 933 986 -649 521 1847 475
1611D75p04K049R06k083k19J09J68J041m79q16N17n80j672J797J512k221j453
$$ 475 -229 1820 2726 643 424 533 701 1742 1263 447 964 384 -1288 509 2021 -200 -1653
1628a653K354m69j871L38O90P5J86j309P3O84m63j47J735M16k912q5K584p88j44
$$ -1653 701 232 -1639 -1301 -611 -536 -350 -1659 -1586 -902 -1365 -1512 223 639 -2273 -2358 226 -562 -706
1647g06J011n44j209N61M38k00R6l11l39J231q86j307J361J554j208o72R68q58
$$ -706 305 -239 -1448 -887 -449 -649 -553 -864 -1203 28 -858 -2165 -804 750 -458 -1130 -162 -1020
1665a020r30J293J690j354L25k74R7J529m96j060J948J28j116j98J663j214k25
$$ -1020 -1950 -657 1033 -321 4 -270 -173 1356 860 -200 1748 1876 760 562 2225 1011 786
1682G86J915j77j318p10O09l35J206o06m59L63j242q94J737O10j550k16R73j178
$$ 786 2701 2524 1206 496 1105 770 1976 1370 911 1274 32 -862 875 1485 -65 -281 692 -486
1700d86m69R43L69n05M54m65o82Q59n40L85Q71J83j823Q48J035j828L05J592j528
$$ -486 -955 -12 357 -148 306 -159 -841 18 -522 -137 734 917 -906 -58 977 -851 -546 1046 -482
1719d82o34N97l08k2R83o03p53M95j214n99J544Q52j522J018M24j189k36J705
$$ -482 -1116 -519 -827 -849 134 -469 -1222 -727 -1941 -2540 -996 -144 -1666 -648 -224 -1413 -1649 56
1737E6k1n25J333j164n49Q99K97O5R51P6j935R09Q46j358J085Q72j302o26N48
$$ 56 35 -490 843 -321 -870 29 326 391 1342 1418 -517 392 1238 -120 965 1837 535 -91 457
1756D57j39p59J382o82o01N09q81K46O49M71j249Q72M01j232JJ519m16J85J84
$$ 457 318 -441 941 259 -342 167 -714 -468 181 652 -597 275 676 -556 -555 964 548 733 917
1775I17o98p89J727n20o76J694p53j496M38L55q16R61M94j801O80k06m35P2J382
$$ 917 219 -570 1157 637 -39 1655 902 -594 -156 199 -617 344 838 -963 -283 -489 -924 -852 530
1794E30r16n82K63Q4m86L06J203j147R93l06o43O41J306j482P14Q49j415j00P75
$$ 530 -386 -968 -705 -621 -1107 -801 402 -745 248 -58 -701 -60 1246 -236 478 1327 -88 -188 587
1813E87J06k96N39p14n51N16R9j285J046L68j136J57R6m73J77J681j366m90J017
$$ 587 693 397 936 222 -329 187 286 -999 47 415 -721 -564 -468 -941 -764 917 -449 -939 78
1832G8n64p06J518L66p97L61k83r4M85N64j344J564M99j986n7J133l3j213J906
$$ 78 -486 -1192 326 692 -105 256 -27 -121 364 928 -416 1148 1647 -339 -396 737 704 -509 1397
1851A397j56j775L43j88K48O05k34j139L8M26k58O51O80r32m66Q15p9o77Q80L34
$$ 1397 1241 -534 -191 -379 -131 474 240 -899 -861 -435 -693 -42 638 -294 -760 55 -24 -701 179 513
1871E13p13Q90K49o68k19N15q70J719o86j641L76J387l09j741J395Q7j531L70
$$ 513 -200 690 939 271 52 567 -303 1416 730 -911 -535 852 543 -1198 197 284 -1247 -877
1889h77J078o87J22o63m74R99j65o21N45J395j999O47J321o45j255J038J518p12
$$ -877 201 -486 -364 -1027 -1501 -502 -667 -1288 -743 652 -1347 -700 621 -24 -1279 -241 1277 565
1907E65l51j1m51K90R19p56Q51l48j917R70K031j832o99J380j3j499R91n54n95
$$ 565 214 203 -248 42 961 205 1056 708 -1209 -239 1792 -40 -739 641 628 -871 120 -434 -1029
1926a029O87Q19n93Q28q88j047K423K91j719K64J474j185l64J897k38j206O5O72
$$ -1029 -342 477 -116 712 -176 -1223 1200 1491 -228 36 1510 325 -39 1858 1620 414 479 1151
1944A151L0l41k98o17R87O33k672R49Q74j526r0J255k56j568P27M81p2m3q4p1
$$ 1151 1181 840 542 -75 912 1545 -1127 -178 696 -830 -920 335 79 -1489 -762 -281 -353 -396 -480 -551
1964e51P13o76p58J796R04k618M01J703j080j159J600M15j284Q9J11L88k41n20
$$ -551 162 -514 -1272 524 1428 -1190 -789 914 -166 -1325 275 690 -594 -505 -394 -6 -247 -767
1982g67l58R17l15j480J076N90j313K40J852r50j633J439M12j78l95R38m42N47
$$ -767 -1125 -208 -523 -2003 -927 -337 -1650 -1410 442 -508 -2141 -702 -290 -468 -863 75 -367 180
2000A80J61q42J574m6k143J557J895j554j059J528Q4j648J156L0j00j90n38J36
$$ 180 341 -501 1073 1027 -1116 441 2336 782 -277 1251 1335 -313 843 873 773 583 45 181
2018A81R84o38j201J394K75j575M3K049p28j508J582O9p64M60L68PM93r69k60
$$ 181 1165 527 -674 720 995 -580 -537 1512 784 -724 858 927 163 623 991 998 1491 522 262
2037B62J161N1j788J241Q26k143o32J787j52j311K71M70l84m96j29M41K21m22
$$ 262 1423 1474 -314 927 1753 -390 -1022 765 613 -698 -427 43 -341 -837 -966 -525 -304 -726
2055g26j329J474N33k012K37J824m19j029J164K28l44o49M35M63J43l89n18J125
$$ -726 -2055 -581 -48 -2060 -1823 1 -418 -1447 -283 -55 -399 -1048 -613 -150 -7 -396 -914 211
2073B11Oj816J061J547j787m08J267pj707J270N10r83J28r9j87J411m74m85P66
$$ 211 217 -1599 -538 1009 -778 -1186 81 74 -1633 -363 147 -836 -708 -807 -994 417 -57 -542 224
2092B24O59k049J256J802j754j082J929K44j146L44O92o55P60r85M07R85j073
$$ 224 883 -1166 90 1892 138 -944 985 1229 83 427 1119 464 1224 239 646 1631 558
2109E58j053J783Q43k031p43J852m70j623J408k68l71j86K75J84K04m95p85J506
$$ 558 -495 1288 2131 100 -643 1209 739 -884 524 256 -115 -301 -26 158 362 -133 -918 588
2127E88J98j935J016J035p46m53J461j64j409M94Q62r47N45m05j56N52o57j460
$$ 588 786 -1149 -133 902 156 -297 1164 1000 -409 85 947 0 545 140 -16 536 -121 -1581
2145a581J786K45k399R97K007j138j285O21N23n23M36r51N90L31j75P6Q57M28
$$ -1581 205 450 -1949 -952 1055 -83 -1368 -747 -224 -747 -311 -1262 -672 -341 -516 -440 417 845
2163H45k502J530J251j527k43J366n78o65N85k4J77P0m05L20N81j114o85J527
$$ 845 -1657 -127 1124 -403 -646 720 142 -523 62 38 215 285 -120 200 781 -333 -1018 509
2181E09M54k313M70J586r30q98J747l7q27K74M41m1M09n34K3J220o24j415Q85
$$ 509 963 -1350 -880 706 -224 -1122 625 588 -239 35 476 435 844 310 333 1553 929 -486 399
2200C99J330k572R45J097n99r84J058Q5o50J95m32K04L93j60j793J638O71j694
$$ 399 1729 -843 102 1199 600 -384 674 759 109 304 -128 76 469 309 -1484 154 825 -869
2218h69R28L47r81K8R80J84j381N20l8N62O20p84r62J503q57K83O08N35j547q8
$$ -869 59 406 -575 -547 433 617 -764 -244 -282 280 900 116 -846 657 -200 83 691 1226 -321 -409
2238d09J296p62j007O70k8m54L56K9l37P96j134k6J423kj812Q34J150j007p13
$$ -409 887 125 -882 -212 -240 -694 -338 -309 -646 150 -984 -1010 413 411 -1401 -567 583 -424 -1137
2257a137J829p44k29P88L32m65o09J31p68J769p07j034Q89O62j183M69O37j056
$$ -1137 692 -52 -281 507 839 374 -235 -104 -872 897 190 -844 45 707 -476 -7 630 -426
2275d26n49J446k66p26N41l07o19R40l29q9M96p8q28N50J106r71L53P80q19k83
$$ -426 -975 471 205 -521 20 -287 -906 34 -295 -384 112 34 -794 -244 862 -109 244 1024 205 -78
2295g8P26l0l99pj16J42o0Lj122J540Qr18K39P09k58p58R09q61j49L25K84p21
$$ -78 648 618 219 212 96 238 178 181 -941 599 607 -311 -72 637 379 -379 530 -331 -480 -155 129 -592
2317e92Q01m34J3N62o29l6N71M01j064M51Q17q08j93O57l92l52O10j015M59R44
$$ -592 209 -225 -212 350 -279 -315 256 657 -407 44 861 53 -140 517 125 -227 383 -632 -173 771
2337G71j128p2N18j39j074R24R08j018m10P17m19k58Q06m86Q7N89j69k20P57m53
$$ 771 -357 -429 89 -50 -1124 -200 708 -310 -720 -3 -422 -680 126 -360 -273 316 147 -73 684 231
2357B31j037J357n6o66K63J321j328q4R57j133N08K40o63n6M77k53j70N05L88
$$ 231 -806 551 495 -171 92 1413 85 1 958 -175 333 573 -90 -146 331 78 -92 413 801
2376H01j031N51m2o15k26J507n31n46J15q6n2P19k67m98O67k12p09M12L21q55
$$ 801 -230 321 279 -336 -562 945 414 -132 -17 -103 -155 564 297 -201 466 254 -455 -43 278 -577
2396e77O94N72q59k71J065p13m54M85m77l34Q87n67l80R03k86l58L93j35r5J97
$$ -577 117 689 -170 -441 624 -89 -543 -58 -535 -869 18 -549 -929 -26 -312 -670 -277 -412 -507 -310
2416c10J77l77p8L27K2l73Q41j59j33J111q72l63L48J5n96Q29M87j317O53P88
$$ -310 -133 -510 -588 -261 -239 -612 229 70 -63 1048 176 -187 161 176 -420 409 896 -421 232 1020
2436A020j217L51L47n22o19J640n78q28J310q00l64Q53P1r56P96j96j11M47J9
$$ 1020 -197 154 501 -21 -640 1000 422 -406 904 104 -260 593 664 -292 504 308 197 644 663
2455F63j079N01O68k72k64J53j00n14O38j33o76L01N87j312P65R7o43K96O63j128
$$ 663 -416 85 753 481 217 370 270 -244 394 261 -415 -114 473 -839 -74 23 -620 -324 339 -789
2475g89L06M72o18J45K25n04p6P50L7o12Q78O28j756P51L49r95K42P28r3n9J69
$$ -789 -483 -11 -629 -484 -259 -763 -839 -89 -52 -664 214 842 -914 -163 186 -809 -567 161 68 9 178
2496A78m21k93J431n71p48O31k75k72M71P55j000L01K43n61K80Q28j118l32P79
$$ 178 -243 -536 895 324 -424 207 -68 -340 131 886 -114 187 430 -131 149 977 -141 -473 306
2515C06K99m73J22J44n39L81J75l58L2O46j529P31L17j93n17O25l03m32P13j52
$$ 306 605 132 254 398 -141 240 415 57 89 735 -794 -63 254 61 -456 169 -134 -566 147 -5
2535em02N22N8l55Q2K5p02P15M68r53j23O23j51m12J297n39m96O14l04k09K95
$$ -5 -407 115 173 -182 -100 -75 -777 -62 406 -547 -670 -47 -198 -610 687 148 -348 266 -38 -247 48
2556D8J51n58Q59M0k29l80N92m82k24N71l84P2N96j12j142P53k2o81O71L38q21
$$ 48 199 -359 500 540 311 -69 523 41 -183 388 4 76 672 560 -582 171 149 -532 139 477 -344
2577c44P16M26j172M06O75q56l15Q11j17m90j7k65M31O07l90o94J82K93o26O47
$$ -344 372 798 -374 32 707 -149 -464 347 230 -260 -277 -542 -111 496 106 -588 -406 -113 -739 -92
2597i2L76q28l28R78K36p48M42q0PJ01m29j9J79n13O42O9L81j069M16Q68j043
$$ -92 284 -544 -872 106 342 -406 36 -44 -37 64 -365 -384 -205 -718 -76 -7 374 -695 -279 589 -454
2618d54j72J217n46o28R13m83K63o5N07r01J084q55o1P03m4k18KN67o13k9O57
$$ -454 -626 591 45 -583 330 -153 110 45 552 -349 735 -120 -181 522 478 260 262 829 216 187 844
2639H44q20j95L82k90%K80k91j31N88l98m63O10M81m45p94J276q63l21L93m55
$$ 844 24 -171 211 -79 -79 201 -90 -221 367 -31 -494 116 597 152 -642 634 -229 -550 -157 -612
2659f12J01Q96l77m05N0N58j293J311K4j144K79R23r42J42K51m6J00N8M10o54
$$ -612 -511 385 8 -397 -347 211 -1082 229 253 -891 -612 311 -631 -489 -238 -284 -184 -126 284 -370
2679c70M82l61j0M40K49j045L38O72n55l49Q50l26n66J133j011N62R9J2o25N84
$$ -370 112 -249 -259 181 430 -615 -277 395 -160 -509 341 15 -551 582 -429 133 232 244 -381 203
2699B03j50j81Q04j94o83K42J016j265J37O29qp37N69m03m0L9M53l28Q0k31n58
$$ 203 53 -128 676 482 -201 41 1057 -208 -71 558 550 -187 382 -21 -61 -22 431 103 183 -48 -606
2720f06L27Q34o50l11R98p33j12K28o0k32J82K5j52J79k8j84M24k77l91L04K26
$$ -606 -279 555 -95 -406 592 -141 -253 -25 -85 -317 -135 -110 -262 -83 -111 -295 129 -148 -539 -235 -9
2741ip28L24P37l75o31L34QL0Q26k79l51K64J2k24L59J42n78K11L37j79l16P98
$$ -9 -737 -413 324 -51 -682 -348 -340 -310 516 237 -114 150 162 -62 297 439 -139 72 409 230 -86 712
2763G12k74q52J074l58j59J51M38q04L31K39m67j90P89n60K22J57l61n24P00k48
$$ 712 438 -414 660 302 143 294 732 -72 259 498 31 -159 630 70 292 449 88 -436 264 16
2783A6o24P67k99J37M06n48k89O49l5j123J049N19m78r61O56j29N7K97j36n02
$$ 16 -608 159 -140 -3 403 -145 -434 215 180 -943 106 625 147 -814 -158 -287 -230 67 -69 -571
2803e71Q26r56P96k41L37n66L21L73j337J290Lk91l6M45m80l39K23N82o37Q75
$$ -571 255 -701 95 -146 191 -375 -54 319 -1018 272 275 -16 -52 393 -87 -426 -203 379 -258 617
2823F17q20K41K72N46r47N90m71k05O36k9k58l35J66l6P19m09j17m25N40k00l54
$$ 617 -203 38 310 856 -91 499 28 -177 459 430 172 -163 3 -33 686 277 160 -265 275 75 -279
2844b79P15Q9p76K17M79p96K81L92j38n42O62j93n22P75j49o31P73m42m41J90
$$ -279 436 525 -251 -34 445 -351 -70 322 184 -358 304 111 -411 364 215 -416 357 -85 -526 -336
2864c36L99n40q7N77l24M06K6n24j24P23q15J55Q65k40o83M45J73p82P80M57r61
$$ -336 63 -477 -564 13 -311 95 121 -403 -527 196 -619 -464 401 161 -522 -77 96 -686 94 551 -410
2885d10K85N57l66r3K26q32L64N45r3n64K64J35l38L49M1m31N35J59l56o43J005
$$ -410 -125 432 66 -27 199 -633 -269 276 183 -381 -117 18 -320 29 70 -361 174 333 -23 -666 339
2906C39J79l45L1J12J43J06p42l94Q00J54p51J28L81l93j39O90L17o61K29j68
$$ 339 518 173 204 316 459 565 -177 -571 229 383 -368 -240 141 -252 -391 299 616 -45 184 16
2926A6j82K48k26K97K43o04O5n8M00k66N60J40r93J44J25k26M32j52k31k51J089
$$ 16 -166 82 -144 153 396 -208 -143 -201 199 -67 493 633 -360 -216 -91 -317 115 -37 -268 -519 570
2947E70o02J79K18J52j070J89O54n74M05O53q04L78J79p49j40M63L29k39N89l90
$$ 570 -32 147 365 517 -553 -364 290 -284 121 774 -30 348 527 -222 -362 101 430 191 780 390
2967C90q55O59l37l53Q10M6q24R5J228o52m94P37p28M94m15J96o31R47j56n32
$$ 390 -465 194 -143 -496 314 360 -464 -369 859 207 -287 450 -278 216 -199 -3 -634 313 157 -375
2987c75Q15k27l97N85r7p59K7J267j069L61j78K81j67k35N69p20O09k52l74N6
$$ -375 440 213 -184 401 304 -455 -428 839 -230 131 -47 234 67 -168 401 -319 290 38 -336 -280
3007b80Q67o55K74k95k63N30l7R1l84J87J72o80P76k29o90J259J37j023M24M23
$$ -280 587 -68 206 -89 -352 178 141 232 -152 35 207 -473 303 74 -616 643 780 -243 181 604
3027F04q88o8O04K2m93N16l55L46k87k80J46J04K98n9l41M82r91N07J54K6n84
$$ 604 -284 -352 252 274 -219 297 -58 288 1 -279 -133 -29 269 210 -131 351 -640 -133 21 47 -537
3048e37L52k66N42K55k79k34J69l13j43P84l25l48L12K71n35K40J97l07j02M39
$$ -537 -185 -451 91 346 67 -167 2 -311 -454 330 5 -343 -31 240 -295 -55 142 -165 -267 172
3068A72o26M99M82q28l5K80p7n76Q14P9k4k17K37k70K11M88m04m9o8L63m34J55
$$ 172 -454 45 527 -301 -336 -56 -133 -709 105 184 160 -57 180 -90 121 609 205 156 88 451 17 172
3090A72k1k90P34m32j92kM14l32KK04O2l31M58o00p8K82l2k14Q04k21p31Q48m73
$$ 172 151 -139 595 163 -29 -31 383 51 53 257 319 -12 446 -154 -232 50 18 -196 608 387 -344 504 31
3113C1l53P72j46n15m5J03M3n79J224o75L88l68m70N30M84m22K27j62K16k75M82
$$ 31 -322 450 304 -211 -256 -153 -110 -689 535 -140 248 -120 -590 -60 424 2 229 67 283 8 490
3134D90j07l27l37M9L76o93M54J18q1J04n8m63L55m39L13k34J106j234L91O22
$$ 490 383 56 -281 -232 144 -549 -95 23 -58 46 -12 -475 -120 -559 -246 -480 626 -608 -217 405
3154D05o67O85p26nj69J109r74M84L14n85J12N7k61J07n3k33L91k04K27k95K70
$$ 405 -262 423 -303 -308 -477 632 -342 142 456 -129 -17 40 -221 -114 -167 -400 -9 -213 14 -281 -11
3175a1M02r2q00O62n63P27R9j12j92p0M64l23m18M30j54j19O37m83J78l47K91
$$ -11 391 299 -501 161 -402 325 424 312 120 50 514 191 -227 203 49 -70 567 84 262 -85 206
3196B06J63K23n13l7j37P1K80k81R0k85O34N5m43N24k86l21K01k9K52n72M62K73
$$ 206 369 592 79 42 -95 -24 256 -25 65 -220 414 469 26 550 264 -57 144 115 367 -205 257 530
3218E30m59k69M20q31Q86k33j29l3K68J8j98R1l97N09m23O94p42K02l77L00O3
$$ 530 71 -198 222 -609 277 44 -85 -118 150 168 -30 61 -336 173 -250 444 -298 -96 -473 -173 -110
3239a10q0p9K91k17M00k93K77k67K33m13N79k95p20O73L86q0L09j92j1o58k32
$$ -110 -190 -269 22 -195 205 -88 189 -78 155 -258 321 26 -694 -21 365 285 594 402 391 -267 -499
3260d99K07K04k26N49k04O3o6j10K04O5j50l59l5N72k83j56L67l09m67J142k21
$$ -499 -292 -88 -314 235 31 94 28 -82 122 187 37 -322 -357 215 -68 -224 143 -166 -633 509 288
3281B88n35M26m64K96OM02o33M23J07k0l53N35n34m29O16Q5l16j34K13r0j5J73
$$ 288 -247 179 -285 11 17 419 -214 209 316 296 -57 478 -56 -485 131 216 -100 -234 -21 -111 -126 47
3303D7M6j28l1k41L21l8j37k76N17L18n23J74K99n93r0Q75m97k27K78k24M8K58
$$ 47 93 -35 -66 -307 14 -24 -161 -437 80 398 -125 49 348 -245 -335 540 43 -184 94 -130 -82 176
3325A76K53p37N18j95J99m70J08M28q35J089o53J01M5j20K07l21N09n11L30m20
$$ 176 429 -308 210 15 214 -256 -148 280 -555 534 -119 -18 27 -93 114 -207 302 -209 121 -299
3345b99K3K09j45J0P15k43l26J61K77m81l16N00k90PL24j92K58N6k02j75k69O66
$$ -299 -276 -67 -212 -202 513 270 -56 105 382 -99 -415 85 -205 -198 126 -66 192 248 46 -129 -398 268
3367B68p37N82K64o07k29K22Q2K73j35n3r6K5m5oP0M74q0n7k52J96k76L29M37
$$ 268 -469 113 377 -230 -459 -237 -155 118 -17 -70 -166 -141 -186 -192 -122 352 272 215 -37 159 -117 212 649
3390F49p67N61o36J29J48K50n2l60L22k31J46J39m15j04J83K7J91J44n23J01O3
$$ 649 -118 443 -193 -64 84 334 282 -78 244 13 159 298 -117 -221 -38 -11 180 324 -199 -98 -35
3411c5N27p83K51l4J57m71N80j83j57p9o9N32m3k38Q7L09n11J44K06J5l94K23
$$ -35 492 -291 -40 -74 83 -388 192 9 -148 -227 -296 236 193 -45 42 351 -160 -16 190 205 -189 34
3433C4j15J61j64N9m91K56J53K66j46j58rj1Q5N09m34K90Q4N5m31M98m16j26L37
$$ 34 -81 80 -84 -25 -516 -260 -107 159 13 -145 -154 -165 -80 429 -5 285 369 424 -7 491 75 -51 286
3456B86k12K40l07J63l65N00p00M89j50m49M82j40o9L31k06m3l45O70j91J56L37
$$ 286 74 314 7 170 -195 305 -395 94 -56 -505 -23 -163 -232 99 -107 -150 -495 175 -16 140 477
3477D77o39M43m16o9J62J1K60o03K78j86J50N76l37R8j14l04L55q1m95M16j94
$$ 477 -162 281 -135 -204 -42 -31 229 -374 -96 -282 -132 444 107 205 91 -213 142 61 -434 -18 -212
3498b12N3q01R76j47J09J59m15L46j13Q9j85R3R9N5k44Q5L9K71R9k48l31n63L13
$$ -212 -159 -960 16 -131 -22 137 -278 68 -45 44 -141 -48 51 106 -138 -53 -14 257 356 108 -223 -786 -473
3521d73j77O30J88K01r39K84o3M19K48k63J0K96m76R6J51q1J09k57k8l57J22J2
$$ -473 -650 -20 168 369 -570 -286 -349 70 318 55 65 361 -115 -19 132 51 160 -97 -125 -482 -360 -348
3543c48L44J32j78M61l09j40L09k81K05m42O19n41M29m08R8km5K50k94n8L40k64
$$ -348 -4 128 -50 411 102 -38 271 -10 195 -247 372 -169 260 -148 -50 -52 -97 153 -141 -199 141 -123
3565a23j07M2J42o11J101q42K62M07r2j99K76l21N7l9m9K34J94k13j28L08m51
$$ -123 -230 -188 -46 -657 444 -398 -136 271 179 -20 256 -65 -8 -47 -96 138 332 119 -9 299 -152
3586a52lP5j11j04J72J47r1N4N0l44N30J16l26R7J93o44K32j57M71l88J41P81
$$ -152 -155 -80 -191 -295 -123 24 -67 -13 37 -307 223 339 13 110 303 -341 -109 -266 205 -183 -42 739
3608G39j349M92K32l33L46m21r0j10J17Q65l22n58R99j125P06m96M25j11R5k4
$$ 739 -610 -118 114 -219 127 -294 -384 -494 -377 488 166 -392 607 -518 188 -308 117 6 101 77
3628G7n37M94o6L30o29K25j80j20O68j86o93P21j24M76l21j57o8P1J00N20l04
$$ 77 -460 34 -32 298 -331 -106 -286 -406 262 76 -617 104 -20 456 135 -22 -90 -19 81 601 297
3649B97l89k62L71K2k06j61M46l04L43n4m57M8j4O91N8m38k44P01o80K82k43M22
$$ 297 -92 -354 17 39 -167 -328 118 -186 157 103 -354 -306 -320 371 429 -9 -253 448 -232 50 -193 229
3671B29q15P03l41L22j73k37N94j44K05P3q91K98j4L21l25Q12p89J46j78Q1P9
$$ 229 -586 117 -224 98 -75 -312 282 138 343 416 -475 -177 -191 130 -195 617 -172 -26 -204 -123 -44
3692d4j02M14m38L52m77j39M74K01q4j86J06k90N88o3m10L15l83N08k88l62L60
$$ -44 -146 268 -170 182 -295 -434 40 241 157 -29 77 -213 375 312 -98 217 -166 342 54 -308 52
3713E2o57J82O74l42R7k63M60l22j16J16N88m15L01p96N99j06k70Ol14M87l84
$$ 52 -605 -423 251 -91 6 -257 203 -119 -235 -119 469 54 355 -441 158 52 -218 -212 -526 -39 -423
3734d23P95o77K83K53m85M96M1k75K25j33m78O96J28j05m66m8J6L32k25ll07L58
$$ -423 372 -305 -22 231 -254 242 283 8 233 100 -378 318 446 341 -125 -173 -157 175 -50 -53 -360 -2
3756bJ11k38P2K76j80M25m80r9J2k64O22m64L98l85J57p8L17l84k78L62m25K61
$$ -2 109 -129 -57 219 39 464 -16 -115 -103 -367 255 -209 189 -196 -39 -117 200 -184 -462 -100 -525 -264
3778b64L99K54m29o40R43o94K37K75k72L37l3K98n85K49N8l0rk50M3l83J32P77
$$ -264 135 389 -40 -680 263 -431 -194 81 -191 146 113 411 -174 75 133 103 94 -156 -113 -496 -364 413
3800D13j37n91L61M27m38K03k91k58M01Q2l47L95L35q85J9N94k92l64N01J1k81
$$ 413 276 -315 46 473 35 238 -53 -311 90 172 -175 220 555 -330 -311 283 -9 -373 128 139 -142
3821a42L87m57K15Nj89k20Q5J26L94j87j11K60n55N06k87r2Q7O3K66k13k29M40
$$ -142 245 -212 3 8 -181 -401 -316 -190 204 17 -94 166 -389 117 -170 -262 -175 -112 154 -59 -288 152
3843A52j62J0k81j6M2K25J02K10J4n37j76Q64j39m63J13M37q3o26J66L3r4j59
$$ 152 -10 0 -281 -297 -255 -30 72 282 296 -241 -417 447 308 -155 -42 395 312 -314 -148 -115 -209 -368
3865c68J64L9K91JJ45m08M66m71K30l77L16J05n77N18j26J21j28L95J24q28K12
$$ -368 -204 -165 126 127 272 -136 330 -141 89 -288 28 133 -444 74 -52 69 -59 336 460 -368 -156
3886a56L22k77k31O10j055P23K77j012K87P42k21l32J10L49k63J46k70K91l31
$$ -156 166 -111 -342 268 -787 -64 213 -799 -512 230 9 -323 -213 136 -127 19 -251 40 -291
3905b91M93n7l9K06n3k89m0k57J15q0O8J02J39k67L85j49P0l58L10j54L7K56l23
$$ -291 202 145 106 312 259 -30 -70 -327 -212 -292 -224 -122 17 -250 135 -14 56 -302 8 -146 -109 147 -176
3928a76M34O7k08M56o07K03q9j35M7l45j69P00o06M22J37N6K97m37K10o41P9O27
$$ -176 258 325 117 573 -34 169 80 -55 -8 -353 -522 178 -428 -6 131 187 484 47 257 -384 -305 322
3950C22n05k86q5M29L68Q1j02l25R4l40M21m30O58l17J49r0N19o29j15L43l25
$$ 322 -183 -469 -554 -125 243 324 222 -103 -9 -349 72 -358 300 -17 132 42 561 -68 -183 160 -165
3971a65L06j4m51N11l12J56p0k11K75L64j64k73j20K43R1J39l7o97L21n1J90p2
$$ -165 141 127 -324 187 -125 31 -39 -250 25 389 225 -48 -168 75 166 305 268 -429 -108 -159 31 -41
3993d1K58j93l0l42J06J76j32J40l32L77P1j07j23L89j15k66K74j71K2L70o30
$$ -41 217 24 -6 -348 -242 -66 -198 -58 -390 -13 58 -49 -172 217 102 -164 110 -61 -39 331 -299
4014b99L81J22l7m47L42k53N04k47L71o77L51p16j30P87O9K0m82l53M76K78J4
$$ -299 82 204 167 -280 62 -191 313 66 437 -240 111 -605 -735 52 121 141 -341 -694 -218 60 74
4035G4m5k48j29R38l05q96L65l1K02l1L1j67O19m63K00j9O1k06J43J21j3m91K89
$$ 74 29 -219 -348 590 285 -611 -246 -277 -75 -106 -75 -242 377 -86 114 95 156 -50 93 214 201 -290 -1
4058aj60j00M63o5j22l11k56Q34m75N94o44N34M0l68j23L80l52K5k02N19m30O74
$$ -1 -161 -261 202 137 15 -296 -552 282 -193 401 -243 291 331 -37 -160 220 -132 -107 -309 210 -220 454
4080D54p60Q6P54o74J15Q5N7k56j8M82o06N10m00n71P13J09L89j042O20J07m80
$$ 454 -306 -220 534 -140 -25 60 117 -139 -157 325 -281 229 -171 -742 -29 80 469 -573 47 154 -326
4101c26K87K68n18L8L39l88L61K88m33k0L19j91j57K01k16K42Q5k26M50k03q3
$$ -326 -39 229 -289 -251 88 -300 61 349 -84 -104 215 24 -133 68 -148 94 179 -47 403 200 117
4122A17j31O7k85J12j28L25m32K73Q64p36K2j03k8N4M9K38n02K65J88n74K93M59
$$ 117 -14 53 -232 -120 -248 77 -355 -82 782 46 68 -35 -63 -9 40 278 -224 41 229 -345 -52 407
4144D07m33J63o8R1q07R07o83o9J64M60k44J27j81m67M61L23k81J03O83j124n3
$$ 407 -26 137 69 160 -647 260 -423 -492 -328 132 -112 15 -166 -633 -172 151 -130 -27 656 -468 -521
4165e21N39R4n18N26j82K60l88j39K71O22q04J08L1L58l61K71L17p37J59J86k16
$$ -521 18 112 -406 120 -62 198 -190 -329 -58 564 -240 -132 -101 257 -104 167 484 -253 -94 92 -124
4186a24K32K58l61j94O05q3p80M81l40J65O22l56m48M47K02o7J77l0n54j61P21
$$ -124 108 366 5 -189 416 333 -447 34 -306 -141 481 125 -323 124 326 259 436 406 -148 -309 412
4207D12o55J9RL98m33j42K55m29K75J30K81k9N70p03L04l09O5R3j76j4oN04j70
$$ 412 -243 -224 -215 183 -250 -392 -137 -566 -291 -161 120 91 661 -42 262 -47 18 111 -65 -79 -85 419 249
4230B49l19N6q7rk67M63O1o58O21Q2k62J18J74n51K28L83m16L31M36j91j47m80
$$ 249 -70 -14 -101 -110 -377 86 147 -511 110 192 -70 48 222 -329 -101 282 -134 197 633 442 295 -185
4252a85P6j91Q9pO3J23l09M16K41m55M54m04J12r4L33o95k75L97M71n00N01Q2
$$ -185 -109 -300 -211 -218 -155 -32 -341 75 316 -139 315 -89 23 -71 262 -433 -708 -311 160 -340 161 243
4274B43l1j67J95o87k1L41K79m24Q0K92j71%M43m96N2L50NM6m19M3J9N28l72m37
$$ 243 212 45 240 -447 -468 -127 152 -272 -192 100 -71 -71 372 -124 -72 278 283 329 -90 -47 -28 500 128 -309
4298c09L05K02q22N45K10n9j4m04L94K0k20O47p76K79k87L20K83p17L32K83j20
$$ -309 -4 198 -624 -79 131 72 58 -346 48 68 -152 495 -281 -2 -289 31 314 -403 -71 212 92
4319I2r9q0M3Q6j2j98J92j03J70n20O27j42j47j77L65Q8q50N15K47R5J59q0n63
$$ 92 -7 -87 -44 42 30 -168 24 -79 91 -429 198 56 -91 -268 97 185 -665 -150 97 192 351 271 -292
4342b92N34k14n39M00K26J59m45n7K73n25O51M80r27R8K83k07J26J72n11L58j66
$$ -292 242 28 -511 -111 115 274 -171 -228 45 -480 171 651 -276 -178 105 -102 24 196 -315 43 -123
4363a23j39Q8M0L37n48P12J8n05M43l43k05N26k73k47O64l77n90Q2J54M08j53
$$ -123 -262 -174 -134 203 -345 367 385 -120 323 -20 -225 301 28 -219 445 68 -522 -440 -286 122 -31
4384c1Q9J48m60M81q5l76N90l76K61l64L50n42L10p3l5K71p1m65M30Oj13k41N48
$$ -31 58 206 -254 227 142 -234 356 -20 241 -123 227 -315 -5 -78 -113 158 87 -378 52 58 -55 -296 252
4407B52q21M94m3j59J88k59Q31o92K21J20k3j68k15N84l83K43j16K4j51J71O1
$$ 252 -569 -75 -118 -277 -89 -348 483 -209 12 132 109 -59 -274 310 -73 170 54 78 -73 98 159
4428A59k64M92k64j24J45n42O51Q7m6q0K27m33J92r0J93p37P00m04q0K08L14l10
$$ 159 -105 387 123 -1 144 -398 253 340 294 214 441 8 200 110 303 -434 266 -138 -218 -10 304 -6
4450fm5K42J24l54j7K34j92K21m21j26J83K93o96O23R7J25q03P25l13lJ84J04
$$ -6 -51 191 315 -39 -56 178 -14 207 -214 -340 -157 136 -560 63 160 285 -518 207 -106 -109 75 179
4472A79l16q3N4J33J95k95k06K81l72L66J18K18l54K13j03k63%N97l74N3k26J07
$$ 179 -137 -220 -166 -33 162 -133 -339 -58 -430 -64 54 272 -82 131 28 -235 -235 362 -12 41 -185 -78
4494g8j40l7J78pj85L3K64Q5k08R7J8l57N10l39O01k91l79K2K58n6j58M31m89
$$ -78 -218 -255 -77 -84 -269 -236 28 113 -95 2 20 -337 173 -166 435 144 -235 -213 45 -11 -169 262 -227
4517b27L00k89M06R4m4r3n84O57J68k99M61r31K58N85j87l63Q1J03j01k91K18
$$ -227 73 -216 190 284 240 147 -437 220 388 89 550 -381 -123 462 275 -88 -7 96 -5 -296 -78
4538g8M3n2M98j50m54N97k70Lr3O5n40r5J86p9N16J9j25j89N01m45j13O33m22
$$ -78 -35 -87 411 261 -193 404 134 137 44 109 -431 -526 -340 -419 97 116 -9 -198 303 -142 -255 378 -44
4561d4K53Q5j31P5J40o55K69k21L56k46n8J16l47N85j82k42l26P11O1n09N92n18
$$ -44 209 294 163 238 378 -277 -8 -229 127 -119 -177 -61 -408 177 -5 -247 -573 138 199 -310 282 -236
4583b36P7J00N83j019N69L53j27j98k71K60j68R5K98n49O14j89M0l1l88L38J03
$$ -236 -159 -59 524 -495 74 427 300 102 -169 91 -77 18 316 -233 381 192 232 201 -187 151 254
4604B54j71j55L14l50L44m11K74k49l61O47k41k50L27j17k13N26M3J10o18L26
$$ 254 83 -72 242 -108 236 -175 99 -150 -511 136 -105 -355 -28 -145 -358 168 211 321 -297 29
4624B9m4K1K3j83N7M10j92k16J98Q4j69N4L70l44n09N91j12L76K36p19J91k02
$$ 29 -15 6 29 -154 -97 313 121 -95 103 187 18 72 442 98 -411 180 68 444 680 -39 152 -50
4646e0j48N70n07M28j00k56K54J36L76p55k88K90M81p27P29m35n74N66j64j19
$$ -50 -198 372 -135 293 193 -63 191 327 703 -52 -340 -50 431 -296 433 -2 -576 -10 -174 -293
4666b93l7Q04lp17J87k25k69N82k57k93N92j93P5M99n77J94j40J93J1N3j81K33
$$ -293 -330 474 471 -246 -59 -284 -553 29 -228 -521 71 -122 -47 452 -125 69 -71 122 133 186 5 238
4688B38p78P78k98J69N8Q1n59Q72n18K39j89K67m52k56R14m89N1J60o03N54j85
$$ 238 -540 238 -60 109 167 248 -311 561 43 282 93 360 -92 -348 566 77 128 288 -315 239 54
4709E4M50n86L09k71n11R43l81n1M05O9m41J65K21k59L10l78n18K87J2o8l02M58
$$ 54 504 -82 227 -44 -555 388 7 -44 361 430 -11 154 375 116 426 48 -470 -183 -171 -239 -541 -83
4731h3L1J01k22L12q0j61J90j33M43l24L25o54P18k63m79M48M9j07j2k17n2N80
$$ -83 -52 49 -173 139 59 -102 88 -45 398 74 399 -255 463 200 -279 169 218 111 99 -118 -170 410
4753D10n83r7M20n79N95k70N67m04p6J18l49L72l61M83m88M84J22q16P95l3L6
$$ 410 -173 -270 150 -429 166 -104 463 59 -17 101 -248 124 -237 246 -242 242 364 -452 343 310 346
4774C46p08R0N2RK16n90M95k16L14k71K29K83J05k73o2O4j06j00J90k53M59o21
$$ 346 -362 -272 -220 -211 5 -585 -90 -306 8 -263 -34 249 354 81 19 83 -23 -123 67 -186 273 -348
4796c48N28k68k60l5K85N62m53kJ80n97K83J21m71M90k4K04n60P70l10l7k50M35
$$ -348 180 -88 -348 -383 -98 464 11 9 189 -408 -125 -4 -475 15 -9 195 -365 405 95 58 -192 243
4818B43o25O22l58J44K91j61q26N47J33j9j69L83k58K04j76J54J38k66Q6n25M07
$$ 243 -382 240 -118 26 317 156 -670 -123 10 -9 -178 205 -53 151 -25 129 267 1 87 -438 -31
4839c1J25J96o60L09K4J56O6n52N65J18j35j27k00M12n62K38M38n44K04j06R5
$$ -31 94 290 -370 -61 -37 119 185 -367 198 316 181 54 -146 266 -296 -58 380 -164 40 -66 29
4860B9L14n13n00P99l73K00M71R5l34p84N80K30n82K17l02O74l73N38o8l69k67
$$ 29 343 -170 -670 129 -244 -44 427 522 188 -596 -16 214 -368 -151 -453 221 -152 386 318 -51 -318
4881c18k6M17J76M8r2j28K68j69j42J54M8j41l7m28M18J24k14R0P7p5j9l62M26
$$ -318 -344 73 249 297 205 77 345 176 34 188 236 95 58 -370 48 172 -42 48 125 50 31 -331 95
4904I5k89k09N33l08L71J45k52m4k92l6M99P0k99l9K13l68q6K81J27o48P97j81
$$ 95 -194 -403 130 -178 193 338 86 42 -250 -286 213 283 -16 -55 158 -210 -296 -15 112 -536 261 80
4926H0R2n16O63m09r4J49L49k17o7n18M14j86J54j09P66q70q2R77p78L64m51M62
$$ 80 172 -344 319 -90 -184 -35 314 97 30 -488 -74 -260 -106 -215 551 -319 -401 576 -202 162 -289 173
4948A73l5l21N32l91qM0L0K78j82j9K08o9mm35N8K8J26k49J61Q8j47J69L38p52
$$ 173 138 -183 349 -42 -50 -10 20 298 116 97 305 236 232 -203 -145 -117 9 -240 -79 9 -138 31 369 -383
4972c83K78N6k64N00o6j66j77L11o13Q16l29k56q2K39J88r6j09J57R0l71Q5K76
$$ -383 -105 -49 -313 187 121 -45 -222 89 -524 292 -37 -293 -375 -136 52 -44 -153 4 94 -277 -192 84
4994H4N7k75L19l52K29j79l50M65J95m56k3Q04j73k63L70j167P45J32lj19K93
$$ 84 141 -134 185 -167 62 -117 -467 -2 193 -263 -286 518 345 82 452 -715 30 162 159 40 333
5015C33k46j90OO85r29O19J12m94M29m86K57K61n95N15n4l51J43m18R48m28R8
$$ 333 87 -103 -97 588 -341 278 390 -104 325 -161 96 357 -238 277 223 -128 15 -403 545 117 215
5036B15k88k4o1L76l71oM45j88l68N70n15M12l15J51p7K22l70j24M40K76l00m4
$$ 215 -73 -97 -158 218 -153 -159 286 98 -270 300 -215 197 -118 33 -44 178 -192 -316 124 400 100 56
5058E6m3J29M1j44Pk87M09n16K00M00l87j30J2N87k23k28K53k59O0n02N61K8K14
$$ 56 13 142 183 39 46 -241 168 -348 -148 252 -135 -265 -253 334 111 -117 136 -123 -63 -565 -4 24 238
5081B38k8J42p9k67l78M46L76o93P9j04m41P24K01k64k08J73N72r3l94l6j89J87
$$ 238 210 352 273 6 -372 74 450 -243 -164 -268 -709 15 216 -48 -256 -83 489 396 2 -34 -223 -36
5103c6J28K29L9n25K11L33n86k1J85l1j37q8N21n64M49k8R6l51N94k55m34L10
$$ -36 92 321 360 -165 46 379 -207 -228 -43 -74 -211 -299 222 -342 107 79 175 -176 418 163 -271 39
5125C9l72K4M52q9N72j173J25M22j56j6k06Q50q46K26L72k58j66N16m29O68q09
$$ 39 -333 -309 143 54 626 -547 -422 0 -156 -172 -378 472 -374 -148 224 -34 -200 316 -113 555 -254
5146b54K92o3o8K06k13L14j60l4P6Q9m39Q27r07J30L75j24p1n8k0J38M98q15O03
$$ -254 38 -25 -93 113 -100 214 54 20 96 185 -254 573 -334 -204 171 47 -24 -82 -102 36 534 -281 322
5169C22k59n19M07K04m42J32N51j66j44j56L98l51K58j82n56L55J40K73k68M10
$$ 322 63 -456 -49 155 -287 -155 396 230 86 -70 328 -23 235 53 -503 -148 -8 265 -3 407
5189D07l7n33K46jk86K32l06M43L2J85q28K83L29m13J45K58j29L3j78k9K05l07
$$ 407 370 -163 83 82 -204 28 -278 165 197 382 -446 -163 166 -247 -102 156 27 60 -118 -147 58 -249
5211b49J1J78J75M79m20J29n49M99l04K25l49M83k70J72j08k15K56p86P79k85
$$ -249 -238 -60 115 594 174 303 -246 253 -51 174 -175 308 38 210 102 -113 143 -643 136 -149
5231a49K03L39k23J6N7k92K75k09k1l20L30L03p41L12J34K43k80j15Q2j0K58K5
$$ -149 54 393 170 186 243 -49 226 17 -4 -324 6 309 -432 -120 14 257 -23 -138 -56 -66 192 217
5253B17j47k23RN01N96n89p9j00k57O0j10M47L2m79J76j69J52j01K99k88k66M72
$$ 217 70 -153 -144 357 953 364 285 185 -72 -12 -122 325 357 -122 54 -115 37 -64 235 -53 -319 153
5275A53k63k4O9K49n2k88J22J23P4J15m61N47k83J2l86K34k11j33L8M82k9m08
$$ 153 -110 -134 -65 184 132 -156 -34 89 163 278 -183 364 81 93 -293 -59 -270 -403 -365 117 88 -320
5297c20M29p9N7N3o42N49J62n66K31L02m18L63l80J13J67R1n81N89m75L60q5J24
$$ -320 109 30 87 140 -502 47 209 -357 -126 176 -242 121 -259 -146 21 112 -469 120 -355 5 -80 44
5319D4k95J62M66r30M71J27j9O5m90M71Jk62K41k79j74P98l2k66l9mK55l63j61
$$ 44 -251 -89 377 -553 -82 45 26 91 -399 72 73 -189 52 -227 -401 397 365 99 60 56 311 -52 -213
5342b13K18k44M55j39l26J47L82l07K15k59Q5k1M69m08m08J46p9O19l94j67L10
$$ -213 5 -239 216 77 -249 -102 280 -27 188 -71 14 -7 462 54 -354 -208 -287 332 -62 -229 81
5363H1J83n21J94Q9P8l18k44J79K8p5L74k52j40M13k72O13ro43O25l37O4n55N04
$$ 81 264 -257 -63 26 104 -214 -458 -279 -251 -326 48 -204 -344 69 -203 410 401 -242 383 46 110 -445 59
5386E9j08N26n14m84Q84n88K61o61N55P71j349O28k62L35k34k71K22P1l11J53
$$ 59 -49 477 -37 -521 363 -225 36 -625 -70 701 -648 -20 -282 53 -181 -452 -230 -159 -470 -317
$$ [...]
8191B35
##END NTUPLES=NMR FID
##END=
