##TITLE=31Pdec_DE-123_W
H2O, 24 sc
 26.1.2026
##JCAMPDX= 6.0         $$ Bruker NMR JCAMP-DX V2.0
##DATA TYPE= NMR SPECTRUM
##DATA CLASS= NTUPLES
##ORIGIN= UXNMR, Bruker Analytische Messtechnik GmbH
##OWNER= root
$$ XWIN-NMR		Version 3.5
$$ Mon Jan 26 14:08:47 2026 Russian Standard Time (UT+4h)  she@DPX200
##.OBSERVE FREQUENCY= 81.013821
##.OBSERVE NUCLEUS= ^31P
##.ACQUISITION MODE= SIMULTANEOUS
##.ACQUISITION SCHEME= undefined
##.AVERAGES= 24
##.DIGITISER RES= 17
##SPECTROMETER/DATA SYSTEM= spect
##.PULSE SEQUENCE= zgpg30
##.SOLVENT NAME= CDCl3
##.SHIFT REFERENCE= (INTERNAL, CDCl3, 0, 198.062)
##AUDIT TRAIL= $$ (NUMBER, WHEN, WHO, WHERE, WHAT)
$$ ##TITLE= Audit trail, XWIN-NMR		Version 3.5
$$ ##JCAMPDX= 5.01
$$ ##ORIGIN= Bruker BioSpin GmbH
$$ ##OWNER= she
$$ F:/spectra/data/she/nmr/P31/2/pdata/1/auditp.txt
$$ ##AUDIT TRAIL=  $$ (NUMBER, WHEN, WHO, WHERE, WHAT)
(   1,<2026-01-26 14:07:21.39 +0400>,<she>,<DPX200>,
      <created by zg, POWCHK disabled, PULCHK disabled
       configuration hash MD5:
       00 E9 B6 7A A2 85 ED C7 34 08 36 98 17 FE 4E 26
       data hash MD5: 32K
       D4 D5 30 D6 5B 8D BE 63 F2 FF 43 02 12 7C 1A 3F>)
(   2,<2026-01-26 14:07:24.56 +0400>,<she>,<DPX200>,
      <Start of raw data processing
       efp BC_mod = 2 LB = 1.5 FT_mod = 6 PKNL = 1 PHC0 = 1340.662 PHC1 = 183.5008 SI = 64K 
       data hash MD5: 64K
       AD 22 D2 F9 83 32 6D C2 D2 79 94 7B 7B 85 58 09>)
(   3,<2026-01-26 14:07:42.23 +0400>,<she>,<DPX200>,
      <pk PHC0 = -13.6397 PHC1 = 0 
       data hash MD5: 64K
       9A 90 76 0E 4D 87 4E 6D FB 1B FE 28 B4 80 2E 24>)
(   4,<2026-01-26 14:07:55.17 +0400>,<she>,<DPX200>,
      <abs ABSG = 5 
       data hash MD5: 64K
       09 BA 0B 78 58 E2 E1 A0 30 DF 47 5B 4E FA 24 73>)
$$ ##END=
$$ 
$$ hash MD5
$$ 48 0B 35 C2 7B BA 79 E8 7A 5F B4 72 04 BB 09 0D
##$RELAX= 
##$RELAX= 
##$RELAX= 
##$RELAX= 
##$RELAX= 
##$RELAX= 
##$RELAX= 
##$RELAX= 
$$ Bruker specific parameters
$$ --------------------------
##$DU= <F:/spectra>
##$EXPNO= 2
##$NAME= <P31>
##$PROCNO= 1
##$TYPE= <nmr>
##$USER= <she>
##$AMP= (0..31)
100 100 100 100 100 100 100 100 100 100 100 100 100 100 100 100 100 100 
100 100 100 100 100 100 100 100 100 100 100 100 100 100 
##$AQSEQ= 0
##$AQ_mod= 1
##$AUNM= <au_zg>
##$AUTOPOS= <>
##$BF1= 81.014009
##$BF2= 200.13
##$BF3= 200.13
##$BF4= 200.13
##$BF5= 200.13
##$BF6= 200.13
##$BF7= 200.13
##$BF8= 200.13
##$BYTORDA= 1
##$CFDGTYP= 0
##$CFRGTYP= 5
##$CHEMSTR= <none>
##$CNST= (0..31)
1 1 145 1 1 1 1 1 1 1 1 1 1 1 1 1 1 1 1 1 1 1 1 1 1 1 1 1 1 1 1 1 
##$CPDPRG= <waltz16>
##$CPDPRG1= <>
##$CPDPRG2= <waltz16>
##$CPDPRG3= <>
##$CPDPRG4= <mlev>
##$CPDPRG5= <mlev>
##$CPDPRG6= <mlev>
##$CPDPRG7= <mlev>
##$CPDPRG8= <mlev>
##$CPDPRGB= <>
##$CPDPRGT= <>
##$D= (0..31)
0 1 0 0 0 0 0 0 0 0.06 0 0.03 2e-05 3e-06 0 0 0.0002 0 0 0 0 0 0 0 0 0 
0 0 0 0 0 0 
##$DATE= 1769422041
##$DBL= (0..7)
120 120 120 11 120 120 24 19 
##$DBP= (0..7)
150 150 150 150 150 150 150 150 
##$DBP07= 0
##$DBPNAM0= <>
##$DBPNAM1= <>
##$DBPNAM2= <>
$$ [...]
##$SUBNAM3= <"">
##$SUBNAM4= <"">
##$SUBNAM5= <"">
##$SUBNAM6= <"">
##$SUBNAM7= <"">
##$SUBNAM8= <"">
##$SUBNAM9= <"">
##$SW= 400.765351723535
##$SWIBOX= (0..15)
0 1 3 0 0 0 0 0 0 0 0 0 0 0 0 0 
##$SW_h= 32467.5324675325
##$TD= 32768
##$TD0= 1
##$TE= 0
##$TE2= 300
##$TE3= 300
##$TEG= 300
##$TL= (0..7)
0 120 53 12 22 120 120 120 
##$TP= (0..7)
150 150 150 150 150 150 150 150 
##$TP07= 0
##$TPNAME0= <>
##$TPNAME1= <>
##$TPNAME2= <>
##$TPNAME3= <>
##$TPNAME4= <>
##$TPNAME5= <>
##$TPNAME6= <>
##$TPNAME7= <>
##$TPOAL= (0..7)
0.5 0.5 0.5 0.5 0.5 0.5 0.5 0.5 
##$TPOFFS= (0..7)
0 0 0 0 0 0 0 0 
##$TUNHIN= 0
##$TUNHOUT= 0
##$TUNXOUT= 0
##$USERA1= <user>
##$USERA2= <user>
##$USERA3= <user>
##$USERA4= <user>
##$USERA5= <user>
##$V9= 5
##$VALIST= <valist>
##$VCLIST= <CCCCCCCCCCCCCCC>
##$VD= 0
##$VDLIST= <DDDDDDDDDDDDDDD>
##$VPLIST= <PPPPPPPPPPPPPPP>
##$VTLIST= <TTTTTTTTTTTTTTT>
##$WBST= 1024
##$WBSW= 4
##$XGAIN= (0..3)
0 0 0 0 
##$XL= 0
##$YL= 0
##$YMAX_a= 10490
##$YMIN_a= -8332
##$ZGOPTNS= <>
##$ZL1= 120
##$ZL2= 120
##$ZL3= 120
##$ZL4= 120
##$ABSF1= 198.0616
##$ABSF2= -202.7028
##$ABSG= 5
##$ABSL= 3
##$ALPHA= 0
##$AQORDER= 0
##$ASSFAC= 0
##$ASSFACI= 0
##$ASSFACX= 0
##$ASSWID= 0
##$AUNMP= <proc_1d>
##$AZFE= 0.1
##$AZFW= 0.5
##$BCFW= 0
##$BC_mod= 2
##$BYTORDP= 0
##$COROFFS= 0
##$CY= -3
##$DATMOD= 1
##$DC= 0
##$DFILT= <>
##$DTYPP= 0
##$F1P= 0
##$F2P= 0
##$FCOR= 1
##$FTSIZE= 65536
##$FT_mod= 6
##$GAMMA= 0
##$GB= 0
##$INTBC= 1
##$INTSCL= 9.790993e-09
##$ISEN= 30
##$LB= 1.5
##$LEV0= 0
##$LPBIN= 0
##$MAXI= 10000
##$MC2= 0
##$MEAN= 0
##$ME_mod= 0
##$MI= 50
##$NCOEF= 0
##$NC_proc= -6
##$NLEV= 6
##$NOISF1= 182.463
##$NOISF2= 159.3651
##$NSP= 0
##$NTH_PI= 0
##$NZP= 0
##$OFFSET= 198.0616
##$PC= 4
##$PHC0= 1327.022
##$PHC1= 183.5008
##$PH_mod= 1
##$PKNL= yes
##$PPARMOD= 0
##$PSCAL= 0
##$PSIGN= 0
##$REVERSE= no
##$SF= 81.0140089999434
##$SI= 65536
##$SIGF1= 159.3651
##$SIGF2= -187.1042
##$SINO= 113.3802
##$SIOLD= 16384
##$SREGLST= <1H.CDCl3>
##$SSB= 0
##$STSI= 65536
##$STSR= 0
##$SW_p= 32467.5324675325
##$SYMM= 0
##$S_DEV= 0
##$TDeff= 32768
##$TDoff= 0
##$TI= <>
##$TILT= no
##$TM1= 0
##$TM2= 0
##$TOPLEV= 0
##$USERP1= <user>
##$USERP2= <user>
##$USERP3= <user>
##$USERP4= <user>
##$USERP5= <user>
##$WDW= 1
##$XDIM= 65536
##$YMAX_p= 293259661
##$YMIN_p= -5098879
$$ End of Bruker specific parameters
$$ ---------------------------------
##NTUPLES= NMR SPECTRUM
##VAR_NAME=  FREQUENCY,     SPECTRUM/REAL,   SPECTRUM/IMAG
##SYMBOL=    X,             R,               I
##VAR_TYPE=  INDEPENDENT,   DEPENDENT,       DEPENDENT
##VAR_FORM=  AFFN,          ASDF,            ASDF
##VAR_DIM=   65536,         65536,           65536
##UNITS=     HZ,            ARBITRARY UNITS, ARBITRARY UNITS
##FACTOR=    0.49542278885378, 1,            1
##FIRST=     16045.7642231865, 0,            0
##LAST=      -16421.768244346, 0,            0
##MIN=       -16421.768244346, -5098879,     0
##MAX=       16045.7642231865, 293259661,    0
$$ Real data points
##PAGE= N=1
##DATA TABLE= (X++(R..R)), XYDATA
$$ [...]
37186d11472j61725r6867k3675J06210J49898J594j30120m7670N8183l6178j15253
$$ -411472 -573197 -670064 -693739 -587529 -437631 -436037 -566157 -613827 -555644 -591822 -707075
37175g07075Q2551K35513j52609q12729q93180j83129N06259M36778j28446m35273
$$ -707075 -624524 -389011 -541620 -1354349 -2247529 -2430658 -1924399 -1487621 -1616067 -2051340
37165b051340k48070O6702J97607J97726K11890K28187J64917M8552K7117K11194
$$ -2051340 -2299410 -2232708 -2035101 -1837375 -1625485 -1397298 -1232381 -1183829 -1156712 -945518
37155i45518N06809O60583N20272J75621k10277n56979p53310o19925k05694J02094
$$ -945518 -438709 221874 742146 917767 707490 150511 -602799 -1222724 -1428418 -1326324
37145a326324O2520l7235J49821M06828K93400n9170j18423J23547J09621k53575
$$ -1326324 -1263804 -1301039 -1151218 -744390 -450990 -510160 -628583 -505036 -395415 -648990
37135f48990k68247M69576J279788J245395M35232k99621m85640l93461l63779
$$ -648990 -917237 -447661 832127 2077522 2512754 2213133 1727493 1334032 970253
37126I70253l50227k19474o4319j5684J0732J81096M47061N25540K09454l36579
$$ 970253 620026 400552 336233 320549 331281 512377 959438 1484978 1694432 1357853
37116A357853o83183o04437l25682j63598q4889R5468K44768J09205p8596K01914
$$ 1357853 674670 70233 -255449 -419047 -503936 -408468 -163700 -54495 -133091 68823
37106F8823Q25511R54305K47657m93482m26025J26505K55688j31919l16348L603
$$ 68823 894334 1848639 2096296 1602814 1176789 1303294 1558982 1427063 1110715 1114318
37096A114318L23022K37872l258n7455O043P678k2406o2660k13254l90104l29960
$$ 1114318 1437340 1675212 1671954 1614499 1620542 1628220 1605814 1543154 1329900 939796 609836
37085F09836r0606q4239l84214n01893j73634J40008k1514l64250l64018j54523
$$ 609836 519230 434991 50777 -451116 -624750 -484742 -506256 -870506 -1234524 -1389047
37075a389047k16474m32919k21711M38811Q70769P02443L24314J17644j03471
$$ -1389047 -1605521 -2038440 -2260151 -1821340 -950571 -248128 76186 193830 90359
37066I0359n04219o89203l04284K54219L65528J48308K22347O25805O93216J17831
$$ 90359 -413860 -1103063 -1407347 -1153128 -787600 -639292 -416945 208860 902076 1019907
37056A019907n19284n64895j32872K19246K54308J11119q5519k44660j67082J79996
$$ 1019907 500623 -64272 -197144 22102 276410 387529 302010 57350 -109732 70264
37046G0264M06147J57223k87175l51529l4037R5587j95198m65979l56724j27983
$$ 70264 476411 633634 346459 -5070 -39107 56480 -138718 -604697 -961421 -1089404
37036a089404j23104j63213P0422L89624L53860j879j87633L8432L92744M86223
$$ -1089404 -1212508 -1375721 -1305299 -915675 -561815 -563694 -751327 -712895 -320151 166072
37026A66072J92680l63840q56828q45827j98996N79191Q26983N32442K34954J19204
$$ 166072 358752 -5088 -861916 -1707743 -1906739 -1327548 -500565 31877 266831 386035
37016C86035k06525q34189j096032m69791N01686Q15994L12776k49509l28914
$$ 386035 179510 -654679 -1750711 -2220502 -1718816 -902822 -590046 -839555 -1168469
37007a168469j60328q6815L0097L92069P09291N25344j06409o59353p52569m33937
$$ -1168469 -1328797 -1415612 -1385515 -993446 -284155 241189 134780 -524573 -1277142 -1711079
36997a711079N1186M46880N00880J57065k24319j75305K52667M92746K41299j12283
$$ -1711079 -1659893 -1213013 -712133 -555068 -779387 -954692 -702025 -209279 32020 -80263
36987h0263r7774J14428K2632l64579n11408j82468K16454K87285J86468K35647
$$ -80263 -178037 -63609 -40977 -405556 -916964 -1099432 -882978 -595693 -409225 -173578
36977a73578L41568K02400j20723k76294j95246j70581l19322l45539m535M70824
$$ -173578 167990 370390 249667 -26627 -221873 -392454 -711776 -1057315 -1061850 -591026
36967e91026O27927L36643j11686l77050l95598l41423l47754l08341j4080M74443
$$ -591026 36901 373544 261858 -115192 -510790 -852213 -1199967 -1508308 -1522388 -1047945
36957a047945P29529M33409j19809k96395O1886M18217K87557j15107k53184m6984
$$ -1047945 -318416 114993 -4816 -301211 -239325 178892 466449 351342 98158 51174
36947E1174J15444L5888m9158P7174K87300L79942L74549L43205J96116j18055
$$ 51174 166618 202506 153348 230522 517822 897764 1272313 1615518 1811634 1693579
36937A693579l74754l25584j03660q4161l40613n21763l54156j8166J47389J35265
$$ 1693579 1318825 993241 889581 805420 464807 -56956 -411112 -429278 -281889 -146624
36927a46624K20605M82859O37032M24782p704k83071k66351j87605k78467m56197
$$ -146624 73981 556840 1193872 1618654 1610950 1327879 1061528 873923 595456 139259
36917A39259m77606k94709q8663J5650P8956J54233J60317O7848L5754J59130
$$ 139259 -338347 -633056 -721719 -706069 -627113 -472880 -312563 -244715 -208961 -49831
36907d9831K04066j17977o18072o88798m7273Q00984J063868N33677k34431n70210
$$ -49831 154235 36258 -581814 -1270612 -1317885 -516901 546967 1080644 846213 276003
36897B76003l40299M9330J47283j18314m40374m79912j81881K41368N50734O08410
$$ 276003 -64296 -14966 132317 14003 -426371 -906283 -1088164 -846796 -296062 312348
36887C12348L50087j52290n75082n34192k5873M97934O22514L66650k1370m04646
$$ 312348 662435 510145 -64937 -599129 -625002 -127068 495446 862096 840726 436080
36877D36080o84278o52300k51745J88832L29158K91138L95883N61271M07700q6135
$$ 436080 -248198 -900498 -1152243 -963411 -634253 -343115 52768 614039 1021739 935604
36867I35604n01240n77362m50360k55965K1514K23425O7015l05741l51263O1389
$$ 935604 434364 -142998 -593358 -849323 -827809 -604384 -537369 -843110 -1194373 -1132984
36857a132984L76572K04153p7081J0026K49081J50506k03068l31062j45743O253
$$ -1132984 -756412 -552259 -629340 -619314 -370233 -219727 -422795 -753857 -899600 -893347
36847h93347m2738j43507k02931k24607q7258K56367M86712L11755K2752J13017
$$ -893347 -936085 -1079592 -1282523 -1507130 -1594388 -1338021 -851309 -539554 -516802 -403785
36837d03785M48581M37164J26k86564j14176J44359J34136K3454K2402o3574m19964
$$ -403785 44796 481960 482086 195522 81346 225705 359841 383295 405697 342123 -77841
36826g7841p63105o77779j64464M16646P20357N72010M8822m27566m01811M4953
$$ -77841 -840946 -1518725 -1683189 -1266543 -546186 25824 74646 -352920 -754731 -709778
36816g09778L64491L02223J66950J93293J71477o292k067L24668M55206k9318
$$ -709778 -345287 -43064 123886 317179 488656 482364 480297 804965 1260171 1230853
36806A230853o52074o74699k16784k534j80133k14199N0975Q4808l18408n02180
$$ 1230853 578779 -95920 -312704 -315238 -495371 -709570 -658595 -573787 -892195 -1394375
36796a394375O0990P92060O98844j86770p52559k61344O98388J024349M97649
$$ -1394375 -1333385 -541325 157519 -29251 -781810 -1043154 -344766 679583 1177232
36787A177232j03358j79174m6873k76327p33530p79697k48194L22282M59979K66820
$$ 1177232 1073874 894700 847827 571500 -162030 -941727 -1189921 -867639 -407660 -140840
36777a40840K4631k11353l77488k20261K74577O22034M26639k8110j97216n7363
$$ -140840 -116209 -327562 -705050 -925311 -650734 -28700 397939 369829 172613 115250
36767A15250j7447k07294l43249k42837k1051K15629M48267N09236K01072k73457
$$ 115250 97803 -109491 -452740 -695577 -716628 -500999 -52732 456504 657576 384119
36757C84119m10990p4679K98524L21035J42605R0046J25748o685k74687l66088
$$ 384119 -26871 -101550 196974 518009 660614 750660 876408 869723 595036 228948
36747B28948j94130n9777j74968k76563R497N22300O46486J34529n00413o66737
$$ 228948 34818 -24959 -199927 -476490 -466993 55307 701793 836322 335909 -330828
36737c30828m54021l10171k34051J07083N65343N53814K7546k99585j2331M05466
$$ -330828 -784849 -1095020 -1329071 -1221988 -656645 -102831 -75285 -374870 -387201 18265
36727A8265M20473K30799J72119q704n82394j065390q36138j61738K12736K18442
$$ 18265 438738 669537 841656 832952 250558 -814832 -1650970 -1812708 -1599972 -1381530
36717a381530L49168O01785M62527q9456m65552m33270l72096m37896k72026K43481
$$ -1381530 -1032362 -430577 31950 -57506 -523058 -956328 -1328424 -1766320 -2038346 -1794865
36707a794865O56991O21945L05002l9192l07330k82712J84149O39841M30436k33180
$$ -1794865 -1137874 -515929 -210927 -250119 -557449 -840161 -656012 -16171 414265 181085
36697A81085m39395J5127L02139m8528m13130k08720J76461K11159J15155K00124
$$ 181085 -258310 -243183 58956 10428 -402702 -611422 -434961 -223802 -108647 91477
36687I1477J12854m24921q05525l89037L64960N54503K04522M5399K49530L39818
$$ 91477 204331 -220590 -1026115 -1415152 -1050192 -495689 -291167 -245768 3762 343580
36677C43580J70268Q9336J83464J51377o9588k13175j87012j00543P7572L26691
$$ 343580 513848 603184 786648 938025 868437 655262 468250 367707 445279 771970
36667G71970K69113k84788p32605l89435L84471O06268J16694k92592k02211p4821
$$ 771970 1041083 756295 23690 -365745 18726 624994 741688 449096 246885 172064
36657A72064k62433l96989j31706K31398K80583J26142J05596K55246L82004L58358
$$ 172064 -90369 -487358 -619064 -387666 -107083 19059 124655 379901 761905 1120263
36647A120263J57075j35923k78514j46881k0623k14157n12613m57632j10116M3109
$$ 1120263 1277338 1141415 862901 716020 695397 481240 -31373 -489005 -599121 -556012
36637e56012r4907j27171J08784L29197L64354L25475J99516q3998k14688J27332
$$ -556012 -650919 -778090 -669306 -340109 24245 349720 549236 465238 250550 377882
36627C77882M95184J58408n94667o72762R4335N81305J53833l17039O2506P33619
$$ 377882 873066 1031474 436807 -235955 -141620 439685 593518 276479 338985 1072604
36617A072604O24811k08373q78518j032031r31530n92030J56356R26280R82726
$$ 1072604 1697415 1489042 610524 -421507 -1353037 -1945067 -1788711 -862431 120295
36608A20295K09983p20306j096950o91357K17184R36528Q39978J70744r2917L75526
$$ 120295 330278 -390028 -1486978 -2178335 -1961151 -1024623 -184645 -13901 -106818 268708
36598B68708O46657k9938r13903q55920r1908K17043j48218l46917p8343L0348
$$ 268708 915365 885427 -28476 -884396 -976304 -759261 -907479 -1254396 -1332739 -1302391
36588a302391k52733l16938R2121L55331J15114o5989K77232O99523O51143L66012
$$ -1302391 -1555124 -1872062 -1779941 -1424610 -1309496 -1375485 -1098253 -398730 252413 618425
36578F18425L08533L38729R3863k47336k27142J37805L79909J79482l86701r66935
$$ 618425 926958 1265687 1359550 1112214 885072 1022877 1402786 1582268 1195567 228632
36568B28632j085588n08266L25027O19515J98107k83334l05939j24168j23354
$$ 228632 -856956 -1365222 -1040195 -420680 -222573 -505907 -811846 -936014 -1059368
36559a059368j53467J9573J49887j7158j63135Q7175M43841M02263J04165N5177
$$ -1059368 -1212835 -1193262 -1043375 -1060533 -1223668 -1136493 -692652 -290389 -186224 -131047
36549a31047K16439J09888k91688n06071l55617j57279n4031J76769N18656N61027
$$ -131047 85392 195280 -96408 -602479 -958096 -1115375 -1169406 -992637 -473981 87046
36539H7046J88650j24779j7103K23324J60520j14712j97166j3051J28614L1210
$$ 87046 275696 150917 133814 357138 517658 402946 205780 192729 321343 352553
36529C52553j54346j99297j06676q2601k44912m12336k80225J42077M32552K71149
$$ 352553 198207 -1090 -107766 -190367 -435279 -847615 -1127840 -985763 -553211 -282062
36519b82062j06000k43013j23538j12284k82516k57099J72700O80398Q45722O27541
$$ -282062 -388062 -631075 -754613 -866897 -1149413 -1406512 -1233812 -553414 292308 919849
36509I19849K08281k93199p15818p91216m91280j82215j26527q3895K49054O56114
$$ 919849 1128130 834931 119113 -672103 -1163383 -1345598 -1472125 -1556020 -1306966 -650852
36499f50852O99086M20913K47818K61872J11299k95043n33688l04065J22167L50647
$$ -650852 48234 469147 716965 978837 1090136 795093 261405 -42660 79507 430154
36489D30154L89877M22678L80280J21200j98593l29798l40115m23242m42258j39991
$$ 430154 820031 1242709 1622989 1744189 1545596 1215798 875683 452441 10183 -129808
36479a29808K48996J51131m55738q33554m62010K00867L47008q9710m53584l32455
$$ -129808 119188 270319 -185419 -1018973 -1480983 -1280116 -933108 -1022818 -1476402 -1808857
36469a808857O705J65439J31384R3999J08758J69205L47546O16825P24572M96408
$$ -1808857 -1802152 -1636713 -1505329 -1411330 -1302572 -1133367 -785821 -168996 555576 1051984
36459A051984J31578m9119m0283p3794j92838k24417j61385k09304l59586k87627
$$ 1051984 1183562 1134443 1094160 1020366 827528 603111 441726 232422 -127164 -414791
36449d14791R9050L45601N2054m29325l72114K95232Q24840O24924l8030n23209
$$ -414791 -315741 29860 81914 -347411 -719525 -424293 400547 1025471 987441 464232
36439D64232n96814m10168n6363L88499N99714L08752j83252k97852r997J19770
$$ 464232 -132582 -542750 -599113 -210614 389100 697852 514600 216748 206751 326521
36429C26521j45560l20820O58M23909L02949k62569n24070j46504K98255Q6150
$$ 326521 180961 -139859 -139201 284708 587657 325088 -198982 -345486 -47231 38919
36419C8919o74693j097599n75488M11891P99823K67034l08837l3779P19399Q36579
$$ 38919 -635774 -1733373 -2308861 -1896970 -1097147 -830113 -1138950 -1172729 -453330 383249
36409C83249J14007m62275k41838K00682J75276L293K41999M84285o625q56663
$$ 383249 497256 34981 -206857 -6175 169101 172394 414393 898678 892053 35390
36399C5390r39782j06052N62948L83656o9823o6529K43195L76617L41001L37385
$$ 35390 -904392 -1010444 -447496 -63840 -133663 -200192 43003 419620 760621 1098006
36389A098006K38419o3074k52752q0551J49427P7491r4550N842K45002K26560
$$ 1098006 1336425 1273351 1020599 940048 1089475 1166966 1072416 1078258 1323260 1549820
36379A549820l8214k03268j44371j3579P7776N4401k17152o39879p59165l29104
$$ 1549820 1511606 1308338 1163967 1150388 1228164 1282565 1065413 425534 -333631 -662735
36369f62735K47144M44442K91824R2069j73195n92792q05052m15738K59334N64211
$$ -662735 -415591 28851 320675 412744 239549 -353243 -1158295 -1574033 -1314699 -750488
36359g50488M72304M61018N32002K06469m46394o68345j79897L01885J35172l26098
$$ -750488 -278184 182834 714836 921305 474911 -193434 -373331 -71446 63726 -262372
36349b62372m03992j42980n8652j90223p1746M44551Q97172Q41384M05399P0251
$$ -262372 -666364 -809344 -867996 -1058219 -1129965 -685414 211758 1053142 1458541 1528792
36339A528792P9217K13852J27828j96249m33882l73750j95443j48017j63025o1328
$$ 1528792 1608009 1821861 1949689 1753440 1319558 945808 750365 602348 439323 377995
36329C77995M4178n2897j68647P1393N47774O70801K06624l88655o39248o12323
$$ 377995 422173 369276 200629 272022 819796 1490597 1697221 1308566 669318 56995
36319E6995n68616m57081r8213L84170O25049L95867k12876q20545r37256m06462
$$ 56995 -511621 -968702 -1066915 -682745 -57696 338171 125295 -695250 -1632506 -2038968
36309b038968K84040M81287K03898O4008K83463L66109j5950m18778l24663P4835
$$ -2038968 -1754928 -1273641 -1069743 -1005735 -722272 -356163 -372113 -790891 -1115554 -1040719
36299a040719K97944L42729M75788N96740M21528P2714r3598q8962j81536l34219
$$ -1040719 -742775 -400046 75742 672482 1094010 1166724 1073126 984164 802628 468409
36289D68409k98398j45425j46939k11457j0758L72481M97503K72550M9477j2682
$$ 468409 170011 24586 -122353 -333810 -344568 27913 525416 797966 847443 834761
36279H34761r9311k02028o2704J96532M1084n98465j019964p06431p1499J99538
$$ 834761 735450 533422 470718 667250 708334 109869 -910095 -1616526 -1688025 -1488487
36269a488487J07776J15847L02843L27442O8161k29287l80685l99144k58463N8875
$$ -1488487 -1380711 -1264864 -962021 -634579 -566418 -795705 -1176390 -1575534 -1833997 -1775122
36259a775122L18871K71791J16880K66456O08767N44965n3353m77661j61938M27281
$$ -1775122 -1456251 -1184460 -1067580 -801124 -192357 352608 299255 -178406 -340344 86937
36249H6937M40429r9991l69138j804M29584L79593J10536J04915K25235L1613
$$ 86937 527366 427375 58237 56433 486017 865610 976146 1081061 1306296 1337909
36239A337909l92869n70637m33239l66346m73222m09422m3370L00392M26813N41763
$$ 1337909 945040 374403 -58836 -425182 -898404 -1307826 -1351196 -1050804 -623991 -82228
36229h2228P06636N82069N3856l99173l79731j61930j52190j99531J3722K82196
$$ -82228 624408 1206477 1260333 861160 481429 319499 167309 -32222 -18500 263696
36219B63696K14149l2791k9494J22628j1226l26519k78716J41174L12431K462
$$ 263696 477845 445054 415560 538188 526962 200443 -78273 62901 375332 377794
36209C77794k71025j48382L807j89387m31301k71919J46178L61967L05378K63400
$$ 377794 106769 -41613 -37806 -227193 -658494 -930413 -784235 -422268 -116890 146510
36199A46510L40789L73226K73716J43028Q4431J03555J25482K7563k00273l11435
$$ 146510 487299 860525 1134241 1277269 1361700 1465255 1590737 1618300 1418027 1106592
36189A106592p8120K76468K96393P277o3957K47348M01597R478m80297m27772
$$ 1106592 1028472 1304940 1601333 1608610 1544653 1792001 2193598 2203076 1722779 1295007
36179A295007N1103L19196J33126j99430l83686l58554j04805K77878M13993M8880
$$ 1295007 1346110 1665306 1798432 1599002 1215316 856762 751957 1029835 1443828 1492708
36169A492708m76248n98509l01085l6663L7576J97932M99787N56990J66604l02441
$$ 1492708 1016460 417951 116866 80203 117779 315711 815498 1372488 1539092 1236651
36159A236651m06501j95096l6659j02780k45195k52130p2610J47669K07020R0261
$$ 1236651 830150 635054 598395 495615 250420 -1710 -74320 73349 280369 370630
36149C70630K0671J53833L24348K73891M895l10398o03671p95727o05207Q6267
$$ 370630 391301 545134 869482 1143373 1148268 837870 234199 -561528 -1166735 -1080468
36139a080468P85829Q26294K70750j30381J8981K76709J12897l37837n73437m05972
$$ -1080468 -294639 531655 802405 672024 691005 967714 1080611 742774 169337 -236635
36129b36635l5024K81026L54354J22749j68905r0243M04333P53662M23778m10354
$$ -236635 -271659 9367 363721 486470 317565 227322 631655 1385317 1809095 1398741
36119A398741j079042j161461p71057k44995J80796M41558N78747N99778L95279
$$ 1398741 319699 -841762 -1612819 -1857814 -1677018 -1235460 -656713 -56935 338344
36110C38344m6331l77960k01027K80952L54215k24783p83247o32408n099L94217
$$ 338344 292013 -85947 -286974 -6022 348193 123410 -659837 -1292245 -1297344 -903127
36100i03127M28000M91606O55337N61955J81183k9967J00735J32968k42507o29229
$$ -903127 -475127 16479 671816 1233771 1414954 1384987 1485722 1618690 1376183 746954
36090G46954m93451L2225L35282J23355l31579o32126n99707k40971K91423O61911
$$ 746954 253503 285728 621010 744365 412786 -219340 -819047 -1060018 -768595 -106684
36080a06684N56734N4547l78927l97462j56337m3492j23433p7740K69673O22960
$$ -106684 450050 504597 125670 -271792 -428129 -471621 -595054 -672794 -403121 219839
36070B19839O09293L26431J71616J78849n3344o37677j024945o99423M6116M79868
$$ 219839 829132 1155563 1327179 1506028 1452684 815007 -209938 -909361 -863245 -383377
36060c83377M18922L37891M95111M95199m5845q00284j055410n79704J26875M11973
$$ -383377 35545 373436 868547 1363746 1317901 517617 -537793 -1117497 -990622 -578649
36050e78649J28344k80035k71071K03104O19023M86643l9726l58342j85077J74296
$$ -578649 -450305 -730340 -1001411 -798307 -179284 307359 267633 -90709 -275786 -101490
36040a01490L46356L18335J92348j04095n48734p59069m11277K17298N24813L44859
$$ -101490 244866 563201 755549 651454 102720 -656349 -1067626 -850328 -325515 19344
36030A9344N6559l1995K695N1856J98541M00042L37864j03015m92313l78585J5868
$$ 19344 75903 43908 46603 98459 297000 697042 1034906 931891 439578 60993 76861
36019G6861N9652l65087o62036l74479J66048L33998P2735j21989L8812L07084
$$ 76861 136513 -228574 -890610 -1265089 -1099041 -765043 -692308 -814297 -775485 -468401
36009d68401L69988K87571K87239L81065M08732L01686J00636j65457m15975m43910
$$ -468401 -98413 189158 476397 857462 1266194 1567880 1668516 1503059 1087084 643174
35999F43174j34661K96414M97940L79457J28349r8957k64389k84756q9028J32861
$$ 643174 508513 804927 1302867 1682324 1810673 1711716 1447327 1162571 1073543 1206404
35989A206404N0424l27784n62208l26453J62696M22097K57916r1254k50706o8288
$$ 1206404 1256828 929044 366836 40383 203079 625176 883092 791838 541132 472844
35979D72844K06580J04290n01947j050083q53727n1911M64213K53000p3427J70510
$$ 472844 679424 783714 281767 -768316 -1622043 -1673954 -1209741 -956741 -1030168 -859658
35969h59658O53841N40788k00820p31447n39700l6882J71161L0461j60780k19376
$$ -859658 -205817 334971 134151 -597296 -1136996 -1173878 -1002717 -972256 -1133036 -1352412
35959a352412o7785L60686Q94477J069986O08753j97611p76029q16076m24593
$$ -1352412 -1420197 -1059511 -165034 904952 1513705 1316094 540065 -276011 -700604
35950g00604O1046K98986J91183R909O6364K21061O1504l59548m39790O3661N23512
$$ -700604 -639558 -340572 -149389 -139480 -73116 147945 209449 -150099 -589889 -526228 -2716
35939b716K91530l11150m37303M1904L70201J7721n94247o87163q2153O69946
$$ -2716 288814 -22336 -459639 -417735 -47534 -29813 -624060 -1311223 -1393376 -723430
35929g23430R20489N21690j00382l91606k36871l1486j11478k94576k15079O7980
$$ -723430 197059 718749 618367 226761 -10110 -41596 -153074 -447650 -662729 -594749
35919e94749J69517Q553q3307P7533K63839K54721J48073Q6660K180j60556k56571
$$ -594749 -425232 -416679 -499986 -422453 -158614 96107 244180 330840 333020 172464 -84107
35908h4107k06911j80810k52632j43228L48896Q47629P49612M3196n93303n78684
$$ -84107 -291018 -471828 -724460 -867688 -518792 328837 1078449 1121645 528342 -50342
35898e0342k7295N26216P30132N88875K61713o0902j82952p1707n082k95982p86431
$$ -50342 -77637 448579 1178711 1767586 2029299 1968397 1785445 1713738 1708656 1412674 626243
35887F26243q90777l66494K02824R4391m98371o38143L0811P26928O50040J08084
$$ 626243 -264534 -631028 -428204 -333813 -832184 -1470327 -1439516 -712588 -62548 45536
35877D5536n7112K39797L80041J84113J29629L73657M23147N1797k41540j12044
$$ 45536 -11576 228221 608262 792375 922004 1295661 1718808 1770605 1529065 1417021
35867A417021m745l61178p82238o34831n0089L50558L71124K17828j03607o14214
$$ 1417021 1412276 1051098 268860 -365971 -416060 -65502 305622 523450 419843 -194371
35857a94371q35109k76461O27228Q94870L51556j72876r7048K38178L40020K41758
$$ -194371 -1029480 -1305941 -678713 216157 567713 394837 297789 535967 875987 1117745
35847A117745J04338j62727n04742n62666k99839j97159m20190m24401R6577N01333
$$ 1117745 1222083 1059356 554614 -8052 -307891 -505050 -925240 -1349641 -1253064 -751731
35837g51731J26014n82430o45550N7012P53679R20940O92169K68401k85334o62383
$$ -751731 -625717 -1208147 -1853697 -1796685 -1043006 -122066 570103 838504 553170 -109213
35827a09213m86071M0949L07640J96435J61139L29095K86406l1857n4027L96985
$$ -109213 -595284 -554335 -246695 -50260 110879 439974 726380 694523 640496 1037481
35817A037481N37566k58901j331236j490199o08234L06516N09001K71830J78970
$$ 1037481 1575047 1316146 -15090 -1505289 -2113523 -1807007 -1298006 -1026176 -847206
35808h47206L01985L38478J59072p7436j58415J0279L35025N54870M66909J69769
$$ -847206 -545221 -206743 -47671 -125107 -283522 -273243 61782 616652 1083561 1253330
35798A253330o5576j68950l10618n37451o16149l68811K1987K20316J54126O5028
$$ 1253330 1187754 1018804 708186 170735 -445414 -814225 -792238 -571922 -417796 -352768
35788c52768J68761L88179M54186K25525j31903l15094k27225o8054l3593n0223
$$ -352768 -184007 204172 658358 883883 751980 436886 209661 141607 108014 57791
35778E7791M3983J54051J4497l67455o16395m56365p2306J59432J46455R2061
$$ 57791 101774 255825 270322 -97133 -713528 -1169893 -1242199 -1082767 -936312 -844251
35768h44251J44784K66778M06544N59915O27106M35638J4270l24676l24834j04553
$$ -844251 -699467 -432689 -26145 533770 1160876 1596514 1610784 1286108 961274 856721
35758H56721J2719q0357j85506j12944P5496J78743R7127r1213k13457j30895
$$ 856721 869440 789083 603577 490633 566129 744872 841999 750786 537329 406434
35748D06434J22641K99661J54702k36527m96558l74379k7153K36884L32593L23380
$$ 406434 529075 828736 983438 746911 250353 -124026 -151179 85705 418298 741678
35738G41678J45935k56212n87630m07107K11733O10903L70268j20794k22794R3098
$$ 741678 887613 631401 43771 -363336 -151603 459300 829568 708774 485980 579078
35728E79078L48066L31764K67692K34689j9048n00427o96050k40143M43811N92585
$$ 579078 927144 1258908 1526600 1761289 1742241 1241814 545764 305621 749432 1342017
35718A342017P2780m78364m69809J270L79531K80406j93667n91217m99851N7577
$$ 1342017 1414797 936433 466624 467894 847425 1127831 934164 342947 -156904 -99327
35708i9327N70093N33121L8279l04091j00701L54978M72444N2599n86005j029142
$$ -99327 470766 1003887 1042166 738075 637374 992352 1464796 1517395 931390 -97752
35698i7752j085102p50394j29153N40727R53536R34932N28095r6280o87435r03347
$$ -97752 -1182854 -1933248 -2062401 -1521674 -568138 366794 894889 798609 111174 -792173
35688g92173n01604L22226R53636R09412L16039k80107m94532l57582r4275J16629
$$ -792173 -1293777 -971551 -17915 891497 1207536 927429 432897 75315 -18960 97669
35678I7669J78570J04373O4051K13138M04716K78869k31961o78250n81883m1241
$$ 97669 276239 380612 444663 657801 1062517 1341386 1109425 431175 -150708 -191949
35668a91949L76008L11165k2405j74747K3995L54292M90190L03317n8270l35229
$$ -191949 184059 495224 472819 298072 322067 676359 1166549 1469866 1411596 1076367
35658A076367m10395l83922l71036l12574j13687R3149M1919k63151m51114k38171
$$ 1076367 665972 282050 -88986 -401560 -515247 -422098 -380179 -643330 -1094444 -1332615
35648a332615J70500L35724J76509P1730L11740O50194N92725O8999m10194l58522
$$ -1332615 -1162115 -826391 -649882 -578152 -266412 383782 976507 1045506 635312 276790
35638B76790R3671M03212L07854L4601j82735m18444o98107o95860j95201L67965
$$ 276790 370461 773673 1081527 1116128 933393 514949 -183158 -879018 -1074219 -706254
35628g06254L44526j78985m04455Q4350P49992Q61566L89853j73735n05520n61772
$$ -706254 -361728 -540713 -945168 -860818 -110826 750740 1140593 966858 461338 -100434
35618a00434l27728P0786K23441j01851m88023l54705J74957M21207J43444j76301
$$ -100434 -428162 -357376 -133935 -235786 -723809 -1078514 -903557 -482350 -338906 -515207
35608e15207j46903r209j18779l41892k97103R3158N67803Q22158O50544N5235
$$ -515207 -662110 -671319 -790098 -1131990 -1429093 -1335935 -768132 54026 704570 759805
35598G59805n91566p58942l42615J89090L88765K85180J02686q2118j59331J06841
$$ 759805 168239 -590703 -933318 -744228 -355463 -70283 32403 -49715 -209046 -102205
35588a02205O10702P36490J45643n73720n98141K554M15404K37923j34850k63481
$$ -102205 508497 1244987 1390630 816910 218769 221323 636727 874650 739800 476319
35578D76319j96694j39491j09205q9892j18969r6895J08214L07198J83434j04748
$$ 476319 279625 140134 30929 -58963 -177932 -274827 -166613 140585 324019 219271
35568B19271n1586L36227M21301m7133m26400j51738L32094K34065l67782o84073
$$ 219271 167685 503912 925213 878080 451680 299942 632036 866101 498319 -185754
35558a85754m06112k1198P6663J19252L94284O72040N63114J55901p1183J05722
$$ -185754 -591866 -613064 -536401 -417149 -22865 649175 1212289 1368190 1297007 1402729
35548A402729L69562K79590j53601m43610k28152K19495K95215j15680m36012
$$ 1402729 1772291 2051881 1898280 1454670 1226518 1446013 1741228 1625548 1189536
35539A189536j93066K90601L57049l1850k65415O86L67746L06867j06153l48113
$$ 1189536 996470 1287071 1644120 1612270 1346855 1347541 1715287 2022154 1916001 1567888
35529A567888j44171K79412N65692N90810M21644J18618k64442n55484n26125
$$ 1567888 1423717 1703129 2268821 2859631 3281275 3399893 3135451 2579967 2053842
35520B053842j59499K45802L58485J55203j21188k63156k08860M1815L67531M46830
$$ 2053842 1894343 2140145 2498630 2653833 2532645 2269489 2060629 2102444 2469975 2916805
35510B916805P8189m12435m77488j38898j1369l48851n89793k21093L90868N60659
$$ 2916805 2994994 2582559 2105071 1966173 1954804 1605953 1016160 795067 1185935 1746594
35500A746594K89884Q3658M7712j01409k74293o7567L69975L35369l28834q56936
$$ 1746594 2036478 2120136 2167848 2066439 1792146 1724579 2094554 2429923 2101089 1244153
35490A244153o58661j79832j74651n87023p21506k59179M18893P96856O91960
$$ 1244153 585492 405660 231009 -356014 -1077520 -1336699 -917806 -120950 571010
35481E71010K26261l12576n82579m19971p962K89150K39187j13176m67313m32824
$$ 571010 797271 484695 -97884 -517855 -525817 -236667 2520 -110656 -577969 -1010793
35471a010793Q6516O47821P03470L17850O9728J66184J62503k12931n17753l09743
$$ -1010793 -924277 -276456 427014 744864 814592 980776 1143279 930348 412595 102852
35461A02852P8354N5920k67430k90060Q5757L21360J04243k33756k82764j01072
$$ 102852 181206 237126 -30304 -320364 -234607 86753 190996 -42760 -325524 -426596
35451d26596k6927k16550m77921m23631J49467Q75944J019586L33090n10165p08144
$$ -426596 -453523 -670073 -1147994 -1571625 -1422158 -546214 473372 806462 296297 -411847
35441d11847l10078M6425J12376J34037J68660K5442j46348K6955L66007K66849
$$ -411847 -721925 -675500 -563124 -429087 -260427 -234985 -381333 -354378 11629 278478
35431B78478k18588k78144L39671P64537L35726k87016j41419M99560N68988j26913
$$ 278478 59890 -218254 121417 885954 1221680 934664 793245 1292805 1861793 1734880
35421A734880o79681m91571j2344J24868n2274k01182k60018k86502j26320L05556
$$ 1734880 1055199 563628 551284 676152 623878 422696 162678 -123824 -250144 55412
35411E5412O61318N16106M851k61768M3447N59795P15222M25959J05515J6884
$$ 55412 716730 1232836 1237687 975919 1019366 1579161 2294383 2720342 2825857 2842741
35401B842741r5999n36327j027508r55462k40070M65265O10209L72118J67790
$$ 2842741 2746742 2210415 1182907 227445 -12625 452640 1062849 1434967 1602757
35392A602757k8201l99076o51015l21111L76259O78870L33780r3506j56510j61442
$$ 1602757 1574556 1175480 524465 203354 579613 1258483 1592263 1498757 1342247 1180805
35382A180805m98633q61974o76092q217M99466M99555K61123J34160J22067P6948
$$ 1180805 682172 -179802 -855894 -864111 -364645 134910 396033 530193 652260 729208
35372G29208j8521j14706k12690k75218j81284R0742L32986K90298m7763m06525
$$ 729208 710687 595981 383291 108073 -73211 17531 350517 640815 593052 186527
35362A86527m91255k83019m5838n55m0530R0653L53976L95061Q2577k03817p4413
$$ 186527 -304728 -587747 -633585 -634140 -674670 -584017 -230041 165020 247597 43780 -30633
35351c0633K99949M57913L25267J96427J29422j08123m34407l89327P1213K79900
$$ -30633 269316 727229 1052496 1248923 1378345 1270222 835815 446488 517701 797601
35341G97601k02112q11040p27896p0608L45912K49630J20259J62189m9342o05180
$$ 797601 595489 -215551 -943447 -1014055 -668143 -418513 -298254 -136065 -185407 -790587
35331g90587p80448j05000P15404P12536R1365j09949L64101O34111J01529o23131
$$ -790587 -1571035 -1676035 -960631 -248095 -156730 -266679 97422 731533 833062 209931
35321B09931o47720n7066L23236Q8377l73759n39590l11345P0948L28722L15757
$$ 209931 -437789 -494855 -171619 -83242 -457001 -996591 -1307936 -1236988 -908266 -592509
35311e92509J26130M0152J82494K99073J01881k40754k70823R3878L97462K74176
$$ -592509 -466379 -426227 -243733 55340 157221 -83533 -354356 -260478 136984 411160
35301D11160m6543p8172K61068N67302M63396q258m93438o66964m43368J9238
$$ 411160 364617 286445 547513 1114815 1578211 1569953 1076515 409551 -33817 -14579
35291a4579M40942N87030L94860j866l44004l88631q9327L21373N09509L68668
$$ -14579 426363 1013393 1408253 1406387 1062383 673752 584425 905798 1415307 1783975
35281A783975J17946Q036N691j07922l67975n33008m19301j75052p6940j29132
$$ 1783975 1901921 1909957 1915648 1807726 1439751 906743 487442 312390 235450 106318
35271A06318n6696K62031N27792L44996k35625o82108n64740n1165L18597K80857
$$ 106318 49622 311653 839445 1184441 948816 266708 -298032 -349197 -30600 250257
35261B50257O7417m2959j23687l46083n26259k92203L05167P23116O02726J86214
$$ 250257 317674 274715 151028 -195055 -721314 -1013517 -708350 14766 617492 803706
35251H03706j34239l33412n00425m21371O8233N32093L76915j96929l82465o806
$$ 803706 669467 336055 -164370 -585741 -517508 14585 391500 194571 -187894 -194700
35241a94700J77252k44046n66907n8965P99297R66831L48334k14527k62942j53366
$$ -194700 -17448 -261494 -828401 -887366 -88069 878762 1227096 1012569 749627 596261
35231E96261j89973j81185j3394Q7718R5042L07068O96729P85210M36060J23282
$$ 596261 406288 225103 211709 299427 394469 701537 1398266 2183476 2619536 2742818
35221B742818J02120q49l85653n88910l17264p6504l13040n59917k23470L15959
$$ 2742818 2844938 2844089 2458436 1869526 1552262 1475758 1162718 602801 379331 695290
35211F95290K92460j54047k51864P7289J78534j25981k87073o9155R6439j3387
$$ 695290 987750 833703 581839 659128 837662 711681 424608 355453 451892 438505
35201D38505n5817R6960L8839l63262n90144k99566J26860K70658K76571L36767
$$ 438505 382688 479648 518487 155225 -434919 -734485 -607625 -336967 -60396 276371
35191B76371K08096k38632n49479l36140P3799J86532R9274J43597K12325P9805
$$ 276371 484467 245835 -303644 -639784 -565985 -379453 -280179 -136582 75743 155548
35181A55548R700L36573P23294N67259k6157l84546k80015j13968j39167j77991
$$ 155548 165248 501821 1225115 1792374 1766217 1381671 1101656 987688 848521 670530
35171F70530j45401k03672l02570j63778J52708K35138K0204n5614J94406L55172
$$ 670530 525129 321457 18887 -144891 7817 242955 263159 207545 401951 757123
35161G57123R4824k78193k98320j9234J49120K1736k46028m24085l56104m1055
$$ 757123 851947 573754 275434 256200 405320 427056 181028 -243057 -599161 -640216
35151f40216K42199J15401l96988p69967n92694p6640K62835K43566J07635J16441
$$ -640216 -398017 -282616 -679604 -1449571 -2042265 -2118905 -1856070 -1612504 -1504869 -1388428
35141a388428K70756L67708K17850j20140l02472o5170L77871N59910L94229K28933
$$ -1388428 -1117672 -749964 -532114 -652254 -954726 -1019896 -642025 -82115 312114 541047
35131E41047K05355K0464m51727p64632n06152N2363L53514L33367L29803M04761
$$ 541047 746402 766866 315139 -449493 -955645 -903282 -549768 -216401 113402 518163
35121E18163K86249n7888k72145j15775K33769M45761L39314p9539o00639q29080
$$ 518163 804412 746524 474379 358604 592373 1038134 1377448 1297909 697270 -131810
35111a31810n19695O6614L94246K70463J919o6714P8343K30681K17101K5821j40569
$$ -131810 -651505 -584891 -190645 79818 81737 15023 93366 324047 541148 566969 426400
35100D26400o089L83932N63298K44068j72862j33023J77129P3712n03567q17983
$$ 426400 420311 804243 1367541 1611609 1438747 1305724 1482853 1556565 1052998 235015
35090B35015m68140O160K3224j59363J1603M50222O50486M96400K34839r9419
$$ 235015 -233125 -226965 -203741 -363104 -351501 98721 749207 1245607 1480446 1381027
35080A381027n71492q19816l55088N87326J129331Q23701J31817l05619l78019
$$ 1381027 809535 -10281 -365369 221957 1351288 2174989 2306806 2001187 1623168
35071A623168l06077k14243j71737k79574m33068l01414J92879O44229O67024
$$ 1623168 1317091 1102848 931111 651537 218469 -82945 109934 754163 1421187
35062A421187L80548J41224L4261q2354k25605k83832k44491j75386q5437o740
$$ 1421187 1801735 1942959 1977220 1894866 1669261 1385429 1140938 965552 880115 873375
35052H73375o8664k68838l31540n9986L02984L58361J05078r0757m0025N3011
$$ 873375 804711 535873 204333 144347 447331 805692 910770 820013 779988 832999
35042H32999n9192l49176n99420o21786l56633Q7329M52914N12481K62096j00976
$$ 832999 773807 424631 -174789 -796575 -1153208 -1065879 -612965 -100484 161612 60636
35032F0636l40899k90181N8423M63320N94923M14705K25055K19561K31343J08215
$$ 60636 -280263 -570444 -512021 -48701 546222 960927 1185982 1405543 1636886 1745101
35022A745101J5389O2074l4907m72576q39949o37054j11054P0555j33938j46060
$$ 1745101 1760490 1822564 1787657 1315081 475132 -161922 -272976 -202421 -336359 -482419
35012d82419J84640L40357J07830k7962J94892K85163r6283m06771p7839M57301
$$ -482419 -297779 42578 150408 122446 317338 602501 506218 99447 21608 478909
35002D78909L88045j90046m49231j04036K97081L26613J75480R4280p284k06486
$$ 478909 866954 676908 227677 123641 420722 747335 922815 1017095 1009811 803325
34992H03325l39017l38036l79307n03707m73300j78827J45519K69869K28757J20401
$$ 803325 464308 126272 -253035 -756742 -1230042 -1408869 -1263350 -993481 -764724 -644323
34982f44323l9083j60371j10393O542n1520j95606n3484L76653N91235L38021
$$ -644323 -683406 -843777 -954170 -947628 -999148 -1194754 -1248238 -871585 -280350 57671
34972E7671K9411N1405J20674j71168n32818l30202L77403Q05477N19530j878
$$ 57671 87082 138487 259161 87993 -444825 -775027 -397624 407853 927383 925505
34962I25505r2945K12515L25324p4680o46045p93024l21265L35469N33634R2800
$$ 925505 832560 1045075 1370399 1295719 649674 -143350 -464615 -129146 404488 497288
34952D97288m99098o40783k95460O8368J60007J92627M20084O40549M60602o2901
$$ 497288 -1810 -642593 -938053 -869685 -709678 -517051 -96967 543582 1004184 941283
34942I41283l91759j89226K37018L50150O1747k39051k41974l6118J30574J56079
$$ 941283 549524 360298 597316 947466 1009213 770162 528188 492070 622644 778723
34932G78723O6993q3256j78212r1289R0480Q6050j76462l77282k34492P7796J98378
$$ 778723 845716 762460 584248 492959 583439 669489 493027 115745 -118747 -40951 157427
34921A57427Q6336m7567j47653k65489k26559J79866O80286O89596J39433l22670
$$ 157427 243763 196196 48543 -216946 -443505 -263639 416647 1106243 1245676 923006
34911I23006j98612J79619J56035l23511o49286l29969M15628Q68287N39945k77961
$$ 923006 724394 904013 1060048 736537 87251 -242718 172910 1041197 1581142 1303181
34901A303181p53203m32311J99057L38580r2089m62733m19151k60491k26376n8542
$$ 1303181 549978 117667 316724 655304 563215 100482 -318669 -579160 -805536 -864078
34891h64078M01870P51740O19300K76946J76895K48925J65142l0298j00772j44833
$$ -864078 -462208 289532 908832 1185778 1362673 1611598 1776740 1746442 1645670 1500837
34881A500837l69471n60670l80592l3938k7624l58419n31856l34267j0053K75745
$$ 1500837 1131366 570696 190104 156166 128542 -229877 -761733 -1096000 -1106053 -830308
34871h30308N46094O20565K80865j39370l3561M86319N99856O513n80987n25077
$$ -830308 -284214 336351 617216 477846 444285 930604 1530460 1536973 955986 430909
34861D30909j53882o9535j73079j9390K85685K51189j45925m21909l43200j75958
$$ 430909 277027 207492 34413 15023 300708 551897 405972 -15937 -359137 -535095
34851e35095j52282j48626l168J93837K76887K60216K84830M09681N33245N13492
$$ -535095 -687377 -836003 -839171 -645334 -368447 -108231 176599 586280 1119525 1633017
34841A633017L69492L08243M27945M57556M7434o62028j077613q69916l40619
$$ 1633017 2002509 2310752 2738697 3196253 3243687 2581659 1504046 634130 293511
34832B93511P8125L45080N87142O89126M66766M4856k78230m08101m19829l09955
$$ 293511 371636 716716 1303858 1992984 2459750 2504606 2226376 1818275 1398446 1088491
34822A088491q0564P6095p600j73338j30127J38378L95583M59508K68254j77588
$$ 1088491 1007927 1084022 1076422 903084 772957 911335 1306918 1766426 2034680 1857092
34812A857092o66527p75266l55464J51704K48465N7796O3082L29544M66889K91718
$$ 1857092 1190565 415299 59835 211539 460004 517800 580882 910426 1377315 1669033
34802A669033K8972j45689k89353l83788l01832j34372j01732r4199K00457O32456
$$ 1669033 1698005 1552316 1262963 879175 577343 442971 341239 247040 447497 1079953
34792A079953O25552P5075l63870k11252J34324N7437l38990m78443k04435J01025
$$ 1079953 1705505 1780580 1416710 1205458 1339782 1397219 1058229 579786 375351 476376
34782D76376J49389L4334m1915M4176L50118P24783P47692J81854n73284q63303
$$ 476376 625765 660099 618184 662360 1012478 1737261 2484953 2666807 2093523 1230220
34772A230220n95732k95223l23289m48911l18753P606K11791J68490K5733k7676
$$ 1230220 634488 339265 15976 -432935 -751688 -744082 -532291 -363801 -338068 -365744
34762c65744Q7766L21871N04169M61908K15334k8163j21115j04128n9558j1026
$$ -365744 -277978 43893 548062 1009970 1225304 1197141 1076026 971898 912340 901314
34752I01314m0144k87797o66722p55120k53088N10516Q18991L98084k13528k86414
$$ 901314 861170 573373 -93349 -848469 -1101557 -591041 227950 626034 412506 126092
34742A26092K33756O90090N27923o9664m74819l95153j36529r0741k10400j64472
$$ 126092 359848 1049938 1577861 1508197 1033378 638225 501696 410955 200555 36083
34732C6083J27366L74208L36463J37965M3737R0498J11414N0093N3746K23403
$$ 36083 163449 537657 874120 1012085 1055822 1146320 1257734 1307827 1361573 1584976
34722A584976M07282L27087j22527p23962j064713q55774k19410L44441M04585
$$ 1584976 1992258 2319345 2196818 1472856 408143 -447631 -667041 -322600 81985
34713H1985N8294j75487Q650L27792L26548K6058j24173P4078K69132R3639k74242
$$ 81985 140279 -35208 -26558 301234 627782 653840 529667 603745 872877 966516 692274
34702F92274l64331q7187J69297J05054j30560k29340j28231L3134J78419L15845
$$ 692274 327943 240756 410053 515107 384547 155207 26976 60110 238529 554374
34692E54374L80885K55400n3508l75679n22552l92825J7660N73807R69242Q98450
$$ 554374 935259 1190659 1137151 761472 238920 -153905 -136245 437562 1406804 2305254
34682B305254L66277k38729m85747l26318j18854k00124m74698n08911n9400N75435
$$ 2305254 2671531 2432802 1947055 1620737 1501883 1301759 827061 318150 258750 834185
34672H34185Q39712N30730j2335l53832m22830m15831m02486k59442M3706L23451
$$ 834185 1673897 2204627 2192292 1838460 1415630 999799 597313 337871 381577 705028
34662G05028L95052K40633o3805l96071n12282j76707M66954Q70677O77350J97730
$$ 705028 1100080 1340713 1276908 880837 368555 191848 658802 1529479 2206829 2404559
34652B404559J4136K13031L52757J63947j20292k35333k93243m86030o92871o86773
$$ 2404559 2418695 2631726 2984483 3148430 3028138 2792805 2499562 2013532 1320661 633888
34642F33888n05754l01360k2391L75462N77285K47368l29888m73215n8471K72101
$$ 633888 128134 -173226 -195617 179845 757130 1004498 674610 201395 142924 415025
34632D15025P2897k44753j13957K38057J19473n17313r07749n10573K66537O22386
$$ 415025 487922 243169 129212 367269 486742 -30571 -938320 -1448893 -1182356 -559970
34622e59970L47263m5277n5871K13917K88150k0033l63676l43879p1810j936k31862
$$ -559970 -212707 -257984 -313855 -99938 188212 168179 -195497 -539376 -611186 -613122 -844984
34611h44984l11623Q6996O28377P54018M51167J93879K26657L32102L12151K65132
$$ -844984 -1156607 -1069611 -441234 312784 763951 957830 1184487 1516589 1828740 2093872
34601B093872K56778J00988k96100o49678o29669l19135q3268o8436p3159Q5165
$$ 2093872 2350650 2451638 2155538 1505860 876191 557056 473788 405352 332193 417358
34591D17358K77914K39921m1269k42811q9425K47623L16437n323k96932j65880
$$ 417358 695272 935193 893924 651113 561688 809311 1125748 1120425 823493 657613
34581F57613J87408K70491R535k16425j89711r4046j07468j47109j19211p6850
$$ 657613 845021 1115512 1125047 908622 718911 624865 517397 370288 251077 174227
34571A74227j9548J38991L13552L04582J84697K16714L01202K3627n69964q40406
$$ 174227 154679 293670 607222 911804 1096501 1313215 1614417 1638044 1068080 227674
34561B27674n21989k06375l79690n76225j64751N18873O61241K75867J07368L67458
$$ 227674 -294315 -500690 -880380 -1456605 -1621356 -1102483 -441242 -165375 -58007 309451
34551C09451M98935K37653k885O143p1536l44328l33906J51504N11061K55535
$$ 309451 808386 1046039 1043154 1049297 977761 633433 299527 451031 962092 1217627
34541A217627k03595k57938m4651l0775j34460p425J63896m8193m23812l24574
$$ 1217627 1014032 756094 711443 680668 546208 538783 702679 654486 230674 -93900
34531i3900K43843N85143L80880N8418m1864j25486l17164k85320J00478L33093
$$ -93900 149943 735086 1115966 1174384 1132520 1007034 689870 404550 505028 838121
34521H38121k202n06624n13845l8376L50365L72824K33962J14829j8269j37091
$$ 838121 835919 329295 -184550 -222926 127439 500263 734225 849054 830785 693694
34511F93694j29922o1917q1633q3839J52467M94678N36344K03355j13561j34756
$$ 693694 563772 501855 420222 336383 488850 983528 1519872 1723227 1609666 1474910
34501A474910l3217p1914k48444m53730o47360o94105l56180L20978Q91013R98389
$$ 1474910 1441693 1369779 1121335 667605 20245 -673860 -1030040 -709062 181951 1180340
34491A180340P44259L93080L2209k64417l03650j10820m8213k42160k62493J80257
$$ 1180340 1924599 2317679 2349888 2085471 1781821 1671001 1622788 1380628 1118135 1298392
34481A298392N89884L25648l87690p55558n38327j72995J02911M35546O57065
$$ 1298392 1888276 2213924 1826234 1070676 532349 359354 462265 897811 1554876
34472A554876L02968m46974o99502j11700N32570M85829P3312n874K34936L74670
$$ 1554876 1857844 1410870 711368 599668 1132238 1618067 1691379 1685505 1920441 2295111
34462B295111M28307N96124N84347L1589o45137o94629k01092K4914k98662o01409
$$ 2295111 2723418 3319542 3903889 3935478 3290341 2595712 2394620 2419534 2120872 1519463
34452A519463m74588k10528j21714n4259J08248J00735j69053k60419J41902O01281
$$ 1519463 1044875 834347 712633 658374 766622 867357 698304 437885 579787 1181068
34442A181068M52989k49602p32256m04209M71747J016924O02810m43321j072450
$$ 1181068 1634057 1384455 652199 247990 719737 1736661 2339471 1896150 823700
34433H23700o44011L10133P60783M50485Q639q2917Q076M4711J03550J60468m4676
$$ 823700 179689 489822 1250605 1701090 1709729 1626812 1634888 1679599 1783149 1943617 1898941
34422A898941m15571l96639J54495N96713M56199J39684J47509J84376k13844
$$ 1898941 1483370 1086731 1241226 1837939 2294138 2433822 2581331 2765707 2551863
34413B551863o71128m81897J62388L93138J9545k50289k3598K12609J2127k93444
$$ 2551863 1880735 1398838 1561226 1954364 1973909 1723620 1700022 1912631 1924758 1631314
34403A631314k01783J60236L05706J03408j85442l49518l59875k21857J4388J88784
$$ 1631314 1429531 1589767 1895473 1998881 1813439 1463921 1104046 882189 896577 1085361
34393A085361J83050O5494l5211q2830n8385J03588L52788M41666K02771j63389
$$ 1085361 1268411 1333905 1298694 1215864 1157479 1261067 1613855 2055521 2258292 2094903
34383B094903k71679k5146K59365K62949P0211Q316J33007J29394j50427l17158
$$ 2094903 1823224 1798078 2057443 2320392 2390603 2398919 2531926 2661320 2510893 2193735
34373B193735M8935O58010P48307J20793n38074n67784j37318J51505P7424j43847
$$ 2193735 2242670 2900680 3648987 3769780 3231706 2663922 2526604 2678109 2755533 2611686
34363B611686k93467k57381J6532L02773J62135l71598n57063N8455P91571O88028
$$ 2611686 2318219 2060838 2077370 2380143 2542278 2170680 1613617 1672072 2463643 3151671
34353C151671m7094l44770J06867M73465J34398m59002o08367k96885J21766N28370
$$ 3151671 3104577 2759807 2866674 3340139 3474537 3015535 2407168 2110283 2232049 2760419
34343B760419Q57558Q22116L27416j80305k10440J72133N34760N82014K44719
$$ 2760419 3617977 4440093 4767509 4587204 4376764 4548897 5083657 5665671 5910390
34334E910390l74440q76020p47721K7236Q46362J182411J045714O18183k2052
$$ 5910390 5535950 4659930 3912209 3939445 4785807 5968218 7013932 7632115 7610063
34325G610063n45252l90272L77567Q06679K59215o19614q00881k98431Q7938J17003
$$ 7610063 7064811 6674539 7052106 7858785 8118000 7498386 6697505 6399074 6487012 6604015
34315F604015K79213P33918R85023P49022L93323K83985L06851K81112L23206
$$ 6604015 6883228 7617146 8602169 9351191 9744514 10028499 10335350 10616462 10939668
34306A0939668N21234O67200N91432M54937M87311O74605Q51871Q84690O93177
$$ 10939668 11460902 12128102 12719534 13174471 13661782 14336387 15188258 16072948 16766125
34297A6766125L57383K36063O60268J428288J920690J829325J496974J441705
$$ 16766125 17123508 17359571 18019839 19448127 21368817 23198142 24695116 26136821
34289B6136821J818520K436980L022719L347651L368276L370875L775420M703701
$$ 26136821 27955341 30392321 33415040 36762691 40130967 43501842 47277262 51980963
34281E1980963N915191P177602Q470737R842166J1364819J3263022J5760740J8723794
$$ 51980963 57896154 65073756 73544493 83386659 94751478 108014500 123775240 142499034
34273A42499034K1683508K4167230K5668059K5380269K2540774J7239774J0520886
$$ 142499034 164182542 188349772 214017831 239398100 261938874 279178648 289699534
34266B89699534L560127k871323q153941j1788099j4022760j5922974j8203076
$$ 289699534 293259661 290388338 282234397 270446298 256423538 240500564 222297488
34259B22297488k0305964k1165264k0601284j9380002j8073421j6526489j4501779
$$ 222297488 201991524 180826260 160224976 140844974 122771553 106245064 91743285
34252I1743285j2271847j0326766q836253p634962o542143n507385m540871l644636
$$ 91743285 79471438 69144672 60308419 52673457 46131314 40623929 36083058 32438422
34244C2438422k830394k195559j936945k144287k528797k554376k000492j243992
$$ 32438422 29608028 27412469 25475524 23331237 20802440 18248064 16247572 15003580
34236A5003580q01698p38778p38728o08677m34366l17238k58837l02735n23377
$$ 15003580 14201882 13463104 12724376 12115699 11681333 11364095 11105258 10802523 10279146
34227A0279146q26910r72895q51975n93029l77060k85669l18566l91627l26051
$$ 10279146 9452236 8479341 7627366 7034337 6657277 6371608 6053042 5661415 5335364
34218E335364k9937K88567K79532j20071n73760p26953n67291l38653k19443j79239
$$ 5335364 5305427 5593994 5873526 5753455 5179695 4452742 3885451 3546798 3327355 3148116
34208C148116r1540P7745J82173K3760l58350n86875l06066L29507P08229M28315
$$ 3148116 3056576 3134321 3316494 3340254 2981904 2395029 2088963 2418470 3126699 3555014
34198C555014k00647m86099j50331L67239M53374J7094m93475o72713n28895k63130
$$ 3555014 3354367 2868268 2717937 3085176 3538550 3555644 3062169 2389456 1860561 1597431
34188A597431L5277K91054K91253l1011k89616m0019N13934O57981J50155l89573
$$ 1597431 1632708 1923762 2215015 2184004 1894388 1854369 2368303 3026284 3176439 2786866
34178B786866l58181k1801l7171m12068n29829j47847K17227O7991l64576m88444
$$ 2786866 2428685 2406884 2369713 1957645 1427816 1279969 1497196 1565187 1200611 712167
34168G12167j59200K02170K09020l8110j45520O0206L15272K39956j73406n19152
$$ 712167 552967 755137 964157 926047 780527 840733 1156005 1395961 1222555 703403
34158G03403m75712j91584k5699l4564M1237L21350N75867N27391J76146k37495
$$ 703403 227691 36107 10408 -24156 17081 338431 914298 1441689 1617835 1380340
34148A380340m50886l29487L9139L51672L31917J9312k95595m24376m21649l85609
$$ 1380340 929454 599967 639106 990778 1322695 1342007 1046412 622036 200387 -185222
34138a85222l25884k67182k67374k59160q9785J85316K82214J09442k2979J69814
$$ -185222 -511106 -778288 -1045662 -1304822 -1394607 -1209291 -927077 -817635 -840614 -670800
34128f70800N11128O26395M93857L99678M12419K81793p9354l72572l48110j74343
$$ -670800 -159672 466723 960580 1360258 1772677 2054470 1975116 1602544 1254434 1080091
34118A080091j40154k27134k72644l53684n97782p13829k41757O19006R71154
$$ 1080091 939937 712803 440159 86475 -511307 -1225136 -1466893 -847887 123267
34109A23267L53345n12677o04649N2029N16331K83610j73129k86300j29910Q677
$$ 123267 476612 -36065 -640714 -588685 -72354 211256 38127 -248173 -378083 -369406
34099c69406J75334M10848L55994k23108q32061p92176k21897J37406J9598o4007
$$ -369406 -194072 216776 572770 349662 -482399 -1274575 -1496472 -1359066 -1339468 -1403475
34089a403475K84852P27378P10466K21905k59214l41598n3084K51552K06676j99940
$$ -1403475 -1118623 -391245 319221 541126 281912 -59686 -112770 138782 345458 145518
34079A45518n57755m98791j79026l8602j54212j92211J4986K72757M46114O07289
$$ 145518 -412237 -911028 -1090054 -1128656 -1282868 -1475079 -1460093 -1187336 -741222 -133933
34069a33933O51126K83674l75506o97014l97752k4592j36666m24750k22898L97912
$$ -133933 517193 800867 425361 -271653 -669405 -693997 -830663 -1255413 -1478311 -1080399
34059a080399P24357M90578J95940K37225L31015Q0470l30666m03346o1898K37129
$$ -1080399 -356042 134536 330476 567701 898716 979186 648520 245174 183276 420405
34049D20405R2682l95182p91863p72517l48469K16113N95294N73018K02294j52166
$$ 420405 513087 117905 -673958 -1446475 -1794944 -1578831 -983537 -410519 -208225 -360391
34039c60391r4166L46531O72500N10179R3968r7892l9067r9374l70590n40229
$$ -360391 -454557 -108026 564474 1074653 1168621 1070729 1031662 932288 561698 21469
34029B1469m91188m94741o27993n42825j19992J67519l0526l21830j74953K53266
$$ 21469 -469719 -964460 -1592453 -2135278 -2255270 -2087751 -2118277 -2440107 -2615060 -2361794
34019b361794M70425M85207O20523P39271M14737k12506n02863k92121r9975k40438
$$ -2361794 -1891369 -1406162 -785639 -46368 368369 155863 -347000 -639121 -739096 -979534
34009i79534l83511k03358J37886L91924N55920N59437J89486l60067m26369K12855
$$ -979534 -1363045 -1566403 -1428517 -1036593 -480673 78764 268250 -91817 -518186 -305331
33999c05331Q38993O78353p6322o02144n05262p1398L05436M63594L79899J54632
$$ -305331 533662 1212015 1135693 533549 28287 -43111 262325 725919 1105818 1260450
33989A260450J4832K6179o6028m23545p36332n99958j03132L21415M86583N22737
$$ 1260450 1275282 1301461 1235433 811888 75556 -524402 -627534 -306119 180464 703201
33979G03201M88903L08566L6302j57505k29045k17062p5578J52596J70507j79203
$$ 703201 1192104 1500670 1536972 1379467 1150422 933360 857782 1010378 1180885 1001682
33969A001682n07822l21062K24552M83878K09088k08054l87399l58174k40297
$$ 1001682 493860 172798 397350 881228 1090316 882262 494863 136689 -103608
33960a03608k2799K00628K18820R0979J49683M60367O64952N17042J80869j51105
$$ -103608 -126407 74221 293041 384020 533703 994070 1659022 2176064 2356933 2205828
33950B205828n04201p92753p06767k09299K56828L55312K70405K49437J56692
$$ 2205828 1701627 908874 202107 -7192 249636 604948 875353 1124790 1281482
33941A281482j49641m00702l18477r9910n5280p7571O3514K09738J09704o0608
$$ 1281482 1131841 731139 412662 312752 257472 179901 243415 453153 562857 502249
33931E02249k5242K0255k13816m17797j02925M43093M45832j18442m25013q3471
$$ 502249 477007 497262 283446 -134351 -237276 205817 651649 533207 108194 24723
33921B4723L14560K19157q1711j09666L1560L5013q805P5016P7247k18261n46881
$$ 24723 339283 558440 476729 367063 398623 433636 424831 499847 577094 358833 -188048
33910a88048n44695k93546l8639K65820O28523O29231j7160p79450q50261k12581
$$ -188048 -732743 -1026289 -1064928 -799108 -170585 458646 441486 -337964 -1188225 -1400806
33900a400806M23799N99520M30474J20097j97031k32094J44469M17166j9855q18064
$$ -1400806 -977007 -377487 52987 173084 -23947 -256041 -111572 305594 285739 -532325
33890e32325r72243k67977M00869L98959J72301K80981M34336J43059l10647l32485
$$ -532325 -1504568 -1772545 -1371676 -972717 -800416 -519435 -85099 57960 -252687 -585172
33880e85172k4966N2335j10990J2271N21519Q34037N23178j00316m25019k32416
$$ -585172 -610138 -557803 -668793 -656522 -135003 699034 1222212 1121896 696877 464461
33870D64461J72656L18175J3991m14722m26093N6806M62285L12619r6197j31778
$$ 464461 637117 955292 969283 554561 128468 185274 647559 960178 863981 732203
33860G32203K62054N65320M88115K51445M6712k56620o96421r43040p03162j40246
$$ 732203 994257 1559577 2047692 2299137 2345849 2089229 1392808 449768 -253394 -393640
33850c93640L25006M63375L37969J09037j16552l05796m36716m17407j65908J64376
$$ -393640 -68634 394741 732710 841747 725195 419399 -17317 -434724 -600632 -436256
33840d36256K43743L4590m1959K85334O07500L68591k37094m74485j56594Q8078
$$ -436256 -192513 -157923 -199882 85452 692952 1061543 824449 349964 193370 281448
33830B81448k12969o94019p16606j89189M69156Q45951P58942K75838k38075l64797
$$ 281448 68479 -625540 -1342146 -1531335 -1062179 -216228 542714 818552 580477 215680
33820B15680j32622N588j59238l12643j88641J8590R5532K10328M95843O58707
$$ 215680 83058 88646 -70592 -383235 -571876 -553286 -457754 -247426 248417 907124
33810I07124M65090K31725L00363L68899k2039n92545o31051r1268L38781K75575
$$ 907124 1372214 1603939 1904302 2273201 2251162 1658617 1027566 936298 1275079 1550654
33800A550654M3586o3992k14288m72631m73654o2229K53427l6315o89332j067147
$$ 1550654 1594240 1530248 1315960 843329 369675 307446 560873 524558 -164774 -1231921
33790a231921r49807n60981n8803M80316P49843M74481j3170j0944N77042R68828
$$ -1231921 -2181728 -2742709 -2801512 -2321196 -1571353 -1096872 -1110042 -1120986 -543944 424884
33780D24884M98988m47663q72559l77460M33704P59008M62784L578k32479k46712
$$ 424884 923872 476209 -396350 -773810 -340106 418902 881686 885264 652785 406073
33770D06073j69251j3042J89858K29160o4359n03637o80452m43756m9973K20116
$$ 406073 236822 223780 413638 642798 578439 74802 -605650 -1049406 -1099379 -879263
33760h79263L80631N40966N96360L79963K6039j23728O252J32553P3088K858P8186
$$ -879263 -498632 42334 638694 1018657 1044696 920968 927220 1059773 1132861 1135719 1213905
33749A213905R7859j62182m91501n07447k57645j27868j80276p6038K52952L85892
$$ 1213905 1311764 1149582 658081 150634 -107011 -234879 -415155 -491193 -238241 147651
33739A47651J16236j24517O1967L66268K67013j23478k83799j28204R21N2611
$$ 147651 263887 139370 201337 567605 834618 711140 427341 299137 300058 352669
33729C52669K92938O18885N59423R7416j91862o2548k949l69557p27155n35401
$$ 352669 645607 1264492 1823915 1921331 1729469 1666921 1663972 1294415 567260 31859
33719C1859j0425K38463Q6057j15729j62780j25163l7827R9015J63936J16559
$$ 31859 21434 259897 345954 230225 67445 -57718 -95545 3470 167406 283965
33709B83965J60818L75107M47278J62640j39863o0192J90313J32669j94493l58106
$$ 283965 444783 819890 1267168 1429808 1289945 1229753 1420066 1552735 1358242 1000136
33699A000136k60084j58262r5934Q1525K31009N7273k83622l42684j22857l4952
$$ 1000136 740052 581790 485856 567381 798390 855663 572041 229357 106500 71548
33689G1548j14514K0968L61645L96347J3526k10558N6672L35086J03786m00112
$$ 71548 -42966 -21998 339647 735994 749520 538962 595634 930720 1034506 634394
33679F34394o06988m18969j52238L472P7323J09569J53951K83994M07270L16274
$$ 634394 27406 -391563 -543801 -540329 -463006 -353437 -199486 84508 491778 808052
33669H08052L7528j82027k95928m48091m97775j20888M74177N81946K6742m88106
$$ 808052 845580 663553 367625 -80466 -578241 -699129 -224952 356994 383736 -104370
33659a04370m12265q4987r102m7487J02024K34282Q2489p8434O9980K65198J93866
$$ -104370 -516635 -601622 -610724 -658211 -556187 -321905 -239416 -317850 -247870 17328 211194
33648B11194J34016L34289K99706l94120j052145p09504K75224O52953J88028
$$ 211194 345210 679499 979205 585085 -467060 -1176564 -901340 -248387 -60359
33639f0359j10640K45940N05054J03930l37067j10607L88731L52826j70574m56791
$$ -60359 -170999 74941 579995 683925 346858 236251 624982 977808 807234 350443
33629C50443j88804K72357M79620K78350k32147p45530r04176o51539k60801Q6038
$$ 350443 161639 433996 913616 1191966 959819 214289 -689887 -1341426 -1602227 -1516189
33619a516189M28771O57264M88310J9095k01061N1905L18350K13180K0266Q7342
$$ -1516189 -1087418 -430154 58156 77251 -123810 -71905 246445 459625 479891 567233
33609E67233J48468j55701n01153l23121K27344M89889L28738K37688M02874L71040
$$ 567233 715701 560000 58847 -264274 -36930 452959 781697 1019385 1422259 1793299
33599A793299j45793p12635p41086k41251K96763N14123M05299J14232k14126
$$ 1793299 1647506 934871 193785 -47466 249297 763420 1168719 1282951 1068825
33590A068825m31346m35003k55791k5185J50531K48448K60623J17906k22089n68398
$$ 1068825 637479 202476 -53315 -78500 72031 320479 581102 699008 476919 -91479
33580i1479n31112K4699O33904O48566L9581n41242o01378l47164j90877j16533
$$ -91479 -622591 -597892 36012 684578 724159 182917 -418461 -765625 -956502 -1073035
33570a073035J01612L54815L41152R9703m6449j9869m4352j82317k20672p4486
$$ -1073035 -971423 -616608 -275456 -175753 -222202 -242071 -286423 -468740 -689412 -763898
33560g63898N6091L2053l0126k9150p0284k30771l40152j68407K63070O60091
$$ -763898 -707807 -675754 -705880 -735030 -805314 -1036085 -1376237 -1544644 -1281574 -621483
33550f21483P04189L34439j38499k66859N4251M27113M31587J36073j01969j91376
$$ -621483 82706 417145 278646 11787 66038 493151 924738 1060811 958842 767466
33540G67466l04176l98167j93118L02500O55478N66046K29375l0457j68202k61339
$$ 767466 463290 65123 -127995 174505 829983 1396029 1625404 1594947 1426745 1165406
33530A165406k56457j24467j9062k9681k950J48685K13181M5718q3673J16471
$$ 1165406 908949 784482 765420 735739 732789 881474 1094655 1140373 1056700 1173171
33520A173171M16671L56610l3739k72206j61224l293n550M2382K85984M26905
$$ 1173171 1589842 1946452 1912713 1640507 1479283 1475990 1470440 1512822 1798806 2225711
33510B225711J56855l12469n05465l07594k2610R0819N2984j0228k0606N3110
$$ 2225711 2382566 2070097 1564632 1257038 1234428 1325247 1378231 1368003 1347397 1400507
33500A400507J52967J31305k7840p4989J85335N23371N23022J63400j52044j70823
$$ 1400507 1553474 1684779 1656939 1581950 1767285 2290656 2813678 2977078 2825034 2654211
33490B654211o7978o4295r5817k4408R7143J61416J94003K45525L06673M55243
$$ 2654211 2586233 2521938 2426121 2401713 2498856 2660272 2854275 3099800 3406473 3861716
33480C861716Q13241J202499J186519P12987L68109O30892J178392J369022J165484
$$ 3861716 4674957 5877456 7063975 7776962 8145071 8775963 9954355 11323377 12488861
33471A2488861J076124J360117J831061K331352K826818L086798K882166K524722
$$ 12488861 13564985 14925102 16756163 19087515 21914333 25001131 27883297 30408019
33463C0408019K585934K987961L007105K328010J430377P06024q8342j121082
$$ 30408019 32993953 35981914 38989019 41317029 42747406 43453430 43365088 42244006
33455D2244006j927737k108867k022516k186562k469279k497657k426567k591051
$$ 42244006 40316269 38207402 36184886 33998324 31529045 29031388 26604821 24013770
33447B4013770k749405k449245j909465j738817j906071j794427j256352q21700
$$ 24013770 21264365 18815120 16905655 15166838 13260767 11466340 10209988 9388288
33439I388288p78387q07142o97861p02019r01254q80715m03458R8136Q6810l80017
$$ 9388288 8609901 7802759 7104898 6402879 5501625 4620910 4217452 4315588 4402398 4022381
33429D022381p96406p54553j93844N39517P91988K12644o42195q41235l12552
$$ 4022381 3225975 2471422 2277578 2817095 3609083 3821727 3179532 2338297 2025745
33420B025745J06668J0384k8862L45181M41238l52718j327772j319479l94662
$$ 2025745 2132413 2142797 2113935 2459116 2900354 2547636 1219864 -99615 -494277
33411d94277L24367L01054O0046P4532J62210J47610K41622M48391L31998k35668
$$ -494277 -169910 131144 191190 265722 427932 575542 817164 1265555 1597553 1361885
33401A361885o90586n45705n7705K57330L25556L28543K28551m7157k53143j39675
$$ 1361885 671299 125594 67889 325219 650775 979318 1207869 1160712 907569 767894
33391G67894P7633L817l15007m61512k48121J13167L68494M09959J75110k83477
$$ 767894 845527 849344 534337 72825 -175296 -62129 306365 716324 891434 607957
33381F07957o43533n66635j42314J96901K21240R8774M3780O4625R6644R9820
$$ 607957 -35576 -602211 -744525 -547624 -326384 -227610 -183830 -119205 -22561 77259
33371G7259j4218k53629l19289J09961P64495R03544K91715l74801l95897l6290
$$ 77259 63041 -190588 -509877 -399916 364579 1268123 1559838 1185037 789140 752850
33361G52850l4027m11138m67975N6097N28004L61489j78748n00205n46805o31286
$$ 752850 718823 307685 -160290 -104193 423811 785300 606552 106347 -440458 -1071744
33351a071744p07921m18455K00355O21325N66416L92260M97023O78571M34853
$$ -1071744 -1779665 -2198120 -1997765 -1376440 -810024 -417764 79259 757830 1192683
33342A192683k39463p23990n16947J25795M84248K36407j86665j92906K06255
$$ 1192683 953220 229230 -287717 -161922 322326 558733 372068 179162 385417
33333C85417M67794K96151J1710Q922J61220O9518k76765m57913k22987J83614
$$ 385417 853211 1149362 1161072 1169994 1331214 1400732 1123967 666054 443067 626681
33323F26681L55067J57134k19735m60534l59591l1446J29298r7667l94294k73473
$$ 626681 981748 1138882 919147 458613 99022 67576 196874 99207 -295087 -568560
33313e68560K18622N31546L85349R5651l0368j68449n14168p25614l37114M31221
$$ -568560 -349938 181608 566957 662608 632240 463791 -50377 -775991 -1113105 -681884
33303f81884Q04303M39401j46296k97203l5125J14246q3266k99155j99554L1171
$$ -681884 122419 561820 415524 118321 83196 197442 114176 -184979 -384533 -353362
33293c53362k3757l29870l69427R7288N84058N02259j294k58287k8061K56307
$$ -353362 -377119 -706989 -1076416 -979128 -395070 107189 105895 -152392 -180453 75854
33283G5854K18286N080j25360j92189k18296l4147L09918L63664p3880n03777
$$ 75854 294140 299220 173860 -18329 -236625 -270772 39146 402810 328930 -174847
33273a74847m10571o3035o1655l49325l47299L9983K73642R1318j02890M4857
$$ -174847 -585418 -648453 -710108 -1059433 -1406732 -1366749 -1093107 -1001789 -1104679 -1059822
33263a059822L13273L80001L35287L82272M03402J95566j16763k38928j18991
$$ -1059822 -746549 -366548 -31261 351011 754413 949979 833216 594288 475297
33254D75297M4854P5444p4094l14978l95953j12121L10552L32581j58751n19615
$$ 475297 520151 595595 521501 206523 -189430 -301551 9001 341582 182831 -336784
33244c36784j19916P42992J111497N18408m71017r23580n08886K60600O03932
$$ -336784 -456700 286292 1397789 1916197 1445180 521600 12714 273314 877246
33235H77246K29549m14285o62533m14360k12382m29252o49438k17066P28199J240351
$$ 877246 1106795 692510 29977 -384383 -596765 -1026017 -1675455 -1892521 -1164322 76029
33225G6029P23879k79752p49043m04398Q0301L8835l76904n12950j11642L98916
$$ 76029 799908 520156 -228887 -633285 -552984 -514149 -891053 -1404003 -1515645 -1116729
33215a116729N00172K02532p5389q7803Q26o0032k44039k94041l9952L98563O99735
$$ -1116729 -616557 -414025 -489414 -577217 -576391 -636423 -880462 -1174503 -1214455 -815892 -116157
33204a16157O26278K59910q5726k34170l30018n29674o35577l10420L52491P88565
$$ -116157 510121 770031 684305 450135 120117 -409557 -1045134 -1355554 -1003063 -214498
33194b14498O29323J68379l7316J41382L43282K43460j03368m36328n93004n71194
$$ -214498 414825 583204 545888 687270 1030552 1274012 1170644 734316 141312 -429882
33184d29882m17069j57208J71684M66905N65458L57494p0875m39594m81621j90185
$$ -429882 -846951 -1004159 -832475 -365570 199888 557382 486507 46913 -434708 -624893
33174f24893J31991J24234k38421n19829k59795M02648P66904M16308j94106l13014
$$ -624893 -492902 -368668 -607089 -1126918 -1386713 -984065 -217161 199147 5041 -307973
33164c07973R7532L63370R0859l35005m05238j90676p9255j30743p6995J90771
$$ -307973 -210441 152929 243788 -91217 -496455 -687131 -766386 -897129 -974124 -783353
33154g83353M77140N74230M53134J96227q3347k87780m06436m62815l46953Q6164
$$ -783353 -306213 268017 721151 917378 834031 546251 139815 -323000 -669953 -583789
33144e83789O35399P57080K10948n16183p46108m12076M8J73283K17185K37805
$$ -583789 51610 808690 1019638 503455 -242653 -654729 -654681 -481398 -264213 -26408
33134b6408R1544k74346n43418l38721K93664Q76865R73550N95778J27214j33268
$$ -26408 65136 -209210 -752628 -1091349 -797685 79180 1052730 1648508 1775722 1642454
33124A642454k46846l68011l65060j3324M78218N69811J56386k12678j42109J7523
$$ 1642454 1395608 1027597 662537 649213 1127431 1697242 1853628 1640950 1498841 1516364
33114A516364k21870o79019q14479n50305k19465O3924L68454M69044J11096l26502
$$ 1516364 1294494 615475 -199004 -749309 -968774 -904850 -536396 -67352 43744 -282758
33104b82758j78071M63328P97495N24705K03272J72872j4278o24071j001743n02163
$$ -282758 -460829 2499 799994 1324699 1527971 1700843 1686565 1062494 60751 -441412
33094d41412M10733P62298L94834n0818k23083l51371n40165n22817k25262J9943
$$ -441412 -30679 731619 1126453 1075635 852552 501181 -38984 -561801 -787063 -767120
33084g67120l619j06270p3065M7147J68041L33275N09128N06161K59024m9485
$$ -767120 -770739 -877009 -950074 -902927 -734886 -401611 107517 613678 872702 823217
33074H23217k50562l44922l11732l2026M40594P52147N96234Q5938l70897n10861
$$ 823217 572655 227733 -83999 -116025 324569 1076716 1672950 1758888 1387991 877130
33064H77130m31815m03047n20487n74855l10747J83630M92497L71244O0373o5473
$$ 877130 445315 42268 -478219 -1053074 -1363821 -1180191 -687694 -316450 -256077 -321550
33054c21550J6512R0843J32952K61761L42225O9530m77581p63884m56284J45715
$$ -321550 -305038 -214195 -81243 180518 522743 592273 114692 -649192 -1105476 -959761
33044i59761N29239N51345L79339R1412l40292p60740q36166m17404K48151P31941
$$ -959761 -430522 120823 500162 591574 251282 -509458 -1345624 -1763028 -1514877 -782936
33034g82936P99602N60094K87264J38783Q9657J08787K38116M04290L48496j8047
$$ -782936 16666 576760 864024 1002807 1092464 1201251 1439367 1843657 2192153 2174106
33024B174106l32594j96304J89452K26567j79162m02711l4913M08036J65072o29393
$$ 2174106 1841512 1645208 1834660 2061227 1882065 1479354 1444441 1852477 2017549 1388156
33014A388156j026340m81078M69305R08111N96808Q1880r5159m972p9614m25409
$$ 1388156 361816 -119262 350043 1258154 1854962 1936842 1841683 1836711 1757097 1331688
33004A331688o25666l31021J46547J59484l39686n91244k2289Q65313J051312
$$ 1331688 706022 375001 521548 681032 341346 -249898 -272187 593126 1644438
32995A644438L25297m52429n10535j05140j075l65791o37854l93538J05547L32493
$$ 1644438 1969735 1517306 1006771 901631 900556 534765 -103089 -496627 -391080 -58587
32985e8587J33386k39027m92427m62430q7547M82029Q25640O38440K04262J35676
$$ -58587 74799 -164228 -656655 -1119085 -1206632 -724603 101037 739477 943739 1079415
32975A079415N19785O92474J35112p25546j029407o00090o3789P9838k4655p7972
$$ 1079415 1599200 2291674 2426786 1701240 671833 71743 7954 87792 63137 -14835
32965a4835j06105k06397k33780o1527J42144J96475K09002L14247L86204L29386
$$ -14835 -120940 -327337 -561117 -622644 -480500 -284025 -75023 239224 625428 954814
32955I54814L71919O65276Q35012M28598l10323o26854k13780M57547P97150O77283
$$ 954814 1326733 1992009 2827021 3255619 2945296 2318442 2104662 2562209 3359359 4036642
32945D036642L05443p2392k38120j33987m4331l24846q64412j148419r36592n16076
$$ 4036642 4342085 4269693 4031573 3897586 3853255 3528409 2663997 1515578 578986 62910
32935F2910j90679O9496L18451M06471K99867K44994L44958L26092J0624l26097
$$ 62910 -127769 -58273 260178 666649 966516 1211510 1556468 1882560 1893184 1567087
32925A567087l90164l27664l93490m76542l52837j31710k5388P0529L13154M70599
$$ 1567087 1176923 849259 455769 -20773 -373610 -505320 -530708 -460179 -147025 323574
32915C23574K54851r3733j06468J54490K08603l9749k03496j18929n0720j20465
$$ 323574 578425 484692 378224 532714 741317 701568 498072 379143 328423 207958
32905B07958j18345j2498o6197k64080j98130K20760M91948K84252n2609j02648
$$ 207958 89613 77115 10918 -253162 -451292 -230532 261416 545668 493059 390411
32895C90411p706l5333K784L38485O11308K80533n01391j004904q49320l41917
$$ 390411 382705 347372 350156 688641 1299949 1580482 1079091 74187 -775133 -1117050
32885a117050M9644J30648o5592l41522l71953l4391L37070L52216J16229J9191
$$ -1117050 -1067406 -936758 -1002350 -1343872 -1715825 -1750216 -1413146 -1060930 -944701 -925510
32875i25510J14297J49084R4933J21932J14098j90283n44861l34414M48771R80812
$$ -925510 -811213 -662129 -567196 -445264 -331166 -521449 -1066310 -1400724 -951953 28859
32865B8859O65378r9103n62796n76952m92159m77404l96582j36251L11795Q94885
$$ 28859 694237 595134 32338 -544614 -1036773 -1514177 -1910759 -2047010 -1735215 -840330
32855h40330J338281J212761M93976k21115m14122k76785k52968k83371m6699
$$ -840330 497951 1710712 2204688 1983573 1569451 1292666 1039698 756327 709628
32846G09628K96104K46198k24688o24529p01345o63990n97728k82807K39145N10228
$$ 709628 1005732 1251930 1027242 402713 -298632 -962622 -1560350 -1843157 -1604012 -1093784
32836a093784L44559J67940L45491O07399N15779J46237r1188m8353J04245K02491
$$ -1093784 -749225 -581285 -235794 371605 887384 1033621 942433 894080 998325 1200816
32826A200816J59003p3013l19188k23936K15799M46697P2020n19933p04248n25776
$$ 1200816 1359819 1286806 967618 743682 959481 1406178 1478198 958265 254017 -271759
32816b71759m77116n63752l06204L12399O28685K67162k59117k53882K80673P90258
$$ -271759 -748875 -1312627 -1618831 -1306432 -677747 -410585 -669702 -923584 -642911 147347
32806A47347Q55443M41447k19848o95484n79294L4606N23262M34244j4922l50394
$$ 147347 1002790 1444237 1224389 528905 -50389 -15783 507479 941723 926801 576407
32796E76407m42335m08603k57971j8153N8598j55458l39853j82267Q0907O6110
$$ 576407 134072 -274531 -532502 -550655 -492057 -647515 -987368 -1169635 -1088728 -1022618
32786a022618o1159J03369L71478J64769m66205p78348m40272J6699J21943J61296
$$ -1022618 -1083777 -980408 -608930 -444161 -910366 -1688714 -2128986 -2112287 -1990344 -1829048
32776a829048N37077J005027J065207P10077K87595o7060l97946n94465n45926
$$ -1829048 -1291971 -286944 778263 1488340 1775935 1708875 1310929 716464 170538
32767A70538m22312m02109l36824o4581K01684K19367J76170L25248M32865J63340
$$ 170538 -251774 -653883 -990707 -1055288 -853604 -634237 -458067 -132819 300046 463386
32757D63386k06071j24725K83570L24661j85847o43689n99344l27418k15839j76333
$$ 463386 257315 132590 416160 740821 554974 -88715 -688059 -1015477 -1231316 -1407649
32747a407649J0424K39642L16942K79984K05150M6637q7977J04783O02266Q69327
$$ -1407649 -1397225 -1157583 -840641 -560657 -355507 -308870 -396847 -292064 310202 1179529
32737A179529N22145j45763o01260o94915n40948j64204L27350N56738L23452
$$ 1179529 1701674 1555911 954651 259736 -281212 -445416 -118066 438672 762124
32728G62124k3252q3029k544j16529k87932j77246N7023j6278k89190k31783J59075
$$ 762124 738872 655843 653299 536770 248838 71592 128615 112337 -176853 -408636 -249561
32717b49561K51960j84233n11446j63403M71300O02805J59782j66476Q8931N65622
$$ -249561 2399 -181834 -693280 -856683 -385383 217422 377204 210728 299659 865281
32707H65281N74241l8917o92053p26562j73343K81406J40849l04544m36954j78194
$$ 865281 1439522 1400605 708552 -18010 -191353 90053 230902 -73642 -510596 -688790
32697f88790j1434j74870k82051P7840O88074R26704N09796j86826n24207k49797
$$ -688790 -700224 -875094 -1157145 -1079305 -391231 535473 1045269 858443 334236 84439
32687H4439K42098L56007L5268j59557J06457L43565n9152p56866p68431Q6722
$$ 84439 326537 682544 717812 558255 664712 1008277 949125 192259 -576172 -489450
32677d89450Q08288N67631k12359o00341m39423k63078k85382j89212J75854N16054
$$ -489450 318838 886469 674110 73769 -365654 -628732 -914114 -1103326 -927472 -411418
32667d11418N79490M43102K28046o7696l47753l86514j64366M3208M6628j5760
$$ -411418 168072 611174 839220 771524 423771 37257 -127109 -83901 -37273 -53033
32657e3033O2053K50387L63944K91102M4203k82350n14553m79537j80945J69093
$$ -53033 9020 259407 623351 914453 958656 676306 161753 -317784 -498729 -329636
32647c29636L38296K46030l3836l36103m66883l17793L1069L57162M43848J90574
$$ -329636 8660 254690 220854 -115249 -582132 -899925 -868856 -511694 -67846 122728
32637A22728l10821p40260p30294k37390L46850N92424M62565K35737J24807J30806
$$ 122728 -188093 -928353 -1658647 -1896037 -1549187 -956763 -494198 -258461 -133654 -2848
32627b848J43861J2909l35878o57442m79361K67222R19434P99219J19908l00635
$$ -2848 141013 153922 -181956 -839398 -1318759 -1051537 -132103 667116 787024 486389
32617D86389j57826O4334l3400k37267k74862l14883n42871o93513m47765K0061
$$ 486389 328563 392897 359497 122230 -152632 -467515 -1010386 -1703899 -2151664 -2131603
32607b131603L13673L84552M28836M31256K27666j22652l94375m89853l61735
$$ -2131603 -1817930 -1433378 -1004542 -573286 -345620 -468272 -862647 -1352500 -1714235
32598a714235J34739R12523J399618J112634L37949k63148n63256q67393j044404
$$ -1714235 -1579496 -666973 732645 1845279 2183228 1920080 1356824 489431 -554973
32589e54973n95859K88820O30516K8495o25487l94382L60378O22049K49098j8349
$$ -554973 -1150832 -862012 -231496 -203001 -828488 -1222870 -862492 -240443 8655 -9694
32579i694J29862J95860j11337l45534j40920J19940o1248m56104m29044J44195
$$ -9694 120168 316028 204691 -140843 -281763 -161823 -223071 -679175 -1108219 -964024
32569i64024P47100R03739O14192J66262j65339k38236j12618j2620n2508o6601
$$ -964024 -216924 686815 1301007 1467269 1301930 1063694 951076 938456 885948 819347
32559H19347J06616K90053J89794j25405k92593j97458j03398j72498k12580n7562
$$ 819347 925963 1216016 1405810 1280405 987812 790354 686956 514458 301878 244316
32549B44316J29242J66774J85426L37404M03136P2251m91524p66789n57023j95637
$$ 244316 373558 540332 725758 1063162 1466298 1538549 1047025 280236 -276787 -472424
32539d72424j7529J6723M8178K0885j21939k17895j31619j9582o6597j23581O8083
$$ -472424 -489953 -473230 -425052 -404167 -526106 -744001 -875620 -895202 -961799 -1085380 -1017297
32528a017297L96297M80184K29136n8393j96178l35229n46145n42109j08116M34710
$$ -1017297 -621000 -140816 88320 29927 -166251 -501480 -1047625 -1589734 -1697850 -1263140
32518a263140N50071J88983j47484o2941K81226M52249K86475J497j31705p3161
$$ -1263140 -713069 -524086 -671570 -734511 -453285 -1036 285439 286936 155231 82070
32508H2070M3668J44820K73653M03756L41907k0933m36419n21370k76667j07362
$$ 82070 125738 270558 544211 947967 1289874 1268941 832522 311152 34485 -72877
32498g2877k17778k95533k6438L69248M71254L12580K48978K91867R7412l46855
$$ -72877 -290655 -586188 -612626 -243378 227876 540456 789434 1081301 1178713 831858
32488H31858n67101l28578l9471j24428l79515l30292M4418L51577L70071K12553
$$ 831858 264757 -63821 -103292 -227720 -607235 -937527 -893109 -541532 -171461 41092
32478D1092J8309j44195j38310J12384L70665K93997q2913l68529l36556j34230
$$ 41092 59401 -84794 -223104 -110720 259945 553942 471029 102500 -234056 -368286
32468c68286N8005K49880M27365M21897J71647r9210j40734K3117J88750K39080
$$ -368286 -310281 -60401 366964 788861 960508 861298 720564 743681 932431 1171511
32458A171511J88943O7361j16330l19676m38231l34393L1181M22303M31520k2291
$$ 1171511 1360454 1427815 1311485 991809 553578 219185 250366 672669 1104189 1081898
32448A081898m27341k44423L08352M57103o5250o17795n48729p0850J53017l176
$$ 1081898 654557 410134 718486 1175589 1110339 492544 -56185 -127035 25982 22806
32438B2806o7941J93739L91910R1578n51518r49623p45396j69955K28717J60379
$$ 22806 -45135 148604 540514 632092 80574 -869049 -1614445 -1784400 -1555683 -1395304
32428a395304j10457q0472L70924P94376O91546J07427m36468n22991k09025J32305
$$ -1395304 -1505761 -1586233 -1215309 -420933 270613 378040 -58428 -581419 -790444 -658139
32418f58139J97016k428j76938p5181J97763K82186N0630j80667p8058K43904
$$ -658139 -461123 -463551 -640489 -715670 -517907 -235721 -185091 -365758 -443816 -199912
32408a99912M06018K76857L1930j98980m16186n05944k74795J74252M13606K16090
$$ -199912 206106 482963 514893 315913 -100273 -606217 -881012 -706760 -293154 -77064
32398g7064j25412k01927k4134Q3238k170p2723K6175J50244J08195j9701j994
$$ -77064 -202476 -404403 -428537 -345299 -347469 -420192 -394017 -243773 -135578 -155279 -157273
32387a57273J71689K45858P3367j42384j14624J32501L17904K92566J63081L4510
$$ -157273 14416 260274 333641 191257 76633 209134 527038 819604 982685 1017195
32377A017195j25288k92720k99362q7108J31191J44898M4644P0044K61976M35082
$$ 1017195 891907 599187 299825 212717 343908 488806 533450 603494 865470 1300552
32367A300552M14493J58630k53423o11670o65976l92759p1738N1441M7222Q4318
$$ 1300552 1715045 1873675 1620252 1008582 342606 -50153 -121891 -70450 -23228 61090
32357F1090J10305k275j41217r3678P9184J12942m5305j76274j33784O041J27708
$$ 61090 171395 169120 27903 -65775 13409 126351 81046 -95228 -229012 -222971 -95263
32346i5263J64707L8643k31600m04016k77398k4603N8922O5702L07987O44899
$$ -95263 69444 108087 -123513 -527529 -804927 -829530 -770608 -704906 -396919 247980
32336B47980N09019k10434q00034n86079J68531O23609M20813p240j21813Q4140
$$ 247980 756999 546565 -253469 -839548 -671017 -47408 373405 366165 244352 328492
32326C28492K29836J22395K945J88483N75339O98874L54744q7301k14690j72766
$$ 328492 558328 680723 683668 872151 1447490 2146364 2501108 2413807 2199117 2026351
32316B026351l52504o62131o44735k85211r3144k52724k97756Q8596N13200N12081
$$ 2026351 1673847 1011716 366981 81770 -11374 -264098 -561854 -473258 39942 552023
32306E52023K62269J59052Q8087k75662p02031o09761J1264M91097M00592Q1198
$$ 552023 814292 973344 1061431 785769 83738 -526023 -514759 -23662 376930 458128
32296D58128M4042K24280J58734k63307n63536k81565L52308O01380J56494l81038
$$ 458128 502170 726450 885184 621877 58341 -223224 129084 730464 886958 505920
32286E05920k64922L26180M98772o2161o23052m73099J18556M54324M27527M11154
$$ 505920 240998 567178 1065950 1003789 380737 -92362 26194 480518 908045 1319199
32276A319199M65835L07597q1649l93579m88715m74039l63992j24822L9723p3942
$$ 1319199 1785034 2092631 2010982 1617403 1128688 654649 290657 165835 205558 131616
32266A31616k42444j21027J42590J60732N3612K61335O31631M75975l02294q93649
$$ 131616 -110828 -231855 -89265 71467 125079 386414 1018045 1494020 1191726 298077
32256B98077p03351j14854K36415L11002L24371J57261k92041o22023m46195p9018
$$ 298077 -405274 -520128 -283713 27289 351660 508921 216880 -405143 -851338 -930356
32246i30356o3078k61118j05679L88731N99952L18139Q0995K70583M83163J77853
$$ -930356 -993434 -1254552 -1360231 -971500 -371548 -53409 27586 298169 781332 959185
32236I59185m71582q16869n98928j65484P4734O4787j6393J8868K98995P88366
$$ 959185 487603 -329266 -928194 -1093678 -1018944 -954157 -970550 -951682 -652687 135679
32226A35679J153514R72653K51985m44679n96007l17464r9897p8421N2731L94444
$$ 135679 1289193 2261846 2513831 2069152 1473145 1155681 1055784 977363 1030094 1424538
32216A424538N79049L55967K7782l6895N470k02041n49575o24923m06586k49579
$$ 1424538 2003587 2359554 2387336 2350441 2355911 2153870 1604295 979372 572786 323207
32206C23207k16866M849M38466O23964L05848j55405l26965k71961k93814m44072
$$ 323207 106341 111190 549656 1173620 1479468 1324063 997098 725137 431323 -12749
32196a2749n73309o00959m78342j39557K84143M77214L87584L51834N38291O31969
$$ -12749 -586058 -1187017 -1665359 -1804916 -1520773 -1043559 -655975 -304141 234150 866119
32186H66119L84653Q4975N8048O6562k42509n77578l46965L48552P35822M32047
$$ 866119 1250772 1335747 1393795 1460357 1217848 640270 293305 641857 1377679 1809726
32176A809726j11627l66119l68458l73438l51833j91417o0659j82774m20582m17872
$$ 1809726 1698099 1331980 963522 590084 238251 46834 -13825 -196599 -617181 -1035053
32166a035053q5535K94530M22763K78338Q7914R6485L17502M52607J76167m04370
$$ -1035053 -1120588 -826058 -403295 -124957 -37043 59442 376944 829551 1005718 601348
32156F01348p20652l70479L05264N30616L9387n27345l84952L53463P31606J48074
$$ 601348 -119304 -489783 -184519 346097 385484 -141861 -526813 -173350 558256 706330
32146G06330q05100j013368k04069P56358R48475L76775k97783o11615n61257
$$ 706330 -98770 -1112138 -1316207 -559849 388626 765401 467618 -143997 -705254
32137g05254k82060J10913M21334M48391K01245j41065m25187n13671k38719L51582
$$ -705254 -987314 -876401 -455067 -6676 194569 53504 -371683 -885354 -1124073 -772491
32127g72491Q20622P59836L26007K0495k1400j08695l43373l81586m1663K89031
$$ -772491 48131 807967 1133974 1154469 1133069 1024374 681001 299415 257752 546783
32117E46783J99273r3081l4919M63551R07368Q61953L94968j54466n53193p13252
$$ 546783 746056 652975 618056 1081607 1988975 2850928 3245896 3091430 2538237 1824985
32107A824985n93393k58938O1412J54708M2211r5282j78554k69056l44595k40340
$$ 1824985 1231592 972654 1034066 1188774 1230985 1135703 957149 688093 343498 103158
32097A03158O5369K85583J70406q6979q1310J86056K57640j12776n70759o37028
$$ 103158 168527 454110 624516 537537 456227 642283 899923 787147 216388 -420640
32087d20640k99201J13019L93681N04663L73033J1777k90960k71116q4710m5462
$$ -420640 -719841 -606822 -213141 291522 664555 676332 385372 114256 29546 -15916
32077a5916p9135J14655M14098L32737j75318n04606k42107K28393K99690l6324
$$ -15916 -95051 19604 433702 766439 591121 86515 -155592 72801 372491 336167
32067C36167l20470l14831j44614Q3529L77604O15472N79159K87372K0942m5054
$$ 336167 15697 -299134 -443748 -360219 17385 632857 1212016 1499388 1520330 1475276
32057A475276j8742m7534r7487o4168M1405J08761M2397j88880n24214p82534
$$ 1475276 1456534 1409000 1311513 1247345 1288750 1397511 1439908 1251028 726814 -55720
32047e5720p59592m40821o5900J07720Q8186J07380K81985M23166K77438j11706
$$ -55720 -815312 -1256133 -1322033 -1214313 -1126127 -1018747 -736762 -313596 -36158 -147864
32037a47864m34088m95882l90316k42043j2197K90888M33824K60379K0537O9733
$$ -147864 -581952 -1077834 -1468150 -1710193 -1722390 -1431502 -997678 -737299 -716762 -647029
32027f47029L18538L51458Q8370q2939O3008K30776Q5355k54793m77099n28522
$$ -647029 -328491 22967 111337 28398 91406 322182 407537 152744 -324355 -852877
32017h52877m85475k31035L21157Q28138Q00913K86840j35598j21004N1085j164
$$ -852877 -1338352 -1569387 -1248230 -420092 380821 667661 532063 411059 462144 460980
32007D60980j83846j46814J22921K58932M4789k79021l32686p3009J77259J25034
$$ 460980 277134 130320 253241 512173 556962 277941 -54745 -127754 49505 174539
31997A74539j91389n16333o76769o60450m59113k9485N12918Q30319O85493K73402
$$ 174539 -16850 -533183 -1209952 -1870402 -2329515 -2359000 -1846082 -1015763 -330270 -56868
31987e6868L1689J08419K18564R7701j20916j55204j8341O0686O5520J89813L82887
$$ -56868 -25179 83240 301804 399505 278589 123385 105044 165730 231250 421063 803950
31976H03950L00416j10287l69426j46000J61714J1495l80858l77506m3110j23460
$$ 803950 1104366 994079 624653 478653 640367 651862 271004 -106502 -149612 -273072
31966b73072p52250j036236l76869N55480Q24488N63412M74374N05897Q0214o09001
$$ -273072 -1025322 -2061558 -2438427 -1882947 -1058459 -495047 -20673 485224 565438 -43563
31956d3563o80484n603N31859M66015L75795O46728O58489o7710p95526n97991
$$ -43563 -724047 -729650 -197791 268224 644019 1290747 1949236 1881526 1086000 488009
31946D88009J53380L55383j29181l93190K973M43968L22693j41639m17454l55256
$$ 488009 641389 996772 867591 474401 477374 921342 1244035 1102396 684942 329686
31936C29686r3793K08982L03868k0587m94667n02809O7615N41761L45645k08328
$$ 329686 235893 444875 748743 728156 233489 -269320 -201705 340056 685701 477373
31926D77373m17898j61922R0659O5465j4765R1745K87786L87976M30425N39095
$$ 477373 59475 -102447 -11788 53677 38912 130657 418443 806419 1236844 1775939
31916A775939O35539M97269P0378m34890p88071r47876r51451p32069k52776K18273
$$ 1775939 2411478 2908747 2979125 2544235 1756164 808288 -143163 -875232 -1128008 -909735
31906i09735K58153j50843m59970k03886L52892N42519K02352j13563Q3808N55150
$$ -909735 -651582 -802425 -1262395 -1466281 -1113389 -570870 -368518 -482081 -398273 156877
31896A56877O71890K27643l40466m88255j25827L75029N96465M27788O2945k59228
$$ 156877 828767 1056410 715944 227689 101862 476891 1073356 1501144 1564089 1304861
31886A304861m50668n19347m21487r7615L23163M86562J42482m69390p28112k91991
$$ 1304861 854193 334846 -86641 -184256 138907 625469 767951 298561 -429551 -721542
31876g21542M23520O74161L11660m8164N6301K42397p5059o64945p48228k02085
$$ -721542 -298022 376139 687799 639635 695936 938333 863274 198329 -549899 -751984
31866g51984K38380J30268o7187R9345K54588j13481o59167o27218j4524M62542
$$ -751984 -513604 -383336 -450523 -351178 -96590 -210071 -869238 -1496456 -1510980 -1048438
31856a048438M48169K91901L07955L42136K02331j6779j97587l53214l95570j58038
$$ -1048438 -600269 -308368 -413 341723 544054 527275 329688 -23526 -419096 -577134
31846e77134K38286M26350K98727J05412k922j13277j80812m599L06126L33421
$$ -577134 -338848 87502 386229 491641 488719 375442 194630 190031 496157 829578
31836H29578p81k62129j87799n7834j28656j99023q3114l1692k40427l59368k0698
$$ 829578 828797 566668 378869 321035 192379 -6644 -89758 -121450 -361877 -721245 -741943
31825g41943M56753M62713J2622k88557j29734J69608K24562M5843j46714k22288
$$ -741943 -285190 177523 190145 -98412 -228146 -58538 166024 211867 65153 -157135
31815a57135j46121N3895K43072K87591K27980J75461Q1969j51679l68611k47574
$$ -157135 -303256 -249361 -6289 281302 509282 684743 766712 615033 246422 -1152
31805a152K36849O94945P66887M92178J33613j69956m13616n41366m82645l42733
$$ -1152 235697 930642 1697529 2189707 2323320 2153364 1739748 1198382 715737 373004
31795C73004l35270m55875m12756m6929L16690K15993k60772m66789l0420N98548
$$ 373004 37734 -418141 -830897 -877826 -561136 -345143 -605915 -1072704 -1103124 -504576
31785e04576P16154K66596j73243j93611M5192J92524J32976k7100j23976l4534
$$ -504576 211578 478174 304931 111320 156512 349036 482012 454912 330936 296402
31775B96402J85999K92592J77421P4433J60457J76792j15002l43226l4927M35175
$$ 296402 482401 774993 952414 1026847 1187304 1364096 1249094 905868 870941 1306116
31765A306116K32310n55185q47297j81586N23552L40173l47954n93279k84102
$$ 1306116 1538426 983241 135944 -45642 477910 818083 470129 -123150 -407252
31756d07252J7523J31858K73510L27629o183m86449n33660j18530K25333K32844
$$ -407252 -389729 -257871 15639 343268 337085 -149364 -683024 -801554 -576221 -343377
31746c43377J25114M8770o8916j18581J17720M55054M33992J0875l85874n00534
$$ -343377 -218263 -169493 -238409 -356990 -239270 215784 649776 660651 274777 -225757
31736b25757m58148l59194j85963o8714j09542k8383M12137P52942L66820m01782
$$ -225757 -683905 -1043099 -1229062 -1297776 -1407318 -1435701 -1023564 -270622 96198 -305584
31726c05584n09538K38721Q24273N08483j64855l18283O9210M78640P09377P93561
$$ -305584 -815122 -576401 247872 756355 591500 273217 342427 821067 1530444 2324005
31716B324005N64883l4779n73798o33288m06965l15525l39996k34822q7958j23074
$$ 2324005 2888888 2854109 2280311 1647023 1240058 924533 584537 349715 261757 138683
31706A38683j92582j8043K41895J87667j75942m57582m43408k28987R0760M44159
$$ 138683 -53899 -71942 169953 357620 181678 -275904 -719312 -948299 -857539 -413380
31696d13380O00013L75939l3702k83994l32262l40471k91386q7633J18472J10437
$$ -413380 186633 562572 528870 244876 -87386 -427857 -719243 -806876 -688404 -577967
31686e77967k289J1068N7493o3256j53392J15380N07107M15696j91604o32352
$$ -577967 -580256 -569188 -511695 -574951 -728343 -612963 -105856 309840 118236 -514116
31676e14116m78066j09000m3625k03596j94350N0163K83389L73244L70394K83676
$$ -514116 -992182 -1101182 -1144807 -1348403 -1542753 -1492590 -1209201 -835957 -465563 -181887
31666a81887O3930k48744n29111o54124n18596j19913K92238L58048M2499k46467
$$ -181887 -117957 -366701 -895812 -1549936 -2068532 -2188445 -1896207 -1538159 -1495660 -1742127
31656a742127j21125L59739Q46688J079423R47410M06467l70479q86956p14672
$$ -1742127 -1863252 -1503513 -656825 422598 1370008 1776475 1405996 519040 -195632
31647a95632l4113M65115L20417k28429n88316m91746j84036j1786j4947J5805
$$ -195632 -229745 235370 555787 327358 -260958 -752704 -936740 -948526 -963473 -947668
31637i47668K03579M28354M63032J68148l96437r13211r16034k11928P38155J123593
$$ -947668 -744089 -315735 147297 315445 -80992 -994203 -1910237 -2122165 -1384010 -260417
31627b60417O47025j20868m44675k53259J5702J59974L41585N58103N21784J87435
$$ -260417 386608 265740 -178935 -432194 -416492 -256518 85067 643170 1164954 1352389
31617A352389o9918m0635m0063l49965o29219l41237L71619P16450K23898o44306
$$ 1352389 1282471 1241836 1201773 851808 222589 -118648 252971 969421 1193319 549013
31607E49013j023048n99431J08922L66303N989m39191m11276l5951O5043l10781
$$ 549013 -474035 -1073466 -964544 -598241 -592252 -1031443 -1442719 -1478670 -1413627 -1724408
31597a724408n85945k27673M01405N25893J30859p145M42075P91055L91272l23591
$$ -1724408 -2310353 -2538026 -2136621 -1610728 -1479869 -1487014 -1044939 -253884 137388 -186203
31587a86203m73931l9147K20871l677k26992j29841n8203k40158k35136K91625
$$ -186203 -660134 -699281 -478410 -482087 -709079 -838920 -897123 -1137281 -1372417 -1080792
31577a080792Q11589O41408L9042j71502J17810K10075j77940m28749m4699N23014
$$ -1080792 -269203 372205 411247 239745 357555 567630 389690 -39059 -83758 439256
31567D39256N40437L7420l31570k26656O6465J82950J23439Q7633J20423N9757
$$ 439256 979693 1017113 685543 458887 525352 708302 831741 919374 1039797 1099554
31557A099554k05585m87281m20671M6671M28915K46481k79766m71741j46651J47984
$$ 1099554 893969 406688 -13983 32688 461603 708084 428318 -43423 -190074 -42090
31547d2090m764l03389l00237r9439n5557j32254n6115J26685J49611N0445J32310
$$ -42090 -46854 -350243 -650480 -749919 -805476 -937730 -993845 -867160 -717549 -667104 -534794
31536e34794M48020O99132O16743J68936m86404r80434q78127k02133M04158M30338
$$ -534794 -86774 612358 1229101 1398037 911633 -68801 -946928 -1149061 -744903 -314565
31526c14565J60641J23685K13761K2731k30266J4945N14794L63536n19355j033985
$$ -314565 -153924 -30239 183522 206253 -24013 -9068 505726 869262 349907 -684078
31516f84078m92879L15955L31158k39204m21981l1573K33564M8375j04421J66725
$$ -684078 -1176957 -861002 -529844 -769048 -1191029 -1222602 -989038 -940663 -1045084 -878359
31506h78359N75345O80792M43058M1675l83755n85443k53721M61814Q30263L39543
$$ -878359 -303014 377778 820836 862511 478756 -106687 -360408 101406 931669 1271212
31496A271212n80527j023679o97143j63782j367j24723j13851J07137K37691J05742
$$ 1271212 690685 -332994 -1030137 -1193919 -1195286 -1320009 -1433860 -1326723 -1089032 -983290
31486i83290j22891k31237j71797L0037L19189M86371K93800j36695l52521j76587
$$ -983290 -1106181 -1337418 -1509215 -1479178 -1159989 -673618 -379818 -516513 -869034 -1045621
31476a045621K0976q3583k31162k4398L71568M74092K53172J02021J15700j2151
$$ -1045621 -1024645 -1108228 -1339390 -1363788 -992220 -518128 -264956 -162935 -47235 -59386
31466e9386l38868m95636k87025M3751K75671M27540M07756M2803l69073k08064
$$ -59386 -398254 -893890 -1180915 -1137164 -861493 -433953 -26197 16606 -352467 -560531
31456e60531M58052P24221J66985m00368j47980M44756L65262k95843n37648r6517
$$ -560531 -102479 621742 788727 388359 240379 685135 1050397 754554 216906 120389
31446A20389K03744j17564m39775j31547M08906L95593j92047p01873p43842m88333
$$ 120389 324133 206569 -233206 -364753 44153 439746 247699 -454174 -1198016 -1686349
31436a686349k04603Q667Q2863k1263j37023k3729K59744L66726J46535j01390
$$ -1686349 -1890952 -1882285 -1799422 -1820685 -1957708 -1981437 -1721693 -1354967 -1208432 -1309822
31426a309822k3704K84747M08218J98847l1924K537J61856J84452J51033K64519
$$ -1309822 -1333526 -1048779 -640561 -441714 -473638 -471101 -309245 -124793 26240 290759
31416B90759L25834l8795o13845o75065o4605M19288J34279m39563m44223O2743
$$ 290759 616593 577798 -36047 -711112 -775717 -356429 -222150 -661713 -1105936 -1043193
31406a043193L06238N1558j57953L042K13335K18160K23445L04594J11036m32076
$$ -1043193 -736955 -685397 -843350 -840308 -626973 -408813 -185368 119226 230262 -201814
31396b01814p18231k76822M40716O44937K69119j04761j57616r2288p5648J1691
$$ -201814 -920045 -1196867 -756151 -111214 157905 53144 -104472 -196760 -272408 -260717
31386b60717K13680L53515L71738M39509O00671O22121L53988m2034l83866p06652
$$ -260717 -47037 306478 678216 1117725 1718396 2340517 2694505 2652471 2268605 1561953
31376A561953r97657r73458m55139K03914M51052K45470N3900J18392J61090l5932
$$ 1561953 564296 -409162 -864301 -660387 -209335 36135 90035 208427 369517 333585
31366C33585k12803j10661L8762l0930j5844M62699R58052O09813m84740j165298
$$ 333585 120782 10121 48883 17953 2109 464808 1422860 2032673 1547933 382635
31356C82635p85156q9965j6518l61375l68840k9178J18896P1639K48979N17385
$$ 382635 -402521 -492486 -509004 -870379 -1239219 -1268397 -1149501 -1077862 -828883 -311498
31346c11498L62109j0839J79998R01646J144233M98526j46859m5827K31276j40842
$$ -311498 50611 39772 219770 1121416 2265649 2764175 2617316 2571489 2802765 2661923
$$ [...]
##END NTUPLES=NMR SPECTRUM
##END=
