##TITLE=31Pdec_DE-123_oil
D2O, 24 sc
 26.1.2026
##JCAMPDX= 6.0         $$ Bruker NMR JCAMP-DX V2.0
##DATA TYPE= NMR SPECTRUM
##DATA CLASS= NTUPLES
##ORIGIN= UXNMR, Bruker Analytische Messtechnik GmbH
##OWNER= root
$$ XWIN-NMR		Version 3.5
$$ Mon Jan 26 13:51:16 2026 Russian Standard Time (UT+4h)  she@DPX200
##.OBSERVE FREQUENCY= 81.013821
##.OBSERVE NUCLEUS= ^31P
##.ACQUISITION MODE= SIMULTANEOUS
##.ACQUISITION SCHEME= undefined
##.AVERAGES= 24
##.DIGITISER RES= 17
##SPECTROMETER/DATA SYSTEM= spect
##.PULSE SEQUENCE= zgpg30
##.SOLVENT NAME= DMSO
##.SHIFT REFERENCE= (INTERNAL, DMSO, 0, 198.062)
##AUDIT TRAIL= $$ (NUMBER, WHEN, WHO, WHERE, WHAT)
$$ ##TITLE= Audit trail, XWIN-NMR		Version 3.5
$$ ##JCAMPDX= 5.01
$$ ##ORIGIN= Bruker BioSpin GmbH
$$ ##OWNER= she
$$ F:/spectra/data/she/nmr/P31/2/pdata/1/auditp.txt
$$ ##AUDIT TRAIL=  $$ (NUMBER, WHEN, WHO, WHERE, WHAT)
(   1,<2026-01-26 13:50:20.54 +0400>,<she>,<DPX200>,
      <created by zg, POWCHK disabled, PULCHK disabled
       configuration hash MD5:
       00 E9 B6 7A A2 85 ED C7 34 08 36 98 17 FE 4E 26
       data hash MD5: 32K
       9D 57 36 2D A8 72 F0 D8 AC 57 2F 59 AA B0 C0 06>)
(   2,<2026-01-26 13:50:22.89 +0400>,<she>,<DPX200>,
      <Start of raw data processing
       efp BC_mod = 2 LB = 1.5 FT_mod = 6 PKNL = 1 PHC0 = 1340.748 PHC1 = 183.5008 SI = 64K 
       data hash MD5: 64K
       89 06 E3 51 01 70 C6 FC A7 CF 85 C5 DB 0F ED 86>)
(   3,<2026-01-26 13:50:40.84 +0400>,<she>,<DPX200>,
      <pk PHC0 = -0.08569624 PHC1 = 0 
       data hash MD5: 64K
       87 40 BF 77 04 75 7A 2A 74 EB BC 8A CC 7B D5 38>)
$$ ##END=
$$ 
$$ hash MD5
$$ 11 5B 56 6A 3F D7 92 73 8A 95 C1 C9 BF AC 77 AA
##$RELAX= 
##$RELAX= 
##$RELAX= 
##$RELAX= 
##$RELAX= 
##$RELAX= 
##$RELAX= 
##$RELAX= 
$$ Bruker specific parameters
$$ --------------------------
##$DU= <F:/spectra>
##$EXPNO= 2
##$NAME= <P31>
##$PROCNO= 1
##$TYPE= <nmr>
##$USER= <she>
##$AMP= (0..31)
100 100 100 100 100 100 100 100 100 100 100 100 100 100 100 100 100 100 
100 100 100 100 100 100 100 100 100 100 100 100 100 100 
##$AQSEQ= 0
##$AQ_mod= 1
##$AUNM= <au_zg>
##$AUTOPOS= <>
##$BF1= 81.014009
##$BF2= 200.13
##$BF3= 200.13
##$BF4= 200.13
##$BF5= 200.13
##$BF6= 200.13
##$BF7= 200.13
##$BF8= 200.13
##$BYTORDA= 1
##$CFDGTYP= 0
##$CFRGTYP= 5
##$CHEMSTR= <none>
##$CNST= (0..31)
1 1 145 1 1 1 1 1 1 1 1 1 1 1 1 1 1 1 1 1 1 1 1 1 1 1 1 1 1 1 1 1 
##$CPDPRG= <waltz16>
##$CPDPRG1= <>
##$CPDPRG2= <waltz16>
##$CPDPRG3= <>
##$CPDPRG4= <mlev>
##$CPDPRG5= <mlev>
##$CPDPRG6= <mlev>
##$CPDPRG7= <mlev>
##$CPDPRG8= <mlev>
##$CPDPRGB= <>
##$CPDPRGT= <>
##$D= (0..31)
0 1 0 0 0 0 0 0 0 0.06 0 0.03 2e-05 3e-06 0 0 0.0002 0 0 0 0 0 0 0 0 0 
0 0 0 0 0 0 
##$DATE= 1769421019
##$DBL= (0..7)
120 120 120 11 120 120 24 19 
##$DBP= (0..7)
150 150 150 150 150 150 150 150 
##$DBP07= 0
##$DBPNAM0= <>
##$DBPNAM1= <>
##$DBPNAM2= <>
##$DBPNAM3= <>
##$DBPNAM4= <>
##$DBPNAM5= <>
##$DBPNAM6= <>
##$DBPNAM7= <>
##$DBPOAL= (0..7)
0.5 0.5 0.5 0.5 0.5 0.5 0.5 0.5 
##$DBPOFFS= (0..7)
$$ [...]
##$SUBNAM2= <"">
##$SUBNAM3= <"">
##$SUBNAM4= <"">
##$SUBNAM5= <"">
##$SUBNAM6= <"">
##$SUBNAM7= <"">
##$SUBNAM8= <"">
##$SUBNAM9= <"">
##$SW= 400.765351723535
##$SWIBOX= (0..15)
0 1 3 0 0 0 0 0 0 0 0 0 0 0 0 0 
##$SW_h= 32467.5324675325
##$TD= 32768
##$TD0= 1
##$TE= 0
##$TE2= 300
##$TE3= 300
##$TEG= 300
##$TL= (0..7)
0 120 53 12 22 120 120 120 
##$TP= (0..7)
150 150 150 150 150 150 150 150 
##$TP07= 0
##$TPNAME0= <>
##$TPNAME1= <>
##$TPNAME2= <>
##$TPNAME3= <>
##$TPNAME4= <>
##$TPNAME5= <>
##$TPNAME6= <>
##$TPNAME7= <>
##$TPOAL= (0..7)
0.5 0.5 0.5 0.5 0.5 0.5 0.5 0.5 
##$TPOFFS= (0..7)
0 0 0 0 0 0 0 0 
##$TUNHIN= 0
##$TUNHOUT= 0
##$TUNXOUT= 0
##$USERA1= <user>
##$USERA2= <user>
##$USERA3= <user>
##$USERA4= <user>
##$USERA5= <user>
##$V9= 5
##$VALIST= <valist>
##$VCLIST= <CCCCCCCCCCCCCCC>
##$VD= 0
##$VDLIST= <DDDDDDDDDDDDDDD>
##$VPLIST= <PPPPPPPPPPPPPPP>
##$VTLIST= <TTTTTTTTTTTTTTT>
##$WBST= 1024
##$WBSW= 4
##$XGAIN= (0..3)
0 0 0 0 
##$XL= 0
##$YL= 0
##$YMAX_a= 7724
##$YMIN_a= -7793
##$ZGOPTNS= <>
##$ZL1= 120
##$ZL2= 120
##$ZL3= 120
##$ZL4= 120
##$ABSF1= 0
##$ABSF2= 0
##$ABSG= 0
##$ABSL= 0
##$ALPHA= 0
##$AQORDER= 0
##$ASSFAC= 0
##$ASSFACI= 0
##$ASSFACX= 0
##$ASSWID= 0
##$AUNMP= <proc_1d>
##$AZFE= 0.1
##$AZFW= 0.5
##$BCFW= 0
##$BC_mod= 2
##$BYTORDP= 0
##$COROFFS= 0
##$CY= -3
##$DATMOD= 1
##$DC= 0
##$DFILT= <>
##$DTYPP= 0
##$F1P= 0
##$F2P= 0
##$FCOR= 1
##$FTSIZE= 65536
##$FT_mod= 6
##$GAMMA= 0
##$GB= 0
##$INTBC= 1
##$INTSCL= 9.790993e-09
##$ISEN= 30
##$LB= 1.5
##$LEV0= 0
##$LPBIN= 0
##$MAXI= 10000
##$MC2= 0
##$MEAN= 0
##$ME_mod= 0
##$MI= 50
##$NCOEF= 0
##$NC_proc= -5
##$NLEV= 6
##$NOISF1= 182.463
##$NOISF2= 159.3651
##$NSP= 0
##$NTH_PI= 0
##$NZP= 0
##$OFFSET= 198.0616
##$PC= 4
##$PHC0= 1340.662
##$PHC1= 183.5008
##$PH_mod= 1
##$PKNL= yes
##$PPARMOD= 0
##$PSCAL= 0
##$PSIGN= 0
##$REVERSE= no
##$SF= 81.0140089999434
##$SI= 65536
##$SIGF1= 159.3651
##$SIGF2= -187.1042
##$SINO= 113.3802
##$SIOLD= 16384
##$SREGLST= <1H.CDCl3>
##$SSB= 0
##$STSI= 65536
##$STSR= 0
##$SW_p= 32467.5324675325
##$SYMM= 0
##$S_DEV= 0
##$TDeff= 32768
##$TDoff= 0
##$TI= <>
##$TILT= no
##$TM1= 0
##$TM2= 0
##$TOPLEV= 0
##$USERP1= <user>
##$USERP2= <user>
##$USERP3= <user>
##$USERP4= <user>
##$USERP5= <user>
##$WDW= 1
##$XDIM= 65536
##$YMAX_p= 366046097
##$YMIN_p= -17847537
$$ End of Bruker specific parameters
$$ ---------------------------------
##NTUPLES= NMR SPECTRUM
##VAR_NAME=  FREQUENCY,     SPECTRUM/REAL,   SPECTRUM/IMAG
##SYMBOL=    X,             R,               I
##VAR_TYPE=  INDEPENDENT,   DEPENDENT,       DEPENDENT
##VAR_FORM=  AFFN,          ASDF,            ASDF
##VAR_DIM=   65536,         65536,           65536
##UNITS=     HZ,            ARBITRARY UNITS, ARBITRARY UNITS
##FACTOR=    0.49542278885378, 1,            1
##FIRST=     16045.7642231865, 0,            0
##LAST=      -16421.768244346, 0,            0
##MIN=       -16421.768244346, -17847537,    0
##MAX=       16045.7642231865, 366046097,    0
$$ Real data points
##PAGE= N=1
##DATA TABLE= (X++(R..R)), XYDATA
$$ [...]
41921F4228l43514l00207j66921M7999K68132K73157j7043l04642k53067K8950
$$ 64228 -279286 -579493 -746414 -698415 -430283 -157126 -174169 -478811 -731878 -702928
41911g02928J59037O0593K173P8883O5330j34009k76069j78542p7O2992P1972
$$ -702928 -543891 -483298 -481125 -402242 -336912 -470921 -746990 -925532 -925609 -862617 -790645
41900g90645J34961J59944M9011p3429o1373K191j1998r403J56423L58284L16954
$$ -790645 -655684 -495740 -446729 -520158 -581531 -579340 -591338 -600741 -444318 -86034 230920
41889B30920J1548k63673k61146k9600K04481K67787J44045m3409j35222q3334
$$ 230920 242468 -21205 -282351 -311951 -107470 160317 304362 260953 125731 42397
41879D2397J0384L1161j7584n0027n189J06921J99478J46123p8061k97127l08309
$$ 42397 52781 83942 66358 16331 11142 118063 317541 463664 385603 88476 -219833
41868b19833j56501p1871j26380j57132o7410L4238P4894J44958K59532K43214
$$ -219833 -376334 -448205 -574585 -731717 -799127 -764889 -689995 -545037 -285505 -42291
41858d2291K5408j75381j56318j6550N3741O1396P8748M3387o8359q2406Q7038
$$ -42291 -16883 -192264 -348582 -365132 -311391 -249995 -171247 -127860 -196219 -278625 -191587
41847a91587K04406P1634r3586j321J85591J08156j43622j40177J72056L75097
$$ -191587 12819 84453 -9133 -10454 175137 283293 139671 -506 171550 546647
41837E46647K54187P6797O6066N8125j08222k64871k31370j21708p7064J44J73140
$$ 546647 800834 877631 943697 1001822 893600 628729 397359 275651 198587 198731 371871
41826C71871K30109L8034j25588K7231K62450J22265l40682n75156l05345J12451
$$ 371871 601980 640014 514426 541657 804107 926372 585690 10534 -294811 -182360
41816a82360K32882Q3377j7938M4388J25647J19708O1346l1136j94252l68918
$$ -182360 50522 133899 115961 160349 285996 405704 467050 435914 241662 -127256
41806a27256l90706k12931r750N1454L9374J16427K36174J84625o0879k26597
$$ -127256 -517962 -730893 -740643 -689189 -649815 -533388 -297214 -112589 -173468 -400065
41796d00065j01425J70267L04008K44811J38888M9706o6830j60119j10259L2480
$$ -400065 -501490 -331223 -27215 217596 356484 406190 339360 179241 68982 101462
41786A01462O5790n9223j63744j38493j02095j59970k04483r9412R4212K28616
$$ 101462 167252 108029 -55715 -194208 -296303 -456273 -660756 -760168 -665956 -437340
41776d37340K73905K59258J36656j10758l12729k68603k9946J52204J53535P9896
$$ -437340 -163435 95823 232479 121721 -191008 -459611 -489557 -337353 -183818 -103922
41766a03922L5290k9836j64479k59357j70850O4893K58213K85700J88593N4978
$$ -103922 -68632 -98468 -262947 -522304 -693154 -628261 -370048 -84348 104245 159223
41756A59223r1836k40447l11177k22607j1606J95909L21222L60568L03228J43468
$$ 159223 67387 -173060 -484237 -706844 -718450 -522541 -201319 159249 462477 605945
41746F05945k6709q6679p9201j60969l03652k62910K1923K31179R4910j78892
$$ 605945 579236 492557 413356 252387 -51265 -314175 -292252 -61073 33837 -145055
41736a45055k02581J5413J45491R1309O1122J02754J5618j87805j86201R2491
$$ -145055 -347636 -332223 -186732 -95423 -34301 68453 84071 -103734 -289935 -197444
41726a97444K39673j7277l27927k16887K02656M22836K67241K489j67124k79440
$$ -197444 42229 24952 -302975 -519862 -317206 105630 372871 375360 208236 -71204
41716g1204l06858j03137K44586L74927J32161j83152k23119l8883P6581K9607
$$ -71204 -378062 -481199 -236613 138314 270475 87323 -135796 -174679 -98098 -68491
41706f8491j3918O2486J66856J69310Q7242K9152J9593l5076j97002l76797m23138
$$ -68491 -82409 -19923 146933 316243 403485 432637 452230 417154 220152 -156645 -579783
41695e79783l01812j03826J02784K99867L88523K18776j46903l72817k30099P9806
$$ -579783 -881595 -985421 -882637 -582770 -194247 24529 -122374 -495191 -725290 -645484
41685f45484J82159K7394r2926P634J89786K44735J57806M5742k75O3596K19449
$$ -645484 -463325 -435931 -528857 -521223 -331437 -86702 71104 116846 116571 180167 399616
41674C99616L21453J90174j32216l47578k36581O3601K29786J35967m7826j07604
$$ 399616 721069 911243 779027 431449 194868 258469 488255 624222 576396 468792
41664D68792k6619M6098N852p8694o1414P4946J71694R4423q4016j82710j42115
$$ 468792 442173 488271 494123 415429 354015 428961 600655 695078 611062 428352 286237
41653B86237m4054N3838J53327J93545P2512j55081k62687j31184Q1243J56205
$$ 286237 242183 296021 449348 642893 715405 560324 297637 166453 247696 403901
41643D03901R5443N6349Q7281P8156m8009k25229l37111l23597j85391K6191J95878
$$ 403901 499344 555693 642974 721130 673121 447892 110781 -212816 -398207 -372016 -176138
41632a76138K04074N8538p8304n6039Q3404J50197M2356j19051j37799Q262J39676
$$ -176138 27936 86474 8170 -47869 35535 185732 228088 109037 -28762 -20500 119176
41621A19176R9912o8459j98996j78371p286K28941L78244K97011J9769k07026
$$ 119176 219088 150629 -48367 -226738 -234024 -5083 373161 670172 689941 482915
41611D82915j88485l2115Q627j02058j68084j10386r4624k20009l00798j35386
$$ 482915 294430 262315 270942 168884 800 -109586 -204210 -424219 -725017 -860403
41601h60403J57095K82968J78189M7913K4805J4434o2087p3922J23874M07285
$$ -860403 -703308 -420340 -242151 -194238 -169433 -154999 -217086 -291008 -167134 240151
41591B40151M69202J92383j84072l26307j72396L1101L9878j21931k43382k07166
$$ 240151 709353 901736 717664 391357 218961 250062 289940 168009 -75373 -282539
41581b82539r2534q857N4404J47135K16877J61589k937j40082j66845j29692p6451
$$ -282539 -375073 -383930 -329526 -182391 34486 196075 193138 53056 -113789 -243481 -319932
41570c19932L4052K10106L04478J55030j64387l68313k79433k6525J34119J08689
$$ -319932 -285880 -75774 228704 383734 219347 -148966 -428399 -454924 -320805 -212116
41560b12116M47o7498n1668M7499J91836K70042J68959q3155l20220m09138l50296
$$ -212116 -211669 -279167 -330835 -283336 -91500 178542 347501 264346 -55874 -465012 -815308
41549h15308k06226k8449J19887J73509J51039J50404K09738K48305J86605M6147
$$ -815308 -1021534 -1049983 -930096 -756587 -605548 -455144 -245406 2899 189504 235651
41539B35651j01075j88108j37538P4775K97112L05860J09645k7881K4818O8644
$$ 235651 134576 -53532 -191070 -116295 180817 486677 596322 568441 593259 661903
41529F61903o4576j77484j4281K61971K53618p0185l19782k60057r6632r1019
$$ 661903 597327 419843 405562 667533 921151 850966 531184 271127 174495 83476
41519H3476j95140k22088j37883j4663J16565K10925J75315L5627j9332R5196
$$ 83476 -111664 -333752 -471635 -486298 -369733 -158808 16507 52134 32802 127998
41509A27998K03448J28254m7829j44663j57415j75819j60388j9562J69846K34724
$$ 127998 331446 459700 411871 267208 109793 -66026 -226414 -245976 -76130 158594
41499A58594J58858P7825M9652L957r3910j82866k08146j63662n6577O1398P9571
$$ 158594 317452 395277 444929 448886 354976 172110 -36036 -199698 -256275 -194877 -115306
41488a15306l2220j35461j10809m6990o7888o9532J21947L79025L60378J6256
$$ -115306 -147526 -282987 -393796 -440786 -508674 -578206 -456259 -77234 283144 299400
41478B99400k80290k31348n135M2280j44885l13936k76961r5504P2429J55465
$$ 299400 19110 -212238 -217373 -175093 -319978 -633914 -910875 -1006379 -933950 -778485
41468g78485J86909K20655K37186J28648j50715m09118l37982R9290N31455N77059
$$ -778485 -591576 -370921 -133735 -5087 -155802 -564920 -902902 -803612 -272157 304902
41458C04902K85637K1300j9306L0067N714n0216l3836J5421j0074r7246j28478
$$ 304902 590539 611839 592533 622600 628314 578098 544262 559683 549609 452363 323885
41447C23885n2068O4151J38175J52481J23219N5764m5301j54246k31706k47762
$$ 323885 271817 335968 474143 626624 749843 805607 760306 606060 374354 126592
41437A26592k02572j32565p9861m2260K2624J22142J87951J48727K3392r9636
$$ 126592 -75980 -208545 -288406 -330666 -308042 -185900 2051 150778 174170 74534
41427G4534j58841j48198o9387P2189K13299K45042J21330p7645k17693k25678
$$ 74534 -84307 -232505 -301892 -229703 -16404 228638 349968 272323 54630 -171048
41417a71048j30329k8198j2238q4962j39078q1136L2785P1699L8098P0198J95312
$$ -171048 -301377 -329575 -341813 -426775 -565853 -646989 -614204 -542505 -504407 -434209 -238897
41406b38897K37991Q0381j29080j85377j30668j47175k19360j44982J14192L28651
$$ -238897 -906 79475 -49605 -234982 -365650 -512825 -732185 -877167 -762975 -434324
41396d34324L15293J60836M1073j3891o0962r0695o5391k1253k0643o5709j32702
$$ -434324 -119031 41805 82878 68987 8025 -82670 -148061 -169314 -189957 -255666 -388368
41385c88368k08790k27660q0681K06577M10373L45864R9460q7891j04906k6151
$$ -388368 -597158 -824818 -905499 -698922 -288549 57315 156775 68884 -36022 -62173
41375f2173M9070Q2322N9378l881l1631L0693J16027J10470J9117l4307K0601
$$ -62173 -13103 69219 128597 124716 93085 123778 239805 350275 369392 335085 355686
41364C55686J04238Q4997n9964j96971j64468J9480J20189m2239l10329l40306
$$ 355686 459924 544921 484957 287986 123518 142998 263187 220948 -89381 -429687
41354d29687n9584K18896K16293K0048j24725j45138q5534P0695K81936L21358
$$ -429687 -489271 -270375 -54082 -34034 -158759 -303897 -389431 -318736 -36800 284558
41344B84558O0100k39016k20699M4586J65094R858j59354j46653n4579Q705J01380
$$ 284558 344658 105642 -115057 -70471 94623 104481 -54873 -201526 -256105 -247400 -146020
41333a46020K02472J27905j29581k71687j17588J03344J15665J7718O1590K06049
$$ -146020 56452 184357 54776 -216911 -334499 -231155 -115490 -97772 -36182 169867
41323A69867K08054N0421m0729K2378P0418k8615j74174j94003o0643R5399J08138
$$ 169867 377921 428342 387613 409991 480409 451794 277620 83617 22974 118373 226511
41312B26511p3743k87530k74332K619K47703J81212r1328k35868j44313j7469
$$ 226511 152768 -134762 -409094 -406475 -158772 22440 -68888 -304756 -449069 -466538
41302d66538j8965p5158n8911K2973J00700J54984J86015J72985J15813L8573
$$ -466538 -485503 -560661 -619572 -596599 -495899 -340915 -154900 18085 133898 172471
41292A72471n5604j41072j11180Q9852K92428K49721r404j78048r5806L1400l2667
$$ 172471 116867 -24205 -135385 -45533 246895 496616 487212 309164 213358 244758 212091
41281B12091j88583j74104J4700J11052l1726k39787k62271q0092J07516J37139
$$ 212091 23508 -150596 -135896 -24844 -56570 -296357 -558628 -638720 -531204 -394065
41271c94065M6963o099M6689J05043N1913n8074n5639R5838K29338K03696Q8886
$$ -394065 -347102 -353201 -306512 -201469 -149556 -207630 -263269 -167431 61907 265603 354489
41260C54489K9413K4127k6369j19125j47635q2882j8387k7879r3107j79235k68138
$$ 354489 383902 408029 381660 262535 114900 32018 13631 -14248 -107355 -286590 -554728
41249e54728l06620k40517j21216n8307m0629N9252K54161L66739K78380J20095
$$ -554728 -861348 -1101865 -1223081 -1281388 -1322017 -1262765 -1008604 -641865 -363485 -243390
41239b43390Q6598J65078J98453J41074Q0354M1523m6735j77902k25360j30532
$$ -243390 -156792 8286 206739 347813 428167 469690 422955 245053 19693 -110839
41229a10839l347L5663J0794J1504M1296L8361j910j5562L0645R4372J18427R6615
$$ -110839 -114186 -78523 -67729 -56225 -14929 23432 21522 5960 36605 130977 249404 346019
41217C46019O5261M4881R496o7019j40634j24769j6629O5052L0269n0930n2642
$$ 346019 411280 456161 465657 398638 258004 133235 116606 181658 211927 160997 108355
41206A08355K5439R3255J37800K02891K23299O7064k20648l98289l28890j39908
$$ 108355 133794 227049 364849 567740 791039 858103 637455 239166 -89724 -229632
41196b29632N094J25201K80088L59774K05234j25389l72412l44935q8201J81402
$$ -229632 -224538 -99337 180751 540525 745759 620370 247958 -96977 -185178 -3776
41186c776K48929P7751j32486j52660j7826L3085n4143n3725J33887K54363R9399
$$ -3776 245153 322904 190418 37758 19932 53017 -1126 -54851 79036 333399 432798
41175D32798j15641p7454J20808J54656l939j28195j95785l57249m88654k78243
$$ 432798 317157 239703 360511 515167 511228 383033 187248 -170001 -658655 -936898
41165i36898J70191L22722j4120l58935k46463J39892L34024K52662J42306J12967
$$ -936898 -766707 -443985 -458105 -817040 -1063503 -923611 -589587 -336925 -194619 -81652
41155h1652Q8798N5296L0277p4079k69226l20080o3352K44004K29475m6682j97894
$$ -81652 7146 62442 92719 18640 -250586 -570666 -634018 -390014 -160539 -207221 -405115
41144d05115j00533r920q8791j74169q5943J19489K91527L55754K82600R1794
$$ -405115 -505648 -515568 -604359 -778528 -864471 -744982 -453455 -97701 184899 276693
41134B76693p4987q7743m4501j28857k58476j65239J31591K58175K2514k77757
$$ 276693 201706 113963 69462 -59395 -317871 -483110 -351519 -93344 -70830 -348587
41124c48587k75583k0629J74137J77668R3998J3192m4297k0261J13306K21811
$$ -348587 -624170 -644799 -470662 -292994 -198996 -185804 -230101 -250362 -137056 84755
41114H4755J47607l8600j11271j1223Q4294L6835o9705p8210L2711J56788J87953
$$ 84755 232362 193762 82491 71268 155562 192397 122692 44482 77193 233981 421934
41103D21934Q0358j40204l55266m06648k54759n4283Q004n8240o0816J17231L51070
$$ 421934 502292 362088 6822 -399826 -654585 -708868 -700864 -759104 -819920 -702689 -351619
41092c51619M12294K19738j01338l61543m39978l19653q9001J01783J71686J87019
$$ -351619 60675 280413 179075 -182468 -622446 -942099 -1031100 -929317 -757631 -570612
41082e70612K33588K62567J94296J17721J74679K55491Q6364l02014m96207k69597
$$ -570612 -337024 -74457 119839 237560 412239 667730 754094 452080 -44127 -313724
41072c13724N6154Q6734o1782j8031J92053J99493n8308k18645j00797R142j34274
$$ -313724 -257570 -170836 -232618 -250649 -58596 140897 82589 -136056 -236853 -227711 -361985
41061c61985l15256k07123J27297L69371L93658L11966J99842M4202j06564j72820
$$ -361985 -677241 -884364 -757067 -387696 5962 317928 517770 561972 455408 282588
41051B82588j89591k32457k37727r0740J25553J74714m609j90238j75598m2534
$$ 282588 92997 -139460 -377187 -467927 -342374 -167660 -172269 -362507 -538105 -580639
41041e80639j6518j23017j40451P3373L34134L39965Q7256r9049p452J71016J46923
$$ -580639 -597157 -720174 -860625 -787252 -453118 -113153 -25897 -124946 -132398 38618 185541
41030A85541l0755q2314M2204R9698m0134k06459k18773j19504j5176Q8439J75333
$$ 185541 154786 72472 114676 214374 174240 -32219 -250992 -370496 -385672 -297233 -121900
41019a21900J55812M4063Q28P0624Q2804m8160j51279r6438k3699o2823o5896
$$ -121900 33912 77975 78803 149427 232231 184071 32792 -63646 -87345 -150168 -216064
41008b16064J06831K52852J13816j66093k35666q6600j9729j05390q6142J34925
$$ -216064 -109233 143619 257435 91342 -144324 -230924 -250653 -356043 -442185 -307260
40998c07260K95130J94310k6m2186M1340P1666L422q1432j32022j34383o3956
$$ -307260 -12130 182180 182154 139968 181308 252974 256396 174964 42942 -91441 -155397
40987a55397M6443Q2648o79q4992l7744J07150K02832J76949R2601L8756P673
$$ -155397 -108954 -26306 -26985 -111977 -149721 -42571 160261 337210 429811 468567 476240
40976D76240r0393k64027l31198j10202K47699L26445k123l06797j44443K88175
$$ 476240 385847 121820 -209378 -319580 -71881 254564 252441 -54356 -198799 89376
40966H9376M10065Q1480k44427k22954m2379q838r3798j17672p7343m4917K0901
$$ 89376 499441 580921 336494 113540 71161 62323 -31475 -149147 -226490 -271407 -250506
40955b50506J39195K00278J88476K63546M15486L40101n5233l35113j25936K34570
$$ -250506 -111311 88967 277443 540989 956475 1296576 1241343 906230 780294 1014864
40945A014864J39834l40086n24766j46762K56364J54011k46237l79953j13820
$$ 1014864 1154698 814612 289846 143084 399448 553459 307222 -72731 -186551
40936a86551J87671K13717K6181j20139p3184R4353J60131k0794l27129m86597
$$ -186551 1120 214837 241018 120879 47695 142048 302179 281385 -45744 -532341
40926e32341l95052j99249m6854P7117K13722L12516L40370L47563L35359K17789
$$ -532341 -927393 -1126642 -1173496 -1096379 -882657 -570141 -229771 117792 453151 670940
40916F70940N838j41958j52364j37874j60548j13655K1646N1861r1000j42867
$$ 670940 676778 534820 382456 244582 84034 -29621 -7975 43886 -47114 -189981
40906a89981P6366K74197Q6593k99867l68269m6031K07108J17617o0321n2039
$$ -189981 -113615 160582 247175 -52692 -420961 -466992 -259884 -142267 -202588 -254627
40896b54627K8001J737j3304J29498K67252J83775j729k8562P1191N4215j14920
$$ -254627 -226626 -224889 -238193 -108695 158557 342332 340603 312041 383232 437447 322527
40885C22527k35804k14241j51398j13285o1671K91M0568J24847K98288L90015
$$ 322527 86723 -127518 -278916 -392201 -453872 -453581 -413013 -288166 10122 400137
40875D00137K11409p9212j28009P7494J63524n4097k94095k66979q9152j9505
$$ 400137 611546 532334 404325 481819 645343 591246 297151 30172 -58980 -78485
40865g8485n5118n6553n7407j48688k09671o8146J61268K05289O0060j591J38435
$$ -78485 -133603 -190156 -247563 -396251 -605922 -674068 -512800 -307511 -247451 -249042 -110607
40854a10607K75675K05792j2465k01118k85007k75768j82623m3302N4001O2955
$$ -110607 165068 370860 358395 157277 -127730 -403498 -586121 -629423 -575422 -512467
40844e12467L1813K2802M0108N2225J9367q8280k11752j78875J02080M36484N00591
$$ -512467 -480654 -457852 -417744 -365519 -346152 -434432 -646184 -825059 -722979 -286495 214096
40833B14096K37787o2581j34098k1060P5899P9199M3325J1532p544o864k5266
$$ 214096 451883 389302 255204 234144 310043 389242 432567 444099 436555 429691 404425
40822D04425j28701k52234j92166R5627L11864J44390k68320m40794j45000K91694
$$ 404425 275724 23490 -168676 -73049 238815 383205 114885 -325909 -470909 -179215
40812a79215L93779J01474k07685j97026O3401K30146J06536j45267k27715p8401
$$ -179215 214564 316038 108353 -88673 -25272 204874 311410 166143 -61572 -139973
40802a39973Q4964Q8699J9682K1875K6255j14065k97606k49046N2180K81549K18441
$$ -139973 -55009 33690 53372 75247 101502 -12563 -310169 -559215 -507035 -225486 -7045
40791g045M3510Q633L1870j04734l03336k47895O7261K59755J05634j40215j40098
$$ -7045 36465 45098 76968 -27766 -331102 -578997 -511736 -251981 -146347 -286562 -426660
40780d26660N7021J66691J10076M6020O2836R0466Q0196N0525k6339j76439k77460
$$ -426660 -369639 -202948 -92872 -46852 15984 106450 186646 237171 210832 34393 -243067
40769b43067j79018K4459P3524o6651j42802k2305R0059k30j38160n5775J96264
$$ -243067 -422085 -397626 -324102 -390753 -533555 -555860 -465801 -466031 -604191 -659966 -463702
40758d63702L06882J42289r8461j76025q4276J4514J0391n9620r0156m2315J5130
$$ -463702 -156820 -14531 -112992 -289017 -373293 -358779 -348388 -408008 -498164 -540479 -525349
40747e25349K3562N0915J80442L00256J88695j28828l11798j35262J85348K86794
$$ -525349 -501787 -450872 -270430 29826 218521 89693 -222105 -357367 -172019 114775
40737A14775J33412k0388l6507j0471k7459m4680k4330J5557R1907K22917L10736
$$ 114775 248187 227799 191292 180821 153362 108682 84352 99909 191816 414733 725469
40726G25469K35954N6199p3917j53297k85058l95635k77011L9358K23778Q2827
$$ 725469 961423 1017622 943705 790408 505350 109715 -167296 -127938 95840 178667
40716A78667j72411k35073r1599N3846Q9797O1802K7309K518L119K9878M9202
$$ 178667 6256 -228817 -320416 -266570 -176773 -114971 -87662 -85144 -82025 -52147 -2945
40705b945M4663L4803J4940l5500p3364l0181N0278L6913j01050k52856l17085
$$ -2945 41718 76521 91461 55961 -17403 -47584 2694 39607 -61443 -314299 -631384
40694f31384k55025k4498L27742N19793K70050k46457m74524j62630K94000L83065
$$ -631384 -886409 -910907 -583165 -63372 206678 -39779 -514303 -676933 -382933 132
40684A32J06408j46098j46697R693J50480J73904M3600j53954k31556j47462r8909
$$ 132 106540 -39558 -186255 -176562 -26082 147822 191422 37468 -194088 -341550 -440459
40673d40459j97613k36049k0252K45438K28313M285l5865K13504M16574K89701
$$ -440459 -638072 -874121 -894373 -648935 -420622 -416337 -452202 -238698 177876 467577
40663D67577l6956k33476j31560J81230M40800L62687p8839n15381n41293k16473
$$ 467577 430621 197145 65585 246815 687615 1050302 971463 456082 -85211 -301684
40653c01684K0742m2012j57399p0872Q8880O2164j12048j63302L02J63862J03610
$$ -301684 -280942 -322954 -480353 -551225 -462345 -400181 -512229 -675531 -675229 -511367 -407757
40642d07757j14144k00840L01K85892L10392M0357j70162o4095J40207P2539k25408
$$ -407757 -521901 -722741 -722440 -436548 -126156 -85799 -255961 -320056 -179849 -107310 -332718
40631c32718l59123j51597J63296L30724L42007K52471N4034j48569j34365Q8852
$$ -332718 -691841 -843438 -680142 -349418 -7411 245060 299094 150525 16160 105012
40621A05012J99371K0303j79444q5788J65198J90264o4964k65548j80924L4320
$$ 105012 304383 324686 145242 59454 224652 414916 349952 84404 -96520 -62200
40611f2200J09103K988j16444j30414r2245j05532j44332o4037J72369L56629
$$ -62200 46903 49891 -66553 -196967 -289212 -394744 -539076 -603113 -430744 -74115
40601g4115K58120l2112j53860O9417L87085M30218J45613j88812l00299j74460
$$ -74115 184005 151893 -1967 67450 454535 884753 1030366 841554 541255 366795
40591C66795k0849m3911k12310k68254n3196K28287K47008K0376j11298j2515
$$ 366795 345946 302035 89725 -178529 -231725 -3438 243570 263946 152648 140133
40581A40133N2943j12175k87969j87851Q7350K28918J71979P4999n280j05313
$$ 140133 193076 80901 -207068 -394919 -307569 -78651 93328 168327 163047 57734
40571E7734j28007M1458K42072J87519r1763k66198j88608n1194j0023L1323J52025
$$ 57734 -70273 -28815 213257 400776 309013 42815 -145793 -196987 -207010 -175687 -23662
40560b3662K21386J42248M6021N6915O2461p6551k53648k78249j87341j60189
$$ -23662 197724 339972 385993 442908 505369 428818 175170 -103079 -290420 -450609
40550d50609j96557j22186R8315K75279K56701J01527n2454j33023r4111R6794
$$ -450609 -647166 -769352 -671037 -395758 -139057 -37530 -89984 -223007 -317118 -220324
40540b20324L32133L73479J28132j88232l14794k77923k75521l04751j66065J41032
$$ -220324 111809 485288 613420 425188 110394 -167529 -443050 -747801 -913866 -772834
40530g72834L07386J36913j41477j77886M4181K69311L55181L51689K82018J13544
$$ -772834 -465448 -328535 -470012 -647898 -603717 -334406 20775 372464 654482 768026
40520G68026p7268j59468j64602k18211k73218j76822M064L6782o3397k4280J85449
$$ 768026 690758 531290 366688 148477 -124741 -301563 -297499 -260717 -324114 -348394 -162945
40509a62945K34493p408j64969Q6885M78173N21600K09200n9429r6843p6673j29922
$$ -162945 71548 64140 -100829 -13944 464229 985829 1195029 1135600 1038757 962084 832162
40498H32162j72267j49918j47989k05521k49667k34106j63487j6337J75533K51462
$$ 832162 659895 509977 361988 156467 -93200 -327306 -490793 -507130 -331597 -80135
40488h0135J32914K854L5296Q0608q0262l06965l03417j47323j66789l20979k09548
$$ -80135 52779 55633 90929 171537 91275 -215690 -519107 -666430 -833219 -1154198 -1363746
40477a363746K21185M90333K95271l8710r0738N4349N8838j04272j82514o0390
$$ -1363746 -1142561 -652228 -356957 -395667 -486405 -432056 -373218 -477490 -660004 -720394
40467g20394J40947K64534K24696M4473q4270L3591K60499K18867j38187l75132
$$ -720394 -579447 -314913 -90217 -45744 -130014 -96423 164076 382943 244756 -130376
40457a30376k12062M0953Q848j30025R580L11953L24484J0581j93242p6934P9124
$$ -130376 -342438 -301485 -292637 -422662 -413082 -101129 223355 233936 40694 -36240 42884
40446D2884L6451m4710L6615J57307R8916r1364j93645j31690j9845K3064j8368
$$ 42884 79335 34625 71240 228547 327463 236099 42454 -89236 -109081 -86017 -104385
40435a04385q2651r1973k1807O8877J15475J29099J40572J23206O0545J4421J3418
$$ -104385 -187036 -279009 -300816 -231939 -116464 12635 153207 276413 336958 351379 364797
40424C64797l2826j69859k60462j86299o7965o4393p4967P6449K56779J70193
$$ 364797 331971 162112 -98350 -284649 -352614 -417007 -491974 -415525 -158746 11447
40414A1447j36979k87829j35998M9241N8299M1306J62892K78555J85474m4540
$$ 11447 -125532 -413361 -549359 -500118 -441819 -400513 -237621 40934 226408 181868
40404A81868k06566k46231k10288j03348J8828P477j26736j14973J86791M99305
$$ 181868 -24698 -270929 -481217 -584565 -565737 -558260 -684996 -799969 -613178 -113873
40394a13873M70557J76964j7645j454K557j34406k41893j41233P9879J85699P1461
$$ -113873 356684 533648 516003 514549 517106 382700 140807 -426 79453 265152 336613
40383C36613j33824j91902K004K59267K64120l0994l07026k91013j06924l0353
$$ 336613 202789 10887 12891 272158 536278 505284 198258 -92755 -199679 -230032
40373b30032n3746L1633K15443K51124O4434j16504j11896k6321l1101j07094
$$ -230032 -283778 -252145 -36702 214422 278856 162352 50456 24135 -6966 -114060
40363a14060j25652n1555L8285N4982l1238j40302j08653J12261L02211J87610
$$ -114060 -239712 -291267 -252982 -198000 -229238 -369540 -478193 -365932 -63721 123889
40353A23889j74750m14530l00292l394J63605J17085J6374K3590J42188K35904
$$ 123889 -50861 -465391 -765683 -769077 -605472 -488387 -472013 -448423 -306235 -70331
40343g0331J76976K2255j3591J34945K16389J3836k41450j38296K55488M04825
$$ -70331 106645 128900 115309 250254 466643 480479 239029 100733 356221 761046
40333G61046P5416l19079l42688j25493k3566k4788J04282L03643K94975P0400
$$ 761046 836462 517383 174695 49202 25636 848 105130 408773 703748 774148
40323G74148j03118j35342j92004l07350k72115Q323L25040M32515K99015L9611
$$ 774148 671030 535688 343684 36334 -235781 -227458 97582 530097 829112 868723
40313H68723k04571k93829j97107q5857j24078j90803n7127J94710K49185P1450
$$ 868723 664152 370323 173216 87359 -36719 -227522 -284649 -89939 159246 230696
40303B30696k0670J08437J80419j6609k65872k88367j71865j41040j49857l6794
$$ 230696 210026 318463 498882 482273 216401 -71966 -243831 -384871 -534728 -571522
40293e71522J01450N1883j09238j04514R6015K37092J84931P5895L1579k593p4016
$$ -571522 -470072 -418189 -527427 -631941 -535926 -298834 -113903 -38008 -6429 -9022 -83038
40282h3038j12931q1931m2019m807R9579K45210K83150J68940M6637J4900k8666
$$ -83038 -195969 -277900 -319919 -324726 -225147 20063 303213 472153 518790 533690 505024
40271E05024j91783l69192l61534j40556J20161K41133J85513M6002n5989p3652
$$ 505024 313241 -55951 -417485 -558041 -437880 -196747 -11234 34768 -21221 -94873
40261i4873n6790n3429k5879O4686J39586R6818j729J346J02573J39701Q4400
$$ -94873 -151663 -205092 -230971 -166285 -26699 70119 68390 69736 172309 312010 396410
40250C96410J09307K62054K99476L0137l52333n01070l64848j76474p8277j1865
$$ 396410 505717 767771 1067247 1097384 745051 243981 -120867 -297341 -375618 -387483
40240c87483N4388N2996J595J9299R4815O1319j02591j62870L3144K88811L10472
$$ -387483 -333095 -280099 -278504 -259205 -164390 -103071 -205662 -368532 -335388 -46577 263895
40229B63895J02325q3538j09201o7453p5653j36393j99995k13497j10287J07088
$$ 263895 366220 282682 173481 106028 30375 -106018 -306013 -519510 -629797 -522709
40219e22709K82855K58383J00685J5097L4146k192j27238j50207K0928J88895
$$ -522709 -239854 18529 119214 134311 168457 166265 39027 -111180 -90252 98643
40209I8643J58460K2919k7310o195k5612m9853j4942n3835k90909n02703l42355
$$ 98643 257103 280022 252712 246517 220905 171052 156110 102275 -188634 -691337 -1033692
40198a033692J09996L87590K80394P5231M6415Q0805P311m6993P8441K19064J24708
$$ -1033692 -923696 -536106 -255712 -180481 -134066 -53261 -45950 -92943 -14502 204562 329270
40187C29270j11986j93789p9483M658m4297r6780o3222k3582o1235j50499k08577
$$ 329270 217284 23495 -55988 -51330 -95627 -192407 -255629 -279211 -340446 -490945 -699522
40176f99522j25890J76084N54924O49650L12900r0436j22904R7537Q9904k26335
$$ -699522 -825412 -649328 -94404 555246 868146 777710 654806 752343 842247 615912
40166F15912m16980k39678Q159K5470m5908J3629O6111r4815k98149k37738J2829
$$ 615912 198932 -40746 -32587 -7117 -53025 -39396 26715 -68100 -366249 -603987 -591158
40155e91158J18471K1168j0413J54980L26893K99415Q0807j99225l81179k89668
$$ -591158 -472687 -451519 -461932 -306952 19941 319356 400163 200938 -180241 -469909
40145d69909Q5495M24513L77863N7763p6724J13098K47077N1021j87043q7722
$$ -469909 -384414 40099 417962 475725 399001 512099 759176 810197 623154 535432
40135E35432J77137J29511k57123m91420k83746O8159J55677o182j40232j53853
$$ 535432 712569 842080 584957 93537 -190209 -122050 33627 27445 -112787 -266640
40125b66640j45620j17164J8028J83125J72146l3537k02301j59582K0856J79099
$$ -266640 -412260 -529424 -511396 -328271 -156125 -189662 -391963 -551545 -530689 -351590
40115c51590K44024J92356K4287j34329r0886J39560K89312J90041n984r9577
$$ -351590 -107566 84790 109077 -25252 -116138 23422 312734 502775 496791 397214
40105C97214j45457k76840m01029l27634r2537J02223J95532K65828K93410J89714
$$ 397214 251757 -25083 -426112 -753746 -846283 -744060 -548528 -282700 10710 200424
40095B00424J8906p2599j05643j76409j76837N7747L47949L09550n4572l01818
$$ 200424 219330 146731 41088 -135321 -312158 -254411 93538 403088 348516 46698
40085D6698k01109k9421m1465o4065R4422K06386j0711l52390l75301m6118K53721
$$ 46698 -154411 -183832 -225297 -289362 -194940 11446 735 -351655 -726956 -773074 -519353
40074e19353L00782K38736K25572K07063J01007m6819j62662k21419j87473l9336
$$ -519353 -218571 20165 245737 452800 553807 506988 344326 122907 -64566 -103902
40064a03902J22044J33805l3552k44871l55647l07283j17136J09700K10302J31121
$$ -103902 18142 151947 118395 -126476 -482123 -789406 -906542 -796842 -586540 -455419
40054d55419J8205K5482J02089J02681L1243R583N3341N2121l7605j21002r1887
$$ -455419 -437214 -411732 -309643 -206962 -175719 -166136 -112795 -60674 -98279 -219281 -311168
40043c11168N8223K37156L00128J67503m9123j40872p9075n2579j53843k23001
$$ -311168 -252945 -15789 284339 451842 402719 261847 182772 130193 -23650 -246651
40033b46651j26733K1844Q4624J12868J45590N1849j64133j70082K28470O56898
$$ -246651 -373384 -351540 -266916 -154048 -8458 43391 -120742 -290824 -62354 594544
40023E94544O21802K18310o5227j08160k01248l93752l78487j02829O1678n8728
$$ 594544 1216346 1434656 1369429 1261269 1060021 666269 287782 184953 246631 187903
40013A87903j41796O0203K83281J91253r0426k07982r5437M7662J02631P9468
$$ 187903 46107 106310 389591 580844 490418 282436 186999 234661 337292 416760
40003D16760k9174j89747k37926o6401J79967K69063J67308K8523k4494q04O569
$$ 416760 387586 197839 -40087 -106488 73479 342542 509850 538373 513879 513075 519644
39992E19644r1229k62805l30263j84351J3434L7578m1211K6513K16642K42583
$$ 519644 428415 165610 -164653 -349004 -335570 -297992 -339203 -312690 -96048 146535
39982A46535N7871l7409R2189J89760O9957o8496l3276J3399j10659k38291j47480
$$ 146535 204406 166997 259186 448946 518903 450407 417131 430530 319871 81580 -65900
39971f5900L5526O9214J5386P8318K01561J72085L480r7810n3924N7280J82577
$$ -65900 -30374 38840 54226 132544 334105 506190 509670 411860 357936 415216 597793
39960E97793K63918J72364q8228k72693k31169j60140k51558l23344j36530J39787
$$ 597793 861711 1034075 945847 673154 441985 281845 30287 -293057 -429587 -289800
39950b89800J83698O7556J08750K91195K99969Q5904n7703P414J04308J07289
$$ -289800 -106102 -38546 70204 361399 661368 747272 689569 696983 801291 908580
39940I08580Q0866J9141j70703l75362l39859q8478P7234N7614N8168J46423J10533
$$ 908580 989446 1008587 837884 462522 122663 34185 111419 169033 227201 373624 484157
39929D84157j14558k70252j93419o2832n2122p1131l3874m7691j30704p4484J74435
$$ 484157 369599 99347 -94072 -156904 -209026 -280157 -314031 -361722 -492426 -566910 -392475
39918c92475L18974J69749q121P6109K40634J36754j53890k33544Q587K81254
$$ -392475 -73501 96248 88127 164236 404870 541624 387734 154190 162777 444031
39908D44031L29835J63947j16167m02606m97471k60201J21731K80148J36516k2890
$$ 444031 773866 937813 821646 419040 -78431 -338632 -216901 63247 199763 176873
39898A76873Q749J08416J13044Q6654J21760R8758j12018l41672k83543O9688
$$ 176873 185622 294038 407082 493736 615496 714254 602236 260564 -22979 46709
39888D6709L82808L96136J88212l0107j83634k80163k61879r3084R5729J37477
$$ 46709 429517 825653 1013865 983758 800124 519961 258082 164998 260727 398204
39878C98204N5014j5002p3093k14204l53640k67469K8583K14147J15925k9208
$$ 398204 453218 438216 365123 150919 -202721 -470190 -441607 -227460 -111535 -140743
39868a40743L9548J86447J11708j59003l17258k18053l134J68357K45433J82220
$$ -140743 -101195 85252 196960 37957 -279301 -497354 -500488 -332131 -86698 95522
39858I5522j4674j51188l7397J79374J60800j10203k70308j15849J04151R3445
$$ 95522 80848 -70340 -107737 71637 232437 122234 -148074 -263923 -159772 -66327
39848f6327n9424p5153P9657J95815J63090P9554L8063j2735j42284k73699k32478
$$ -66327 -125751 -200904 -121247 74568 237658 317212 355275 342540 200256 -73443 -305921
39837c05921K7670K97823L05394N6020j35718m3451J71503K04813L6557r3168
$$ -305921 -278251 19572 324966 380986 245268 201817 373320 578133 614690 521522
39827E21522o5901o854l4359j03244j27864r5619l7268m769m6592r4913J5824
$$ 521522 455621 448767 414408 311164 183300 87681 50413 45644 -948 -95861 -80037
39816h0037K66135L55101J19967j40606r3746O3891q3281m20159m15488P463L00472
$$ -80037 186098 541199 661166 520560 426814 490705 407424 -12735 -428223 -420760 -120288
39805a20288J34624j35991r8798J18645J85208R0795O03p2096j23634r28K94336
$$ -120288 14336 -121655 -220453 -101808 83400 174195 174798 102702 -20932 -21860 272476
39794B72476M30053J95766j32780j99178q2693q1846k15148k75448j94817n2682
$$ 272476 702529 898295 765515 566337 483644 401798 186650 -88798 -283615 -336297
39784c36297J05992K10789J37475l3199m300K46876L13198K30k69094j05219J79986
$$ -336297 -230305 -19516 117959 84760 80460 327336 640534 640764 371670 266451 446437
39773D46437P7386k76879l65104j51583l8621j11278q0990Q3382J08136m318M0867
$$ 446437 523823 246944 -118160 -269743 -308364 -419642 -500632 -417250 -309114 -313432 -272565
39762b72565K28511K07584n9385j97030o7426M4863J8051Q7070K86072K77982
$$ -272565 -44054 163530 104145 -92885 -160311 -115448 -97397 -10327 275745 553727
39752E53727k2980k06630l0296J79873J07476n2398k6492M2211o6068j94306j17206
$$ 553727 530747 324117 293821 473694 581170 528772 502280 544491 478423 284117 166911
39741A66911J3202m7201j72637j12815K6344k3565j87631j56744R7813K95302
$$ 166911 180113 132912 -39725 -152540 -126196 -149761 -337392 -494136 -396323 -101021
39731a01021K73186J28172j4299r4094m2283J34220K59190J99173P5764N6344
$$ -101021 172165 300337 286038 191944 149661 283881 543071 742244 818008 874352
39721H74352P0158k0722j17623n1836O5512o041k06503k38673m1722J28963J14982
$$ 874352 944510 923788 806165 754329 819841 813800 607297 368624 326902 455865 570847
39710E70847L1348k4520j31118k98633l39605j53263N7981M3799j42283k23819
$$ 570847 602195 577675 446557 147924 -191681 -344944 -286963 -243164 -385447 -609266
39700f09266p8570J24914J79846J07386Q7266J71109J96847N1987j00859l3252
$$ -609266 -687836 -562922 -383076 -275690 -188424 -17315 179532 231519 130660 97408
39690I7408J69411J76033j01535l37685k38449O2245K32711J85248O8496l6584
$$ 97408 266819 442852 341317 3632 -234817 -172572 60139 245387 313883 277299
39680B77299j58256k48876k05989o2579M0342O3232Q6353J35402J41106O2203
$$ 277299 119043 -129833 -335822 -398401 -358059 -294827 -208474 -73072 68034 130237
39670A30237p1573k04948k44106q3464K18456L86407K23179j18045l20081k70572
$$ 130237 58664 -146284 -390390 -473854 -255398 131009 354188 236143 -83938 -354510
39660c54510p2826J82114M13935M36991J51057j98134k58908o3690L5090p6752
$$ -354510 -427336 -245222 168713 605704 756761 558627 299719 236029 271119 194367
39650A94367j42361k9900K9552j18941k33740p4347J55901J06711j51121k20953
$$ 194367 52006 22106 51658 -67283 -301023 -375370 -219469 -112758 -263879 -484832
39640d84832J3168K21844J24779j27858j95088J1116K63466L12157J25054j28313
$$ -484832 -471664 -249820 -125041 -252899 -447987 -436871 -173405 138752 263806 135493
39630A35493k50362j78287j9799O7933M5106J7002Q0769J79765J67282J6101j11191
$$ 135493 -114869 -293156 -312955 -245022 -199916 -182914 -102145 77620 244902 261003 149812
39619A49812o3131P9635R2642q0827k31409j58144O5617K01175J43742m204j09226
$$ 149812 86681 166316 258958 178131 -53278 -211422 -145805 55370 199112 194908 85682
39608H5682j30718q9049k9048j4704o1774q3963k454J12411J24629M0166o341
$$ 85682 -45036 -134085 -163133 -177837 -239611 -323574 -326028 -213617 -88988 -48822 -55163
39597e5163K8186M5151N011J1577J18198J97139J18310m6897j25166p4021O592
$$ -55163 -26977 18174 23185 34762 152960 350099 468409 421512 296346 222325 228917
39586B28917M7366O6977O9022N228j21828k06002j55273l0079O360j04514k13360
$$ 228917 276283 343260 412282 417510 295682 89680 -65593 -95672 -89312 -193826 -407186
39575d07186j36323Q4393J99652P9367r3487p0057J07379J69211J8096j33432
$$ -407186 -543509 -459116 -259464 -180097 -273584 -343641 -236262 -67051 -48955 -182387
39565a82387q2460Q3956J47406P2196Q303L8142P1354M028j19657j50773r278
$$ -182387 -264847 -180891 -33485 38711 47014 85156 156510 160538 40881 -109892 -119170
39554a19170K06646K92133J41297j21307k60979j86028j5317J10851J81932K28674
$$ -119170 87476 379609 520906 399599 138620 -47408 -62725 48126 230058 458732
39544D58732J93942N106k72644m59271m25410j80346J53542L79510L14082k5495
$$ 458732 652674 657780 385136 -74135 -499545 -679891 -526349 -146839 167243 141748
39534A41748l45445l36256k9685K37935K48644J35299J18003J72882J20795o0195
$$ 141748 -203697 -539953 -569638 -331703 -83059 52240 170243 343125 463920 403725
39524D03725k08617k30602j83676j07508K2663J25022J9661k63498l94409j67291
$$ 403725 195108 -35494 -219170 -326678 -304015 -178993 -159332 -422830 -817239 -984530
39514i84530J49039J57189p8568j26469J39575L42018J95738n9662o8416R1812
$$ -984530 -835491 -678302 -756870 -883339 -743764 -401746 -206008 -265670 -334086 -242274
39504b42274J03215m5888r9972l5669j06657l50161m35715j56312K36489L88517
$$ -242274 -139059 -184947 -284919 -320588 -427245 -777406 -1213121 -1369433 -1132944 -744427
39494g44427K99417K02109J68728R0139n1102j29173p1541O9361K18704L08856
$$ -744427 -445010 -242901 -74173 15966 -35136 -164309 -235850 -166489 52215 361071
39484C61071K50179L3056j70996j75665l0966N8082M4110O4118J39243R5141j14098
$$ 361071 611250 644306 473310 297645 266679 324761 368871 432989 572232 667373 553275
39473E53275k38226q3961J35868O8438k42281l76281j27630J97537K08603m8656
$$ 553275 315049 231088 366956 435394 193113 -183168 -310798 -113261 95342 46686
39463D6686k02294p2028J48742K06749Q0413q3668j60509j00600P1949K23564
$$ 46686 -155608 -227636 -78894 127855 208268 124600 -35909 -136509 -64560 159004
39453A59004J84412l4852j90438r4027J17830J51071m7732k26854j75667K1479
$$ 159004 343416 308564 118126 24099 141929 293000 245268 18414 -157253 -135774
39443a35774J36170P6255o6859j63452j50645m5821P1108J21532J18676J46203
$$ -135774 396 76651 9792 -153660 -304305 -350126 -279018 -157486 -38810 107393
39433A07393K07172J73205l2833k66074k91357p9938J31114J09203j13248k91351
$$ 107393 314565 487770 454937 188863 -102494 -182432 -51318 57885 -55363 -346714
39423c46714k44008l7564J03351N0581q3947q9303P1946K10467J69354M6961N5986
$$ -346714 -590722 -628286 -524935 -474354 -558301 -647604 -575658 -365191 -195837 -148876 -92890
39412i2890K14388L20699K37534M8956j09691k26582l19286l01050j02339J45254
$$ -92890 121498 442197 679731 728687 618996 392414 73128 -227922 -330261 -185007
39402a85007K24225J17384J4026J5153N581j13841k27583j65184M2488K02612
$$ -185007 39218 156602 170628 185781 191362 77521 -150062 -315246 -272758 -70146
39392g0146J98779O7467j16301k91104l61973k47689j5114J42702J21418K7649
$$ -70146 128633 196100 79799 -211305 -573278 -820967 -836081 -693379 -571961 -544312
39382e44312L4339J69242L02643L12163K05043P9866M066m4675j09914j60250
$$ -544312 -509973 -340731 -38088 274075 479118 558984 563050 518375 408461 248211
39372B48211j20296m965N6733j8130j53706k31605k45148k40213j75708J3309
$$ 248211 127915 122950 179683 161553 7847 -223758 -468906 -709119 -884827 -871518
39362h71518K44819L37150K38005P5686k8359o4338m0103N9778J71920J59461
$$ -871518 -626699 -289549 -51544 24142 -4217 -68555 -108658 -48880 123040 282501
39352B82501k403j63099j89656j12015j2148J00149K04298J85633k4098k85202
$$ 282501 280098 116999 -72657 -184672 -196820 -96671 107627 293260 269162 -16040
39342a6040l58530j65959J29030K87783K08182L284j09474l4266R4514Q5283o6890
$$ -16040 -374570 -540529 -411499 -123716 84466 87750 -21724 -55990 38524 123807 56917
39331E6917k06295k34273j55662L5589L06901M51887K73631o7297j81593n582
$$ 56917 -149378 -383651 -539313 -503724 -196823 255064 528695 461398 279805 274223
39321B74223R3440r5702k79533j32776J91125L28816K36712J17246K4374r4037
$$ 274223 367663 271961 -7572 -140348 50777 379593 616305 733551 757925 663888
39311F63888j26022M3648K16878J20271j17973j33837P1077J21560j13622l21449
$$ 663888 537866 581514 798392 918663 800690 666853 737930 859490 745868 424419
39301D24419k59374q4984k5547n1653m9292l4538k6883M6571J63326J51578k3321
$$ 424419 165045 80061 54514 2861 -46431 -80969 -107852 -61281 102045 253623 230302
39290B30302j39339m2773J15990J35526N2860J329l8140j39256k20233j38838
$$ 230302 90963 48190 164180 299706 352566 353895 315755 176499 -43734 -182572
39280a82572P6422K51494K71878J50942l8967j98600k21179p2974J62797L46042
$$ -182572 -106150 145344 417222 568164 529197 330597 109418 36444 199241 545283
39270E45283L52874J35445j91148l78425l07685j65894j78976k50287j22359J60184
$$ 545283 898157 1033602 842454 464029 156344 -9550 -188526 -438813 -561172 -400988
39260d00988K84624J76686J02635J83453J92033n370j77914j30029l5371q9643
$$ -400988 -116364 60322 162957 346410 538443 533073 355159 225130 189759 100116
39250A00116j29086O6619L20689K76700o6080l67998m12520k67376o4694J03091
$$ 100116 -28970 37649 358338 635038 568958 200960 -211560 -478936 -543630 -440539
39240d40539J30749L215r6297j1287J20122O3804j08191r0181J88247M26321L39021
$$ -440539 -309790 -306575 -402872 -414159 -294037 -230233 -338424 -428605 -240358 185963 524984
39229E24984r442l13073l34962q9869J80241K21190L7500j04506k1690J47992
$$ 524984 515542 202469 -132493 -222362 -42121 179069 216569 112063 90373 238365
39219B38365J72306N4178m3400q0906j27731j46623m1011J09239J00384q2496
$$ 238365 410671 464849 421449 340543 212812 66189 25178 134417 234801 152305
39209A52305k08952j10195J16335K64963K61913J85869J20155L9047j47781m13118
$$ 152305 -56647 -166842 -50507 214456 476369 662238 782393 821440 673659 260541
39199B60541n22540k72006J75715M01444K61642P9488J52253L09983K09027j29228
$$ 260541 -261999 -534005 -358290 43154 304796 384284 536537 846520 1055547 926319
39189I26319l69374l26909r3876J94996M19184L84381K1716l50654l10870Q8339
$$ 926319 556945 230036 136160 331156 750340 1134721 1156437 805783 494913 583252
39179E83252L44165J69210j77815l26748k55584j47168m7474R5823K10281J56410
$$ 583252 927417 1096627 918812 592064 336480 189312 141838 237661 447942 604352
39169F04352m3467k16919k72828k80914k99699k44697j7072K78341L69980J46424
$$ 604352 560885 343966 71138 -209776 -509475 -754172 -771244 -492903 -122923 23501
39159B3501j43938j67812N3076J73403K3973j52212q2006J35452K03539N4065
$$ 23501 -120437 -288249 -235173 -61770 -37797 -190009 -272015 -136563 66976 121041
39149A21041j17345j50225n8070P0464J45413J07404J6890L1893J78947K60207
$$ 121041 3696 -146529 -204599 -134135 11278 118682 135572 167465 346412 606619
39139F06619J20859j21101k54438k37368j31388M6634K18481J86200q1191k78405
$$ 606619 727478 606377 351939 114571 -16817 29817 248298 434498 353307 74902
39129G4902j44368J48360K60880J81479J39409J69776J14776l4739j44867k22155
$$ 74902 -69466 78894 339774 521253 660662 830438 945214 910475 765608 543453
39119E43453l62223m69634l53884o8157J45972K03126J85704J05487m2057j03276
$$ 543453 181230 -288404 -642288 -710445 -564473 -361347 -175643 -70156 -112213 -215489
39109b15489J4342Q1639j12231l11518j44598K08941K44091m3328j55775N9060
$$ -215489 -201147 -119508 -231739 -543257 -687855 -478914 -234823 -278151 -433926 -374866
39099c74866J88423Q836j51664k9160J50449J35774M7985K4993o9933k71736k86836
$$ -374866 -186443 -177607 -329271 -358431 -207982 -72208 -24223 770 -69163 -340899 -627735
39088f27735Q716K49569J35198p0623n759J64863O2300k21160k55657L4834K80705
$$ -627735 -619019 -369450 -234252 -304875 -310634 -145771 -83471 -304631 -560288 -525454 -244749
39077b44749K33594L2901j11163j71972j82402j09447N2675K11645K70523K24669
$$ -244749 -11155 21746 -89417 -261389 -443791 -553238 -500563 -288918 -18395 206274
39067B06274J46747J08587J07721P3833j6359q1146p2048q0546j64332j80517
$$ 206274 353021 461608 569329 643162 626803 545657 473609 393063 228731 48214
39057D8214r918J63045Q6325j24736j37617M9409J01931q6861k36133j60189j5097
$$ 48214 38296 201341 287666 162930 25313 74722 176653 89792 -146341 -306530 -321627
39046c21627M7926R1491J25576J3633k01407k42143l0825J65357J64756Q8847
$$ -321627 -273701 -182210 -56634 -43001 -244408 -486551 -517376 -352019 -187263 -98416
39036i8416K4651j20995k73971j46984K37953M19142J57702j76439j72162N8013
$$ -98416 -73765 -194760 -468731 -615715 -377762 41380 199082 22643 -149519 -91506
39026i1506J95934K32335L09432L53591K18708k3140k04232k70088j99093J2222
$$ -91506 104428 336763 646195 999786 1218494 1195354 991122 721034 521941 534163
39016E34163J62960J2829k46017j42901K84094M05962l3916m65918l73392m3259
$$ 534163 697123 709952 463935 321034 605128 1011090 977174 511256 137864 94605
39006I4605K9163o2880M584J06396l0087k10260q2350K14372K87795J42188N7698
$$ 94605 123768 60888 65472 171868 141781 -68479 -150829 63543 351338 493526 551224
38995E51224N1522k9960j03432k1847O5496j4354p4155Q7221K37519J00630r5270
$$ 551224 602746 572786 469354 447507 513003 498649 424494 511715 749234 849864 754594
38984G54594J2342K69395K72743M9403q1689j04420k06809k88222j19982J66005
$$ 754594 766936 1036331 1309074 1358477 1276788 1172368 965559 677337 557355 723360
38974G23360K63456J96803J64424R9183j13140k18382N4834M32569M27013N5676
$$ 723360 986816 1183619 1348043 1447226 1334086 1115704 1170538 1603107 2030120 2085796
38964B085796k69822l75573l62949k44398l4913K2940k02936m16853l34025j08705
$$ 2085796 1815974 1440401 1077452 833054 798141 821081 618145 201292 -132733 -241438
38954b41438P3981L70797P71741P77717J88664l56248l07433p9054k35157m50499
$$ -241438 -167457 203340 975081 1752798 1941462 1585214 1277781 1198727 963570 513071
38944E13071j98057J53482n534l15515n4493M87687M63499m7657k49543m9310
$$ 513071 315014 468496 462962 147447 92954 580641 1044140 996483 746940 697630
38934F97630j5417j45935L8082L42204J45989l17854k41143K86831M06692K9811
$$ 697630 682213 536278 574360 916564 1062553 744699 503556 790387 1197079 1226890
38924A226890j00740J36617J14796j96804j66277J66479J10440k53928j38733
$$ 1226890 1126150 1262767 1377563 1180759 1014482 1180961 1291401 1037473 898740
38915H98740L72879L44393k64802m44737M6211L06689K2152m6069L49205M70035
$$ 898740 1271619 1616012 1351210 906473 952684 1259373 1281525 1235456 1584661 2054696
38905B054696J09250O423L63829M96754K79724L48768O37997M25415j0478L37665
$$ 2054696 2163946 2170369 2534198 3030952 3310676 3659444 4297441 4722856 4712378 5050043
38895E050043J172237J221499O97864J084986K341241K896855K569599K597719
$$ 5050043 6222280 7443779 8141643 9226629 11567870 14464725 17034324 19632043
38887A9632043K699769J527120K14077J417305M417333N944985O544915J0327119
$$ 19632043 22331812 23858932 24073009 25490314 29907647 35852632 42397547 52724666
38879E2724666J7359954K3940391L2677739N1426857P4588412P6281133L7046945
$$ 52724666 70084620 94025011 126702750 178129607 252718019 328999152 366046097
38872C66046097k6169689p1694179p6332392n4853143l4592603k4852761j8570227
$$ 366046097 339876408 268182229 191849837 136996694 102404091 77551330 58981103
38865E8981103j1677778p568323p145623o352128l641024j935236k513089k965946
$$ 58981103 47303325 39735002 32589379 26237251 22596227 20660991 18147902 15181956
38857A5181956j962648j139092j430638j551147q92723n67917r19075q86971l25192
$$ 15181956 13219308 12080216 10649578 9098431 8205708 7637791 6718716 5831745 5506553
38848E506553l26371r17944q88693j55904M9160m35863m37272K12358L22373l50143
$$ 5506553 5180182 4262238 3373545 3217641 3266801 2830938 2393666 2606024 2928397 2578254
38838B578254o08884l6603L32108Q421k01406P1792J04543l18766l76942J58510
$$ 2578254 1969370 1932767 2264875 2273296 2071890 2143682 2248225 1929459 1552517 1711027
38828A711027L86550o5061l84157j40399r282l31430m03147J18325M58875J02725
$$ 1711027 2097577 2032516 1648359 1507960 1498678 1167248 764101 882426 1341301 1444026
38818A444026l10321j85949O8447J713m3075K26361L62025N6134j94406j209J84280
$$ 1444026 1133705 947756 1016203 1017916 974841 1201202 1563227 1619361 1424955 1423746 1608026
38807A608026o9607l81336k93271o4030p1622j14098N6812J48800r5036l20055
$$ 1608026 1538419 1157083 863812 799782 728160 614062 670874 819674 724638 404583
38797D04583j62139J11075J20603J8358O8831R6073r8937k28662J6993L79020
$$ 404583 242444 353519 474122 492480 561311 657384 558447 329785 346778 725798
38787G25798M14139J52638o3401r7954r539J69667L23406K35148n1603j99772
$$ 725798 1139937 1292575 1229174 1131220 1121681 1291348 1614754 1849902 1798299 1598527
38777A598527j20463j32803l60733m53054j95435Q2458N8626o8336R960J88086
$$ 1598527 1478064 1345261 984528 531474 336039 418497 477123 408787 418747 606833
38767F06833K10029J06235J9862p9507j95330j41419J22247L04794K06580J3615
$$ 606833 816862 923097 942959 863452 668122 526703 648950 953744 1160324 1173939
38757A173939o0416p7546j02799k5592J02635k0301m11130o08161l44843M501
$$ 1173939 1113523 1035977 933178 907586 1010221 989920 578790 -29371 -374214 -369713
38747c69713K0736j24865n3251J63744J94341K7954q6557q7854q3116m4613J06858
$$ -369713 -348977 -473842 -527093 -363349 -169008 -141054 -227611 -315465 -398581 -443194 -336336
38736c36336K44753J83737k0923j71055j97021j29600K9986K15568K59686J39433
$$ -336336 -91583 92154 71231 -99824 -296845 -426445 -396459 -180891 78795 218228
38726B18228N5373R5143O3876j56943l46080k68982k8234J42211K04752K17533
$$ 218228 273601 368744 432620 275677 -70403 -339385 -367619 -225408 -20656 196877
38716A96877J38163l6641j41595p1173N1173J02211J33548J61321N5123j72733
$$ 196877 335040 298399 156804 85631 136804 239015 372563 533884 589007 416274
38706D16274k53791o6599J18152M2681j37058j13706J21172L30591L53748J80374
$$ 416274 162483 95884 214036 256717 119659 5953 127125 457716 811464 991838
38696I91838j05022k96411k02524N6041J34664m3442j90352j49526r8497j08788
$$ 991838 886816 590405 387881 443922 578586 535144 344792 195266 96769 -12019
38686a2019L5138L32814L61805p2323n07980m61250j15229O4457O3077J69498
$$ -12019 23119 355933 717738 645415 137435 -323815 -439044 -374587 -311510 -142012
38676a42012L57440L38980R5072j07313j45547j18066q4957n2788j00349k26622
$$ -142012 215428 554408 649480 542167 396620 278554 193597 140809 40460 -186162
38666a86162k20653L1770K82086K46422J7529j26031j11433M49K15574M22121
$$ -186162 -406815 -375045 -92959 153463 170992 44961 -66472 -66023 149551 571672
38656E71672L01611j94175n62500l76977O7371K03750L5202o419J62011K36548
$$ 571672 873283 679108 116608 -260369 -192998 10752 45954 39535 201546 438094
38646D38094J64506K17273M16196M33033J43410j77747k97467k68594j78777l4635
$$ 438094 602600 819873 1236069 1669102 1812512 1634765 1337298 1068704 889927 855292
38636H55292N1164q0844l28728m01473k40814p6654n6532j14753j87369k48842
$$ 855292 906456 825612 496884 95411 -145403 -222057 -278589 -393342 -580711 -829553
38626h29553j77024Q9351L13642K36536K3997M6308K69546L17468J23118K4450
$$ -829553 -1006577 -917226 -603584 -367048 -343051 -296743 -27197 290271 413389 437839
38616D37839J49347J99926q129k39969k61978j77521j46325j17161l5319L832
$$ 437839 587186 787112 778983 539014 277036 99515 -46810 -163971 -199290 -195458
38606a95458k853J17872L61836M17642J21513k29814k75344q0476K4250p1780
$$ -195458 -198311 -80439 281397 699039 820552 590738 315394 234918 259168 187388
38596A87388j84953j48527P431J38495J21407m0838j85059j45176K1760R2409
$$ 187388 2435 -146092 -138661 -166 121241 80403 -104656 -249832 -228072 -135663
38586a35663p107j01023m0212Q0206P2329r0271k52480k42531k7621K31881L06109
$$ -135663 -142770 -243793 -284005 -203799 -131470 -221741 -474221 -716752 -744373 -512492 -206383
38575b06383J52387j9515m3693l5041j49462k48220q4913K46636L77407J86485
$$ -206383 -53996 -73511 -117204 -152245 -301707 -549927 -634840 -388204 -10797 175688
38565A75688m3536n0224R6085J76587R3113j12627l09171l07704m3154K61738
$$ 175688 132152 81928 178013 354600 447713 335086 25915 -281789 -324943 -63205
38555f3205L18628J48691M268m7339j59669l24537l03705l4156K13629K18336
$$ -63205 255423 404114 408382 361043 201374 -123163 -426868 -461024 -247395 -29059
38545b9059Q7837K3594L8693M5677K5973r219o1509p2098K6941J49023J30691
$$ -29059 58778 82372 121065 166742 192715 183496 121987 49889 76830 225853 356544
38534C56544n256p5142k9252J7898M6962J40031K20011J07843j19007j71014k3873
$$ 356544 351288 276146 246894 264792 311754 451785 671796 779639 660632 489618 465745
38523D65745J0234j97152l68326k82461j09422p3161r7888k3786R2987J26576
$$ 465745 475979 278827 -89499 -371960 -481382 -554543 -652431 -676217 -583230 -456654
38513d56654J00820O7863q325q2028P796K32117L07826J28022l0471N6287K08347
$$ -456654 -355834 -287971 -296296 -378324 -370528 -138411 169415 297437 266966 323253 531600
38502E31600J76509M2019n005k5976j56141k87941k59634j78298k30476l21079
$$ 531600 708109 750128 745123 719147 563006 275065 15431 -162867 -393343 -714422
38492g14422k16939O8007L17261M28065M24207K91796P4885j2604J28819K26049
$$ -714422 -931361 -863354 -546093 -118028 306179 597975 672860 660256 789075 1015124
38482A015124r740l81960m31523j03986J85257J64960K0162K290N2607j4993j79341
$$ 1015124 1005384 623424 191901 87915 273172 438132 458294 460584 513191 498198 318857
38471C18857k58429j84444p1330l2051l4461K6628J53504K15783J36833K7110
$$ 318857 60428 -124016 -195346 -227397 -261858 -235230 -81726 134057 270890 298000
38461B98000J7096L2407p6293k25172j77314N2184J65004L9206p9110J2678J61692
$$ 298000 315096 347503 271210 46038 -131276 -79092 85912 125118 46008 58686 220378
38450B20378J57852Q3352J23051K28624K12490L0355k15703m09745m28727k16044
$$ 220378 378230 461582 584633 813257 1025747 1056102 840399 430654 1927 -214117
38440b14117L8738N1964j07882o1931K40568L53042N6621k15900p1208J80560
$$ -214117 -175379 -123415 -231297 -293228 -52660 300382 357003 141103 69895 250455
38430B50455O6150k36734k41682j5764j4883k36299k48229k361Q8407q0196j31249
$$ 250455 316605 79871 -161811 -177575 -192458 -428757 -676986 -679347 -590940 -671136 -802385
38419h02385Q0767K18755J02652J1401J18057J69141J378j19171J3831J60467
$$ -802385 -721618 -502863 -400211 -388810 -270753 -101612 -100234 -219405 -205574 -45107
38409d5107P1415p7897l9411O2704M070j08714m9434J08981J40547N6710K5374
$$ -45107 26308 -51589 -91000 -28296 -24226 -132940 -182374 -73393 67154 123864 149238
38398A49238M2633j2517j08465j16011l7918M5267J47730K79394L03948J32386
$$ 149238 191871 179354 70889 -45122 -83040 -37773 109957 389351 693299 825685
38388H25685o1986p1771P118o7032k68201l35342j87164j3213P3035J86701L78988
$$ 825685 763699 691928 699046 632014 363813 28471 -158693 -171906 -98871 87830 466818
38377D66818M40841J86118k10326l70300j80907P6209J13132k083r760J10446
$$ 466818 907659 1093777 883451 513151 332244 408453 521585 519502 509742 620188
38367F20188J02899j35081l32169k19298N4758J28926n1118j96362j31548j0785
$$ 620188 723087 588006 255837 36539 91297 220223 169105 -27257 -158805 -169590
38357a69590l0380j65130k70404k55916r0209J88553M07615L89348K07965J28702
$$ -169590 -199970 -365100 -635504 -891420 -981629 -793076 -385461 3887 211852 340554
38347C40554K23333K50312K2658k92578l82669j69721J36152K75288J55536q7744
$$ 340554 563887 814199 836857 544279 161610 -8111 128041 403329 558865 471121
38337D71121k11955j21700K1789M4741J5470O6157Q3051j20037l89873l75049
$$ 471121 259166 137466 159255 203996 219466 285623 368674 248637 -141236 -516285
38327e16285q3393J10476P2816P7845K38101K54538j7602k17988m9232J98982
$$ -516285 -599678 -489202 -416386 -338541 -100440 154098 136496 -81492 -130724 68258
38317F8258J09538j97497l09953j84967r5768r4734m706J55130J83318Q7618N9524
$$ 68258 177796 -19701 -329654 -514621 -610389 -705123 -709829 -554699 -371381 -283763 -224239
38306b24239R5981L1352q7343m9215J07793J28795P421K3453K49504L95940K56414
$$ -224239 -128258 -96906 -184249 -233464 -125671 3124 10545 33998 283502 679442 935856
38295I35856k0603k15526k88656k43679m8379J79733K00540J2620q0796P6284
$$ 935856 915253 699727 411071 167392 119013 298746 499286 511906 431110 507394
38285E07394K32868J07354j98589l61705k46110J8000K20218K02523m0183k78147
$$ 507394 740262 847616 649027 287322 41212 59212 279430 481953 441770 163623
38275A63623k37741J9386J16567j06839l24700j83999J82985L63902K24679j1344
$$ 163623 -74118 -54732 61835 -45004 -369704 -553703 -370718 -6816 217863 206519
38265B06519j37037j40379o6613L8546O1619p4307k33983k02793k632J26387Q2520
$$ 206519 69482 -70897 -137510 -98964 -37345 -111652 -345635 -548428 -551060 -424673 -342153
38254c42153L3503J26640K56079K32615N7381r5708j02651L88R2601Q9763J0510
$$ -342153 -308650 -182010 74069 306684 364065 268357 165706 166094 258695 348458 358968
38243C58968m6815j3067O8384J09846J09486J28155J42449M5173j60323k89656
$$ 358968 312153 299086 367470 477316 586802 714957 857406 902579 742256 452600
38233D52600k02083q110P4084J5110k2934L2173N1255o6413k03698j88202m6489
$$ 452600 250517 242407 316491 331601 308667 340840 392095 325682 121984 -66218 -112707
38222a12707M8814L4165O754L9064R4922J39293J74193J36262o0534l04315l00189
$$ -112707 -63893 -29728 -22974 16090 111012 250305 424498 560760 500226 195911 -104278
38211a04278M5965M14711M33852J37232j44696k50777k80863k70373r6251K15582
$$ -104278 -58313 356398 790250 927482 782786 532009 251146 -19227 -115478 100104
38201A00104L76158J96003j31881k86873k14746r3173k2321M9978J45276J77181
$$ 100104 476262 672265 540384 253511 38765 -54408 -76729 -26751 118525 295706
38191B95706O7952j55528l67291l88505j14460L02703M95477K59992j63094l43522
$$ 295706 363658 208130 -159161 -547666 -662126 -359423 136054 396046 232952 -110570
38181a10570j56080J39914K71434K00677R054k33842m09885l63402j02656J46429
$$ -110570 -266650 -126736 144698 345375 354429 120587 -289298 -652700 -755356 -608927
38171f08927K09122J68740J87393K40719J86895J6431j36335j88642j58316n0821
$$ -608927 -399805 -231065 -43672 197047 383942 400373 264038 75396 -82920 -133741
38161a33741J26291K38594J14375j75411l06494r5888K24583K88822O9263j18378
$$ -133741 -7450 231144 345519 170108 -136386 -232274 -7691 281131 350394 232016
38151B32016o7202O7406M6477q7222r4556P2093J63907k4706l52712m87979k99966
$$ 232016 164814 232220 278697 191475 96919 169012 332919 308213 -44499 -532478 -832444
38140h32444L0528K70965L60472L35783J82533j06054l86291m38685k20818N0592
$$ -832444 -801916 -530951 -170479 165304 347837 241783 -144508 -583193 -804011 -753419
38130g53419J25626k1099j99072k23508p6254J29512K79821L33545L04364K21105
$$ -753419 -627793 -648892 -847964 -1071472 -1147726 -1018214 -738393 -404848 -100484 120621
38120A20621J20644M4982N815l1752q3586q4555K7186J63717J42757n7052k16655
$$ 120621 241265 286247 292062 260310 176724 92169 119355 283072 425829 368777 152122
38109A52122j53657K8765J11808Q8262J26581K51633K87128J44149m3509j41942
$$ 152122 -1535 27230 139038 227300 353881 605514 892642 1036791 993282 851340
38099H51340j86116k34317k32760j48259q0677j03072j21960m2237N2558M5832
$$ 851340 665224 430907 198147 49888 -30789 -133861 -255821 -298058 -245500 -199668
38089a99668L461O1423J77641J85239N2014q2073j01643r763J37540K56874K46381
$$ -199668 -196207 -134784 42857 228096 280110 198037 96394 86631 224171 481045 727426
38078G27426J03515k5321m4059o1769j85131k77819j60609M6677P4410n4370n9488
$$ 727426 830941 805620 761561 699792 514661 236842 76233 122910 197320 142950 83462
38067H3462J03961J42628p8270k62952j04540K63227M44299K51766j64534n17427
$$ 83462 187423 330051 251781 -11171 -115711 147516 591815 843581 679047 161620
38057A61620n67755k63884J51862L09585J22178j03351q2523R0731J58174Q3579
$$ 161620 -406135 -670019 -518157 -208572 -86394 -189745 -272268 -181537 -23363 60216
38047F0216J1329j9595p6297j26781o7081P7971J75223J83967J70700J50194P2042
$$ 60216 71545 51950 -24347 -151128 -218209 -140238 34985 218952 389652 539846 611888
38036F11888n2413j54397k18636k59424k24595p2301Q4194O9786j07594k40823
$$ 611888 559475 405078 186442 -72982 -297577 -369878 -285684 -215898 -323492 -564315
38026e64315j68962O4430K95475L81731K70912L5746j53504j73408o3718N1445
$$ -564315 -733277 -668847 -373372 8359 279271 315017 161513 -11895 -75613 -24168
38016b4168J11738J21298P4148j1396l9713N5017J78361J68214M71j94073k91903
$$ -24168 87570 208868 283016 271620 231907 286924 465285 633499 633970 439897 147994
38005A47994k65030j44387N052R8908J09218R8100J15864J27823J06148R8347
$$ 147994 -117036 -261423 -256371 -157463 -48245 49855 165719 293542 399690 498037
37995D98037J15810P0033n8736j13464J7121J79558J53777j7536j13594q5180
$$ 498037 613847 683880 625144 511680 528801 708359 862136 844600 731006 645826
37985F45826p7342j23486p4457J14449K42189J09316k24409n04698n23583k76638
$$ 645826 568484 444998 370541 484990 727179 836495 612086 107388 -416195 -692833
37975f92833L3756J57483M6209q7921n3332N9109L5882j21009k09707j34163J4885
$$ -692833 -659077 -501594 -455385 -543306 -596638 -537529 -501647 -622656 -832363 -966526 -951641
37964i51641J60615L00303L60735K23824n0719k24946j74140k4533M7242P079
$$ -951641 -791026 -490723 -129988 93836 43117 -181829 -355969 -380502 -333260 -326181
37954c26181p6475j20113n0211J20030K33671J60326P206j8611O3863M3030j21160
$$ -326181 -402656 -522769 -572980 -452950 -219279 -58953 -51747 -70358 -6495 36535 -84625
37943h4625k14961j05797P5924J71136J95419K17981K29934K20069K05615J24651
$$ -84625 -299586 -405383 -329459 -158323 37096 255077 485011 705080 910695 1035346
37933A035346j08417l82628m45826k53913l3401Q2670K07808L68843L30446j6312
$$ 1035346 926929 544301 98475 -155438 -188839 -106169 101639 470482 800928 784616
37923G84616l47968k96354J3287J24004j18143l78397l02653M9709L23298K96045
$$ 784616 436648 140294 153581 277585 159442 -218955 -521608 -471899 -148601 147444
37913A47444J00041K4778J45782K31635Q0753j59503j85494J9525J82736J71633
$$ 147444 247485 272263 418045 649680 730433 570930 385436 404961 587697 759330
37903G59330J30232J26273p143l13661m99259l27121q859P2759j12294k56203
$$ 759330 889562 1015835 1008692 695031 195772 -131349 -140208 -67449 -179743 -435946
37893d35946j59467P7541K62094L09792K55071J97515K13007K41933J41523q9514
$$ -435946 -595413 -517872 -255778 54014 309085 506600 719607 961540 1103063 1013549
37883A013549k63494k56220j57785q5792k4307M3911M0300l5707k9916J13100
$$ 1013549 750055 493835 336050 250258 225951 269862 310162 274455 244539 357639
37873C57639K10540J17982n4367j71461k91413m45930m42300j51325K09338L58445
$$ 357639 568179 686161 631794 460333 168920 -277010 -719310 -870635 -661297 -302852
37863c02852L32246L03807K30332J4770j72798j26408j7235j57787m41409m54662
$$ -302852 29394 333201 563533 578303 405505 279097 261862 104075 -337334 -791996
37853g91996j24544J80946K29414J77062J61777O1103j71773k84235p4961K67977
$$ -791996 -916540 -735594 -506180 -329118 -167341 -106238 -278011 -562246 -637207 -369230
37843c69230M02436K52716K0329j08300j12730o5689k7376n360J6145J9500j9328
$$ -369230 33206 285922 306251 197951 85221 19532 -7844 -13204 2941 22441 3113
37832C113l9098M1482J23202k398k66569k73636J37836N50438N05115J43694q2156
$$ 3113 -35985 5497 128699 126301 -140268 -413904 -276068 274370 779485 923179 841023
37821H41023j29019k88326n28198m88758j42197J05631P0266J9393J09692J18309
$$ 841023 712004 423678 -104520 -593278 -735475 -629844 -559578 -540185 -430493 -312184
37811c12184n4618j22241O5221J90191J14k31685j58588O7651R5880k0294M0180
$$ -312184 -366802 -489043 -423822 -233631 -233517 -465202 -623790 -556139 -460259 -480553 -440373
37800d40373K86681L90139J71953j97580m42318l92258n0863L37141M19992J57630
$$ -440373 -153692 236447 408400 210820 -231498 -623756 -674619 -337478 82514 240144
37790B40144n9199N4882K33660P3308k91514l49314R968L10557J58339k59212
$$ 240144 180945 235827 469487 542795 251281 -98033 -88065 222492 380831 121619
37780A21619m83030l38683k2869J97064K12638Q4059n7919j18231p7741M7078
$$ 121619 -361411 -700094 -722963 -525899 -313261 -229202 -287121 -405352 -483093 -436015
37770d36015K18419L29607K51530P373j90864j74204m662J48035K12024K00673
$$ -436015 -217596 112011 363541 370914 180050 5846 1184 149219 361243 561916
37760E61916J16649k978m9699J5547P5971L1651m9800p8541j07271j95042k35507
$$ 561916 678565 675587 625888 641435 717406 749057 699257 620716 513445 318403 82896
37749H2896j12687O8801J08029k620r2148o0317M7673J52365J77399N9891j24330
$$ 82896 -29791 39010 147039 144419 52271 -8046 39627 191992 369391 429282 304952
37738C04952j55610L1076J69917J4549k51578k40941O1142K56960R5274k12208
$$ 304952 149342 180418 350335 364884 113306 -127635 -66493 190467 285741 73533
37728G3533l11194j21186J58052K90705J82350o0170k03555j22725M9998J17388
$$ 73533 -237661 -358847 -200795 89910 272260 212090 8535 -114190 -64192 53196
37718E3196Q8014Q5725P7662n2148j97480j07191J87149L27299J28793j49240
$$ 53196 141210 226935 304597 252449 54969 -52222 134927 462226 591019 441779
37708D41779j99977r1794p6864j64714j54153k212J00855L5858o7057k3907J47062
$$ 441779 241802 150008 73144 -91570 -245723 -247935 -147080 -111222 -178279 -202186 -55124
37697e5124K48171J43747p7016j94153j04955N7753R0943k9727j41876j26879
$$ -55124 193047 336794 259778 65625 -39330 18423 109366 79639 -62237 -189116
37687a89116m8712k9480p4358q8984k3738P0255J18811J03987N0827k9483j39196
$$ -189116 -237828 -267308 -341666 -430650 -454388 -384133 -265322 -161335 -110508 -139991 -279187
37676b79187k35512k33299j16486O948M6799P3869J85828K73540J32766j69194
$$ -279187 -514699 -747998 -864484 -857536 -810737 -736868 -551040 -277500 -144734 -313928
37666c13928k92052r2270J60597K02537J42459J60649J08762k02897m97134k96716
$$ -313928 -605980 -698250 -537653 -335116 -192657 -32008 76754 -126143 -623277 -919993
37656i19993L12847O65419L80622j59225l84072k29614o837J21352K10430K60571
$$ -919993 -607146 58273 438895 279670 -104402 -334016 -340853 -219501 -9071 251500
37646B51500J95960N9435j1259J9562O9252O8806j1649j77885l19836k28443J17064
$$ 251500 447460 506895 495636 515198 584450 653256 641607 463722 143886 -84557 32507
37635C2507L94654K95823m1046j99823n0557J21946O8497j19208k37511k54957
$$ 32507 427161 722984 681938 482115 431558 553504 622001 502793 265282 10325
37625A0325k24179j14877P9230K11782J60304L6165K8724J14845J23116L2677
$$ 10325 -213854 -328731 -249501 -37719 122585 158750 187474 302319 425435 458112
37615D58112j4958J6274J6644k0985L3332J65624J69000k673j05124j0589L5765
$$ 458112 443154 459428 476072 455087 488419 654043 823043 820370 715246 704657 740422
37604G40422j63550l42270j51523K27820L04109K4327j71994n5721J19317J30859
$$ 740422 576872 234602 83079 310899 615008 639335 467341 411620 530937 661796
37594F61796Q6342M8160j45231m38874m28037q074K92984O6045k91496j64754
$$ 661796 748138 796298 651067 212193 -215844 -223918 69066 135111 -156385 -321139
37584c21139L16281N06405K42930k4910m0626m2755j93430k75348j34813K6879
$$ -321139 -4858 501547 744477 719567 678941 636186 442756 167408 32595 59474
37574E9474N630j12546j74324j69842r7720Q1359K50726J97006l9178j69227r4446
$$ 59474 65104 -47442 -221766 -391608 -489328 -407969 -157243 39763 585 -168642 -263088
37563b63088k4625q4802j45758j34330j48062j57384J2027K67954K52025o1258
$$ -263088 -287713 -372515 -518273 -652603 -800665 -958049 -946022 -678068 -426043 -487301
37553d87301k10853M9024L32573K39944j7210j6451J88662K41173R2844j9706
$$ -487301 -698154 -649130 -316557 -76613 -93823 -110274 78388 319561 412405 392699
37543C92699m5875j28821k43118k19399p3133K1358K4140J5119j5036q3258n3638
$$ 392699 346824 218003 -25115 -244514 -317647 -296289 -272149 -257030 -272066 -355324 -408962
37532d08962J43795K77565J27747j07066q4770J17510J25635j14423k71199j81662
$$ -408962 -265167 12398 140145 33079 -51691 65819 191454 77031 -194168 -375830
37522c75830n9057q3754j47118j00757K8073J48176J91811P0685k05140l79346
$$ -375830 -434887 -518641 -665759 -766516 -738443 -590267 -398456 -327771 -532911 -912257
37512i12257k06341J60098L43771K86516K54847L15550K30805m6345k06259p8571
$$ -912257 -1118598 -958500 -614729 -328213 -73366 242184 472989 426644 220385 141814
37502A41814R1046O4552l2381p053N8926K1006m0355n076L7731j9900o8269J4022
$$ 141814 232860 297412 265031 257978 316904 337910 297555 292479 330210 310310 242041 256063
37490B56063J02059K7604j22723j65148j25412j30245j28717J176J67285J63624
$$ 256063 358122 385726 263003 97855 -27557 -157802 -286519 -285343 -118058 45566
37480D5566j239j30577j51967j59553j72675r8561N4228J44491J13572N5184M8906
$$ 45566 44327 -86250 -238217 -397770 -570445 -669006 -614778 -470287 -356715 -301531 -252625
37469b52625Q2846J46380K31794K36269M5050k49164l80082k27348K8510J28637
$$ -252625 -169779 -23399 208395 444664 489714 240550 -139532 -366880 -338370 -209733
37459b09733K681k26184l82765l37657q1382K32236M04994M04528L67981L68511
$$ -209733 -207052 -433236 -816001 -1153658 -1235040 -1002804 -597810 -193282 174699 543210
37449E43210L06953J03663j32259k38644k09671j45283o9203N3441J62667J42178
$$ 543210 850163 953826 821567 582923 373252 227969 158766 212207 374874 517052
37439E17052K4649q935R7568J46071n4748l92714n59020m15152j15908J30384
$$ 517052 541701 532766 630334 776405 721657 328943 -230077 -645229 -761137 -630753
37429f30753K78694L72607L83151K44430P486j53436j14290O2502J82094J02100
$$ -630753 -352059 20548 403699 648129 655615 502179 387889 450391 632485 734585
37419G34585j19395k55255j29051J73610L58041K23509j20329l76515l64154j56882
$$ 734585 615190 359935 230884 404494 762535 986044 865715 489200 125046 -31836
37409c1836M4385J16476R6665R8094J52653J55438O452k14601l10083k17405q6937
$$ -31836 12549 129025 225690 323784 476437 631875 638327 423726 113643 -103762 -190699
37398a90699n4475n8688J4742J13347Q5918q3075k45427k76910j82079l1964R3452
$$ -190699 -245174 -303862 -289120 -175773 -89855 -172930 -418357 -695267 -877346 -909310 -815858
37387h15858J11245r406j83293k66447j82245L2029K52246L14419J41586j08968
$$ -815858 -704613 -714019 -897312 -1163759 -1346004 -1313975 -1061729 -747310 -605724 -714692
37377g14692j55582M5997K01244Q8355j00754o3128J25169J45399j5104l1778
$$ -714692 -870274 -824277 -623033 -534678 -635432 -698560 -573391 -427992 -443096 -474874
37367d74874K03471L71656K07655j24252l23245l53953l32979k38837o858K29667
$$ -474874 -271403 100253 307908 183656 -139589 -493542 -826521 -1065358 -1072216 -842549
37357h42549K69705J48876P0493O8320j9556k20727l05709j04675K06749K92581
$$ -842549 -572844 -423968 -353475 -285155 -304711 -525438 -831147 -935822 -729073 -436492
37347d36492P5428j71198j71153L3214J96257K13624J82087J36429l6449l19002
$$ -436492 -361064 -532262 -703415 -670201 -473944 -260320 -78233 58196 21747 -297255
37337b97255m30492j85787J80289L05224J88911R5720P0341p6769l21091l68528
$$ -297255 -727747 -913534 -733245 -428021 -239110 -143390 -73049 -149818 -470909 -839437
37327h39437j31487J13461J72395J79064K31231J56032j18941l00276j42271J46455
$$ -839437 -970924 -857463 -685068 -506004 -274773 -118741 -237682 -537958 -680229 -533774
37317e33774K30508J44689J24204J49830M4118j24264j20565N1128J73247J78826
$$ -533774 -303266 -158577 -34373 115457 159575 35311 -85254 -34126 139121 317947
37307C17947J55543O0082k04009m61428m04177p3566J62077J50679J10191J73031
$$ 317947 473490 533572 329563 -131865 -536042 -609608 -447531 -296852 -186661 -13630
37297a3630J65424j5155j58355q0203Q3026J27005P5532K2503p5781k20058k09149
$$ -13630 151794 136639 -21716 -101919 -18893 108112 183644 206147 130366 -89692 -298841
37286b98841O5152L46349L31538J22337M0673R2029j7336l21585m37976j23496
$$ -298841 -233689 112660 444198 566535 607208 699237 681901 360316 -77660 -201156
37276b01156L07130L69008M5114k33914j87814N887N1856n2242j01545l5231Q272
$$ -201156 105974 474982 520096 286182 98368 104255 156111 103869 2324 -32907 -24635
37265b4635m9704j11872q3847j0681K9767L8414K7845l0311j06034q6296M5796
$$ -24635 -74339 -186211 -270058 -280739 -250972 -212558 -184713 -215024 -321058 -407354 -361558
37254c61558J34563Q1073J9136J00378K23668J84699J3222o8961N725P1375J087
$$ -361558 -226995 -145922 -126786 -26408 197260 381959 395181 326220 331945 403320 404407
37243D04407j42944k50693k72296j68810N8979K63996K53239L2681k00214l14469
$$ 404407 261463 10770 -261526 -430336 -371357 -107361 145878 178559 -21655 -336124
37233c36124l26913k44725n0437J46117J88068J38625K04382L45246K76431l3240
$$ -336124 -663037 -907762 -958199 -812082 -624014 -485389 -281007 64239 340670 307430
37223C07430k13330m3161J80192J08411j18370j62205q1168j81384l97077l17640
$$ 307430 94100 50939 231131 339542 221172 58967 -22201 -203585 -600662 -918302
37213i18302J29885M83641L89672P0571o8882n661J1760o9377p0773O4802J78244
$$ -918302 -788417 -304776 84896 155467 86585 80924 92684 23307 -47466 17336 195580
37202A95580J62993R8008N9858m205j24328j85617r0317N5204O3246o8940j60122
$$ 195580 358573 456581 516439 512234 387906 202289 111972 167176 230422 161482 1360
37191A360j08518j4561p867q1474j60331k13718k08594o5879K03431M02514L49678
$$ 1360 -107158 -121719 -129586 -211060 -371391 -585109 -793703 -859582 -656151 -253637 96041
37180I6041J33842Q313M9192R0038M678j26040j82144j74827j62644j26754k8318
$$ 96041 229883 238196 287388 377426 382104 256064 73920 -100907 -263551 -390305 -418623
37169d18623R7785J84568J97944J18607m5218j86614j62662O590J20208N6804
$$ -418623 -320838 -136270 61674 180281 135063 -51551 -214213 -207623 -87415 -30611
37159c0611n9381m1335J16433K70276L07384K00544k0053k49143l44303k72940
$$ -30611 -89992 -131327 -14894 255382 562766 763310 743257 494114 149811 -123129
37149a23129j44385l6450Q8028K20017K25813N9276j04431j11125n9421j03110
$$ -123129 -267514 -303964 -215936 4081 229894 289170 184739 73614 14193 -88917
37139h8917j65714q8885M6591K6640j23718j63114l1199N8727j9760j08860k9947
$$ -88917 -254631 -343516 -296925 -270285 -394003 -557117 -588316 -529589 -549349 -658209 -688156
37128f88156J62959L04841L26291K32289K6717k23477l64740l08681j32175L6632
$$ -688156 -525197 -220356 105935 338224 364941 141464 -223276 -531957 -664132 -627500
37118f27500J42743J73045J21191M4439L7113Q1376M3285j14606k47223k38233
$$ -627500 -484757 -311712 -190521 -146082 -108969 -27593 15692 -98914 -346137 -584370
37108e84370j62759j27277p4127J05870L51195M75732L98504K04206R864j14168
$$ -584370 -747129 -874406 -948533 -842663 -491468 -15736 382768 586974 596838 482670
37098D82670j23962k7876O9104N0448o8383j54727j22990k1915M5782L4979k2883
$$ 482670 358708 330832 399936 450384 382001 227274 104284 82369 128151 163130 140247
37087A40247p7352j19617j79951k48369k29329n5201J59507J97966K4619j32789
$$ 140247 62895 -56722 -236673 -485042 -714371 -769572 -610065 -412099 -387480 -520269
37077e20269p9237P5941P9742r7374k12718o7839K50507M70911M02883R8109j89364
$$ -520269 -599506 -523565 -443823 -541197 -753915 -821754 -571247 -100336 302547 400656 211292
37066B11292k17810J708K04981J81174K7381m933J35178K45405J62070n2072k37239
$$ 211292 -6518 -4810 200171 381345 408726 403793 538971 784376 946446 894374 657135
37055F57135l03640k23143j1467J92016J68201j22209m11866m00709j08938J70409
$$ 657135 353495 130352 118885 310901 479102 356893 -54973 -455682 -564620 -394211
37045c94211K33620J40759L8183l2769q8051q7078J6290J55153J94802J11260
$$ -394211 -160591 -19832 18351 -14418 -102469 -189547 -173257 -18104 176698 287958
37035B87958M2644J11291K41968K36417L2077j95957k46284j43993q6571j56169
$$ 287958 330602 441893 683861 920278 952355 756398 510114 366121 279550 123381
37025A23381k05557p5089J75577L37949L00922J35918l4126j53297k15057k13512
$$ 123381 -82176 -157265 18312 356261 657183 793101 758975 605678 390621 177109
37015A77109j54812p4964j1598K4809L6966J6017n3329j61243k43150j98013J3442
$$ 177109 22297 -52667 -64265 -39456 -2490 13527 -39802 -201045 -444195 -642208 -628766
37004f28766K69154L48636J62400j16538k27038j08456O5903J34330J21128J30919
$$ -628766 -359612 -10976 151424 34886 -192152 -300608 -234705 -100375 20753 151672
36994A51672J63819J21021l5273j98618k13943m4385J62338J95024l269k54578
$$ 151672 315491 436512 401239 202621 -11322 -55707 106631 301655 298386 43808
36984D3808l27186j82440J6049J20920J39536J44428J48412J26307R2005Q5822
$$ 43808 -283378 -465818 -449769 -328849 -189313 -44885 103527 229834 321839 407661
36974D07661J13712J37357J03513j7877j75688k31800j06156O8536O0395j56954
$$ 407661 521373 658730 762243 744366 568678 336878 230722 299258 359653 202699
36964B02699l49445l38438k20538j60052j17583K8807J98294J78716l2288j73715
$$ 202699 -146746 -485184 -705722 -865774 -983357 -954550 -756256 -577540 -609828 -783543
36954g83543n7100K06432L76884L55470K18109Q0418J187l9511j11049k39986
$$ -783543 -840643 -634211 -257327 98143 316252 396670 397857 358346 247297 7311
36944G311l40609k96589j09662R9722K28726K54082J84591N6532l6273k3391L0346
$$ 7311 -333298 -629887 -739549 -639827 -411101 -157019 27572 84104 47831 24440 54786
36933E4786Q263o6487n6871N8819J33128O8688m6391q4483m2281N979J8312q637
$$ 54786 63049 -3438 -60309 -1490 131638 200326 153935 69452 27171 33150 51462 42825
36921D2825n3533n2952L6151J37780J33583M5069l499p366p5925j75701j15377
$$ 42825 -10708 -63660 -27509 110271 243854 288923 285424 278058 202133 26432 -88945
36910h8945J17193K43416P7787j85988k62841j64957q6258o3550m827O5490N4250
$$ -88945 28248 271664 349451 163463 -99378 -264335 -350593 -414143 -418970 -353480 -299230
36899b99230J2167M1503N6878q9673k84182k46925K9109K21998J30862p5346j55930
$$ -299230 -287063 -245560 -188682 -278355 -562537 -809462 -780353 -558355 -427493 -502839 -658769
36888f58769j08756n0340Q470R6512J39274O1261n5047o9888N502L8269j4593
$$ -658769 -767525 -817865 -809395 -712883 -573609 -512348 -567395 -637283 -631781 -593512 -608105
36877f08105m9476J7056J20960J37962N3474j4615K8403J30647J84057J94745
$$ -608105 -657581 -640525 -519565 -381603 -328129 -342744 -314341 -183694 363 195108
36867A95108K42803K73748J09352k45817m91695l98255j39878m5389j25180j16409
$$ 195108 437911 711659 821011 575194 83499 -314756 -454634 -500023 -625203 -741612
36857g41612O0456K01368J92816J72272K22676J97013J342j93276k13421j59915
$$ -741612 -681156 -479788 -286972 -114700 107976 304989 306331 113055 -100366 -260281
36847b60281k10182k98941k27260M046J91325K16958J58104J27916J58225K22442
$$ -260281 -470463 -769404 -996664 -992618 -801293 -584335 -426231 -298315 -140090 82352
36837H2352K50179J49628o4110k06765j29092N1052P5939j01197k55061k07141
$$ 82352 332531 482159 418049 211284 82192 133244 209183 107986 -147075 -354216
36827c54216n0733J7496k9434n6624Q566P7287M0728o3482q7686L0002J64742
$$ -354216 -404949 -387453 -416887 -473511 -464945 -387658 -346930 -410412 -498098 -468096 -303354
36816c03354J45200l2581j96796k03678p7716O7649J67758K18993K23336J88971
$$ -303354 -158154 -190735 -387531 -591209 -668925 -601276 -433518 -214525 8811 197782
36806A97782J46993J09579M1479p8295j96922k36551j75677m3754J27210K95147
$$ 197782 344775 454354 495833 417538 220616 -15935 -191612 -235366 -108156 186991
36796A86991L84325L33501J69048l876q3540l9355P1179J33806O2017j14994k65390
$$ 186991 571316 904817 1073865 1069989 986449 947094 1018273 1152079 1214096 1099102 833712
36785H33712k77204j58634j8665K9159m1640j34428j05438O6380K11500J56368
$$ 833712 556508 397874 379209 408368 366728 232300 126862 193242 404742 561110
36775E61110m2897j68038j37360q9764j30707j60605o5407O1709N5746m0077j7991
$$ 561110 518213 350175 212815 123051 -7656 -168261 -233668 -171959 -116213 -156290 -174281
36764a74281J73512L25502K47487K3778j09660o9960J4343K8084Q204M832n2096
$$ -174281 -769 324733 572220 595998 486338 416378 430721 458805 467009 471841 419745
36753D19745k00066k59420m1029K69958K37620j94171m95569k33951K81362M08423
$$ 419745 219679 -39741 -80770 189188 426808 232637 -262932 -496883 -215521 192902
36743A92902P8190j63696j0975J89406L4330l34353m91958l09864M855K49763
$$ 192902 271092 107396 96421 285827 320157 -14196 -506154 -816018 -811163 -561400
36733e61400L49944K86422J28097K5980R660p1238k57316l31242j56206M7803
$$ -561400 -211456 74966 203063 229043 238703 167465 -89851 -421093 -577299 -529496
36723e29496K3460j09899o0269J57077K67562J85003R1704J00339J28086J10850
$$ -529496 -506036 -615935 -676204 -519127 -251565 -66562 25142 125481 253567 364417
36713C64417R0316P8868M9590M1051P4260L1342j53948k77062j22999J30573J12131
$$ 364417 454733 533601 583191 624242 698502 729844 575896 298834 175835 306408 418539
36702D18539j72982l41274k19138m4212n507J9924J25625J49097j619j20993m9880
$$ 418539 245557 -95717 -314855 -359067 -364574 -344650 -219025 -69928 -71547 -192540 -242420
36691b42420L5413n9943j96110j55568m0546q5070k17397j56408J17489L10158
$$ -242420 -207007 -266950 -463060 -618628 -659174 -744244 -961641 -1118049 -1000560 -690402
36681f90402K42133O1405k1492J158Q379n6933j43895j64602q0181L5622M3739
$$ -690402 -448269 -386864 -408356 -407198 -398819 -455752 -599647 -764249 -844430 -808808 -765069
36670g65069q4272j83214p6288J93248L98029L68359J34427j24921k10441m9586
$$ -765069 -849341 -1032555 -1108843 -915595 -517566 -149207 -14780 -139701 -350142 -399728
36660c99728J98084K51844K4650k41121k60167n2428J27779J42311P6764K4790
$$ -399728 -201644 50200 74850 -166271 -426438 -478866 -351087 -208776 -132012 -107222
36650a07222m1010j37394j69682n7711J25628K25933J75173L9346o4250o3341
$$ -107222 -148232 -285626 -455308 -513019 -387391 -161458 13715 53061 -11189 -74530
36640g4530K0068Q9183O9662k344l1110o062k5289j35759k25598j63405j407Q0347
$$ -74530 -54462 34721 104383 102039 70929 64867 39578 -96181 -321779 -485184 -486591 -406244
36628d06244L4729J1775J01318J60612M2358j22487q9160J02080J56501j3559
$$ -406244 -371515 -359740 -258422 -97810 -55452 -177939 -267099 -165019 -8518 -22077
36618b2077j44268n5609N6535k4336j45467n1242J51619J56353k4692r2119J5664
$$ -22077 -166345 -221954 -165419 -189755 -335222 -386464 -234845 -78492 -103184 -195303 -179639
36607a79639K5037j85232l62431k70194O65K41644L76571L79405K14022p063o8055
$$ -179639 -154602 -339834 -702265 -972459 -971794 -730150 -353579 25826 239848 232785 164730
36596A64730R788m4726k75743l37053l1331L07055K75244j4808j62590p9172J5116
$$ 164730 174518 129792 -145951 -483004 -514335 -207280 67964 53156 -109434 -188606 -173490
36585a73490M3901J26693K40926K06922J8018j25438j36638j33025j85984k16961
$$ -173490 -129589 -2896 238030 444952 462970 337532 200894 67869 -118115 -335076
36575c35076j65458o0384P3723K00654K08406O1374n2406M2717K04541J71108
$$ -335076 -500534 -560918 -487195 -286541 -78135 -16761 -69167 -26450 178091 349199
36565C49199j2715q3852k5140p3771k56853l07836j29001L5677K2611q789P1499
$$ 349199 336484 252632 227492 153721 -103132 -410968 -539969 -504292 -481681 -490470 -418971
36554d18971J06565k4214j21141K2034K51118K82856J27377K936k9218o7604j14338
$$ -418971 -312406 -336620 -457761 -435727 -184609 98247 225624 228560 199342 131738 17400
36543A7400r2988n9407j32576k41519j82841O3467K84342L17748K05738N0116
$$ 17400 -75588 -134995 -267571 -509090 -691931 -628464 -344122 -26374 179364 229480
36533B29480j01992j91970j43185N415Q8162J4520j06203j05026N0330K47078
$$ 229480 127488 -64482 -207667 -202252 -114090 -99570 -205773 -310799 -260469 -13391
36523a3391L53734L13201J65441K0137l3475j9274l7776j17875j64011r5757J4959
$$ -13391 340343 653544 818985 839122 805647 786373 748597 630722 466711 370954 385913
36512C85913K7502o1152q8361N3956K42196K47390J3641k78113m26004l92262
$$ 385913 413415 352263 263902 317858 560054 807444 821085 542972 116968 -275294
36502b75294k51240o9520Q6813J26134L1273o7890l4143J01842K06888K32941
$$ -275294 -526534 -596054 -509241 -383107 -351834 -419724 -453867 -352025 -145137 87804
36492H7804K13122J22919q2241k96280l12018r1886J57366K40908J81879J12824
$$ 87804 300926 423845 341604 45324 -266694 -358580 -201214 39694 221573 334397
36482C34397Q5333O7353L6671Q60j8640O616N2224K181k03464l89194k94293N3071
$$ 334397 419730 487083 523754 524614 505974 512590 564814 566995 363531 -25663 -319956 -266885
36470b66885L05628K30210j5091j52879j43249j03839n0373O0178J46099R9140
$$ -266885 38743 268953 253862 100983 -42266 -146105 -196478 -136300 9799 108939
36460A08939J971K1951J26288J27791l24q7220o1265m9520j17008j35296l1569
$$ 108939 110910 132861 259149 386940 386616 299396 238131 188611 71603 -63693 -95262
36449i5262L0065j06991l02452k81346k7806J82814J55266P157l2955O5686J32509
$$ -95262 -65197 -172188 -474640 -755986 -783792 -600978 -445712 -438555 -471510 -405824 -273315
36438b73315M3369j29029k14348j35811J3117O5120l6946j43062l7542K72062
$$ -273315 -229946 -358975 -573323 -709134 -696017 -630897 -667843 -810905 -848447 -576385
36428e76385M78686L09114r9117l20565j65086J14148K20046J96397K19615K04093
$$ -576385 -97699 211415 112298 -208267 -373353 -259205 -39159 157238 376853 580946
36418E80946o1144m52929n55504k32428J54203K35916Q5757p903J8138L2244J4946
$$ 580946 519802 66873 -488631 -721059 -566856 -330940 -245183 -253086 -234948 -202704 -187758
36407a87758N8744J37240J29921N1807K8735M5603n1037k57238l40174j68585
$$ -187758 -129014 8226 138147 189954 218689 264292 213255 -43983 -384157 -552742
36397e52742N8417O5331j18120j97996j8494K30710K70798R8029k8842M9221J81142
$$ -552742 -494325 -428994 -547114 -745110 -763604 -532894 -262096 -164067 -192909 -143688 37454
36386C7454J37452n7628j79645j38560o4683m6311J162J15022J45660J840j34457
$$ 37454 174906 117278 -62367 -200927 -265610 -311921 -310759 -195737 -50077 -48237 -182694
36375a82694n4109J32822J40394o0828k09883j55777m1253k6494n9345l5533L484
$$ -182694 -236803 -103981 36413 -24415 -234298 -390075 -431328 -457822 -517167 -552700 -549216
36364e49216j0445N144J56688L44814L49783J40272o4356p7116M2690J24657J22933
$$ -549216 -559661 -554517 -397829 -53015 296768 437040 372684 295568 338258 462915 585848
36353E85848J03102O3771o9893k61492l27118j73629L5231P7956k2342l8386J36838
$$ 585848 688950 752721 682828 421336 94218 -79411 -44180 33776 11434 -26952 109886
36342A09886L46548L69422J53688j58509l42167k42681N3827K29348Q0120j72251
$$ 109886 456434 825856 979544 821035 478868 236187 290014 519362 599482 427231
36332D27231j43353J38616K26397q1391m08127l52966p2533J6473j11605j39318
$$ 427231 283878 422494 648891 567500 159373 -193593 -266126 -249653 -361258 -500576
36322e00576J1467P4577p5001k23305k01050j34933j69725k09144j14466L8978
$$ -500576 -489109 -414532 -489533 -712838 -913888 -1048821 -1218546 -1427690 -1542156 -1503178
36312a503178R2844N9381P0691J53410J96294J10915n7245j52997k5663L12210
$$ -1503178 -1410334 -1350953 -1280262 -1126852 -930558 -819643 -876888 -1029885 -1055548 -743338
36302g43338O24156O40700L42885k4401k30486k49907j75863q5896m0516q3313
$$ -743338 -119182 521518 864403 840002 609516 359609 183746 97850 57334 -25979
36292b5979j60602j30348O9166L09743L85235K10380r6745l02851k63423q3782
$$ -25979 -186581 -316929 -247763 61980 447215 657595 560850 257999 -5424 -89206
36282h9206j5420j36733k47910j80960n7696o0843j10971l7417O1126k9440j97648
$$ -89206 -104626 -241359 -489269 -670229 -727925 -788768 -899739 -937156 -876030 -905470 -1103118
36271a103118j20876J72953K87568Q7787r2880l4025L1922q4097j29233J25009
$$ -1103118 -1223994 -1051041 -763473 -675686 -768566 -802591 -770669 -854766 -983999 -858990
36261h58990L86262K65343o8874j48439N3936J51440K3553m4778Q0092J70046
$$ -858990 -472728 -207385 -276259 -424698 -370762 -219322 -195769 -240547 -160455 9591
36251I591Q5072O832O5482J02284l094q6438r8J05877M2943q9285q6547J0725
$$ 9591 94663 101495 166977 269261 266167 179729 179631 285508 328451 239166 152619 163344
36239A63344Q344j02241j41552m0406O5741M2699r1628k24825k48718j19668P7143
$$ 163344 171688 69447 -72105 -112511 -46770 -4071 -95699 -320524 -569242 -688910 -611767
36228f11767J55756L3391j24933r1746J11306K32188J34574k7615n0769L5479
$$ -611767 -456011 -422620 -547553 -639299 -527993 -295805 -161231 -188846 -239615 -204136
36218b04136M9243n6176j37651r3781j2871k7031j10722j19112R655J80003K64836
$$ -204136 -154893 -211069 -348720 -442501 -455372 -482403 -593125 -712237 -702582 -522579 -257743
36207b57743K33817J40476L7811o2553j69308k62814k69305j23250J14916K66777
$$ -257743 -23926 116550 154361 91808 -77500 -340314 -609619 -732869 -617953 -351176
36197c51176K38513J60156K10248L40961L27194R0880j81875k85286k10194o8564
$$ -351176 -112663 47493 257741 598702 925896 1016776 834901 549615 339421 270857
36187B70857N0137Q4309J0149p8468m4434O8024N2316j31967k50645j42378L9824
$$ 270857 320994 405303 415452 336984 292550 360574 412890 280923 30278 -112100 -72276
36176g2276J06908J28435K12576K06663o4472m10956m83107k82107j13851q7351
$$ -72276 34632 163067 375643 582306 517834 106878 -376229 -658336 -772187 -859538
36166h59538l7127O5785L8776j07862r7495J41003L01032J83424O259L525M3119
$$ -859538 -896665 -830880 -792104 -899966 -997461 -856458 -555426 -372002 -365743 -362218 -319099
36155c19099p0831k01322j19789P5379J34477Q6279J28799K09150R9731j49729
$$ -319099 -389930 -591252 -711041 -635662 -501185 -414906 -286107 -76957 22774 -126955
36145a26955k17502p68K32873K54163J34911J2831j21781k68320k86302r5454
$$ -126955 -344457 -345225 -112352 141811 276722 289553 167772 -100548 -386850 -482304
36135d82304J61012K99436L05555K45650J19505o0099j74530j41253n5992n7035
$$ -482304 -321292 -21856 283699 529349 648854 588755 414225 272972 216980 159945
36125A59945j27610j54170r9296n19J12446J77024P9496j69806l40431k44207
$$ 159945 32335 -121835 -221131 -221650 -109204 67820 147316 -22490 -362921 -607128
36115f07128j8000N9235k7684m5446R0232K05471J99748K09972L30435M17711
$$ -607128 -625128 -565893 -593577 -639023 -548791 -343320 -143572 66400 396835 814546
36105H14546L36331J85978R5787j4425k42481m39021l98406j98123p3606m4830
$$ 814546 1150877 1336855 1432642 1418217 1175736 736715 338309 140186 66580 21750
36095B1750L6927J38929Q4963o9544o8070Q8925R5141j33676k66683r1148J25036
$$ 21750 58677 197606 282569 213025 144955 233880 329021 195345 -71338 -162486 -37450
36084c7450P7428r0887p9589P2905J57894K15570L53391L49464m7915n34823n34272
$$ -37450 39978 -50909 -130498 -57593 100301 315871 669262 1018726 970811 435988 -98284
36073i8284p6009J79292q3881l99148k90682N1940K27976K88484M66938N88694
$$ -98284 -174293 4999 -78882 -478030 -768712 -716772 -488796 -200312 266626 855320
36063H55320L13179j96674m01694j70647N2418n2551k47433j80824P2690J73783
$$ 855320 1168499 971825 570131 399484 451902 399351 151918 -28906 43784 217567
36053B17567J8915j75046k08681j17162m1055j3547N2152J89150K65105J26510
$$ 217567 236482 61436 -147245 -264407 -305462 -319009 -266857 -77707 187398 313908
36043C13908j50064k80928j29778Q0044M7149j98162l40563k00774P2053K41781
$$ 313908 163844 -117084 -246862 -166818 -119669 -317831 -658394 -859168 -787115 -545334
36033e45334K51436J91319J28652N5513m4196j29772j10819N0773K33141K36028
$$ -545334 -293898 -102579 26073 81586 37390 -92382 -203201 -152428 80713 316741
36023C16741L2688j60960j65503o9997m6888o3273J5996J32521J01344n6849j16890
$$ 316741 349429 188469 22966 -47031 -93919 -157192 -141196 -8675 92669 35820 -81070
36012h1070k011J15644J08132L6134n3969k05608l27587j81978K28141N08075
$$ -81070 -83081 32563 140695 176829 122860 -82748 -410335 -592313 -364172 143903
36002A43903L40112p3963k72193j04596J78121L06496K37631P6280m9776o0524
$$ 143903 484015 410052 137859 33263 211384 517880 755511 831791 782015 721491
35992G21491r541m3629j65551j63279N9393K32673N1553l43455n07210k77061
$$ 721491 711950 668321 502770 339491 398884 631557 683110 339655 -167555 -444616
35982d44616O9819K49709K66030K16631J02952m8365j20448j03694j48954k89176
$$ -444616 -374797 -125088 140942 357573 460525 412160 291712 188018 39064 -250112
35972b50112l23338j40090N6736N2544m2320j4254O0584l8475k28377j78453J61118
$$ -250112 -573450 -713540 -656804 -604260 -646580 -660834 -600250 -638725 -867102 -1045555 -884437
35961h84437M23475L34060P5111l0092L2420N5857j3939n7147n0469q8176j39167
$$ -884437 -460962 -126902 -51791 -81883 -49463 6394 -7545 -64692 -115161 -203337 -342504
35950c42504m8166J55020J99615k4989k22868p3217K75998L75454R8438j96442
$$ -342504 -390670 -235650 -36035 -61024 -283892 -357109 -81111 294343 392781 196339
35940A96339j83717K8706J58710J53800J10512j069k21307l32888p9620L53564
$$ 196339 12622 41328 200038 353838 464350 463281 241974 -90914 -170534 183030
35930A83030M58526J02706k45809j82636O8052M1620k71106m89176m52963l56223
$$ 183030 641556 744262 498453 315817 383869 425489 154383 -334793 -787756 -1143979
35920a143979k98645j21904K14567M50125L89316J86169Q0643P6352P2700J04109
$$ -1143979 -1442624 -1564528 -1349961 -899836 -510520 -324351 -243708 -167356 -94656 9453
35910I453K06181K10553m4909l92411m98654l18036j20027o6245k9290J07731
$$ 9453 215634 426187 381278 -11133 -509787 -827823 -947850 -1014095 -1043385 -935654
35900i35654K24699J70157J0846p7072m9622N584K4303K166n0131p9390J0109
$$ -935654 -710955 -540798 -529952 -607024 -656646 -651062 -626759 -624593 -674724 -754114 -744005
35889g44005K10533L28099J89417r6468k29329q7416J25187J52355J411j01439
$$ -744005 -533472 -205373 -15956 -112424 -341753 -429169 -303982 -151627 -150216 -251655
35879b51655j5369J52264J93799M7293j47422k21318j56484o6356l0863k1873
$$ -251655 -267024 -114760 79039 126332 -21090 -242408 -398892 -465248 -496111 -517984
35869e17984j442o517o7533j04647j2118J67744K66813K11116J13405R3593J09432
$$ -517984 -519426 -525943 -593476 -698123 -710241 -542497 -275684 -64568 48837 142430 251862
35858B51862O1708j1893J2794J28718J83039J09212K9397M9075P6486k6546j97217
$$ 251862 313570 301677 314471 443189 626228 735440 764837 813912 890398 863852 666635
35847F66635k31742o9692J27749J96027J35805L7840l6970o0924l8878n0917j74013
$$ 666635 434893 365201 492950 688977 824782 862622 825652 764728 725850 674933 500920
35836E00920l08072k31089P3191K97092J75282j50155l16076j99271J7556J73283
$$ 500920 192848 -38241 34950 332042 507324 357169 41093 -158178 -140622 32661
35826C2661K68674K84011J26861j56924l45275l29526k60270k85157l16712k10484
$$ 32661 301335 585346 712207 555283 210008 -119518 -379788 -664945 -981657 -1192141
35816a192141k4180P6536O5273L9410M0133M8515Q7385J63686J73411L5286j30428
$$ -1192141 -1216321 -1139785 -1074512 -1035102 -994969 -946454 -859069 -695383 -521972 -486686 -617114
35805f17114j32415J9001J47038J80574J89976J70690K8022j88162k73660j77621
$$ -617114 -749529 -730528 -583490 -402916 -212940 -42250 -14228 -202390 -476050 -653671
$$ [...]
##END NTUPLES=NMR SPECTRUM
##END=
