##TITLE=31Pdec_DE-123_EXT_3
D2O, 24 sc
 26.1.2026
##JCAMPDX= 6.0         $$ Bruker NMR JCAMP-DX V2.0
##DATA TYPE= NMR SPECTRUM
##DATA CLASS= NTUPLES
##ORIGIN= UXNMR, Bruker Analytische Messtechnik GmbH
##OWNER= root
$$ XWIN-NMR		Version 3.5
$$ Mon Jan 26 13:41:50 2026 Russian Standard Time (UT+4h)  she@DPX200
##.OBSERVE FREQUENCY= 81.013821
##.OBSERVE NUCLEUS= ^31P
##.ACQUISITION MODE= SIMULTANEOUS
##.ACQUISITION SCHEME= undefined
##.AVERAGES= 24
##.DIGITISER RES= 17
##SPECTROMETER/DATA SYSTEM= spect
##.PULSE SEQUENCE= zgpg30
##.SOLVENT NAME= DMSO
##.SHIFT REFERENCE= (INTERNAL, DMSO, 0, 198.062)
##AUDIT TRAIL= $$ (NUMBER, WHEN, WHO, WHERE, WHAT)
$$ ##TITLE= Audit trail, XWIN-NMR		Version 3.5
$$ ##JCAMPDX= 5.01
$$ ##ORIGIN= Bruker BioSpin GmbH
$$ ##OWNER= she
$$ F:/spectra/data/she/nmr/P31/2/pdata/1/auditp.txt
$$ ##AUDIT TRAIL=  $$ (NUMBER, WHEN, WHO, WHERE, WHAT)
(   1,<2026-01-26 13:40:35.67 +0400>,<she>,<DPX200>,
      <created by zg, POWCHK disabled, PULCHK disabled
       configuration hash MD5:
       00 E9 B6 7A A2 85 ED C7 34 08 36 98 17 FE 4E 26
       data hash MD5: 32K
       6B A2 93 E1 F5 AB DC 31 AA 85 86 16 8C 69 8E 70>)
(   2,<2026-01-26 13:40:38.25 +0400>,<she>,<DPX200>,
      <Start of raw data processing
       efp BC_mod = 2 LB = 1.5 FT_mod = 6 PKNL = 1 PHC0 = 1511.122 PHC1 = -249.0997 SI = 64K 
       data hash MD5: 64K
       4C D4 BD A8 5D AB 2F C1 93 E4 5C 17 14 28 3F 8A>)
(   3,<2026-01-26 13:41:13.35 +0400>,<she>,<DPX200>,
      <pk PHC0 = -170.3743 PHC1 = 432.6005 
       data hash MD5: 64K
       3C 0C 8C AE 0F 1A FB 78 A6 BA 81 55 8A 79 D7 7F>)
(   4,<2026-01-26 13:41:20.25 +0400>,<she>,<DPX200>,
      <abs ABSG = 5 
       data hash MD5: 64K
       67 AE C2 99 FD D5 A7 74 AD E4 74 D4 1C 08 F8 EB>)
$$ ##END=
$$ 
$$ hash MD5
$$ 6A 57 5E 9B BC D4 C9 F6 C9 F0 43 52 3E DD 59 EE
##$RELAX= 
##$RELAX= 
##$RELAX= 
##$RELAX= 
##$RELAX= 
##$RELAX= 
##$RELAX= 
##$RELAX= 
$$ Bruker specific parameters
$$ --------------------------
##$DU= <F:/spectra>
##$EXPNO= 2
##$NAME= <P31>
##$PROCNO= 1
##$TYPE= <nmr>
##$USER= <she>
##$AMP= (0..31)
100 100 100 100 100 100 100 100 100 100 100 100 100 100 100 100 100 100 
100 100 100 100 100 100 100 100 100 100 100 100 100 100 
##$AQSEQ= 0
##$AQ_mod= 1
##$AUNM= <au_zg>
##$AUTOPOS= <>
##$BF1= 81.014009
##$BF2= 200.13
##$BF3= 200.13
##$BF4= 200.13
##$BF5= 200.13
##$BF6= 200.13
##$BF7= 200.13
##$BF8= 200.13
##$BYTORDA= 1
##$CFDGTYP= 0
##$CFRGTYP= 5
##$CHEMSTR= <none>
##$CNST= (0..31)
1 1 145 1 1 1 1 1 1 1 1 1 1 1 1 1 1 1 1 1 1 1 1 1 1 1 1 1 1 1 1 1 
##$CPDPRG= <waltz16>
##$CPDPRG1= <>
##$CPDPRG2= <waltz16>
##$CPDPRG3= <>
##$CPDPRG4= <mlev>
##$CPDPRG5= <mlev>
##$CPDPRG6= <mlev>
##$CPDPRG7= <mlev>
##$CPDPRG8= <mlev>
##$CPDPRGB= <>
##$CPDPRGT= <>
##$D= (0..31)
0 1 0 0 0 0 0 0 0 0.06 0 0.03 2e-05 3e-06 0 0 0.0002 0 0 0 0 0 0 0 0 0 
0 0 0 0 0 0 
##$DATE= 1769420435
##$DBL= (0..7)
120 120 120 11 120 120 24 19 
##$DBP= (0..7)
150 150 150 150 150 150 150 150 
##$DBP07= 0
##$DBPNAM0= <>
##$DBPNAM1= <>
$$ [...]
##$SUBNAM3= <"">
##$SUBNAM4= <"">
##$SUBNAM5= <"">
##$SUBNAM6= <"">
##$SUBNAM7= <"">
##$SUBNAM8= <"">
##$SUBNAM9= <"">
##$SW= 400.765351723535
##$SWIBOX= (0..15)
0 1 3 0 0 0 0 0 0 0 0 0 0 0 0 0 
##$SW_h= 32467.5324675325
##$TD= 32768
##$TD0= 1
##$TE= 0
##$TE2= 300
##$TE3= 300
##$TEG= 300
##$TL= (0..7)
0 120 53 12 22 120 120 120 
##$TP= (0..7)
150 150 150 150 150 150 150 150 
##$TP07= 0
##$TPNAME0= <>
##$TPNAME1= <>
##$TPNAME2= <>
##$TPNAME3= <>
##$TPNAME4= <>
##$TPNAME5= <>
##$TPNAME6= <>
##$TPNAME7= <>
##$TPOAL= (0..7)
0.5 0.5 0.5 0.5 0.5 0.5 0.5 0.5 
##$TPOFFS= (0..7)
0 0 0 0 0 0 0 0 
##$TUNHIN= 0
##$TUNHOUT= 0
##$TUNXOUT= 0
##$USERA1= <user>
##$USERA2= <user>
##$USERA3= <user>
##$USERA4= <user>
##$USERA5= <user>
##$V9= 5
##$VALIST= <valist>
##$VCLIST= <CCCCCCCCCCCCCCC>
##$VD= 0
##$VDLIST= <DDDDDDDDDDDDDDD>
##$VPLIST= <PPPPPPPPPPPPPPP>
##$VTLIST= <TTTTTTTTTTTTTTT>
##$WBST= 1024
##$WBSW= 4
##$XGAIN= (0..3)
0 0 0 0 
##$XL= 0
##$YL= 0
##$YMAX_a= 6152
##$YMIN_a= -6734
##$ZGOPTNS= <>
##$ZL1= 120
##$ZL2= 120
##$ZL3= 120
##$ZL4= 120
##$ABSF1= 198.0616
##$ABSF2= -202.7028
##$ABSG= 5
##$ABSL= 3
##$ALPHA= 0
##$AQORDER= 0
##$ASSFAC= 0
##$ASSFACI= 0
##$ASSFACX= 0
##$ASSWID= 0
##$AUNMP= <proc_1d>
##$AZFE= 0.1
##$AZFW= 0.5
##$BCFW= 0
##$BC_mod= 2
##$BYTORDP= 0
##$COROFFS= 0
##$CY= -3
##$DATMOD= 1
##$DC= 0
##$DFILT= <>
##$DTYPP= 0
##$F1P= 0
##$F2P= 0
##$FCOR= 1
##$FTSIZE= 65536
##$FT_mod= 6
##$GAMMA= 0
##$GB= 0
##$INTBC= 1
##$INTSCL= 9.790993e-09
##$ISEN= 30
##$LB= 1.5
##$LEV0= 0
##$LPBIN= 0
##$MAXI= 10000
##$MC2= 0
##$MEAN= 0
##$ME_mod= 0
##$MI= 50
##$NCOEF= 0
##$NC_proc= -7
##$NLEV= 6
##$NOISF1= 182.463
##$NOISF2= 159.3651
##$NSP= 0
##$NTH_PI= 0
##$NZP= 0
##$OFFSET= 198.0616
##$PC= 4
##$PHC0= 1340.748
##$PHC1= 183.5008
##$PH_mod= 1
##$PKNL= yes
##$PPARMOD= 0
##$PSCAL= 0
##$PSIGN= 0
##$REVERSE= no
##$SF= 81.0140089999434
##$SI= 65536
##$SIGF1= 159.3651
##$SIGF2= -187.1042
##$SINO= 113.3802
##$SIOLD= 16384
##$SREGLST= <1H.CDCl3>
##$SSB= 0
##$STSI= 65536
##$STSR= 0
##$SW_p= 32467.5324675325
##$SYMM= 0
##$S_DEV= 0
##$TDeff= 32768
##$TDoff= 0
##$TI= <>
##$TILT= no
##$TM1= 0
##$TM2= 0
##$TOPLEV= 0
##$USERP1= <user>
##$USERP2= <user>
##$USERP3= <user>
##$USERP4= <user>
##$USERP5= <user>
##$WDW= 1
##$XDIM= 65536
##$YMAX_p= 322207887
##$YMIN_p= -42396092
$$ End of Bruker specific parameters
$$ ---------------------------------
##NTUPLES= NMR SPECTRUM
##VAR_NAME=  FREQUENCY,     SPECTRUM/REAL,   SPECTRUM/IMAG
##SYMBOL=    X,             R,               I
##VAR_TYPE=  INDEPENDENT,   DEPENDENT,       DEPENDENT
##VAR_FORM=  AFFN,          ASDF,            ASDF
##VAR_DIM=   65536,         65536,           65536
##UNITS=     HZ,            ARBITRARY UNITS, ARBITRARY UNITS
##FACTOR=    0.49542278885378, 1,            1
##FIRST=     16045.7642231865, 0,            0
##LAST=      -16421.768244346, 0,            0
##MIN=       -16421.768244346, -42396092,    0
##MAX=       16045.7642231865, 322207887,    0
$$ Real data points
##PAGE= N=1
##DATA TABLE= (X++(R..R)), XYDATA
$$ [...]
$$ plain form
41646 2342141 1637198 506536 -439433 -639501 -446802 -521384 -925740 -1264975 -1233906 -740219
41636 -740219 -36210 120572 -784686 -1905186 -1659701 59528 1367781 842430 -473701
41627 -473701 -576034 718472 1731656 1317547 88176 -721167 -576925 324704 1520129
41618 1520129 2468746 2828089 2793091 2831361 3012569 2947141 2422030 1732358 1276368 1061376
41608 1061376 705965 -140163 -1314356 -2050200 -1610294 -132345 1432237 2363979 2820473
41599 2820473 3275174 3764727 4013214 3896712 3390008 2384364 956259 -451756 -1451986
41590 -1451986 -2044115 -2293745 -2084674 -1475209 -839940 -345257 190129 596706 227242
41581 227242 -955416 -1908454 -1843481 -1352153 -1370173 -1681905 -1467278 -767624 -224593 241473
$$ packed form
41646B342141p04943j130662r45969k00068J92699p4582m04356l39235L1069M93687
41636g40219P04009J56782r05258j120500K45485J719229J308253n25351j316131
41627d73701j02333J294506J013184m14109j229371q09343J44242R01629J195425
41618A520129R48617L59343l4998L8270J81208o5428n25111o89672m55990k14992
41608A061376l55411q46128j174193p35844M39906J477949J564582R31742M56494
41599B820473M54701M89553K48487j16502n06704j005644j428105j408015j000230
41590a451986n92129k49630K09071O09465O35269M94683N35386M06577l69464
41581B27242j182658r53038O4973M91328j8020l11732K14627O99654N43031M66066
$$ plain form
41571 241473 1196544 2317070 2567840 1816480 1081855 1025499 1282574 1417104 1409773 1021902
41561 1021902 -107857 -1401824 -1602580 -591390 221597 -50651 -478023 93411 1179507
41552 1179507 1456577 714243 -73320 -208854 139177 533782 659866 330856 -244636
41543 -244636 -438432 10247 520794 526199 345044 517585 738413 339744 -441762 -639848
41533 -639848 39330 833950 1015026 638495 124332 -245286 -278455 68315 421704 296248
41523 296248 -212066 -528303 -459037 -371506 -378724 2345 1021988 2023318 2051740 894927
41513 894927 -790462 -2168278 -2788038 -2688811 -2229021 -1727223 -1138480 -204632 1055448
41504 1055448 2270351 3197394 3946366 4577466 4830325 4488249 3693929 2636193 1254924
$$ packed form
41571B41473R55071J120526K50770p51360p34625n6356K57075J34530p331l87871
41561A021902j129759j293967k00756J011190Q12987k72248m27372N71434J086096
41552A179507K77070p42334p87563j35534L48031L94605J26084l29010n75492
41543b44636j93796M48679N10547N405j81155J72541K20828l98669p81506j98086
41533f39848O79178P94620J81076l76531n14163l69618l3169L46770L53389j25456
41523B96248n08314l16237O9266Q7531p218L81069J019643J001330K8422j156813
41513H94927j685389j377816o19760R9227M59790N01798N88743R33848J260080
41504A055448J214903R27043P48972O31100K52859l42076p94320j057736j381269
$$ plain form
41495 1254924 -390778 -1775741 -2400214 -2427242 -2349629 -2203753 -1696744 -1011650 -763277
41486 -763277 -1037429 -1196553 -931665 -802119 -1250423 -1733959 -1537928 -965886 -889061 -1423092
41476 -1423092 -1959892 -2329023 -2876109 -3338949 -2800311 -1183961 199882 245898 -577073
41467 -577073 -1103163 -1007975 -735350 -540904 -465416 -724191 -1207357 -1062879 217029 1688478
41457 1688478 2045324 1510577 1387888 1892649 1881842 900067 -11267 -81431 -24148 -671327
41447 -671327 -1527419 -1677080 -1260397 -983764 -814411 -259422 482671 734193 511321 516364
41437 516364 981042 1333620 1107417 554221 245511 504343 1245637 2003315 2160040 1476939
41427 1476939 315543 -869572 -1963405 -2830840 -2976037 -2101656 -699070 472537 1226843
$$ packed form
41495A254924j645702j384963o24473k7028P7613J45876N07009O85094K48373
41486g63277k74152j59124K64888J29546m48304m83536J96031N72042P6825n34031
41476a423092n36800l69131n47086m62840N38638J616350J383843M6016q22971
41467e77073n26090R5188K72625J94446P5488k58775m83166J44478J279908J471449
41457A688478L56846n34747j22689N04761j0807r81775r11334p0164N7283o47179
41447f71327q56092j49661M16683K76633J69353N54989P42093K51522k22872N043
41437E16364M64678L52578k26203n53196l08710K58832P41294P57678J56725o83101
41427A476939j161396j185115j093833q67435j45197Q74381J402586J171607P54306
$$ plain form
41418 1226843 1721931 1724494 839881 -658248 -1928965 -2480696 -2434768 -1996054 -1309901 -786101
41408 -786101 -857680 -1313487 -1450047 -990986 -350813 53085 195503 80536 -425758 -1205516
41398 -1205516 -1810253 -1979873 -1872342 -1649861 -1220008 -535673 176871 629611 686272 355739
41388 355739 -169425 -512002 -419437 14434 667264 1639544 2773095 3254795 2353522 399786
41378 399786 -1583759 -3045954 -4016774 -4307336 -3587722 -2304838 -1530793 -1622724 -1866813
41369 -1866813 -1717599 -1506939 -1532543 -1343639 -562408 291465 526821 372329 662352 1675876
41359 1675876 2775398 3032531 1984370 119726 -1197580 -817103 871055 2217041
41351 2217041 2242592 1693446 1761115 2453293 2892764 2672027 2103420 1452691 720427 66272
$$ packed form
41418A226843M95088K563q84613j498129j270717n51731M5928M38714O86153N23800
41408g86101p1579m55807j36560M59061O40173M03898J42418j14967n06294p79758
41398a205516o04737j69620J07531K22481M29853O84335P12544M52740N6661l30533
41388C55739n25164l42577R2565M33871O52830R72280J133551M81700r01273j953736
41378C99786j983545j462195r70820k90562P19614J282884P74045r1931k44089
41369a866813J49214K10660k5604J88904P81231Q53873K35356j54492K90023J013524
41359A675876J099522K57133j048161j864644j317306L80477J688158J345986
41351B217041K5551n49146O7669O92178M39471k20737n68607o50729p32264o54155
$$ plain form
41341 66272 -216598 -170319 -189916 -599097 -1433694 -2413273 -2913504 -2380813 -1097864 -60749
41331 -60749 280766 557955 1238145 1572361 660834 -974764 -1946786 -1849813 -1499459 -1472781
41321 -1472781 -1517106 -1458433 -1583913 -1823644 -1524148 -493665 481869 624110 51755 -697299
41311 -697299 -1411012 -2029889 -2299442 -2113289 -1776315 -1467983 -862962 219785 1173841
41302 1173841 1197715 324000 -649128 -1096821 -974418 -454075 281386 864367 858885 213590
41292 213590 -707982 -1642140 -2654737 -3726864 -4447211 -4412734 -3767643 -3038877 -2501206
41283 -2501206 -2019712 -1532569 -1286475 -1339830 -1149113 -118410 1494215 2663705 2681508
41274 2681508 1796405 707147 -127152 -484853 -228271 392437 642781 47466 -953498
$$ packed form
41341F6272k82870M6279j9597m09181q34597r79579n00231N32691J282949J037115
41331f0749L41515K77189O80190L34216r11527j635598r72022R6973L50354K6678
41321a472781m4325N8673j25480k39731K99496J030483R75534J42241n72355p49054
41311f97299p13713o18877k69553J86153L36974L08332O05021J082747R54056
41302A173841K3874q73715r73128m47693J22403N20343P35461N82981n482o45295
41292B13590r21572r34158j012597j072127p20347L4477O45091P28766N37671
41283b501206M81494M87143K46094n3355J90717J030703J612625J169490J7803
41274B681508q85103j089258q34299l57701K56582O20708K50344n95315j000964
$$ plain form
41265 -953498 -1554665 -1596153 -1502782 -1376539 -805647 371171 1700065 2675627 3190555 3264821
41255 3264821 2818388 1983481 1250687 983506 1025326 1003393 783359 459842 198829 291319
41245 291319 1013265 2099602 2642727 1978848 608732 -167960 394540 1780625 2931147
41236 2931147 3368280 3367911 3213505 2742420 1828340 958720 814269 1266312 1312980 289713
41226 289713 -1235172 -2146730 -2081168 -1598852 -1269644 -1117054 -929510 -615716 -158516 398217
41216 398217 828413 915682 815773 896240 1166195 1204001 728177 -55401 -720679 -957420
41206 -957420 -663371 -40502 417568 388131 121420 -2122 -167812 -794992 -1587567 -1691720
41196 -1691720 -963594 -301054 -357322 -639775 -406290 139357 197634 -462187 -1313555 -1831231
$$ packed form
41265i53498o01167m1488R3371J26243N70892J176818J328894R75562N14928P4266
41255C264821m46433q34907p32794k67181M1820k1933k20034l23517k61013R2490
41245B91319P21946J086337N43125o63879j370116p76692N62500J386085J150522
41236B931147M37133l69j54406m71085r14080q69620j44451M52043M6668j023267
41226B89713j524885r11558O5562M82316L29208J52590J87544L13794M57200N56733
41216C98217M30196Q7269r9909Q0467K69955L7806m75824p83578o65278k36741
41206i57420K94049O22869M58070k9437k66711j23542j65690o27180p92575j04153
41196a691720P28126O62540n6268k82453K33485N45647N8277o59821q51368n17676
$$ plain form
41186 -1831231 -1921847 -1766682 -1681086 -1989737 -2665602 -3229062 -3294799 -3009242 -2681379 -2300082
41176 -2300082 -1771093 -1285443 -992640 -608227 122254 787516 704613 -147178 -1076693 -1499380
41166 -1499380 -1386641 -1007359 -660628 -583027 -721307 -708941 -432882 -375650 -887119 -1397418
41156 -1397418 -1084914 -197246 165664 -294771 -534525 296271 1514197 1783368 944606
41147 944606 246530 773584 2149541 2957975 2215404 310015 -1408373 -1871999 -1147409
41138 -1147409 -144060 383662 467928 647247 1167730 1507776 845445 -787792 -1998629
41129 -1998629 -1260523 1187931 3299246 3492708 2396669 1704430 1849975 1773666 744473
41120 744473 -667015 -1549497 -1649165 -1133876 -162432 947437 1779400 2390930 3236662
$$ packed form
41186a831231r0616J55165Q5596l08651o75865n63460o5737K85557L27863L81297
41176b300082N28989M85650K92803L84413P30481O65262q2903q51791r29515m22687
41166a499380J12739L79282L46731P7601j38280J2366K76059N7232n11469n10299
41156a397418L12504Q87668L62910m60435k39754Q30796J217926K69171q38762
41147I44606o98076N27054J375957Q08434p42571j905389j718388m63626P24590
41138a147409J003349N27722Q4266J79319N20483L40046o62331j633237j210837
41129a998629P38106K448454K111315J93462j096039o92239J45545p6309j029193
41120G44473j411488q82482r9668N15289R71444J109869Q31963O11530Q45732
$$ plain form
41111 3236662 4258984 4744734 4410364 3851089 3446686 2667445 1197981 -6362 208132
41102 208132 1504566 2453392 2383100 1845955 1352495 710327 -192471 -891683 -1045136 -942023
41092 -942023 -903994 -745342 -266687 199023 258897 174933 578000 1559571 2449244 2528730
41082 2528730 1769671 880818 714413 1495536 2520975 2781436 2018714 980763 476213
41073 476213 453783 350000 114276 299206 1021355 1408449 576202 -1090852 -2231687
41064 -2231687 -2141190 -1538818 -1393221 -1510434 -973108 237949 950390 379462 -746706
41055 -746706 -1184097 -777420 -386152 -514396 -779444 -681823 -184724 552587 1343038 1706993
41045 1706993 1142815 14410 -469109 311224 1456117 1666508 919921 321677 511174
$$ packed form
41111C236662J022322M85750l34370n59275m04403p79241j469464j204343K14494
41102B08132J296434R48826p0292n37145m93460o42168r02798o99212j53453J03113
41092i42023L8029J58652M78655M65710N9874q3964M03067R81571Q89673P9486
41082B528730p59059q88853j66405P81123J025439K60461p62722j037951n04550
41073D76213k2430j03783k35724J84930P22149L87094q32247j667054j140835
41064b231687R0497O02372J45597j17213N37326J211057P12441n70928j126168
41055g46706m37391M06677L91268j28244k65048R7621M97099P37311P90451L63955
41045A706993n64178j128405m83519P80333J144893K10391p46587n98244J89497
$$ plain form
41036 511174 1047987 1424635 1845491 2617371 3389083 3561339 3140199 2675823 2525738 2640787
41026 2640787 2967742 3539471 4100968 4140114 3543052 2868779 2643454 2628228 2205721 1388610
41016 1388610 939974 1335202 2013194 2010444 1146253 203071 -42861 353847 718641 542756
41006 542756 -46345 -424144 -11163 1137432 2236580 2522869 2198082 2278481 3244858
40997 3244858 4179078 3726282 1807792 -106470 -484504 881384 2978594 4573898 4945559
40988 4945559 4128644 2860302 2053099 1968571 2033672 1671085 1028378 572123 291681 -162103
40978 -162103 -724171 -930521 -709669 -562582 -804503 -1186113 -1501337 -1988171 -2706385 -3024322
40968 -3024322 -2337892 -1016320 -3211 373127 547100 738766 591699 -3449 -434251
$$ packed form
41036E11174N36813L76648M20856P71880P71712J72256m21140m64376j50085J15049
41026B640787L26955N71729N61497L9146n97062o74273k25325j5226m22507q17111
41016A388610m48636L95228O77992k750q64191r43182k45932L96708L64794j75885
41006E42756n89101l77799M12981J148595J099148K86289l24787Q0399R66377
40997C244858R34220m52796j918490j914262l78034J365888K097210J595304L71661
40988D945559q16915j268342q07203q4528O5101l62587o42707m56255k80442m53784
40978a62103n62068k06350K20852J47087k41921l81610l15224m86834p18214l17937
40968c024322O86430J321572J013109L76338J73973J91666j47067n95148m30802
$$ plain form
40959 -434251 -197278 280127 230175 -325562 -644796 -340584 236199 730076 1262967 1921405
40949 1921405 2282303 1873724 795842 -487677 -1636354 -2234141 -1499311 923434 3846409
40940 3846409 5153453 4045585 2061801 1249739 1777873 2101103 1195516 -290651 -1159513
40931 -1159513 -1064420 -446993 252631 818031 1104323 1148368 1193110 1258762 968560 149890
40921 149890 -714776 -1098739 -1231806 -1733540 -2572332 -2980124 -2452520 -1334689 -296989
40912 -296989 342263 631276 739982 925196 1402732 1984980 2095254 1426856 421307
40903 421307 -184622 -182079 19153 87744 243234 870334 1838125 2480877 2316169 1575856
40893 1575856 846810 335361 -213308 -918121 -1495943 -1730727 -1828816 -2042106 -2243010 -2184847
$$ packed form
40959d34251K36973M77405m9952n55737l19234L04212N76783M93877N32891O58438
40949A921405L60898m08579j077882j283519j148677n97787P34830K422745K922975
40940C846409J307044j107868j983784q12062N28134L23230r05587j486167q68862
40931a159513R5093O17427O99624N65400K86292M4045M4742O5652k90202q18670
40921A49890q64666l83963j33067n01734q38792m07792N27604J117831J037700
40912b96989O39252K89013J08706J85214M77536N82248J10274o68398j005549
40903D21307o05929K543K01232O8591J55490O27100R67791O42752j64708p40313
40893A575856p29046n11449n48669p04813n77822k34784r8089k13290k00904N8163
$$ plain form
40883 -2184847 -1911861 -1557790 -997466 -119061 771016 1265327 1390399 1376789 1163710 735972
40873 735972 689780 1615336 2960265 3433988 2717094 1857865 1654180 1603176 1031966 362531
40863 362531 358926 742452 589149 -177646 -651487 -236974 719310 1582128 1978808 1682790
40853 1682790 711196 -309394 -586112 -234545 -290430 -1318071 -2565970 -2923312 -2237705
40844 -2237705 -1184897 -230116 640151 1357487 1672221 1717358 2052662 2825366 3330695
40835 3330695 2859368 1716352 855678 584953 259974 -554301 -1255528 -1069754 -366401
40826 -366401 -402753 -1772855 -3682116 -4872018 -4808540 -3844188 -2675010 -1861468 -1531976
40817 -1531976 -1337269 -918812 -446492 -338733 -474292 -212803 722834 1956597 3134037
$$ packed form
40883b184847K72986L54071N60324Q78405Q90077M94311J25072j3610k13079m27738
40873G35972m6192R25556J344929M73723p16894q59229k03685n1004n71210o69435
40863C62531l605L83526j53303p66795m73841M14513R56284Q62818L96680k96018
40853A682790r71594j020590k76718L51567n5885j027641j247899l57342O85607
40844b237705J052808R54781Q70267P17336L14734M5137L35304P72704N05329
40835C330695m71327j143016q60674k70725l24979q14275p01227J85774P03353
40826c66401l6352j370102j909261j189902O3478R64352J169178Q13542L29492
40817a531976J94707M18457M72320J07759j35559K61489R35637J233763J177440
$$ plain form
40808 3134037 4177379 4710515 4141811 2760058 1843243 2021400 2366347 1884059 1043342
40799 1043342 791264 849389 330621 -487038 -525814 157904 345874 -342223 -871827 -504031
40789 -504031 270452 918327 1659055 2471842 2548402 1562571 479767 208142 252499 -389652
40779 -389652 -1639171 -2520909 -2469181 -1714562 -794054 -289941 -590810 -1346570 -1655676 -1272632
40769 -1272632 -973355 -1204034 -1236348 -457709 366809 196008 -587446 -758905 -86476 563658
40759 563658 622333 224210 -468475 -1254228 -1507417 -924486 -335556 -597771 -1093745 -748901
40749 -748901 -131192 -702273 -2064425 -2086674 -244782 1283817 836513 -344295 -312278
40740 -312278 629452 887236 244605 -335825 -746682 -1570703 -2289128 -1657923 78017
$$ packed form
40808C134037J043342N33136n68704j381753r16815J78157L44947m82288q40717
40799A043342k52078N8125n18768q17659l8776O83718J87970o88097n29604L67796
40789e04031P74483O47875P40728Q12787P6560r85831j082804k71625M4357o42151
40779c89652j249519q81738N1728P54619R20508N04113l00869p55760l09106L83044
40769a272632K99277k30679l2314P78639Q24518j70801p83454j71459O72429O50134
40759E63658N8675l98123o92685p85753k53189N82931N88930k62215m95974L44844
40749g48901O17709n71081j362152k2249J841892J528599m47304j180808L2017
40740c12278R41730K57784o42631n80430m10857q24021p18425O31205J735940
$$ plain form
40731 78017 1161601 862342 418718 860181 1348229 603215 -1090201 -2335470 -2412395
40722 -2412395 -1693346 -740843 136580 680894 814034 916010 1416156 2160953 2638096
40713 2638096 2718211 2683663 2587538 2139139 1320215 590977 212386 -232959 -1226835 -2426267
40703 -2426267 -2877773 -2180442 -1029489 -371243 -328184 -352525 -278043 -653930 -1855999 -3313279
40693 -3313279 -4014278 -3610443 -2700483 -2123480 -2235942 -2775459 -3136291 -2836212 -2006531
40684 -2006531 -1404812 -1670722 -2563739 -3175134 -2881009 -1859577 -747085 -120443 -292146
40675 -292146 -1171356 -2146100 -2431693 -1811333 -911020 -590771 -1137896 -2078089 -2626021 -2324711
40665 -2324711 -1451067 -797876 -833372 -1117180 -856557 9212 724183 749298 331226 -140441
$$ packed form
40731G8017J083584k99259m43624M41463M88048p45014j693416j245269p6925
40722b412395P19049R52503Q77423N44314J33140J01976N00146P44797M77143
40713B638096Q0115l4548r6125m48399q18924p29238l78591m45345r93876j199432
40703b426267m51506O97331J150953O58246M3059k4341P4482l75887j202069j457280
40693c313279p00999M03835R09960N77003j12462n39517l60832L00079Q29681
40684b006531O01719k65910q93017o11395K94125J021432J112492O26642j71703
40675b92146q79210r74744k85593O20360R00313L20249n47125r40193n47932L01310
40665b324711Q73644O53191l5496k83808K60623Q65769P14971K5115m18072m71667
$$ plain form
40655 -140441 -718279 -1422905 -1759299 -1376486 -867124 -1151311 -2167234 -2895348 -2736786
40646 -2736786 -2194040 -1999610 -2190446 -2370041 -2364774 -2175345 -1654128 -756094 61853 177849
40636 177849 -468433 -1329142 -1906609 -2128073 -2076473 -1762152 -1331799 -1161831 -1425052 -1737709
40626 -1737709 -1593596 -1115353 -994663 -1548135 -2176240 -2080057 -1294056 -553916 -202865 188087
40616 188087 901309 1366134 928724 -26025 -469185 -201996 -152999 -934638 -1802428 -1621605
40606 -1621605 -431622 644663 867247 533195 128248 -426566 -1298805 -2062947 -2111434
40597 -2111434 -1552760 -1103150 -1034980 -753182 334753 1904894 3044507 3296977 2984952
40588 2984952 2563496 2083679 1407849 594431 -163410 -750897 -1058757 -894451 -223886
$$ packed form
40655a40441n77838p04626l36394L82813N09362k84187j015923p28114J58562
40646b736786N42746J94430j90836j79595N267J89429N21217Q98034Q17947J15996
40636A77849o46282q60709n77467k21464N1600L14321M30353J69968k63221l12657
40626a737709J44113M78243J20690n53472o28105R6183P86001P40140L51051L90952
40616A88087P13222M64825m37410r54749m43160K67189M8997p81639q67790J80823
40606a621605J189983J076285K22584l34052m04947n54814q72239p64142m8487
40597b111434N58674M49610O8170K81798J087935J570141J139613K52470l12025
40588B984952m21456m79817o75830q13418p57841n87487l07860J64306O70565
$$ plain form
40579 -223886 627036 1240214 1450088 1229763 473408 -750759 -1904284 -2389480 -2213238
40570 -2213238 -1831642 -1413338 -787662 -122240 14824 -494382 -995093 -943334 -609479 -495587
40560 -495587 -530098 -356663 -40933 79187 -36554 -272747 -800864 -1731730 -2487817 -2219566
40550 -2219566 -875260 693176 1698153 1995960 1784775 1337438 1035163 1047889 947901
40541 947901 272795 -519777 -436189 587472 1471952 1555183 1464115 1895043 2390568 2153099
40531 2153099 1436996 1147778 1394277 1429348 959888 606175 880633 1413353 1509861 1052803
40521 1052803 563403 564389 1014782 1301810 882878 53632 -176820 744290 2114001 2691971
40511 2691971 1990452 503906 -999043 -1881861 -1680713 -536176 464163 153863 -1316925
$$ packed form
40579b23886Q50922O13178K09874k20325p56355j224167j153525m85196J76242
40570b213238L81596M18304O25676O65422J37064n09206n00711N1759L33855J13892
40560d95587l4511J73435L15730J20120j15741k36193n28117r30866p56087K68251
40550b219566J344306J568436J004977K97807k11185m47337l02275J2726r9988
40541I47901o75106p92572Q3588J023661Q84480Q3231r1068M30928M95525k37469
40531B153099p16103k89218K46499L5071m69460l53713K74458N32720R6508m57058
40521A052803m89400R86M50393K87028m18932q29246k30452R21110J369711N77970
40511B691971p01519j486546j502949q82818K01148J144537J000339l10300j470788
$$ plain form
40502 -1316925 -2537718 -2477774 -1573258 -1002860 -1344360 -2164568 -2591042 -2137158 -1222726
40493 -1222726 -857895 -1487971 -2313601 -2246371 -1313850 -403050 176736 836183 1382707 828954
40483 828954 -960624 -2551365 -2650811 -1647087 -607724 346171 1537516 2332638 1702217
40474 1702217 7922 -1076400 -562070 951420 2470283 3666388 4471570 4564640 3760502
40465 3760502 2326046 611744 -1097772 -2276280 -2473596 -2153847 -2357542 -3171034 -3448332
40456 -3448332 -2593035 -1630052 -1613498 -1819245 -782292 1316737 2703659 2452984 1557608
40447 1557608 1197340 1128194 539317 -364355 -659946 -212109 99446 -315357 -976885 -1084219
40437 -1084219 -521779 173011 497018 324274 -210206 -818805 -1099328 -744763 187929
$$ packed form
40502a316925j220793N9944R04516N70398l41500q20208m26474M53884R14432
40493a222726L64831o30076q25630O7230R32521R10800N79786O59447N46524n53753
40483H28954j789578j590741r9446J003724J039363R53895J191345P95122o30421
40474A702217j694295j084322N14330J513490J518863J196105Q05182R3070q04138
40465C760502j434456j714302j709516j178508j97316L19749k03695q13492k77298
40456c448332Q55297R62983J6554k05747J036953K099029J386922k50675q95376
40447A557608l60268o9146n88877r03672k95591M47837L11555m14803o61528j07334
40437a084219N62440O94790L24007j72744n34480o08599k80523L54565R32692
$$ plain form
40428 187929 1298650 2140144 2451218 2203663 1603978 1042286 844970 993076 1199310
40419 1199310 1305709 1439826 1685376 1804112 1513606 927802 438106 169921 -142938
40410 -142938 -655656 -1080812 -1081252 -794108 -660619 -795465 -825800 -415615 290165 866182
40400 866182 1076459 1001390 833679 727877 777616 956959 1104855 1123942 1165836 1426354
40390 1426354 1754603 1713072 1146962 505690 417959 1024582 1843732 2223966 1891114 1215553
40380 1215553 996535 1706605 2792081 3073912 2164835 1117011 1114086 1808107 1766114 553895
40370 553895 -578045 -464867 383393 684410 264536 100009 737257 1648879 2260048
40361 2260048 2771848 3596972 4539923 4966894 4501560 3283774 1797123 633632 130283
$$ packed form
40428A87929J110721Q41494L11074k47555n99685n61692j97316J48106K06234
40419A199310J06399J34117K45550J18736k90506n85804m89696k68185l12859
40410a42938n12718m25156m40K87144J33489j34846l0335M10185P05780N76017
40400H66182K10277p5069j67711j05802M9739J79343J47896J9087M1894K60518
40390A426354L28249m1531n66110o41272q7731O06623Q19150L80234l32852o75561
40380A215553k19018P10070J085476K81831r09077j047824k925O94021m1993j212219
40370E53895j131940J13178Q48260L01017m19874j64527O37248R11622O11169
40361B260048N11800Q25124R42951M26971m65334j217786j486651j163491n03349
$$ plain form
40352 130283 13227 -329800 -1020783 -1447176 -1114375 -428389 -241529 -814985 -1626085 -2064623
40342 -2064623 -1890658 -1077783 269960 1678831 2390482 2008986 925559 -89919 -611375
40333 -611375 -760150 -883743 -1252776 -1946303 -2754735 -3213349 -2992550 -2296055 -1626106 -1088646
40323 -1088646 -242505 1163638 2617573 3387328 3448276 3367901 3297013 2677118 1204241
40314 1204241 -419023 -1145619 -723503 238406 1097378 1583888 1564912 1037240 452135
40305 452135 520552 1445173 2648668 3406415 3443693 2817169 1647344 253004 -797603
40296 -797603 -1169181 -1156197 -1307415 -1748328 -2093214 -1928229 -1209142 -318214 116530 -323250
40286 -323250 -1315626 -1906651 -1450835 -309158 679151 1216959 1589310 1816219 1444062
$$ packed form
40352A30283j17056l43027o90983m26393L32801O85986J86860n73456q11100m38538
40342b064623J73965Q12875J347743J408871P11651l81496j083427j015478n21456
40333f11375j48775j23593l69033o93527q08432m58614K20799O96495O69949N37460
40323a088646Q46141J406143J453935P69755O0948q0375p0888o19895j472877
40314A204241j623264p26596M22116R61909Q58972M86510j8976n27672n85105
40305D52135O8417R24621J203495P57747L7278o26524j169825j394340j050607
40296g97603l71578J2984j51218m40913l44886J64985P19087Q90928M34744m39780
40286c23250r92376n91025M55816J141677R88309N37808L72351K26909l72157
$$ plain form
40277 1444062 427789 -349994 11041 1227462 2089456 1923047 1310741 1189948 1666425
40268 1666425 2089965 2034286 1692681 1340876 944300 495531 291879 525618 926123 1221004
40258 1221004 1653863 2475467 3117652 2658122 1241273 268736 732235 1925209 2393075
40249 2393075 1764708 943023 669418 691585 498771 194507 193762 437082 455066 168424
40239 168424 148004 826636 1681579 1599724 168987 -1672805 -2552827 -2095168 -1128391 -556121
40229 -556121 -470475 -469254 -345315 -121384 248703 768812 1140961 1000305 368863 -374210
40219 -374210 -888682 -1041359 -867270 -645291 -824638 -1519286 -2205773 -2297913 -1927344 -1759264
40209 -1759264 -2082873 -2492211 -2492503 -2061716 -1548897 -1285640 -1301577 -1199805 -444497 907351
$$ packed form
40277A444062j016273p77783L61035J216421Q61994j66409o12306j20793M76477
40268A666425M23540n5679l41605l51805l96576m48769k03652K33739M00505K94881
40258A221004M32859Q21604O42185m59530j416849r72537M63499J192974M67866
40249B393075o28367q21685k73605K2167j92814l04264p45K43320J7984k86642
40239A68424k0420O78632Q54943q1855j430737j841792q80022M57659R66777N72270
40229e56121Q5646J221J23939K23931L70087N20109L72149j40656o31442p43073
40219c74210n14472j52677J74089K21979j79347o94648o86487r2140L70569J68080
40209a759264l23609m09338k92M30787N12819K63257j5937J01772P55308J351848
$$ plain form
40199 907351 1954956 1916364 1211443 1003529 1708376 2604928 2950397 2729054 2123151 1075611
40189 1075611 -185511 -911045 -716685 -178854 8406 -54001 1963 -32022 -416994 -583937
40179 -583937 149001 1187458 1183440 82248 -516978 475732 2101599 2690974 1983531
40170 1983531 1036609 543975 289481 103347 275638 757866 841927 201945 -307616 410125
40160 410125 2179593 3627023 3796412 3143626 2721340 2822115 2820604 2143122 959043
40151 959043 -93872 -524496 -226498 602556 1550030 2141060 2154888 1802943 1462474 1241431
40141 1241431 932488 392272 -211091 -638494 -951258 -1436995 -2123834 -2554711 -2242645
40132 -2242645 -1312248 -471371 -261152 -495293 -568112 -182551 395195 699250 471466 -242204
$$ packed form
40199I07351J047605l8592p04921k07914P04847Q96552L45469k21343o05903j047540
40189A075611j261122p25534J94360N37831J87260o2407N5964l3985l84972j66943
40179e83937P32938J038457m018j101192n99226R92710J625867N89375p07443
40170A983531r46922m92634k54494j86134J72291M82228Q4061o39982n09561P17741
40160D10125J769468J447430J69389o52786m22286J00775j511o77482j184079
40151I59043j052915m30624K97998Q29054R47474N91030J3828l51945l40469k21043
40141A241431l08943n40216o03363m27403l12764m85737o86839m30877L12066
40132b242645R30397Q40877K10219k34141p2819L85561N77746L04055k27784p13670
$$ plain form
40122 -242204 -1170306 -1949202 -2325321 -2257808 -1767242 -820635 437627 1490810 1838965
40113 1838965 1577394 1256314 1148847 1034464 767300 587984 646113 658456 407268 208607
40103 208607 392758 553492 -87272 -1539957 -2771486 -2769614 -1598171 -212646 577224
40094 577224 760510 819639 987582 995156 620002 259286 537400 1283362 1415042 242270
40084 242270 -1465205 -2267210 -1756493 -881511 -580319 -741248 -744996 -460475 -246987 -298041
40074 -298041 -473467 -673847 -983050 -1427470 -1859310 -2100487 -2036916 -1632926 -1053315 -682629
40064 -682629 -740315 -923441 -802409 -623804 -1235742 -2883352 -4467295 -4586176 -3224777
40055 -3224777 -1809998 -1488019 -1931647 -2120727 -1695423 -994730 -226739 618324 1208500
$$ packed form
40122b42204r28102p78896l76119O7513M90566R46607J258262J053183L48155
40113A838965k61571l21080j07467j14383k67164j79316N8129J2343k51188j98661
40103B08607J84151J60734o40764j452685j231529J872J171443J385525P89870
40094E77224J83286N9129J67943P574l75154l60716K78114P45962J31680j172772
40084B42270j707475q02005N10717Q74982L01192j60929l748K84521K13488n1054
40074b98041j75426k00380l09203m44420m31840k41177O3571M03990N79611L70686
40064f82629n7686j83126J21032J78605o11938j647610j583943j18881J361399
40055c224777J414779L21979m43628j89080M25304P00693P67991Q45063N90176
$$ plain form
40046 1208500 1043269 271120 -367536 -585684 -877325 -1555263 -2118508 -1951037 -1085104
40037 -1085104 108159 1387693 2339097 2254154 1007214 -425634 -1052765 -1081804 -1311780
40028 -1311780 -1740058 -1727152 -1297951 -1196548 -1601802 -1776858 -1196691 -165247 900349
40019 900349 1923863 2607335 2334816 1193511 354210 746067 1825039 2292994 1722837
40010 1722837 905014 755974 1312009 1730969 1113203 -493446 -1882711 -1898006 -898558
40001 -898558 -400949 -1066176 -1802374 -1333822 54897 1059675 1148806 1000661 1353479
39992 1353479 2126268 2698864 2639387 2167404 2070209 2892038 4051559 4289916 3320782 2373221
39982 2373221 2516354 3106468 2755561 1356061 111981 -222783 -86903 -73491 -122309
$$ packed form
40046A208500j65231p72149o38656k18148k91641o77938n63245J67471Q65933
40037a085104J193263J279534R51404q4943j246940j432848o27131k9039k29976
40028a311780m28278J2906M29201J01403m05254j75056N80167J031444J065596
40019I00349J023514O83472k72519j141305q39301L91857J078972M67955n70157
40010A722837q17823j49040N56035M18960o17766j606649j389265j5295R99448
40001h98558M97609o65227p36198M68552J388719J004778Q9131j48145L52818
39992A353479P72789N72596n9477m71983r7195Q21829J159521K38357r69134r47561
39982B373221J43133N90114l50907j399500j244080l34764J35880J3412m8818
$$ plain form
39973 -122309 -4892 112350 -95470 -758112 -1803891 -2882136 -3316445 -2656204 -1284796
39964 -1284796 -7907 869444 1508482 1748037 1114032 -333785 -1840184 -2729852 -2792888
39955 -2792888 -1997682 -574198 645136 839163 284555 21012 326280 431768 -77205
39946 -77205 -631717 -827834 -1128358 -1789353 -2056179 -1268019 -22538 643427 657602 606016
39936 606016 491392 -222265 -1513142 -2618604 -2980441 -2776681 -2483132 -2320876 -2120243
39927 -2120243 -1490019 -289341 911754 1220989 502540 -415125 -896475 -1248137 -1869471
39918 -1869471 -2336160 -2025229 -1146098 -423245 -147452 -198041 -557085 -1079887 -1202289 -665713
39908 -665713 -114464 -150053 -249236 412053 1453658 1699698 843785 -366493 -1364530 -2009553
$$ packed form
39973a22309J17417J17242k07820o62642j045779j078245m34309O60241J371408
39964a284796J276889Q77351O39038K39555o34005j447817j506399q89668o3036
39955b792888P95206J423484J219334J94027n54608k63543L05268J05488n08973
39946g7205n54512j96117l00524o60995k66826P88160J245481O65965J4175n1586
39936F06016j14624p13657j290877j105462l61837K03760K93549J62256K00633
39927b120243O30224J200678J201095L09235p18449r17665m81350l51662o21334
39918a869471m66689L10931Q79131P22853K75793n0589l59044n22802j22402N36576
39908f65713N51249l5589r9183O61289J041605K46040q55913j210278r98037o45023
$$ plain form
39898 -2009553 -1808796 -304158 1667031 2488510 1888777 1327508 1880352 2932934 3424434
39889 3424434 3161457 2305279 791635 -910597 -1555472 -631990 696194 1062575 533916
39880 533916 -84062 -681786 -1478113 -1992272 -1710823 -1305765 -1849816 -3067105 -3651992
39871 -3651992 -3224263 -2691715 -2609043 -2445642 -1781194 -1081656 -805647 -707487 -608321 -1025859
39861 -1025859 -2300866 -3661982 -3920658 -2826315 -1142191 420837 1775845 3017329
39853 3017329 3915877 4058047 3332545 2163077 1232741 913927 972586 920223 606111 311444
39843 311444 329767 685357 1226400 1706938 1747568 1029652 -311235 -1657020 -2394543 -2363482
39833 -2363482 -1859055 -1365486 -1256373 -1538646 -1876059 -2021467 -2127447 -2366045 -2372918 -1538801
$$ packed form
39898b009553K00757J504638J971189Q21479n99733n61269N52844J052582M91500
39889C424434k62977q56178j513644j702232o44875R23482J328184L66381n28659
39880E33916o17978n97724p96327n14159K81449M05058n44051j217289n84887
39871c651992M27729N32548Q2672J63401O64448O99538K76009R8160R9166m17538
39861a025859j275007j361116k58676J094343J684124J563028J355008J241484
39853C017329Q98548J42170p25502j169468r30336l18814N8659n2363l14112k94667
39843C11444J8323L55590N41043M80538M0630p17916j340887j345785p37523L1061
39833b363482N04427M93569J09113k82273l37413j45408j05980k38598o873Q34117
$$ plain form
39823 -1538801 65400 1504017 1959297 1597273 1226325 1375477 1989664 2786528 3505113
39814 3505113 3839009 3476603 2359864 811384 -625254 -1433158 -1333214 -472844 568444
39805 568444 1171306 1228134 1220230 1608426 2216980 2426539 1974676 1286268 882228 774556
39795 774556 755183 995110 1795029 2786874 3017716 2063768 591798 -453541 -801847
39786 -801847 -744152 -572291 -527445 -836136 -1292628 -1213493 -356832 529219 713915 577291
39776 577291 833089 1062777 219508 -1465571 -2409017 -1878125 -1057325 -1232876 -1951712
39767 -1951712 -1952249 -1170656 -653216 -821079 -978499 -571806 36476 309255 321050 445180
39757 445180 750361 1061377 1299300 1465001 1498617 1386851 1260803 1232466 1285815 1451773
$$ packed form
39823a538801J604201J438617M55280l62024l70948J49152O14187P96864P18585
39814C505113L33896l62406j116739j548480j436638q07904R9944Q60370J041288
39805E68444O02862N6828p904L88196O08554K09559m51863o88408m04040j07672
39795G74556j9373K39927P99919R91845K30842r53948j471970j045339l48306
39786h01847N7695J71861M4846l08691m56492P9135Q56661Q86051J84696j36624
39776E77291K55798K29688q43269j685079r43446N30892Q20800j75551p18836
39767a951712n37P81593N17440j67863j57420M06693O08282K72779J1795J24130
39757D45180L05181L11016K37923J65701L3616j11766j26048k8337N3349J65958
$$ plain form
39747 1451773 1891124 2598042 3165731 3130251 2561053 2078530 2176403 2690377 3107731 3279581
39737 3279581 3529550 4011282 4280404 3765289 2508064 1149259 212685 -343691 -833893
39728 -833893 -1292098 -1315189 -483775 958338 1919330 1368812 -369436 -1702084 -1573215
39719 -1573215 -752085 -701599 -1576565 -2251027 -2113782 -1695154 -1387921 -766577 288910
39710 288910 861569 227918 -923928 -1380886 -978779 -471070 -288493 -268696 -239065 -22346
39700 -22346 792559 2184733 3101829 2517463 909671 -341267 -905518 -1668183 -2860130
39691 -2860130 -3356540 -2382419 -815481 10797 29691 130743 682712 1254194 1545816
39682 1545816 1793267 2224351 2662383 2781059 2496379 2104689 2126510 2814043 3697314 3939701
$$ packed form
39747A451773M39351P06918N67689l5480n69198m82523R7873N13974M17354J71850
39737C279581K49969M81732K69122n15115j257225j358805r36574n56376m90202
39728h33893m58205k3091Q31414J442113R60992n50518j738248j332648J28869
39719a573215Q21130N0486q74966o74462J37245M18628L07233O21344J055487
39710B88910N72659o33651j151846m56958M02107N07709J82577J9797K9631K16719
39700b2346Q14905J392174R17096n84366j607792j250938n64251p62665j191947
39691b860130m96410R74121J566938Q26278J8894J01052N51969N71482K91622
39682A545816K47451M31084M38032J18676k84680l91690K1821O87533Q83271K42387
$$ plain form
39672 3939701 3339303 2604293 2362216 2324264 1869210 1092334 677127 861141 1087166 722626
39662 722626 -257873 -1335151 -1886850 -1575528 -583493 523953 1355574 2014180 2642710
39653 2642710 2870621 2167986 729767 -449861 -544752 342475 1489299 2329433 2749969
39644 2749969 2855666 2709148 2283660 1549044 598233 -302974 -866800 -1022430 -946461 -820086
39634 -820086 -599578 -74084 834237 1839735 2443750 2421271 2115396 2079679 2424519 2723240
39624 2723240 2593585 2084085 1358421 339198 -1024493 -2374406 -3223531 -3515997 -3530595
39615 -3530595 -3276591 -2399036 -766866 1178319 2778396 3605888 3506215 2567593 1258959
39606 1258959 282198 -54054 -178947 -684286 -1479479 -1826062 -1257963 -220348 353434
$$ packed form
39672C939701o00398p35010k42077l7952m55054p76876m15207J84014K26025l64540
39662G22626r80499j077278n51699L11322R92035J107446Q31621O58606O28530
39653B642710K27911p02635j438219j179628r4891Q87227J146824Q40134M20536
39644B749969J05697j46518m25488p34616r50811r01207n63826j55630P5969J26375
39634h20086K20508N25494R08321J005498O04015k2479l05875l5717L44840K98721
39624B723240j29655n09500p25664j019223j363691j349913q49125k92466j4598
39615c530595K54004Q77555J632170J945185J600077Q27492r9673r38622j308634
39606A258959r76761l36252j24893n05339p95193l46583N68099J037615N73782
$$ plain form
39597 353434 6116 -795622 -1119852 -412092 1047014 2386237 2806575 2131941 901201
39588 901201 -13046 -13914 802917 1803388 2436305 2651538 2648338 2432634 1979615 1755844
39578 1755844 2481272 4030257 5045788 4295169 2245904 591815 174944 160928 -416020
39569 -416020 -1125777 -910412 168774 943248 740669 7247 -739264 -1585945 -2513280
39560 -2513280 -2940503 -2618775 -2286819 -2700548 -3507708 -3820635 -3472959 -2905905 -2186267
39551 -2186267 -1098820 -39788 185742 -497636 -1386941 -2138226 -2995387 -3740491 -3515321
39542 -3515321 -2171704 -861400 -630857 -1146341 -1421322 -1101943 -366648 716182 1868029
39533 1868029 2249424 1447800 440397 553193 1681019 2545499 2586795 2508428 2859645
$$ packed form
39597C53434l47318q01738l24230P07760J459106J339223M20338o74634j230740
39588I01201r14247q68Q16831J000471O32917K15233l200k15704m53019k23771
39578A755844P25428J548985J015531p50619k049265j654089m16871j4016n76948
39569d16020p09757K15365J079186P74474k02579p33422p46511q46681r27335
39560b513280m27223L21728L31956m13729q07160l12927L47676N67054P19638
39551b186267J087447J059032K25530o83378q89305p51285q57161p45104K25170
39542c515321J343617J310304K30543n15484k74981L19379P35295J082830J151847
39533A868029L81395q01624j007403J12796J127826Q64480M1296p8367L51217
$$ plain form
39524 2859645 3181597 2966181 2576237 2620987 2970923 2947070 2201339 1052516 147637 -58860
39514 -58860 249822 293094 -437233 -1332856 -1215974 151704 1651518 2103935 1477232 592216
39504 592216 158097 375249 958344 1204501 528565 -701513 -1335990 -816145 136276
39495 136276 599150 590720 540291 285257 -458539 -1018655 -297264 1564380 3029472 2965090
39485 2965090 1839972 779656 126457 -507123 -1220776 -1557343 -1205991 -504328 -89855
39476 -89855 -228860 -615433 -826839 -884641 -1183423 -1812674 -2252373 -2032197 -1437682 -1091241
39466 -1091241 -972147 -467294 541588 1302620 1215768 693514 555142 940955 1304309
39457 1304309 1200481 582809 -463298 -1690005 -2444609 -2047596 -570187 1145635 2337754
$$ packed form
39524B859645L21952k15416l89944M4750L49936k3853p45731j148823r04879k06497
39514e8860L08682M3272p30327q95623J16882J367678J499814M52417o26703q85016
39504E92216m34119K17152N83095K46157o75936j230078o34477N19845R52421
39495A36276M62874q430n0429k55034p43796n60116P21391J861644J465092o4382
39485B965090j125118j060316o53199o33580p13653l36567L51352P01663M14473
39476h9855j39005l86573k11406n7802k98782o29251m39699K20176N94515L46441
39466a091241J19094N04853J008882P61032q6852n22254j38372L85813L63354
39457A304309j03828o17672j046107j226707p54604L97013J477409J715822J192119
$$ plain form
39448 2337754 2849166 2803623 2296437 1625877 1323829 1549130 1786412 1555050 1105412 907069
39438 907069 706789 -198782 -1729924 -2760923 -2394634 -1023111 224116 702978 546945
39429 546945 105366 -344492 -451345 73965 1044378 1857671 2088746 1811864 1354732 1040112
39419 1040112 1166020 1818130 2536141 2545515 1616750 455924 -51140 181279 473208 224234
39409 224234 -574206 -1523215 -2127631 -1967483 -999704 165821 642304 178294 -508800
39400 -508800 -565426 -21744 315315 -72712 -797540 -1104503 -736009 -23506 694968 1399216
39390 1399216 2091896 2473117 2139885 1070415 -216048 -1023119 -1035772 -589316 -347388
39381 -347388 -571346 -729699 -61625 1415432 2746108 3065427 2526086 1937450 1733260
$$ packed form
39448B337754N11412m5543n07186o70560l02048K25301K37282k31362m49638j98343
39438I07069k00280r05571j531142j030999L66289J371523J247227M78862j56033
39429E46945m41579m49858j06853N25310R70413Q13293K31075k76882m57132l14620
39419A040112J25908O52110P18011R374r28765j160826n07064K32419K91929k48974
39409B24234p98440r49009o04416J60148R67779J165525M76483m64010o87094
39400e08800n6626N43682L37059l88027p24828l06963L68494P12503P18474P04248
39390A399216O92680L81221l33232j069470j286463q07071j2653M46456K41928
39381c47388k23958j58353O68074J477057J330676L19319n39341n88636k04190
$$ plain form
39372 1733260 1688053 1485046 1068317 463055 -227993 -560328 -27960 1138076 1923860
39363 1923860 1637251 669756 -230297 -1024236 -2118581 -3294085 -3692954 -3012760 -2076673
39354 -2076673 -1862355 -2359353 -2774715 -2627951 -2226017 -2103929 -2334901 -2485113 -2079595
39345 -2079595 -1050550 158272 894215 827840 266579 -140785 -95172 31507 -314197
39336 -314197 -1120429 -1766461 -1773185 -1352321 -1014261 -832270 -445271 252982 832800 893381
39326 893381 612325 506069 843236 1510235 2252459 2754812 2639828 1786655 670626
39317 670626 16940 -37689 -159113 -951795 -2055734 -2439754 -1629134 -342603 326155
39308 326155 209015 180697 908285 1900454 2194583 1762379 1643776 2581386 4038682 4863356
$$ packed form
39372A733260m5207k03007m16729o05262o91048l32335N32368J166036P85784
39363A923860k86609r67495r00053p93939j094345j175504l98869O80194R36087
39354b076673K14318m96998m15362J46764M01934J22088k30972j50212M05518
39345b079595J029045J208822P35943o6375n61261m07364M5613J26679l45704
39336c14197q06232o46032o724M20864L38060J81991L86999O98253N79818O0581
39326H93381k81056j06256L37167O66999P42224N02353j14984q53173j116029
39317F70626o53686n4629j21424p92682j103939l84020Q10620J286531O68758
39308C26155j17140k8318P27588R92169K94129m32204j18603R37610J457296Q24674
$$ plain form
39298 4863356 4529772 3362159 1886380 501817 -353325 -295112 612444 1865658 2960528
39289 2960528 3574675 3441357 2534553 1439826 1029962 1520146 2205267 2371965 2108536
39280 2108536 1901598 1784383 1364757 549182 -223912 -477032 -86360 788555 1798962
39271 1798962 2402411 2166803 1254402 319636 -231501 -585179 -935008 -935854 -185533 945832
39261 945832 1526562 1174985 499544 247632 431597 616010 733918 1133914 1915900 2679200
39251 2679200 3019023 2969478 2855662 2929578 3216149 3505526 3445403 2863644 2056421 1527622
39241 1527622 1393600 1315749 1080547 876489 804222 502666 -333211 -1273319 -1474175 -725864
39231 -725864 179706 317874 -289368 -675730 -55393 1190331 1864373 1323916 192610
$$ packed form
39298D863356l33584j167613j475779j384563q55142N8213R07556J253214J094870
39289B960528O14147j33318r06804j094727m09864M90184O85121J66698k63429
39280B108536k06938j17215m19626q15575p73094k53120L90672Q74915J010407
39271A798962O03449k35608r12401r34766n51137l53678l49829q46P50321J131365
39261I45832N80730l51577o75441k51912J83965J84413J17908L99996P81986P63300
39251B679200L39823m9545j13816P3916K86571K89377o0123n81759q07223n28799
39241A527622j34022p7851k35202k04058p2267l01556q35877r40108k00856P48311
39231g25864R05570J38168o07242l86362O20337J245724O74042n40457j131306
$$ plain form
39222 192610 -536777 -769108 -1146668 -1825472 -2179413 -1837952 -1259862 -955320 -822976 -658435
39212 -658435 -609704 -607932 -125352 749567 792263 -694289 -2284659 -1895843 363301 2270900
39202 2270900 2513454 2105514 2317796 2681082 2048893 571925 -591777 -934341 -878616
39193 -878616 -789379 -718431 -924782 -1708610 -2758564 -3419797 -3577542 -3591524 -3433743 -2674227
39183 -2674227 -1398692 -398391 -238564 -751969 -1650092 -2958484 -4446848 -5201953 -4409469
39174 -4409469 -2397014 -438089 441433 156270 -827941 -2115910 -3425706 -4338793 -4472264
39165 -4472264 -4004362 -3687877 -4006169 -4460419 -4102771 -2759861 -1250698 -277048 344012
39156 344012 1014659 1478711 1216110 401312 -196119 -162236 274472 794050 1196003 1108592
$$ packed form
39222A92610p29387k32331l77560o78804l53941L41461N78090L04542J32344J64541
39212f58435M8731J772M82580Q74919M2696j486552j590370L88816K259144J907599
39202B270900K42554m07940K12282L63286o32189j476968j163702l42564N5725
39193h78616Q9237P0948k06351p83828j049954o61233j57745j3982J57781P59516
39183b674227J275535J000301J59827n13405q98123j308392j488364p55105P92484
39174d409469K012455J958925Q79522k85163r84211j287969j309796r13087j33471
39165d472264M67902L16485l18292m54250L57648J342910J509163R73650O21060
39156C44012O70647M64052k62601q14798n97431L3883M36708N19578M01953q7411
$$ plain form
39146 1108592 221841 -1015083 -1575897 -1025040 8893 767145 1191356 1480288 1438122
39137 1438122 857778 138329 -138417 -18356 53735 104041 588705 1484447 2092207 1944865
39127 1944865 1386561 1002449 911452 893613 801929 501406 -223271 -1233403 -1770426 -1181914
39117 -1181914 146610 1093207 1079451 595389 364807 491967 670206 749911 679387 242191
39107 242191 -594524 -1231372 -914389 289266 1451335 1823748 1532074 1126939 877559
39098 877559 748163 724124 849434 1152388 1758655 2812589 4001883 4439337 3465472
39089 3465472 1507022 -215042 -823302 -379742 531632 1396707 1890918 1813551 1176321
39080 1176321 242038 -655528 -1267885 -1426078 -1090503 -494790 -50720 48366 17225 114452
$$ packed form
39146A108592q86751j236924n60814N50857J033933P58252M24211K88932m2166
39137A438122n80344p19449k76746J20061P2091N0306M84664Q95742O07760j47342
39127A944865n58304l84112r0997j7839r1684l00523p24677j010132n37023N88512
39117a181914J328524R46597j3756m84062k30582J27160J78239P9705p0524m37196
39107B42191q36715o36848L16983J203655J162069L72413k91674m05135k49380
39098H77559j29396k4039J25310L02954O06267J053934J189294M37454r73865
39089C465472j958450j722064o08260M43560R11374Q65075M94211p7367o37230
39080A176321r34283q97566o12357j58193L35575N95713M44070R9086l1141R7227
$$ plain form
39070 114452 183203 -186727 -950740 -1291433 -342557 1685567 3375528 3386689 1806234
39061 1806234 -23848 -951011 -933032 -536471 -67481 464198 924056 1140431 1294332
39052 1294332 1730906 2354887 2630392 2292999 1714649 1396220 1383679 1389690 1240478 902842
39042 902842 211802 -1037598 -2621446 -3783258 -3859081 -2958649 -1827438 -1035081 -522865
39033 -522865 -13022 439301 569656 382015 150632 35861 70230 465452 1437897 2610082
39023 2610082 3078087 2396324 1198151 532025 770532 1404042 1731553 1558641 1372377
39014 1372377 1947664 3572394 5577117 6894565 7145310 6867403 6725017 7013937 7926380
39005 7926380 9508449 11146065 12022784 12568803 14491770 18640954 23871861 29166380
$$ packed form
39070A14452O8751l69930p64013l40693R48876K028124J689961J1161j580455
39061A806234j830082r27163J7979L96561M68990N31679M59858K16375J53901
39052A294332M36574O23981K75505l37393n78350l18429j2541O011j49212l37636
39042I02842o91040j249400j583848j161812p5823R00432J131211P92357N12216
39033e22865N09843M52323J30355j87641k31383j14771L4369L95222R72445J172185
39023B610082M68005o81763j198173o66126K38507O33510L27511j72912j86264
39014A372377N75287J624730K004723J317448K50745k77907j42386K88920R12443
39005G926380J582069J637616Q76719N46019J922967M149184N230907N294519
$$ plain form
38997 29166380 35878188 45965443 58090611 67345201 69619401 65264285 57978820 51141360
38989 51141360 45960165 42339025 40310872 40419270 43203538 48808005 57435991 69880991
38981 69880991 86269732 103293787 113866459 111847396 97718552 78342502 60766842
38974 60766842 47452714 37521398 30234946 25532639 22559504 19905956 17247910 15358026
38966 15358026 14457556 13636117 12029505 9771457 7642293 6303801 5880835 5894033 5705215
38957 5705215 5270967 5099869 5234527 4970965 4104678 3637560 4341363 5270501 4853769
38948 4853769 3112932 1625029 1414294 2002334 2545220 2783154 2644790 1924281 790346
38939 790346 -51598 -34420 886903 2522889 4453569 5763182 5652399 4537531 3735581
$$ packed form
38997B9166380O711808J0087255J2125168R254590K274200m355116p285465o837460
38989E1141360n181195l621140k028153J08398K784268N604467Q627986J2445000
38981F9880991J6388741J7024055J0572672k019063j4128844j9376050j7575660
38974F0766842j3314128r931316p286452m702307k973135k653548k658046j889884
38966A5358026r00470q21439j606612k258048k129164j338492m22966J3198j88818
38957E705215m34248j71098J34658k63562q66287m67118P03803R29138m16732
38948D853769j740837j487903k10735N88040N42886K37934j38364p20509j133935
38939G90346q41944J7178R21323J635986J930680J309613j10783j114868q01950
$$ plain form
38930 3735581 3772814 3811975 3131373 2314724 2326170 3068265 3665431 3811988 4040567 4754261
38920 4754261 5677853 6367783 6751877 6941147 6847322 6320600 5585397 5227105 5591810 6365505
38910 6365505 6981162 7326047 7687260 8054485 8050033 7742200 7884313 8854753 9896289 10110387
38900 10110387 9863902 10419872 12328223 14961129 17580991 20054789 22488883 25116624
38892 25116624 28872861 35174644 44597815 56750311 72456060 94890189 125728139
38885 125728139 158931931 180736506 179607633 157340189 128223158 106017524 93722202
38878 93722202 87332252 85796521 92451455 108678392 133181674 168404172 219108250
38871 219108250 278447041 321399254 322207887 279395041 217380442 162556339 123476405
$$ packed form
38930C735581L7233L9161o80602q16649J1446P42095N97166J46557K28579P13694
38920D754261R23592O89930L84094J89270r3825n26722p35203l58292L64705P73695
38910F365505O15657L44885L61213L67225m452l07833J42113R70440J041536K14098
38900A0110387k46485N55970J908351K632906K619862K473798K434094K627741
38892B5116624L756237O301783R423171J2152496J5705749K2434129L0837950
38885A25728139L3203792K1804575j128873k2267444k9117031k2205634j2295322
38878I3722202o389950j535731O654934J6226937K4503282L5222498N0704078
38871B19108250N9338791M2952213Q08633m2812846o2014599n4824103l9079934
$$ plain form
38864 123476405 94923595 72458939 56469389 46547845 39657736 33976705 29987549
38857 29987549 27464852 24778584 21469865 18709992 16889005 15102252 13226421 12266855
38849 12266855 12309901 12113187 11111626 10105477 9649398 9358360 9065863 9137365 9396249
38840 9396249 9187271 8668199 8611689 8894594 8773145 8687849 9959001 12447075 14505481
38831 14505481 15827694 18341201 23386312 29999990 37293861 46517674 58485055 69944185
38823 69944185 75068044 71059997 60973667 50603765 43585990 39977744 38581122 39234652
38815 39234652 42533685 48514058 57106002 69597486 87300878 107238168 120903425
38808 120903425 120298468 105563191 84804920 66217191 52233701 41398137 32848588
$$ packed form
38864A23476405k8552810k2464656j5989550r921544o890109n681031l989156
38857B9987549k522697k686268l308719k759873j820987j786753j875831r59566
38849A2266855M3046j96714j001561j006149m56079k91038k92497P1502K58884
38840I396249k08978n19072n6510K82905j21449q5296J271152K488074K058406
38831A4505481J322213K513507N045111O613678P293871R223813J1967381J1459130
38823F9944185N123859m008047j0086330j0369902p017775l608246j396622O53530
38815C9234652L299033N980373Q591944J2491484J7703392J9937290J3665257
38808A20903425o04957j4735277k0758271j8587729j3983490j0835564q549549
$$ plain form
38801 32848588 26922130 23136673 20068796 16948635 13952679 11277660 9072330 7864381
38793 7864381 7924637 8459540 8346086 7426149 6363841 5614171 5249084 5365312 5906317
38784 5906317 6429355 6657190 6834348 7058895 6935612 6455994 6355238 6817250 6764641 5470129
38774 5470129 3991199 3752623 4448536 4734917 4367858 4106820 3971158 3328315 2548500
38765 2548500 2790565 3964664 4561452 3909100 3096584 3100887 3387941 3117713 2539690 2291161
38755 2291161 2219041 1808759 1138692 611337 237920 -120997 -231435 165074 795536 1157229
38745 1157229 1110493 815772 422729 153444 308341 826112 1186698 1075972 774748 567524
38735 567524 205982 -569720 -1299412 -1150971 41908 1446440 1993431 1388511 426154
$$ packed form
38801C2848588n926458l785457l067877l120161k995956k675019k205330j207949
38793G864381O0256N34903j13454r19937j062308p49670l65087J16228N41005
38784E906317N23038K27835J77158K24547j23283m79618j00756M62012n2609j294512
38774E470129j478930k38576O95913K86381l67059k61038j35662o42843p79815
38765B548500K42065J174099N96788o52352q12516M303K87054k70228n78023k48529
38755B291161p2120m10282o70067n27355l73417l58917j10438L96509O30462L61693
38745A157229m6736k94721l93043k69285J54897N17771L60586j10726l01224k07224
38735E67524l61542p75702p29692J48441J192879J404532N46991o04920r62357
$$ plain form
38726 426154 256042 1125622 1938722 1445690 -154309 -1305418 -909940 456985 1389611
38717 1389611 1252443 589997 261424 556403 1057021 1133552 608201 -23184 -115082 455908
38707 455908 1310964 2079529 2557254 2528399 1914630 1068050 486102 280421 320830 707509
38697 707509 1515588 2235295 2201054 1547413 1010078 819809 634216 557333 1181128 2381373
38687 2381373 3140172 3020157 2832302 3253066 3695155 3300063 2311119 1658730 1717606 2163049
38677 2163049 2581611 2658015 2295811 2056028 2790827 4280616 5074242 4448620 3657910
38668 3657910 4247832 5948050 7448866 8554570 10078328 12029948 13573872 14806789
38660 14806789 17056274 21162692 26842347 34076785 43553788 54716415 64402157 68747435
$$ packed form
38726D26154j70112Q69580Q13100m93032j599999j151109L95478J366925R32626
38717A389611j37168o62446l28573K94979N00618P6531n25351o31385r1898N70990
38707D55908Q55056P68565M77725k8855o13769q46580n81948k05681M0409L86679
38697G07509Q08079P19707l4241o53641n37335j90269j85593p6883O23795J200245
38687B381373P58799j20015j87855M20764M42089l95092r88944o52389N8876M45443
38677B163049M18562P6404l62204k39783P34799J489789P93626o25622p90710
38668C657910N89922J700218J500816J105704J523758J951620J543924J232917
38660A4806789K249485M106418N679655P234438R477003J1162627R685742M345278
$$ plain form
38652 68747435 66427975 59560194 51723252 45570509 42033412 41022074 42355278 45967140
38644 45967140 51709895 59746649 71102728 86377766 102724541 113204766 111464796
38637 111464796 97673333 78574353 61266750 48136799 38054514 30266501 25144549
38630 25144549 22118362 19253566 15420242 11589908 9305069 8585682 8002416 6466358
38622 6466358 4316118 2600284 1750420 1323039 876010 517264 345886 -66464 -993991
38613 -993991 -1724496 -1292433 16862 824681 491350 -120649 -62622 429061 665010 722511
38603 722511 1124724 1784467 2079338 1777542 1290324 1154817 1675154 2800895 3947948
38594 3947948 4259135 3477476 2268601 1360979 854408 757587 1467049 2940977 4028237
$$ packed form
38652F8747435k319460o867781p836942o152743l537097j011338J333204L611862
38644D5967140N742755Q036754J1356079J5275038J6346775J0480225j739970
38637A11464796j3791463j9098980j7307603j3129951j0082285p788013n121952
38630B5144549l026187k864796l833324l830334k284839p19387n83266j536058
38622F466358k150240j715834q49864m27381m47029l58746j71378m12350r27527
38613i93991p30505M32063J309295Q07819l33331o11999N8027M91683K35949N7501
38603G22511M02213O59743K94871l01796m87218j35507N20337J125741J147053
38594C947948L11187p81659j208875r07622n06571r6821P09462J473928J087260
$$ plain form
38585 4028237 3671525 2446200 1829612 2110365 2150022 1246151 76559 -488456 -455321
38576 -455321 -129916 582815 1656414 2460301 2535669 2334593 2474484 2679092 2239714 1266342
38566 1266342 630204 649685 602629 -195613 -1393766 -2067078 -1854733 -1270581 -1049980 -1497382
38556 -1497382 -2363301 -3023803 -2802493 -1509472 157598 1045772 681691 -176367 -422076
38547 -422076 77480 417746 -107950 -1142939 -1777820 -1553237 -719540 211782 874813
38538 874813 1150806 1103632 792912 143855 -827334 -1726063 -2096099 -2058096 -2168785 -2534416
38528 -2534416 -2626667 -2209615 -1797067 -1757257 -1606886 -829303 145030 538120 385663 267745
38518 267745 227300 -71539 -293616 355773 1738803 2602749 2142655 983790 252233
$$ packed form
38585D028237l56712j225325o16588K80753L9657r03871j169592n65015L3135
38576d55321L25405P12731J073599Q03887P5368k01076J39891K04608m39378r73372
38566A266342o36138J9481m7056p98242j198153o73312K12345N84152K20601m47402
38556a497382q65919o60502K21310J293021J667070Q88174l64081q58058k45709
38547d22076M99556L40266n25696j034989o34881K24583Q33697R31322O63031
38538H74813K75993m7174l10720o49057r71189q98729l70036L8003j10689l65631
38528b534416r2251M17052M12548L9810J50371P77583R74333L93090j52457j17918
38518B67745m0445k98839k22077O49389J383030Q63946m60094j158865p31557
$$ plain form
38509 252233 324405 853833 1439686 1861608 2083423 2305935 2628144 2584655 1652763 364436
38499 364436 82296 1232243 2511220 2461137 1205821 -82035 -906803 -1746314 -2844680
38490 -2844680 -3590404 -3259672 -1882767 -235637 777853 789413 279577 150749 777050
38481 777050 1615080 1909215 1503156 738363 -73529 -724275 -1026508 -1117425 -1533535 -2469253
38471 -2469253 -3244457 -3121299 -2444817 -2244162 -2722492 -2908207 -2036115 -628371 219344
38462 219344 199755 -46862 83677 532554 964630 1320725 1666339 1725241 1079408 -36335
38452 -36335 -629204 -85273 890877 1076416 327711 -349870 -352572 -228240 -562813 -997626
38442 -997626 -997299 -893340 -1312142 -2004353 -2147460 -1617299 -1134113 -1208377 -1662530 -2157558
$$ packed form
38509B52233P2172N29428N85853M21922K21815K22512L22209m3489r31892j288327
38499C64436k82140J149947J278977n0083j255316j287856q24768q39511j098366
38490b844680p45724L30732J376905J647130J013490J1560n09836j28828O26301
38481G77050Q38030K94135m06059p64793q11892o50746l02233r0917m16110r35718
38471b469253p75204J23158O76482K00655m78330j85715Q72092J407744Q47715
38462B19344j9589k46617J30539M48877M32076L56095L45614N8902o45833j115743
38452c6335n92869N43931R76150J85539p48705o77581k702J24332l34573m34813
38442i97626L27J03959m18802o92211j43107N30161M83186p4264m54153m95028
$$ plain form
38432 -2157558 -2490628 -2368765 -1593072 -552560 114730 448623 1089804 2118065 2675351
38423 2675351 2125788 1068650 727723 1574623 2881984 3526688 3079817 2168115 1736923
38414 1736923 1904680 1846603 1066108 299195 531284 1505175 2097895 1983859 1862335 2007129
38404 2007129 1793817 1029882 564373 863312 977948 -115643 -1855783 -2788832 -2463255
38395 -2463255 -1651822 -1011486 -543357 -266307 -413407 -794668 -760767 -77125 709051 964301
38385 964301 578723 -227729 -1230078 -2159240 -2722638 -2830353 -2559757 -1922470 -999125
38376 -999125 -195404 135025 273364 745083 1333711 1236326 421892 -8913 607002 1260377
38366 1260377 471661 -1615829 -3277145 -3327289 -2359974 -1665783 -1672233 -1892791 -1841161 -1380345
$$ packed form
38432b157558l33070J21863P75693J040512O67290L33893O41181J028261N57286
38423B675351n49563j057138l40927Q46900J307361O44704m46871r11702m31192
38414A736923J67757n8077p80495p66913K32089R73891N92720j14036j21524J44794
38404B007129k13312p63935m65509K98939J14636j093591j740140r33049L25577
38395b463255Q11433O40336M68129K77050j47100l81261L3901O83642P86176K55250
38385I64301l85578q06452j002349r29162n63398j07715K70596O37287R23345
38376i99125Q03721L30429J38339M71719N88628r7385q14434m30805O15915O53375
38366A260377p88716k087490j661316n0144R67315O94191o450k20558N1630M60816
$$ plain form
38356 -1380345 -482273 697885 1563515 1471115 515873 -472316 -850148 -754093 -677449 -837224
38346 -837224 -1153880 -1489414 -1596378 -1112031 24150 1297159 2073918 2209233 1939377
38337 1939377 1402815 681849 171885 370597 1201303 1938192 1963021 1359696 688233 391885
38327 391885 462666 491259 73689 -619501 -797749 91785 1543344 2420295 2171734 1244442
38317 1244442 367124 -84477 -47126 313226 544295 305610 -76173 -5251 367253 233537
38307 233537 -586668 -1262255 -1215364 -941057 -1003469 -1010823 -388713 452375 665939 290383
38297 290383 74885 233521 337016 350453 781947 1634460 2064364 1425211 57256 -1261374
38287 -1261374 -2171598 -2768927 -3178173 -3390120 -3343007 -3067537 -2879737 -3266420 -4232514 -4941473
$$ packed form
38356a380345Q98072J180158Q65630r2400r55242r88189l77832R6055P6644j59775
38346h37224l16656l35534j06964M84347J136181J273009P76759J35315k69856
38337A939377n36562p20966n09964J98712Q30706P36889K4829o03325o71463k96348
38327C91885P0781K8593m17570o93190j78248Q89534J451559Q76951k48561r27292
38317A244442q77318m51601L7351L60352K31069k38685l81783P0922L72504j33716
38307B33537q20205o75587M6891K74307o2412p354O22110Q41088K13564l75556
38297B90383k15498J58636J03495J3437M31494Q52513M29904o39153j367955j318630
38287a261374r10224n97329m09246k11947M7113K75470J87800l86683r66094p08959
$$ plain form
38277 -4941473 -4532847 -3253003 -2230987 -2113035 -2475606 -2657182 -2560153 -2413898 -2280170
38268 -2280170 -2107754 -1909502 -1644904 -1245653 -910934 -994123 -1401782 -1477543 -721469 656493
38258 656493 2045226 2965501 3181597 2723486 2055672 1844086 2210691 2440223 1699053
38249 1699053 -83692 -2149990 -3503041 -3532230 -2430615 -1135453 -490337 -319201 254179
38240 254179 1399682 2055952 1239609 -567232 -1940527 -2220226 -2078968 -2367429 -2948679
38231 -2948679 -2985768 -2128420 -1025929 -570293 -873459 -1297069 -1424052 -1498786 -1674768 -1421846
38221 -1421846 -359279 688691 443942 -956920 -1793324 -862873 978823 1921803 1334691
38212 1334691 242575 4929 998497 2416129 3036119 2351595 1093675 391682 429859
$$ packed form
38277d941473M08626J279844J022016J17952l62571j81576R7029J46255J33728
38268b280170J72416J98252K64598L99251L34719q3189m07659p5761P56074J377962
38258F56493J388733R20275K16096m58111o67814k11586L66605K29532p41170
38249A699053j782745k066298j353051k9189J101615J295162O45116J71136N73380
38240B54179J145503O56270q16343j806841j373295k79699J41258k88461n81250
38231b948679l7089Q57348J102491M55636l03166m23610j26983p4734j75982K52922
38221a421846J062567J047970k44749j400862q36404R30451J841696R42980n87112
38212A334691j092116k37646R93568J417632O19990o84524j257920p01993L8177
$$ plain form
38203 429859 438875 13308 -361656 -330344 -305704 -596431 -777515 -611644 -741944 -1577429
38193 -1577429 -2264018 -1864233 -941684 -714631 -1081191 -914722 -150007 -45714 -1151715
38184 -1151715 -2403271 -2717061 -2327982 -1973086 -1779758 -1644024 -1836819 -2451897 -2879728
38175 -2879728 -2548065 -1715563 -963430 -404310 43545 126201 -350266 -1008768 -1396815 -1616778
38165 -1616778 -1905166 -2044476 -1871708 -1932059 -2777580 -3874921 -4111536 -3332260 -2531972
38156 -2531972 -2450512 -2759414 -2825267 -2548785 -2110732 -1466244 -518669 554129 1472299 2089379
38146 2089379 2265313 1864021 1130960 701977 869185 1111717 759965 -78486 -720863
38137 -720863 -930197 -1163275 -1642196 -1712825 -638066 1136695 2082586 1194762 -785181
$$ packed form
38203D29859R016m25567l74964L1312K4640k90727j81084J65871j30300q35485
38193a577429o86589L99785R22549K27053l66560J66469P64715J04293j106001
38184a151715j251556l13790L89079L54896J93328J35734j92795o15078m27831
38175b879728L31663Q32502P52133N59120M47855Q2656m76467o58502l88047k19963
38165a616778k88388j39310J72768o0351q45521j097341k36615P79276Q00288
38156b531972Q1460l08902o5853K76482M38053O44488R47575J072798R18170O17080
38146B089379J75934m01292p33061m28983J67208K42532l51752q38451o42377
38137g20863k09334k33078m78921p0629J074759J774761R45891q87824j979943
$$ plain form
38128 -785181 -2062738 -1594278 78714 1689972 2496309 2533131 2074922 1295829 351175
38119 351175 -608496 -1564804 -2512616 -3174525 -3111236 -2247869 -1085531 -220725 222734 537906
38109 537906 925818 1232891 1160770 551778 -563363 -2008566 -3399075 -4151113 -3843706
38100 -3843706 -2714378 -1632701 -1333082 -1666574 -1811219 -1268349 -433730 -54111 -323389
38091 -323389 -759097 -875510 -695261 -551739 -603915 -679221 -519878 -102016 284846 295474
38081 295474 -93138 -514555 -590024 -286369 202648 785346 1456747 2057902 2373020 2459280
38071 2459280 2517970 2373366 1532503 24959 -1237329 -1409392 -797030 -486204 -982077
38062 -982077 -1721139 -1918814 -1346231 -171726 1334374 2598161 2808611 1773340 433397
$$ packed form
38128g85181j277557M68460J672992J611258Q06337L6822m58209p79093r44654
38119C51175r59671r56308r47812o61909O3289Q63367J162338Q64806M43459L15172
38109E37906L87912L07073p2121o08992j115141j445203j390509p52038L07407
38100c843706J129328J081677K99619l33492j44645N42870Q34619L79619k69278
38091c23389m35708j16413J80249J43522n2176p5306J59343M17862L86862J0628
38081B95474l88612m21417p5469L03655M89017N82698O71401O01155L15118Q6260
38071B459280N8690j44604q40863j507544j262288j72063O12362L10826m95873
38062i82077p39062j97675N72583J174505J506100J263787K10450j035271j339943
$$ plain form
38053 433397 -40264 459977 1075184 1225566 1139675 1109573 894021 195561 -729397 -1364795
38043 -1364795 -1605686 -1772984 -2075079 -2336287 -2222112 -1592306 -719624 -210979 -466202
38034 -466202 -1080272 -1106342 -194798 831662 961120 337157 63381 670240 1361731 1055623
38024 1055623 -223298 -1352735 -1320365 -109056 1483549 2532846 2478994 1334223 -286812
38015 -286812 -1459853 -1613447 -1053560 -701818 -1165306 -2098837 -2571534 -2021959 -805491
38006 -805491 87844 -209814 -1733050 -3477995 -4100896 -3205518 -1863585 -1463042 -2104869
37997 -2104869 -2644800 -2323523 -1680130 -1593441 -2081396 -2547815 -2702217 -2604490 -2138538 -1134417
37987 -1134417 104693 983544 1305651 1370901 1502228 1884800 2667625 3691793 4266296
$$ packed form
38053D33397m73661N00241O15207J50382q5891l0102k15552o98460r24958o35398
38043a364795k40891j67298l02095k61208J14175O29806Q72682N08645k55223
38034d66202o14070k6070R11544J026460J29458o23963k73776O06859O91491l06108
38024A055623j278921j129437L2370J211309J592605J049297n3852j144771j621035
38015b86812j173041j53594N59887L51742m63488r33531m72697N49575J216468
38006h05491Q93335k97658j523236j744945o22901Q95378J341933M00543o41827
37997b104869n39931L21277O43393Q6689m87955m66419j54402R7727M65952J004121
37987a134417J239110Q78851L22107O5250J31327L82572P82825J024168N74503
$$ plain form
37978 4266296 3785921 2493419 1121770 -33260 -1072902 -1800629 -1958605 -2050894 -2853724
37969 -2853724 -3936123 -3803823 -1998585 -1713 701682 573976 1082224 2447162 3446061
37960 3446061 3178585 1977102 589999 -590134 -1298821 -1200258 -331268 666140 1063200
37951 1063200 620385 -375404 -1357372 -1761724 -1410473 -678279 -25752 584650 1463842
37942 1463842 2444238 2841745 2304396 1270380 347301 -389590 -1130442 -1649549 -1432828
37933 -1432828 -536925 162170 -54915 -743770 -753777 266282 1363804 1613752 1436204
37924 1436204 1896237 2963462 3399584 2507486 1097046 301981 215127 287955 413807
37915 413807 839560 1455761 1974949 2504336 3174254 3495781 2955405 2064144 1890572 2594727
$$ packed form
37978D266296m80375j292502j371649j155030j039642p27727j57976r2289q02830
37969b853724j082399J32300J805238J996872P03395j27706N08248J364938R98899
37960C446061k67476j201483j387103j180133p08687R8563Q68990R97408L97060
37951A063200m42815r95789r81968m04352L51251P32194O52527O10402Q79192
37942A463842R80396L97507n37349j034016r23079p36891p40852n19107K16721
37933a432828Q95903O99095k17085o88855j0007J020059J097522K49948j77548
37924A436204M60033J067225M36122q92098j410440p95065q6854P2828J25852
37915D13807M25753O16201N19188N29387O69918L21527n40376q91261j73572P04155
$$ plain form
37905 2594727 3334976 3634949 3840749 4072208 3809922 2952121 2298215 2375434 2615450 2363765
37895 2363765 1918774 1751708 1399037 173409 -1446653 -2228943 -1846953 -1152871 -831950
37886 -831950 -742340 -689871 -893750 -1350278 -1538991 -1201029 -771863 -613095 -421982 93258
37876 93258 507171 261323 -460693 -1069147 -1425505 -1686149 -1603320 -824511 207063 522476
37866 522476 -79476 -779541 -963684 -911012 -950543 -779495 -211376 103881 -492583 -1551068
37856 -1551068 -2005191 -1502304 -536075 438599 1197287 1295031 420288 -785789 -1223483
37847 -1223483 -813343 -583488 -1063922 -1560451 -1430471 -1121713 -1298366 -1718323 -1716286 -1191264
37837 -1191264 -416909 528164 1398435 1479131 565571 -263263 113834 1199336 1559975
$$ packed form
37905B594727P40249K99973K05800K31459k62286q57801o53906P7219K40016k51685
37895B363765m44991j67066l52671j225628j620062p82290L81990O94082L20921
37886h31950Q9610N2469k03879m56528j88713L37962M29166J58768J91113N15240
37876I3258M13913k45848p22016o08454l56358k60644Q2829P78809J031574L15413
37866E22476o01952p00065j84143N2672l9531J71048N68119L15257n96464j058485
37856a551068m54123N02887R66229R74674P58688R7744q74743j206077m37694
37847a223483M10140K29855m80434m96529J29980L08758j76653m19957K037N25022
37837a191264P74355R45073Q70271Q0696r13560q28834L77097J085502L60639
$$ plain form
37828 1559975 954535 573027 1118946 1861778 1914435 1385822 756186 -2448 -1020559
37819 -1020559 -1870011 -1997326 -1502103 -990153 -864160 -1072585 -1322150 -1293485 -873004 -324593
37809 -324593 6531 176634 450265 643386 243726 -663325 -1215641 -859498 -102939 217573
37799 217573 17317 -129385 99483 372771 171286 -516783 -959506 -302252 1320175
37790 1320175 2588855 2482972 1690404 1682187 2507065 2666549 1421523 -31125 -337608
37781 -337608 155685 246162 -291350 -791359 -1013116 -1263899 -1578302 -1789953 -2150887 -2919732
37771 -2919732 -3545541 -3190148 -1902135 -417233 941192 2167884 2669901 1768545 184951
37762 184951 -298353 911343 2406541 2753749 2267837 2104326 2442756 2519574 1998142
$$ packed form
37828A559975o05440l81508N45919P42832N2657n28613o29636p58634j018111
37819a020559q49452j27315M95223N11950J25993k08425k49565K8665M20481N48411
37809c24593L31124J70103K73631J93121l99660r07051n52316L56143P56559L20512
37799B17573k00256j46702K28868K73288k01485o88069m42723O57254J622427
37790A320175J268680j05883p92568q217Q24878J59484j245026j452648l06483
37781c37608M93293R0477n37512n00009k21757k50783l14403k11651l60934p68845
37771b919732o25809L55393J288013J484902J358425J226692N02017r01356j583594
37762A84951m83304J209696J495198L47208m85912j63511L38430P6818n21432
$$ plain form
37753 1998142 1392913 1242768 1497316 1706085 1425617 542586 -471276 -756128 146640
37744 146640 1732616 2925506 2929695 1670010 -253080 -1819530 -2158583 -1276032 -105543
37735 -105543 428168 296957 164119 507526 1192754 1759245 1879704 1619462 1392760 1535571
37725 1535571 1825502 1665561 909455 218834 326283 1176549 2104858 2636205 2716025 2348625
37715 2348625 1567268 787517 615844 1026467 1154448 351083 -771794 -874411 497893
37706 497893 2311733 3290607 3359898 3407498 3857180 4142720 3708205 2909486 2506752 2636060
37696 2636060 2766174 2493743 1943702 1466248 1305521 1495272 1743657 1516741 607469
37687 607469 -444752 -861763 -482781 217862 781644 964256 501276 -610946 -1617581
$$ packed form
37753A998142o05229j50145K54548K08769k80468q83031j013862k84852R02768
37744A46640J585976J192890M189j259685j923090j566450l39053Q82551J170489
37735a05543N33711j31211j32838L43407O85228N66491J20459k60242k26702J42811
37725A535571K89931j59941p56106o90621J07449Q50266R28309N31347P9820l67400
37715B348625p81357p79751j71673M10623J27981q03365j122877j02617J372304
37706D97893J813840R78874O9291M7600M49682K85540m34515p98719m02734J29308
37696B636060J30114k72431n50041m77454j60727J89751K48385k26916r09272
37687F07469j052221m17011L78982P00643N63782J82612m62980j112222j006635
$$ plain form
37678 -1617581 -1573739 -594722 206101 290052 361041 950392 1200859 38627 -1895076 -2632814
37668 -2632814 -1304907 723013 1522452 817874 19294 347043 1513352 2361371 2357516
37659 2357516 1989912 1766824 1436734 625669 -184333 -98901 785733 1235708 434049 -1004362
37649 -1004362 -2007194 -2380733 -2526198 -2360527 -1427553 77883 1261099 1627448 1591504
37640 1591504 1710457 1931531 1838647 1275486 501631 -44277 -42773 428553 902949 1040486
37630 1040486 1065432 1390472 1941115 2302600 2442193 2682141 2897348 2430846 1125747
37621 1125747 -125517 -316854 560526 1741023 2638941 3086816 2929425 2027597 664175
37612 664175 -535388 -1180746 -1336757 -1213061 -972682 -814291 -855514 -891512 -634476 -249926
$$ packed form
37678a617581M3842R79017Q00823Q3951P0989N89351K50467j162232j933703p37738
37668b632814J327907K027920P99439p04578p98580L27749J166309Q48019l855
37659B357516l67604k23088l30090q11065q10002Q5432Q84634M49975q01659j438411
37649a004362j002832l73539j45465J65671R32974J505436J183216L66349l5944
37640A591504J18953K21074r2884n63161p73855n45908J504M71326M74396J37537
37630A040486K4946L25040N50643L61485J39593K39948K15207m66502j305099
37621A125747j251264j91337Q77380J180497Q97918M47875j57391r01828j363422
37612F64175j199563o45358j56011J23696K40379J58391m1223l5998K57036L84550
$$ plain form
37602 -249926 -244957 -684442 -959496 -627809 -110501 -134900 -736614 -1312274 -1544475 -1703988
37592 -1703988 -1956044 -1952839 -1466308 -1000686 -1225772 -1922494 -2030245 -880774 981181
37583 981181 2414603 2854568 2624817 2309232 2212060 2427832 3013207 3808240 4295829 4002697
37573 4002697 3065231 2129233 1605927 1288262 869041 556116 808969 1588245 2308182
37564 2308182 2588709 2635569 2707510 2630895 2188486 1670666 1554860 1740304 1560041 615976
37554 615976 -716595 -1695013 -1905976 -1552968 -1252751 -1488982 -2035673 -2057960 -1142385 -79181
37544 -79181 -57869 -1066462 -1765879 -1235311 -206419 -30901 -873934 -1621075 -1400102 -521508
37534 -521508 130590 69426 -591659 -1415830 -1829522 -1373405 -135975 1191290 1958748
$$ packed form
37602b49926M969m39485k75054L31687N17308k4399o01714n75660k32201j59513
37592a703988k52056L205M86531M65622k25086o96722j07751J149471J861955
37583I81181J433422M39965k29751l15585r7172K15772N85375P95033M87589k93132
37573D002697r37466r35998n23306l17665m19221l12925K52853P79276P19937
37564B308182K80527M6860P1941p6615m42409n17820j15806J85444j80263r44065
37554F15976j332571r78418k10963L53008L00217k36231n46691k2287R15575J063204
37544g9181K1312j008593o99417N30568J028892J75518q43033p47141K20973Q78594
37534e21508O52098o1164o61085q24171m13692M56117J237430J327265P67458
$$ plain form
37525 1958748 2162748 2169067 1984603 1260949 137883 -404615 464530 2242013 3453583
37516 3453583 3304339 2451161 1875566 1534952 698755 -723537 -1949178 -2401415 -2334352
37507 -2334352 -2203335 -1990800 -1465639 -698848 1192 411927 472373 313915 311837 717201
37497 717201 1126538 827201 -108548 -653680 -154664 686120 686133 -358977 -1660844 -2545285
37487 -2545285 -2928984 -2909900 -2591725 -2326266 -2543202 -3187739 -3674461 -3478195 -2571335 -1373673
37477 -1373673 -492202 -310766 -548991 -454674 279390 1122147 1575688 1967890 2798767 3736568
37467 3736568 4035670 3648028 3076394 2372679 1271795 207794 57148 700654 936234
37458 936234 193694 -663849 -738531 -352311 -264210 -479178 -639784 -947011 -1783151 -2795754
$$ packed form
37525A958748K04000O319j84464p23654j123066n42498Q69145J777483J211570
37516C453583j49244q53178n75595l40614q36197j422292j225641m52237O7063
37507b334352J31017K12535N25161P66791P00040M10735O0446j58458k078M05364
37497G17201M09337k99337r35749n45132M99016Q40784J3j045110j301867q84441
37487b545285l83699J9084L18175K65459k16936o44537m86722J96266R06860J197662
37477a373673Q81471J81436k38225R4317P34064Q42757M53541L92202Q30877R37801
37467C736568K99102l87642n71634p03715j100884j064001j50646O43506K35580
37458I36234p42540q57543p4682L86220Q8101k14968j60606l07227q36140j012603
$$ plain form
37448 -2795754 -3179209 -2685728 -1762508 -934788 -586279 -988616 -1886708 -2353377 -1772681
37439 -1772681 -749074 -313402 -434388 -183952 667810 1197526 751058 -5415 7122
37430 7122 837431 1549191 1485987 1007863 966875 1721138 2736523 3101192 2434938 1251439
37420 1251439 339975 -109986 -559528 -1349382 -2168666 -2385481 -1702639 -373850 1054919
37411 1054919 2039033 2160255 1242559 -419462 -1970470 -2462637 -1731472 -686543 -353186
37402 -353186 -647738 -544800 495979 1845487 2672676 2962842 3095454 2979198 2335361
37393 2335361 1500591 1141873 1299042 1462970 1537216 1903211 2466080 2530345 1945594 1566372
37383 1566372 2043656 2799775 2864553 2286701 1979918 2375756 2942319 3049154 2703396 2263165
$$ packed form
37448b795754l83455M93481R23220Q27720L48509m02337q98092m66669N80696
37439a772681J023607M35672j20986K50436Q51762N29716m46468p56473J2537
37430G122Q30309P11760o3204m78124m0988P54263J015385L64669o66254j183499
37420A251439r11464m49961m49542p89854q19284k16815O82842J328789J428769
37411A054919R84114J21222r17696j662021j551008m92167P31165J044929L33357
37402c53186k94552J02938J040779J349508Q27189K90166J32612j16256o43837
37393B335361q34770l58718J57169J63928P4246L65995N62869O4265n84751l79222
37383A566372M77284P56119O4778n77852l06783L95838N66563J06835l45758m40231
$$ plain form
37373 2263165 1879158 1478691 1019688 500531 -123075 -799320 -1249628 -1219793 -865885 -646665
37363 -646665 -718610 -673394 -139434 530209 606323 10374 -552297 -687661 -930077 -1764869
37353 -1764869 -2567078 -2319465 -1137167 -171407 10032 28785 457714 862459 562410
37344 562410 -324352 -1135181 -1458793 -1236637 -620758 -201142 -740175 -2039926 -2677049
37335 -2677049 -1675860 41056 770041 188891 -595594 -831834 -774850 -670134 -365848
37326 -365848 -97793 -418726 -993953 -671451 721465 1809997 1584954 761258 361672
37317 361672 63873 -855006 -1871500 -1997984 -1612285 -1912517 -2831320 -3136967 -2622666
37308 -2622666 -2507880 -3266274 -3636410 -2555417 -788994 264901 322917 -191185 -1283230
$$ packed form
37373B263165l84007m00467m59003n19157o23606o76245m50308K9835L53908K19220
37363f46665p1945M5216N33960O69643P6114n95949n62671j35364k42416q34792
37353a764869q02209K47613J182298R65760J81439J8753M28929M04745l00049
37344E62410q86762q10829l23612K22156O15879M19616n39033j299751o37123
37335b677049J001189J716916P28985n81150p84485k36240N6984J04716L04286
37326c65848K68055l20933n75227L22502J392916J088532k25043q23696l99586
37317C61672k97799r18879j016494j26484L85699l00232r18803l05647N14301
37308b622666J14786p58394l70136J080993J766423J053895N8016n14102j092045
$$ plain form
37299 -1283230 -2884076 -3922551 -3291206 -1478224 -45668 397039 590151 1052217 1322730
37290 1322730 1045207 722987 840491 1021994 715983 194190 214214 962917 1891140 2468466
37280 2468466 2640036 2572820 2373128 2184776 2272625 2721208 3083083 2618198 1119042 -619691
37270 -619691 -1478153 -1166568 -358147 348284 1051758 1894050 2405021 2085043 1255972 711018
37260 711018 772468 1249406 1976432 2682117 2668839 1569393 271191 50919 764036 995623
37250 995623 219522 -382568 212488 1277651 1444082 594610 -288510 -627695 -658054 -628515
37240 -628515 -458443 -122943 235908 525954 627663 331957 -229573 -437736 3565 451350
37230 451350 139198 -679607 -1096693 -849798 -507393 -430404 -325129 54730 442926 570643
$$ packed form
37299a283230j600846j038475O31345J812982J432556M42707J93112M62066K70513
37290A322730k77523l22220J17504J81503l06011n21793K0024P48703R28223N77326
37280B468466J71570o7216j99692j88352Q7849M48583L61875m64885j499156j738733
37270f19691q58462L11585Q08421P06431P03474Q42292N10971l19978q29071n44954
37260G11018O1450M76938P27026P05685j3278j099446j298202k20272P13117K31587
37250I95623p76101o02090N95056J065163J66431q49472q83120l39185l0359K9539
37240f28515J70072L35500L58851K90046J01709k95706n61530k08163M41301M47785
37230D51350l12152q18805m17086K46895L42405P6989J05275L79859L88196J27717
$$ plain form
37220 570643 655502 1038159 1550879 1517372 446493 -1216880 -2129933 -1243395 892886
37211 892886 2477985 2403618 1359829 655358 608711 750666 939957 1260908 1217014 210902
37201 210902 -1209110 -1666229 -709833 602517 1054204 456245 -579038 -1222278 -724085
37192 -724085 896453 2240636 1621200 -827501 -3060317 -3609260 -3194561 -3204644 -3544367
37183 -3544367 -3027508 -1317684 632007 1881942 2319161 2166964 1465136 283209 -969979
37174 -969979 -1692501 -1509700 -661323 -19594 -396921 -1623305 -2612807 -2572775 -1833895 -1265697
37164 -1265697 -1254013 -1543031 -1706715 -1448727 -789496 -252159 -439138 -1083250 -1025475 357262
37154 357262 2145556 2919080 2493652 1953039 2107645 2584568 2510096 1625193 572057
$$ packed form
37220E70643Q4859L82657N12720l3507j070879j663373r13053Q86538K136281
37211H92886J585099p4367j043789p04471m6647J41955J89291L20951m3894j006112
37201B10902j420012m57119R56396J312350M51687n97959j035283o43240M98193
37192g24085J620538J344183o19436k448701k232816n48943M14699j0083l39723
37183c544367N16859J709824J949691J249935M37219j52197p01828j181927j253188
37174i69979p22522J82801Q48377O41729l77327j226384r89502M0032P38880N68198
37164a265697J1684k89018j63684K57988O59231N37337j86979o44112N7775J382737
37154C57262J788294P73524m25428n40613J54606M76923p4472q84903j053136
$$ plain form
37145 572057 247676 856145 1557686 1293317 22348 -1229949 -1615572 -1184183 -237909
37136 -237909 1170008 2609503 3043699 2092536 884310 676899 1118382 919121 -135969
37127 -135969 -1025247 -1161155 -1011368 -1001643 -932744 -680634 -431994 40198 1330074 3272761
37117 3272761 4797623 5302360 5259204 5005595 3934328 1634572 -956429 -2442769 -2551672
37108 -2551672 -2084387 -1706649 -1547775 -1690305 -2246719 -2989179 -3482142 -3567385 -3319043 -2670470
37098 -2670470 -1550751 -292932 549695 788435 678640 488678 321237 307898 630429
37089 630429 1261043 1844012 1908318 1250290 235830 -374944 -222526 99477 -234010 -1027342
37079 -1027342 -1249644 -671626 -448827 -1494229 -3021015 -3536519 -2740100 -1497210 -364724
$$ packed form
37145E72057l24381O08469P01541k64369j270969j252297l85623M31389R46274
37136b37909J407917J439495M34196r51163j208226k07411M41483j99261j055090
37127a35969q89278j35908J49787R725O8899K52110K48640M72192J289876J942687
37117C272761J524862N04737m3156k53609j071267k299756k591001j486340j08903
37108b551672M67285L77738J58874j42530n56414p42460m92963q5243K48342O48573
37098b670470J119719J257819Q42627K38740j09795j89962j67441j3339L22531
37089F30429O30614N82969O4306o58028j014460o10774J52418L22003l33487p93332
37079a027342k22302N78018K22799j045402j526786n15504P96419J242890J132486
$$ plain form
37070 -364724 708228 1382274 937732 -414430 -1326749 -984866 -183759 -142026 -903683
37061 -903683 -1585449 -1687184 -1400514 -950770 -429833 -168834 -514790 -1142244 -1243282 -651702
37051 -651702 -245844 -843028 -2044507 -2645884 -2050199 -821879 159483 630980 843161
37042 843161 946623 922820 939256 1234176 1566033 1258724 78400 -1248993 -1732172 -1167353
37032 -1167353 -248267 211193 -50377 -605946 -595864 591040 2477151 3590154 2932338
37023 2932338 1194220 -85180 -418876 -658928 -1370733 -1879725 -1373078 -177652 702879
37014 702879 807414 343649 -463512 -1432560 -2112473 -2135434 -1775558 -1560225 -1474504 -1195705
37004 -1195705 -971824 -1449450 -2522641 -3115799 -2427244 -860296 542785 1130104 906998
$$ packed form
37070c64724J072952O74046m44542j352162r12319L41883Q01107M1733p61657
37061i03683o81766j01735K86670M49744N20937K60999l45956o27454j01038N91580
37051f51702M05858n97184j201479o01377N95685J228320R81362M71497K12181
37042H43161J03462k3803J6436K94920L31857l07309j180324j327393m83179N64819
37032a167353R19086M59460k61570n55569J0082J186904J886111J113003o57816
37023B932338j738118j279400l33696k40052p11805n08992N06647J195426Q80531
37014G02879J04535m63765q07161r69048o79913k2961L59876K15333Q5721K78799
37004a195705K23881m77626j073191n93158O88555J566948J403081N87319k23106
$$ plain form
36995 906998 302856 -31164 355154 1166434 1587188 1258214 606083 32801 -613123 -1396636
36985 -1396636 -1755406 -1193037 -95567 722891 964507 830114 459871 14938 -43053
36976 -43053 500627 988271 532048 -821294 -2186441 -2929600 -3022425 -2570908 -1819248 -1436206
36966 -1436206 -1826794 -2202294 -1386134 354230 1404747 1018391 273483 318798 825778
36957 825778 997704 1103312 1896102 3136898 3810443 3502380 2644449 1646891 629357
36948 629357 -206721 -748599 -1333887 -2171689 -2599551 -1757844 85635 1702631 2370950
36939 2370950 2394535 2179845 1659831 804919 -67073 -773865 -1465197 -2109053 -2331308 -1990615
36929 -1990615 -1418555 -884047 -271611 532593 1365299 2052315 2552878 2725163 2338230
$$ packed form
36995I06998o04142l34020L86318Q11280M20754l28974o52131n73282o45924p83513
36985a396636l58770N62369J097470Q18458K41616j34393l70243m44933n7991
36976d3053N43680M87644m56223j353342j365147p43159r2825M51517P51660L83042
36966a436206l90588l75500Q16160J740364J050517l86356p44908M5315N06980
36957H25778J71926J05608P92790J240796O73545l08063q57931r97558j017534
36948F29357q36078n41878n85288q37802m27862Q41707J843479J616996O68319
36939B370950K3585k14690n20014q54912q71992p06792o91332o43856k22255L40693
36929a990615N72060N34508O12436Q04204Q32706O87016N00563J72285l86933
$$ plain form
36920 2338230 1413029 227243 -974689 -1897954 -2018058 -1098641 198916 885001 780648
36911 780648 435257 60380 -579710 -1287917 -1509167 -1405005 -1743175 -2486984 -2719148 -2361320
36901 -2361320 -2582207 -3760888 -4446119 -3485735 -1984468 -1682245 -2285400 -2074974 -635523
36892 -635523 759945 1323459 1633539 2200837 2694107 2975380 3524311 4273731 4242318 3039295
36882 3039295 1717064 1335840 1530941 1360965 861930 764758 1115979 1216219 831824
36873 831824 589249 1004894 1707479 1846422 964567 -641542 -2211702 -3105267 -3207008
36864 -3207008 -2770376 -1941175 -733091 484279 975557 493877 -198959 -145337 665606
36855 665606 1425896 1618431 1466287 1323454 1195582 993954 764693 450968 -142341 -898831
$$ packed form
36920B338230r25201j185786j201932r23265j20104R19417J297557O86085j04353
36911G80648l45391l74877o40090p08207k21250J04162l38170p43809k32164L57828
36901b361320k20887j178681o85231R60384J501267L02223o03155K10426J439451
36892f35523J395468N63514L10080N67298M93270K81273N48931P49420l1413j203023
36882C039295j322231l81224J95101j69976m99035r7172L51221J00240l84395
36873H31824k42575M15645P02585J38943q81855j606109j570160q93565j01741
36864c207008M36632Q29201J208084J217370M91278m81680o92836N3622Q10943
36855F65606P60290J92535j52144j42833j27872k01628k29261l13725n93309p56490
$$ plain form
36845 -898831 -1335381 -1334941 -1508771 -2327123 -3231960 -3297639 -2626644 -2291285 -2775099 -3290110
36835 -3290110 -3044273 -2460572 -2456981 -3005480 -3239460 -2796957 -2230830 -2039266 -2009663 -1724067
36825 -1724067 -1157124 -544350 -78187 118105 102190 229413 670869 834643 -45387 -1634573
36815 -1634573 -2610082 -2350619 -1723056 -1743424 -2234949 -2406502 -2032821 -1342241 -391648 632283
36805 632283 1088938 771764 584085 1323053 2289147 2287748 1621640 1680793 2679742 3343200
36795 3343200 3064244 2833932 3413555 3938096 3244241 1548177 -189125 -1737590 -3351114
36786 -3351114 -4640203 -4876998 -4222915 -3635504 -3535063 -3374741 -2652513 -1699428 -1249542
36777 -1249542 -1634929 -2543550 -3279815 -3207731 -2215030 -841352 173128 472916 208624
$$ packed form
36845h98831m36550M40j73830q18352r04837o5679O70995L35359m83814n15011
36835c290110K45837N83701L591n48499k33980M42503N66127J91564K9603K85596
36825a724067N66943O12774M66163J96292j5915J27223M41456J63774q80030j589186
36815a634573r75509K59463O27563k0368m91525j71553L73681O90580R50593J023931
36805F32283M56655l17174j87679P38968R66094j399o66108N9153R98949O63458
36795C343200k78956k30312N79623N24541o93855j696064j737302j548465j613524
36786c351114j289089k36795O54083N87411J00441J60322P22228R53085M49886
36777a249542l85387r08621p36265P2084R92701J373678J014480K99788k64292
$$ plain form
36768 208624 -236753 -539117 -677028 -1025053 -1950761 -3159519 -3759430 -3252640 -2212434
36759 -2212434 -1679728 -2063993 -2881474 -3399984 -3319090 -2962207 -2928561 -3365695 -3580241 -2765693
36749 -2765693 -1165694 68165 375521 432604 869552 1107844 264935 -1323657 -2454668
36740 -2454668 -2679671 -2615905 -2689725 -2532746 -1835342 -981710 -446385 -132311 284496 720690
36730 720690 731080 -12321 -1415210 -2896071 -3613658 -3125208 -1885157 -747917 6156
36721 6156 678632 1211855 970949 -211509 -1420818 -1664681 -1094582 -610786 -504499 -216632
36711 -216632 520787 996756 342013 -1363145 -3247193 -4702367 -5736708 -6239869 -5555578
36702 -5555578 -3330904 -478116 1457815 1988585 2093018 2686431 3360766 3200012 2299145
$$ packed form
36768B08624m45377l02364j37911l48025r25708j208758n99911N06790J040206
36759b212434N32706l84265q17481n18510Q0894L56883L3646m37134k14546Q14548
36749b765693J599999J233859L07356N7083M36948K38292q42909j588592j131011
36740b454668k25003O3766p3820J56979O97404Q53632N35325L14074M16807M36194
36730G20690J0390p43401j402889j480861p17587M88450J240051J137240P54073
36721F156O72476N33223k40906j182458j209309k43863N70099M83796J06287K87867
36711b16632P37419M75969o54743j705158j884048j455174j034341n03161O84291
36702e555578K224674K852788J935931N30770J04433N93413O74335j60754r00867
$$ plain form
36693 2299145 1653388 1757197 2124823 2193055 1964461 1651421 1339060 1145141 1107232 802913
36683 802913 -220936 -1473362 -1795232 -975267 -247364 -573945 -1201144 -763930 730476
36674 730476 1982781 2130603 1434479 437623 -529859 -1007445 -613669 148475 214921 -547992
36664 -547992 -1032551 -543727 91856 -203986 -1079085 -1289762 -542273 195329 141960 -433548
36654 -433548 -907985 -1063432 -885902 -293038 511917 902699 525676 -145497 -359892 -24500
36644 -24500 240089 -140816 -1141730 -2227490 -2769780 -2483420 -1661110 -906174 -527739
36635 -527739 -373151 -349333 -754267 -1763975 -2858867 -3220339 -2636543 -1657660 -902831
36626 -902831 -543640 -415597 -283284 -4429 258470 54069 -766238 -1561469 -1505480 -707378
$$ packed form
36693B299145o45757J03809L67626O8232k28594l13040l12361j93919l7909l04319
36683H02913j023849j252426l21870Q19965P27903l26581o27199M37214J494406
36674G30476J252305J47822o96124r96856r67482m77586L93776P62144O6446p62913
36664e47992m84559M88824O35583k95842q75099k10677P47489P37602n3369n75508
36654d33548m74437j55447J77530N92864Q04955L90782l77023o71173k14395L35392
36644b4500K64589l80905j000914j085760n42290K86360Q22310P54936L78435
36635e27739J54588K3818m04934j009708j094892l61472N83796R78883P54829
36626i02831L59191J28043J32313K78855K62899k04401q20307p95231N5989P98102
$$ plain form
36616 -707378 -179864 -508766 -1059624 -807052 445251 1985100 2974053 2971658 2021692 659442
36606 659442 -350442 -666218 -638892 -661442 -509723 239643 1331953 1938547 1663977 976176
36596 976176 543028 590570 1074918 1988998 3100232 3737592 3431244 2713434 2685162 3559456
36586 3559456 4146664 3276218 1417084 210562 434373 1185777 1321900 924024 749555
36577 749555 899880 950091 1035724 1718493 2764202 3119323 2408560 1532137 1312699 1384574
36567 1384574 1069881 658743 976497 2066109 3123621 3605873 3713623 3770610 3673473
36558 3673473 3103582 2023556 893601 412331 833403 1503094 1459063 593037 -272015
36549 -272015 -592893 -692479 -805208 -364818 1063151 2768852 3625464 3396682 2599041
$$ packed form
36616g07378N27514l28902n50858K52572J252303J539849R88953k395r49966j362250
36606F59442j009884l15776K7326k2550J51719P49366J092310O06594k74570o87801
36596I76176m33148M7542M84348R14080J111234O37360l06348p17810k8272Q74294
36586C559456N87208q70446j859134j206522K23811P51404J36123l97876j74469
36577G49555J50325N0211Q5633O82769J045709L55121p10763q76423k19438P1875
36567A384574l14693m11138L17754J089612J057512M82252J07750N6987r7137
36558C673473n69891j080026j129955m81270M21072O69691m4031q66026q65052
36549b72015l20878r9586j12729M40390J427969J705701Q56612k28782p97641
$$ plain form
36540 2599041 1545232 342771 -610013 -1056895 -1465295 -2247691 -2754664 -2070067 -513886
36531 -513886 751532 1360745 1781138 1932922 1222291 -6414 -575284 -343210 -497323
36522 -497323 -1485917 -2140538 -1602381 -719653 -530278 -609300 -160553 273743 -363551 -1758180
36512 -1758180 -2580169 -2369491 -1764564 -1077119 14212 1267313 1605074 461135 -1418268
36503 -1418268 -2895864 -3559243 -3628085 -3339128 -2852830 -2418110 -2198676 -2023889 -1582230
36494 -1582230 -897297 -467289 -768993 -1583026 -2038553 -1578643 -684749 -250846 -433490
36485 -433490 -699070 -850165 -1167761 -1491594 -1163336 -234680 245132 -279253 -961141 -807848
36475 -807848 -17321 714330 1380672 2160599 2432814 1489814 -161305 -1315161 -1591874
$$ packed form
36540B599041j053809j202461r52784m46882m08400p82396n06973O84597J556181
36531e13886J265418O09213M20393J51784p10631j228705n68870K32074j54113
36522d97323r88594o54621N38157Q82728J89375p9022M48747M34296o37294j394629
36512a758180q21989K10678O04927O87445J091331J253101L37761j143939j879403
36503a418268j477596o63379o8842K88957M86298M34720K19434J74787M41659
36494a582230O84933M30008l01704q14033m55527M59910Q93894M33903j82644
36485d33490k65580j51095l17596l23833L28258R28656M79812n24385o81888J53293
36475h07848P90527P31651O66342P79927K72215r43000j651119j153856k76713
$$ plain form
36466 -1591874 -1445082 -1041189 -310201 165886 -361065 -1462702 -1938638 -1621810 -1483846
36457 -1483846 -1754414 -1362028 168718 1519498 1203507 -400668 -1525216 -1065222 525625
36448 525625 2036460 2607517 2235469 1582844 1219980 1017928 558512 -11873 -159762
36439 -159762 49410 -30142 -453242 -425630 388949 1153491 1051043 502971 476398 1047907
36429 1047907 1375783 851323 -286575 -1307543 -1559540 -913826 22011 406131 162253
36420 162253 128294 913949 2043297 2627420 2468152 2010368 1539515 962878 214999 -537857
36410 -537857 -1003669 -891878 -206163 447666 290469 -669044 -1601717 -1998783 -2145229 -2098332
36400 -2098332 -1124402 1029570 3063494 3458373 2525257 2038282 2987880 4714266 6171726
$$ packed form
36466a591874J46792M03893P30988M76087n26951j101637m75936L16828J37964
36457a483846k70568L92386J530746J350780l15991j604175j124548M59994J590847
36448E25625J510835N71057l72048o52625l62864k02052m59416n70385j47889
36439a59762K09172p9552m23100K7612Q14579P64542j02448n48072k6573N71509
36429A047907L27876n24460j137898j020968k51997O45714R35837L84120k43878
36420A62253l3959P85655J129348N84123j59268m57784m70853n76637p47879p52856
36410e37857m65812J11791O85715O53829j57197r59513r32673l97066j46446M6897
36400b098332R73930K153972K033924L94879r33116m86975R49598J726386J457460
$$ plain form
36391 6171726 6943618 6870507 5761051 3920636 2200174 1090136 330204 -340956 -732843
36382 -732843 -811451 -1032166 -1580273 -1886929 -1459566 -712974 -405622 -642429 -996883 -1257271
36372 -1257271 -1428929 -1289572 -645748 112297 408485 389516 721904 1406881 1565537 728761
36362 728761 -330815 -594069 -154531 68410 -272110 -545866 -165735 592230 992999
36353 992999 643301 -306939 -1370878 -1899904 -1457979 -389537 282422 -71878 -953933
36344 -953933 -1491711 -1657343 -2111227 -2944073 -3347015 -2754181 -1643863 -763291 -50289
36335 -50289 1083329 2625334 3716595 3583583 2347804 829073 -197822 -476788 -231542
36326 -231542 158637 444847 551234 478294 333275 411744 960323 1731514 2033867 1478700
$$ packed form
36391F171726P71892p3111j109456j840415j720462j110038p59932o71160l91887
36382g32843p8608k20715n48107l06656M27363P46592L07352k36807l54454k60388
36372a257271j71658J39357O43824P58045K96188j8969L32388O84977J58656q36776
36362G28761j059576k63254M39538K22941l40520k73756L80131P57965M00769
36353I92999l49698r50240j063939n29026M41925J068442O71959l54300q82055
36344i53933n37778j65632m53884q32846m02942N92834J110318Q80572P13002
36335e0289J133618J542005J091261j33012j235779j518731j026895k78966K45246
36326b31542L90179K86210J06387p2940j45019P8469N48579P71191L02353n55167
$$ plain form
36316 1478700 540116 100125 461146 1038362 1086680 566182 144460 370424 1020606 1433945
36306 1433945 1405864 1390925 1676506 1771293 1037955 -342863 -1589346 -2338317 -2805594 -2980711
36296 -2980711 -2441910 -1180318 105646 891816 1405020 1962012 2348677 2295506 1959523
36287 1959523 1422251 357470 -1142287 -2072244 -1756866 -1072524 -1342536 -2319597 -2507571
36278 -2507571 -1475935 -535750 -729549 -1345928 -1182289 -392901 -112317 -725954 -1486464
36269 -1486464 -1706805 -1474407 -1069135 -399916 602973 1486021 1672076 1251930 939071
36260 939071 1137789 1419779 1201254 654344 448008 653010 535843 -317190 -1249033 -1395753
36250 -1395753 -902657 -663438 -1041285 -1478930 -1365086 -738538 -59154 258190 -5016
$$ packed form
36316A478700r38584m39991L61021N77216M8318n20498m21722K25964O50182M13339
36306A433945k8081j4939K85581R4787p33338j380818j246483p48971m67277j75117
36296b980711N38801J261592J285964P86170N13204N56992L86665n3171l35983
36287A959523n37272j064781j499757r29957L15378O84342k70012r77061j87974
36278b507571J031636R40185j93799o16379J63639P89388K80584o13637p60510
36269a486464k20341K32398M05272O69219J002889Q83048J86055m20146l12859
36260I39071J98718K81990k18525n46910k06336K05002j17167q53033r31843j46720
36250a395753M93096K39219l77847m37645J13844O26548O79384L17344k63206
$$ plain form
36241 -5016 -741510 -1382149 -1248160 -245758 981854 1687849 1664340 1279854 1056440 1157123
36231 1157123 1177088 656798 -49492 131052 1595399 3220879 3593865 2743316 1834072
36222 1834072 1412375 1022655 531395 576197 1282794 1643196 895685 -274977 -695112
36213 -695112 -268434 196063 282374 292854 504374 796258 940606 766704 149935 -753258
36203 -753258 -1408888 -1397332 -827363 -15884 888850 1653353 1829257 1394305 1052897 1236784
36193 1236784 1221055 56327 -1890517 -3248247 -3402317 -2995854 -2617987 -2034337 -1095903
36184 -1095903 -456003 -671623 -1211007 -1143967 -481335 -64412 -265556 -563250 -509691 -418281
36174 -418281 -699039 -983434 -490793 850249 2161200 2584072 2088422 1152400 79421
$$ packed form
36241e016p36494o40639J33989J002402J227612P05995k3509l84486k23414J00683
36231A157123J9965n20290p06290J80544J464347J625480L72986q50549r09244
36222A834072m21697l89720m91260M4802P06597L60402p47511j170662m20135
36213f95112M26678M64497Q6311J0480K11520K91884J44348j73902o16769r03193
36203g53258o55630J1556N69969Q11479R04734P64503J75904m34952l41408J83887
36193A236784j5729j164728j946844j357730j54070M06463L77867N83650R38434
36184a095903O39900k15620n39384O7040O62632M16923k01144k97694N3559R1410
36174d18281k80758k84395M92641J341042J310951M22872m95650r36022j072979
$$ plain form
36165 79421 -982271 -1662410 -1590509 -956566 -363248 -99347 -28358 -200242 -937083 -2083462
36155 -2083462 -2776904 -2384025 -1258331 -224615 255069 67206 -813068 -1992646 -2584769
36146 -2584769 -2216948 -1768752 -2287177 -3401963 -3743293 -2893473 -1951913 -1944610 -2549283 -2813884
36136 -2813884 -2437542 -1818787 -1339962 -1146252 -1322896 -1815777 -2315423 -2486471 -2158643
36127 -2158643 -1223219 266193 1748729 2452225 2362506 2363627 2954282 3379888 2740726 1532851
36117 1532851 1149440 1965213 2894319 3021038 2714448 2637403 2465981 1419296 -358577
36108 -358577 -1818767 -2315971 -2130779 -1625181 -656686 804633 2077074 2374254 1773814
$$ packed form
36165G9421j061692o80139P1901O33943N93318K63901P0989j71884p36841j146379
36155b083462o93442L92879J125694J033716M79684j87863q80274j179578n92123
36146b584769L67821M48196n18425j114786l41330Q49820R41560P303o04673k64601
36136b813884L76342O18755M78825J93710j76644m92881m99646j71048L27828
36127b158643R35424J489412J482536P03496q9719J121N90655M25606o39162j207875
36117A532851l83411Q15773R29106J26719l06590p7045j71422j046685j777873
36108c58577j460190m97204J85192N05598R68495J461319J272441K97180o00440
$$ [...]
##END NTUPLES=NMR SPECTRUM
##END=
