##TITLE=31Pdec_DE-213_EXT_2
D2O, 24 sc
 23.1.2026
##JCAMPDX= 6.0         $$ Bruker NMR JCAMP-DX V2.0
##DATA TYPE= NMR SPECTRUM
##DATA CLASS= NTUPLES
##ORIGIN= UXNMR, Bruker Analytische Messtechnik GmbH
##OWNER= root
$$ XWIN-NMR		Version 3.5
$$ Fri Jan 23 16:16:50 2026 Russian Standard Time (UT+4h)  she@DPX200
##.OBSERVE FREQUENCY= 81.013821
##.OBSERVE NUCLEUS= ^31P
##.ACQUISITION MODE= SIMULTANEOUS
##.ACQUISITION SCHEME= undefined
##.AVERAGES= 24
##.DIGITISER RES= 17
##SPECTROMETER/DATA SYSTEM= spect
##.PULSE SEQUENCE= zgpg30
##.SOLVENT NAME= DMSO
##.SHIFT REFERENCE= (INTERNAL, DMSO, 0, 198.062)
##AUDIT TRAIL= $$ (NUMBER, WHEN, WHO, WHERE, WHAT)
$$ ##TITLE= Audit trail, XWIN-NMR		Version 3.5
$$ ##JCAMPDX= 5.01
$$ ##ORIGIN= Bruker BioSpin GmbH
$$ ##OWNER= she
$$ F:/spectra/data/she/nmr/P31/2/pdata/1/auditp.txt
$$ ##AUDIT TRAIL=  $$ (NUMBER, WHEN, WHO, WHERE, WHAT)
(   1,<2026-01-23 16:15:05.14 +0400>,<she>,<DPX200>,
      <created by zg, POWCHK disabled, PULCHK disabled
       configuration hash MD5:
       00 E9 B6 7A A2 85 ED C7 34 08 36 98 17 FE 4E 26
       data hash MD5: 32K
       2B 25 2B 6C 69 A8 B1 16 B4 6A 13 17 50 B7 9F 99>)
(   2,<2026-01-23 16:15:24.28 +0400>,<she>,<DPX200>,
      <Start of raw data processing
       efp BC_mod = 2 LB = 1.5 FT_mod = 6 PKNL = 1 PHC0 = 1418.992 PHC1 = 49.90029 SI = 64K 
       data hash MD5: 64K
       7C E3 45 C0 63 DC C2 3D EA A2 B2 95 80 D3 ED 25>)
(   3,<2026-01-23 16:15:43.46 +0400>,<she>,<DPX200>,
      <pk PHC0 = -38.57334 PHC1 = 27.4 
       data hash MD5: 64K
       28 2E CA 27 1C DF 56 82 0D 9D D8 FB 0E BE 16 EA>)
(   4,<2026-01-23 16:15:46.95 +0400>,<she>,<DPX200>,
      <abs ABSG = 5 
       data hash MD5: 64K
       63 36 8F E4 D2 4E C1 7D E2 61 A0 C9 55 D0 D7 40>)
$$ ##END=
$$ 
$$ hash MD5
$$ 68 1B EE D4 17 7C AE 4A DB 1B ED 7F 8C 9E AD 7F
##$RELAX= 
##$RELAX= 
##$RELAX= 
##$RELAX= 
##$RELAX= 
##$RELAX= 
##$RELAX= 
##$RELAX= 
$$ Bruker specific parameters
$$ --------------------------
##$DU= <F:/spectra>
##$EXPNO= 2
##$NAME= <P31>
##$PROCNO= 1
##$TYPE= <nmr>
##$USER= <she>
##$AMP= (0..31)
100 100 100 100 100 100 100 100 100 100 100 100 100 100 100 100 100 100 
100 100 100 100 100 100 100 100 100 100 100 100 100 100 
##$AQSEQ= 0
##$AQ_mod= 1
##$AUNM= <au_zg>
##$AUTOPOS= <>
##$BF1= 81.014009
##$BF2= 200.13
##$BF3= 200.13
##$BF4= 200.13
##$BF5= 200.13
##$BF6= 200.13
##$BF7= 200.13
##$BF8= 200.13
##$BYTORDA= 1
##$CFDGTYP= 0
##$CFRGTYP= 5
##$CHEMSTR= <none>
##$CNST= (0..31)
1 1 145 1 1 1 1 1 1 1 1 1 1 1 1 1 1 1 1 1 1 1 1 1 1 1 1 1 1 1 1 1 
##$CPDPRG= <waltz16>
##$CPDPRG1= <>
##$CPDPRG2= <waltz16>
##$CPDPRG3= <>
##$CPDPRG4= <mlev>
##$CPDPRG5= <mlev>
##$CPDPRG6= <mlev>
##$CPDPRG7= <mlev>
##$CPDPRG8= <mlev>
##$CPDPRGB= <>
##$CPDPRGT= <>
##$D= (0..31)
0 1 0 0 0 0 0 0 0 0.06 0 0.03 2e-05 3e-06 0 0 0.0002 0 0 0 0 0 0 0 0 0 
0 0 0 0 0 0 
##$DATE= 1769170504
##$DBL= (0..7)
120 120 120 11 120 120 24 19 
##$DBP= (0..7)
150 150 150 150 150 150 150 150 
##$DBP07= 0
##$DBPNAM0= <>
##$DBPNAM1= <>
$$ [...]
##$SUBNAM3= <"">
##$SUBNAM4= <"">
##$SUBNAM5= <"">
##$SUBNAM6= <"">
##$SUBNAM7= <"">
##$SUBNAM8= <"">
##$SUBNAM9= <"">
##$SW= 400.765351723535
##$SWIBOX= (0..15)
0 1 3 0 0 0 0 0 0 0 0 0 0 0 0 0 
##$SW_h= 32467.5324675325
##$TD= 32768
##$TD0= 1
##$TE= 0
##$TE2= 300
##$TE3= 300
##$TEG= 300
##$TL= (0..7)
0 120 53 12 22 120 120 120 
##$TP= (0..7)
150 150 150 150 150 150 150 150 
##$TP07= 0
##$TPNAME0= <>
##$TPNAME1= <>
##$TPNAME2= <>
##$TPNAME3= <>
##$TPNAME4= <>
##$TPNAME5= <>
##$TPNAME6= <>
##$TPNAME7= <>
##$TPOAL= (0..7)
0.5 0.5 0.5 0.5 0.5 0.5 0.5 0.5 
##$TPOFFS= (0..7)
0 0 0 0 0 0 0 0 
##$TUNHIN= 0
##$TUNHOUT= 0
##$TUNXOUT= 0
##$USERA1= <user>
##$USERA2= <user>
##$USERA3= <user>
##$USERA4= <user>
##$USERA5= <user>
##$V9= 5
##$VALIST= <valist>
##$VCLIST= <CCCCCCCCCCCCCCC>
##$VD= 0
##$VDLIST= <DDDDDDDDDDDDDDD>
##$VPLIST= <PPPPPPPPPPPPPPP>
##$VTLIST= <TTTTTTTTTTTTTTT>
##$WBST= 1024
##$WBSW= 4
##$XGAIN= (0..3)
0 0 0 0 
##$XL= 0
##$YL= 0
##$YMAX_a= 11671
##$YMIN_a= -11392
##$ZGOPTNS= <>
##$ZL1= 120
##$ZL2= 120
##$ZL3= 120
##$ZL4= 120
##$ABSF1= 198.0616
##$ABSF2= -202.7028
##$ABSG= 5
##$ABSL= 3
##$ALPHA= 0
##$AQORDER= 0
##$ASSFAC= 0
##$ASSFACI= 0
##$ASSFACX= 0
##$ASSWID= 0
##$AUNMP= <proc_1d>
##$AZFE= 0.1
##$AZFW= 0.5
##$BCFW= 0
##$BC_mod= 2
##$BYTORDP= 0
##$COROFFS= 0
##$CY= -3
##$DATMOD= 1
##$DC= 0
##$DFILT= <>
##$DTYPP= 0
##$F1P= 0
##$F2P= 0
##$FCOR= 1
##$FTSIZE= 65536
##$FT_mod= 6
##$GAMMA= 0
##$GB= 0
##$INTBC= 1
##$INTSCL= 9.790993e-09
##$ISEN= 30
##$LB= 1.5
##$LEV0= 0
##$LPBIN= 0
##$MAXI= 10000
##$MC2= 0
##$MEAN= 0
##$ME_mod= 0
##$MI= 50
##$NCOEF= 0
##$NC_proc= -4
##$NLEV= 6
##$NOISF1= 182.463
##$NOISF2= 159.3651
##$NSP= 0
##$NTH_PI= 0
##$NZP= 0
##$OFFSET= 198.0616
##$PC= 4
##$PHC0= 1380.419
##$PHC1= 77.30029
##$PH_mod= 1
##$PKNL= yes
##$PPARMOD= 0
##$PSCAL= 0
##$PSIGN= 0
##$REVERSE= no
##$SF= 81.0140089999434
##$SI= 65536
##$SIGF1= 159.3651
##$SIGF2= -187.1042
##$SINO= 113.3802
##$SIOLD= 16384
##$SREGLST= <1H.CDCl3>
##$SSB= 0
##$STSI= 65536
##$STSR= 0
##$SW_p= 32467.5324675325
##$SYMM= 0
##$S_DEV= 0
##$TDeff= 32768
##$TDoff= 0
##$TI= <>
##$TILT= no
##$TM1= 0
##$TM2= 0
##$TOPLEV= 0
##$USERP1= <user>
##$USERP2= <user>
##$USERP3= <user>
##$USERP4= <user>
##$USERP5= <user>
##$WDW= 1
##$XDIM= 65536
##$YMAX_p= 310883107
##$YMIN_p= -9523885
$$ End of Bruker specific parameters
$$ ---------------------------------
##NTUPLES= NMR SPECTRUM
##VAR_NAME=  FREQUENCY,     SPECTRUM/REAL,   SPECTRUM/IMAG
##SYMBOL=    X,             R,               I
##VAR_TYPE=  INDEPENDENT,   DEPENDENT,       DEPENDENT
##VAR_FORM=  AFFN,          ASDF,            ASDF
##VAR_DIM=   65536,         65536,           65536
##UNITS=     HZ,            ARBITRARY UNITS, ARBITRARY UNITS
##FACTOR=    0.49542278885378, 1,            1
##FIRST=     16045.7642231865, 0,            0
##LAST=      -16421.768244346, 0,            0
##MIN=       -16421.768244346, -9523885,     0
##MAX=       16045.7642231865, 310883107,    0
$$ Real data points
##PAGE= N=1
##DATA TABLE= (X++(R..R)), XYDATA
$$ [...]
42164b01283P5433O736r0356p4284L2627P1859K4245L2416J17971J14563l4675
42153G5252j37742m5495J02198Q8465n7588j32262o9746L28j4817m1243K6527
42142b06123J63811K42056J76520J3730j22295j57389j24376q9991o8762m6674
42132b19493l5840l2302K9084J72581K75471K00509J8135n9463K1870R0995K4990
42121D86537q0783r1679k5435L3497P2178R3117M5807o9204j39186r5940k5645
42110B03264j3826o367M7750N4626n5285j43795n7968R0529P4148p9157j17567
42099c648L4483J60561R0676o7562j28084p3225P065P1782J04951N4034q0936
42088A70097j78032j31219l665N9847L3785K2778Q4665J38292P8180p2660j74094
$$ y = [-201283, -125850, -119114, -209470, -283754, -251127, -179268, -155023, -122607, -4636, 109927, 75252, -62490, -107985, -5787, 82678, 25090, -107172, -176918, -176590, -191407, -232650, -206123, -42312, 199744, 376264, 389994, 267699, 110310, -14066, -104057, -172819, -219493, -255333, -287635, -258551, -85970, 189501, 390010, 408145, 348682, 370552, 461547, 486537, 405754, 314075, 288640, 322137, 394315, 487432, 533239, 464035, 324849, 228909, 203264, 189438, 183071, 230821, 285447, 230162, 86367, 28399, 118928, 193076, 113919, -3648, 30835, 191396, 282072, 214510, 86426, 13201, 20266, 92048, 196999, 251033, 170097, -7935, -139154, -142819, -82972, -49187, -26409, 58256, 196548, 274728, 202068, 27974]
42077B7974j32193j2455M8546K3787J2127O2241Q8166K8359k2706L2415R7539
42066B53800J1013j75049k40852j27422j4536k1486l3359P2274K05928K20566
42056A50877J49404J20797J27258N7879q2468j57600j05287j6174J5102o52k3182
42045B35954o5082j35468j70362r8909L7485R7664l00j61572k03652p2057Q6785
42034d49514J11863L1340o570L4135M6925j2452m8387j0610M0p9563j21186J617
42022e02362J71981J73716J7689q4754n8276m7871j26086j44213P347J77135J61531
42011b54163J4177m0456N9905J53786J16005J0363m8720m6883k3979J4530O7437
42000B2002R2487O0947R243j8500l4465o3054p8470m4170K1143P2777J02014J12374
$$ y = [27974, -104219, -116674, -68128, -44341, -32214, 30027, 118193, 146552, 123846, 156261, 253800, 264813, 89764, -151088, -278510, -293046, -314532, -347891, -275617, -69689, 150877, 300281, 421078, 548336, 606215, 523747, 366147, 260860, 244686, 259788, 259136, 235954, 170872, 35404, -134958, -233867, -196382, -98718, -99018, -260590, -464242, -536299, -449514, -337651, -306311, -312881, -278746, -231821, -244273, -292660, -303270, -303230, -382793, -503979, -502362, -330381, -156665, -138976, -223730, -282006, -329877, -455963, -600176, -592829, -415694, -254163, -239986, -280442, -220537, -66751, 49254, 59617, 10897, -35986, -59965, -45435, 22002, 114489, 175436, 184679, 166179, 131714, 68660, -9810, -53980, -32837, 39940, 141954, 254328]
41988B54328P1088m4546j76594k35905k07003j35094l4679R6916J91407J53981
41978f6101J7636o1363j0318O0197K7392o7502r9303m1088L0273O2256O7342O4450
41966a6129N8464N6582M6029q025q5879r3011N946R5873N6467n5188r0763m0806
41954g0440l3505j10273j53301p0172P5887J66415J54447N1713j06044k32355
41944c27628k26788r8332K4650N3042K7008J2042L849p893J8856R4631J38460
41933b88103Q7921N922m528N9433J19192J24658P7910n11o0407l4080O2501R6332
41921B46240k3234j94497k32996j08984K2606K8147n4813r0588o839J39006K22741
41910e3211J73569M2562o1021r8090j16503j36345j04252m477P5226O5127K4257
$$ y = [254328, 325416, 280870, 104276, -131629, -338632, -473726, -508405, -411489, -220082, -66101, -48465, -109828, -120146, -59949, -32557, -100059, -199362, -240450, -210177, -147921, -80579, -16129, 42335, 98917, 144946, 136921, 51042, -41969, -36023, 59850, 116317, 61129, -29634, -70440, -103945, -214218, -367519, -437691, -361804, -195389, -40942, 10771, -95273, -327628, -554416, -652748, -628098, -575056, -548048, -536006, -532157, -540050, -521194, -426563, -288103, -200182, -194260, -198788, -139355, -20163, 104495, 182405, 181894, 121487, 87407, 149908, 246240, 223006, 28509, -204487, -313471, -290865, -262718, -317531, -408119, -414958, -275952, -53211, 120358, 162920, 101899, 3809, -112694, -249039, -353291, -357768, -282542, -217415, -193158]
41899a93158L5892N9835N865q9927r6336J0927J02985P8361j1420n6763l4403
41888a88142p386k3100n3514l1042O3916J57393J54567O2774j5541l2276n2426
41877C5223j15111j37817n3312M8098M0280m0617o0862l660L5463L7342P4417
41866a40556J40273J35407M6965j8751j8703k9652p9247q6338l1869j9435p8813
41855a80719p8734M7228J48305Q0966m9917n0993O0100J05346L1713m5024n0455
41844A7816k4860L285M5182M9528n5291j92779j83423q358J35129J15641M7804
41833e0326Q2142J55610J06594m9539j33820o8345K8478L1242l4876p2676n1999
41822e7515n896M7612J07494J43198J11029J7440p4590j10458r3654o5811n1087
$$ y = [-193158, -157266, -97431, -91566, -181493, -277829, -266902, -163917, -85556, -96976, -153739, -188142, -195528, -218628, -272142, -303184, -239268, -81875, 72692, 135466, 119925, 87649, 35223, -79888, -217705, -271017, -222919, -182639, -223256, -284118, -287778, -252315, -214973, -140556, -283, 135124, 182089, 163338, 144635, 114983, 35736, -50602, -82471, -101906, -180719, -259453, -212225, -63920, 17046, -32871, -83864, -23764, 81582, 113295, 68271, 17816, -7044, -3759, 41423, 90951, 35660, -157119, -340542, -348900, -213771, -98130, -50326, 31816, 187426, 294020, 244481, 110661, 42316, 70794, 102036, 67160, -5516, -57515, -63411, -15799, 91695, 234893, 345922, 363362, 288772, 178314, 84660, 18849, -32238]
41811c2238k8570L6121J27865J67810R6991k7653p5324o357O3473K2143o7800
41800B76461n6015N9583J11863J2206j08943r5516L290K2859n8222j00759l5149
41789C1658M2240L8135m378p429J5541K0380L1783Q1242J08760M0011p2485j02234
41777B23224l6679J790n6265j25459j03255k1671J6741j977o66M9816P9973L1943
41765E7515m8404p4762l5486P230J6331K2292N7143R2731P6325M967o8506r6961
41753A0415q1173n1494k9111j2277R281L2149L3749k126n5408q5508q3004p7951
41741c92458q1658n6965J7636Q5492P0239j0289m6388L0534J56920K02732J10182
41730H5977m5277j23680n3996Q9181J55308P8058o0136j42285j47334j20222o8696
$$ y = [-32238, -60808, -24687, 103178, 270988, 367979, 340326, 265002, 258645, 322118, 344261, 276461, 220446, 280029, 391892, 404098, 295155, 199639, 202929, 225788, 167566, 66807, 31658, 73898, 112033, 107655, 100226, 115767, 136147, 167930, 249172, 357932, 397943, 325458, 223224, 186545, 188335, 132070, 6611, -96644, -118315, -101574, -103551, -104217, -54401, 25572, 57515, 9111, -65651, -101137, -93907, -77576, -55284, 1859, 94590, 170915, 175882, 107376, 10415, -70758, -122252, -151363, -163640, -154359, -122210, -88461, -90587, -145995, -231503, -314507, -392458, -474116, -531081, -513445, -427953, -357714, -368003, -414391, -383857, -226937, -24205, 85977, 40700, -82980, -136976, -47795, 107513, 185571, 125435, -16850, -164184, -284406, -353102]
41719c53102K1111R7449Q0148j3210p9725p8400n7843k5950O9987J85775J56986
41708C226o0470k54881k07965R972J50689J26891O2591M0301J791p3543q7037
41697b88435R78O8912J7109p0534o6527J221K4715J1250M9192J20756J11740R167
41685a0456o2770l4907J7850L1182N7958J32753J52673K5852j38778j42898K4932
41674E3391J67254J40761J1946p9882r2145n5914P206O4633N3328k9428p8989
41663A62161j8277P2773O0968m5843j13963p3540J1593N9094N2459L412p3377
41652I7460j29834j15141n6110k7248l0906N4O7923R0581M7977K6031N6634L8842
41640F6263q8799k08688j77350l4610P1908J06629J42134J75011J14648l2340
$$ y = [-353102, -331991, -234542, -154394, -167604, -247329, -325729, -383572, -409522, -339535, -153760, 3226, -57244, -312125, -520090, -510118, -359429, -232538, -169947, -129646, -127855, -201398, -288435, -287457, -218545, -201436, -271970, -338497, -337276, -312561, -301311, -252119, -131363, -19623, -10456, -73226, -108133, -90283, -59101, -1143, 131610, 284283, 310135, 171357, 28459, 53391, 220645, 361406, 373352, 293470, 201325, 145411, 152617, 217250, 270578, 241150, 162161, 143884, 216657, 277625, 231782, 117819, 44279, 55872, 114966, 167425, 170837, 97460, -32374, -147515, -203625, -230873, -261779, -261725, -193802, -103221, -55244, -29213, 27421, 66263, -22536, -231224, -408574, -443184, -371276, -264647, -122513, 52498, 167146, 134806]
41630A34806j25549r4003m4842q6564j47602q3870Q8663J93187J28466M881n422
41619c7849J05658J80720J10375k8834q8261m1799O836j1553m9941m1815O136
41608A09673N6432R9613J18404O5890n0837j28730r3498j3276M540k0135P904
41597A55980P3501N9452m9477j14861n3876K1077l4736j76057k17897p7874J27551
41586b87217K31332J85271O1085n5617j23062j23466n1419N3874J08221O4762
41576F3764j7940m1739M276M4849M3159L6781L1000l2497j41687j65338m0563
41565b15935R3258Q3844J398J1627P9298K1804j47294j79274K5664K24022J67775
41554A66187l9118j11153J0948J30671J16237M3885J7055K1671J0974J76R131
$$ y = [134806, 9257, -84746, -129588, -216152, -363754, -447624, -358961, -165774, -37308, -32427, -37849, 67809, 248529, 358904, 330070, 241809, 200010, 206846, 195293, 145352, 103537, 109673, 166105, 265718, 384122, 450012, 399175, 270445, 176947, 163671, 168211, 148076, 155980, 229481, 288933, 239456, 124595, 70719, 91796, 57060, -118997, -336894, -414768, -287217, -55885, 129386, 190471, 134854, 11792, -111674, -163093, -109219, -998, 63764, 45824, 4085, 8361, 53210, 96369, 133150, 164150, 131653, -10034, -175372, -215935, -122677, -38833, -37435, -25808, 53490, 75294, -72000, -251274, -225610, -1588, 166187, 127069, 15916, 26864, 157535, 273772, 317657, 334712, 356383, 367357, 367533, 376664]
41543C76664K569m7197r9742j03380o7712l5114j7739n825q899m0762p3328m9665
41531a70130M1798J28234J13811j3405j52320j85089r5905K6497R4752R7182P1278
41520d3297N1525N5903P7259O9814n939j02934j15211k6381L7706k7397j46175
41509a75127j59674m5468O3981P5021L4932J7932J3592j4606l8673j0067N0754
41498a87403Q1444P1222O1679O4790M3377k0893r4459j42567j66438j66697j14658
41487e70603j815J09884J38802Q0203Q518k0147k3946m0033n7983m1614R714N7334
41475c51686O9540M7675J7313R450L2027M7532R230o4289r4826n1712K760J8190
41463c08796L6840R5511J18561K6641r3383p4641P8577J80133J32184N0857N7994
$$ y = [376664, 379233, 332036, 232294, 128914, 61202, 26088, 8349, 2524, -6375, -47137, -120465, -170130, -128332, -98, 113713, 100308, -52012, -237101, -333006, -306509, -211757, -114575, -43297, 8228, 64131, 141390, 211204, 205265, 102331, -12880, -39261, -1555, -28952, -175127, -334801, -380269, -316288, -241267, -206335, -188403, -174811, -189417, -228090, -238157, -187403, -105959, -34737, 26942, 91732, 135109, 114216, 19757, -122810, -289248, -455945, -570603, -572418, -462534, -323732, -243529, -235011, -255158, -279104, -319137, -377120, -418734, -409020, -351686, -282146, -234471, -217158, -207708, -175681, -128149, -118919, -183208, -278034, -329746, -326986, -308796, -271956, -176445, -57884, -31243, -124626, -199267, -120690, 59443, 191627, 242484, 300478]
41452C00478R6418N6992l3355p9874q6191j14136j39244q8154J1670N3772J5486
41441f138j8981J44L0181K9338J4590J0648J6249K8839L9263J3521n1295q2273
41429B4086l1900J2365n7306j68164j36637M5930J67289R5510l5098m1586M5637
41418g9874P8159L8822K4225L5044l2146j77803k48551j48502K0585J04245R0391
41407b95405P3337Q6010P3925K0281p504K9871O0833j029j14410j42406l2374
41396b48871J06055J35740N0580m9057r5160r7393p2253j0926O6223R2170L1805
41385i1087n7219p8839k571J02469J30788M1921q7438j30472n4945K8711Q578
41374a90104p6676j02044m4395R30p239N760P4883J04890K5798o3378k9990P6570
$$ y = [300478, 396896, 453888, 420533, 340659, 254468, 140332, 1088, -87066, -75396, -21624, -6138, -25119, -24975, 5206, 34544, 49134, 59782, 76031, 104870, 144133, 157654, 106359, 24086, -7814, 4551, -52755, -220919, -357556, -311626, -144337, -48827, -83925, -125511, -79874, -1715, 37107, 61332, 96376, 64230, -113573, -362124, -510626, -490041, -385796, -295405, -222068, -136058, -62133, -41852, -49356, -19485, 41348, 40319, -74091, -216497, -248871, -142816, -7076, 43504, -5553, -100713, -198106, -270359, -281285, -215062, -122892, -91087, -148306, -227145, -229716, -127247, 3541, 45462, -41976, -172448, -227393, -198682, -190104, -266780, -368824, -413219, -412289, -419528, -413768, -338885, -233995, -208197, -271575, -301565, -224995]
41362b24995Q3920m7892j65724j38803j8629O5631Q1112R0269J30350J68839J63790
41351A87868J12747L8519l7011r4002j12117q5596l9485j8212m4745q8469q5701
41340b66204m945J08675J63359J04800k1868j00053n3523O5217J29779R5245M5206
41329B65688M4812K1705j06761k42179j97887R735J36396M6387r0217n9466Q0355
41318i1432J18743K9497k3034K6068O4930L3561K1041P0345P1760m6846j74343
41307A00290j82016j15709r3488j07736o9304J8801P5110Q7449J11555J43555
41297c1493J24019O3296L5779L9082j4938j34630j91305r0826Q4326J76319J36985
41286A96614M5416j5517l1836k9029l1373n2457q7251j05297p2564J0491R5141
$$ y = [-224995, -141075, -188967, -354691, -493494, -512123, -446492, -365380, -275111, -144761, 24078, 187868, 300615, 339134, 302123, 208121, 96004, 10408, -29077, -47289, -92034, -180503, -266204, -271149, -162474, 885, 105685, 83817, -16236, -69759, -4542, 125237, 220482, 265688, 310500, 332205, 225444, -16735, -214622, -204887, -68491, -22104, -112321, -171787, -91432, 27311, 56808, 33774, 59842, 124772, 158333, 179374, 249719, 321479, 274633, 100290, -81726, -197435, -290923, -398659, -467963, -449162, -374052, -286603, -175048, -31493, 92526, 155822, 191601, 230683, 215745, 81115, -110190, -201016, -116690, 59629, 196614, 242030, 226513, 194677, 165648, 134275, 81818, -5433, -110730, -183294, -172803, -77662]
41275g7662J12776L2746r3439j62246j18952j5891N7302P9143Q8505R5652P1230
41264F9164K3050O840L6000M6882r061r0631j22339q2769o813N6414N9747j6359
41252b9875j17229j43464o8256K4090N7467O0759R0117J20793R7690M2223J3194
41241A47509m207o6547j46369j48180n7349K9237M4124K7181K8550K1336l6197
41230a60912j16034j53078j21351m1222M7286R0706N3030k4633m3770L4309J34923
41219c00746J68605J34972Q7766M7488N747k0575m315L5374M2949m600o6716p8176
41207D7773j4516O6839O2067o0160j85606j69275k5759Q5734Q7377P7571J39160
41196A11205J79409Q2832o9570r4029K1167R6908K7180q5041r7892j7206M9435
$$ y = [-77662, 35114, 67860, -25579, -187825, -306777, -322668, -265366, -186223, -97718, -2066, 69164, 92214, 99054, 135054, 181936, 172875, 82244, -40095, -122864, -129677, -73263, -13516, -29875, -147104, -290568, -358824, -334734, -277267, -216508, -126391, -5598, 92092, 134315, 147509, 143302, 76755, -69614, -217794, -275143, -245906, -201782, -174601, -146051, -124715, -160912, -276946, -430024, -551375, -592597, -545311, -454605, -401575, -426208, -469978, -435669, -300746, -132141, 2831, 90597, 138085, 143832, 123257, 118942, 154316, 197265, 192665, 125949, 47773, 33257, 100096, 162163, 102003, -83603, -252878, -278637, -192903, -105526, -27955, 111205, 290614, 373446, 303876, 209847, 231014, 327922, 355102, 270061, 172169, 154963, 204398]
41185B04398M0735j8138o8409o6767k3423r314p1482j35735p6203R4115J97864
41174F7641J14541n5033j21137l9766P0611J03967O3721j092o5017j11447j13913
41163h6924o7841q844K8385N1614Q6991J19728Q9083l1498j59372j57941K69J65866
41151B9516J69848L1060o8886k2380P7925Q5990j424o2473j9274Q1518J41627
41140D43047J09701J2119p5234q9774m3381j0546l7188q6751j02598q8530q1803
41129e0938p3633j9240P4772J32550J00765K0578k0692P830N2510M7565o295n1958
41117B13814n7576n8294r7996j55305j66054j08655k4212M4745Q8111J00546P7225
41106a43651M8994O0109Q8026N1573o2967j51262j24499l5524L050j7013q457
$$ y = [204398, 245133, 226995, 158586, 91819, 68396, 59082, -12400, -148135, -224338, -130223, 67641, 182182, 127149, 6012, -33754, 36857, 140824, 204545, 203453, 138436, 26989, -86924, -154765, -163609, -135224, -83610, 3381, 123109, 212192, 180694, 21322, -136619, -136350, 29516, 199364, 230424, 161538, 139158, 217083, 303073, 301649, 239176, 219902, 301420, 443047, 552748, 564867, 489633, 399859, 356478, 345932, 308744, 221993, 119395, 30865, -50938, -124571, -143811, -69039, 63511, 164276, 184854, 164162, 171992, 224502, 272067, 265772, 213814, 156238, 97944, -52, -155357, -321411, -430066, -454278, -409533, -321422, -220876, -143651, -94657, -34548, 53478, 105051, 42084, -109178, -233677, -269201, -266151, -283164, -291621]
41095b91621N5778R2672L5319o5854j08885o4156P440M0160L3651L5676P1333
41084a58487J05681Q7586K0414l8823n3864m9454o2191q1060n9367K8694J48700
41073a12171K06950J14048r9049k50441j85271J1751R7017n287r4090R651J94419
41062a12473K29067R5854k5384m3754l2395l4618L431P5194P3812k4471r5729
41051A08534o6545l1789p8796j27677o7423N5328J15287R7130P4000N9005J4536
41040A51590k9271l110O5665P0016j7888j11707j43572j29151q5513Q303J28295
41029i6343J76304R7484l0716q6154m4725J0442l90p0921j26970j06831k7821
41018c06641K9890K1088j360L8936J19384J33537L6085r3806j60851j62617j47111
$$ y = [-291621, -235843, -143171, -107852, -173706, -282591, -346747, -339307, -299147, -265496, -229820, -158487, -52806, 34780, 55194, 16371, -37493, -86947, -149138, -230198, -289565, -260871, -112171, 94779, 208827, 109778, -140663, -325934, -314183, -217166, -222453, -316543, -306892, -112473, 116594, 212448, 187064, 143310, 110915, 76297, 79728, 154922, 228734, 204263, 108534, 41989, 10200, -68596, -196273, -263696, -208368, -93081, 4049, 78049, 137054, 151590, 122319, 119209, 184874, 254890, 237002, 125295, -18277, -147428, -232941, -224638, -96343, 79961, 177445, 146729, 60575, 15850, 26292, 25902, -45019, -171989, -278820, -306641, -276751, -255663, -257023, -218087, -98703, 34834, 70919, -22887, -183738, -346355, -493466]
41007d93466j18318n1165K9678O0362K9024k057J8548O7979R3395Q6432Q0807
40996a98781R0092Q1725K0935p7215j52684j53512p9191K0614Q0495O3725l091
40985c06888l9398J5066J22950J76867J24277K9602k0414l0728n9420j00873r4018
40974a82977l6763P961L3933J06279K09466K03950K9654j52013j53934k8412K2119
40963E9263m3593p0884R965P1113K0851l9765r009L2110j5154n4369N6863K30719
40951B48110K41626O6733q2555q4803n4716j07220j70383j36872m5740R021L0168
40940h6631N5463M9025j5799n3761J1945R4913N8150o4288j08153j9634R0214
40929A1444J27915J13362P7701l43j16388k06261k29172j97212j06117N4043J95823
$$ y = [-493466, -611784, -662949, -633271, -572909, -543885, -545942, -527394, -459415, -366020, -279588, -198781, -108689, -26964, -6029, -83244, -235928, -389440, -468631, -448017, -367522, -303797, -306888, -346286, -331220, -208270, -31403, 92874, 122476, 102062, 71334, 11914, -88959, -182977, -219740, -211779, -177846, -71567, 137899, 341849, 371503, 219490, 65556, 37144, 59263, 15670, -55214, -45249, 25864, 46715, 6950, -2059, 30051, 14897, -39472, 17391, 248110, 489736, 556469, 473914, 389111, 334395, 227175, 56792, -80080, -125820, -116799, -86631, -31168, 17857, 2058, -51703, -39758, 55155, 113305, 49017, -59136, -78770, 11444, 139359, 252721, 330422, 330079, 213691, 7430, -221742, -418954, -525071, -471028, -275205]
40918b75205J75330l91j27714n8221J02813J53155O6597j3252L97M8780N3065
40907A25354J1664m1497q1848p5463L793J08059J34392M8216o4351j05316q0091
40896a7088o0392p0242o6307j8122M6657Q4281Q2640N5622K3280J1800L8517P4103
40884A84749N6264k1384o9982j4432Q2114Q4775k1275j01257o5745L202j0283
40873A06746p6982q1398m166O5339P0509L4351j8991q1539j07598n5386J4295
40862a34820r87p2777n9573O9982J68268J24005J5585l5359m1390o9745q8391
40851a25202k5913Q0002J24157Q4935K3250l0135p8648r2081m7814l597j3880
40840a04926j4695P3926J67888J07272p9235j76900q8519L6568M4712j4948k8817
$$ y = [-275205, -99875, -100266, -227980, -286201, -183388, -30233, 36364, 23112, 23509, 72289, 125354, 137018, 95521, 13673, -61790, -57997, 50062, 184454, 232670, 168319, 63003, -17088, -77480, -147722, -214029, -232151, -185494, -101213, -18573, 37049, 60329, 72129, 110646, 184749, 241013, 219629, 149647, 135215, 217329, 302104, 280829, 179572, 113827, 117029, 106746, 29764, -51634, -55800, 9539, 80048, 114399, 95408, 13869, -93729, -149115, -134820, -135807, -208584, -268157, -198175, -29907, 94098, 109683, 74324, 32934, -36811, -125202, -151115, -71113, 53044, 137979, 161229, 131094, 52446, -39635, -87449, -91046, -104926, -119621, -45695, 122193, 229465, 150230, -26670, -115189, -78621, -33909, -48857, -77674]
40829g7674j9687o8274j33724j05290J8664J36577J92268J95035J26344l4494
40819B29745j98542k22337j01507J2430K5502J0607M7042P6539K3471l8928J3759
40808a22219J37301J52847J2593j16145r3999q420j9167r6931p3693P0409J45302
40797a2122L3763j11678p8979Q6842J41283r29j33069m5884J78823K79781J55933
40786D93764l4283j04665n2451K967J457j6162r152m03l1577j02655j73208j99397
40774b25765j60620p0520K8109R2200J06997P9002J4614o5872j04126m5632P6875
40763b74738J50494J10725K7315J4508Q1683J31195R4414P075n9758q4888q6037
40752A11988o8299k2235M4035R6795R7676L4943m8320p2215q749N6748J6650r9727
$$ y = [-77674, -97361, -165635, -299359, -404649, -385985, -249408, -57140, 137895, 264239, 229745, 31203, -191134, -292641, -280211, -254709, -244102, -197060, -120521, -97050, -135978, -122219, 15082, 167929, 180522, 64377, -29622, -38042, -57209, -154140, -227833, -157424, -12122, 21641, -90037, -169016, -82174, 59109, 58180, -74889, -120773, 58050, 337831, 493764, 459481, 354816, 302365, 305332, 306789, 290627, 281475, 281072, 249495, 146840, -26368, -225765, -386385, -456905, -428796, -336596, -229599, -150597, -135983, -201855, -305981, -351613, -274738, -124244, -13519, 13796, 28304, 109987, 241182, 335596, 342671, 282913, 198025, 111988, 43689, 21454, 65489, 162284, 259960, 294903, 246583, 174368, 165619, 222367, 239017, 139290]
40740A39290j39831l8748O9379K8456j17306j86792j15966k2115j670O025Q3249
40729b96029J63346J12296n7043j73168j26713o930L3747j7551m2362L0140J34512
40718b45755J65602R9204n498p4724o6602P052P6620P1692J0110j3154M3416J01930
40706A69893P5129j4142q4629j11623j12174p0157K2955R4212P2597J7458L4587
40695I4106Q6159L9983r0386j35256m0157L8909o378o6738k6367K7486k6803j06561
40683b12003n4667Q6881J43632R3040P1023J16245J15491J7626q6460j29499j43164
40672A8145j31571l9006J02331J54187P4014q968M988M6980K5231k5649m1934
40661A78748n3749r7301j13186n3564O954l859j2232P2694J63356J00243q4917
$$ y = [139290, -541, -39289, 30090, 58546, -58760, -245552, -361518, -383633, -385303, -379278, -296029, -132683, -20387, -77430, -250598, -377311, -384241, -350494, -368045, -410407, -380267, -245755, -80153, 19051, 13553, -61171, -127773, -120721, -44101, 27591, 37701, 24547, 67963, 169893, 245022, 230880, 146251, 34628, -77546, -147703, -124748, -30536, 42061, 59519, 94106, 180265, 220248, 129862, -5394, -45551, -6642, -13020, -79758, -106125, -78639, -105442, -212003, -266670, -179789, -36157, 56883, 127906, 244151, 359642, 377268, 290808, 161309, 18145, -113426, -152432, -50101, 104086, 178100, 169132, 174120, 221100, 246331, 220682, 178748, 124999, 27698, -85488, -139052, -132098, -135957, -148189, -75495, 87861, 188104, 103187]
40650A03187j90125j26895j6511K1525J5690K2059Q743m5755o0092K3598J05576
40639a39000N7949n8716o1002P2024J36772j596j84177j58981O0155J97446Q5715
40628F589j23555j92421j05858j9738J3477R0494K36393L13208K16455L6276p0413
40617D00907p9820p2817p5675n0063j0814k6817r2511j09466l7382K8477m398
40606a30379p9683p2527J9900O9078K690r4104j08437n1146l541K9555J06590
40595c12004K04639K07848P6819o9710j06725o1554m5241q4369j10442q2847l3199
40584d16785K429K1890L0683L4083M6709O4600N2811P566j0993L4991R9244J47781
40572A15009K36512L75989M01124J56369k19291l95107k61781n0727J1764k7566
$$ y = [103187, -86938, -213833, -230344, -208819, -193129, -171070, -162327, -208082, -268174, -244576, -139000, -81051, -139767, -200769, -128745, 8027, 6431, -177746, -336727, -276572, -79126, 6589, -116966, -309387, -415245, -434983, -421506, -331012, -94619, 218589, 435044, 471320, 400907, 321087, 248270, 172595, 122532, 111718, 84901, -7610, -117076, -154458, -125981, -130379, -210062, -282589, -262689, -193611, -190921, -285025, -393462, -444608, -448149, -418594, -312004, -107365, 100483, 177302, 107592, 867, -60687, -105928, -190297, -300739, -383586, -416785, -414356, -392466, -361783, -327700, -280991, -216391, -163580, -156014, -167007, -132016, -32772, 115009, 351521, 727510, 1128634, 1285003, 1065712, 670605, 408824, 358097, 369861, 342295]
40562C42295k4442O977k9567j09364j30835q9246n7644m6425j5803J3301j0931
40551a51684n8938n6706j4759p046l3812j8301N4928R9981M9877n7782j35200
40540c29442j31612o0124J8344M2389J6901J0876N3549P8809L0569k8602m44R1351
40528b07436J25893O0114j5285j0310M9257O8562k71j06378j42125m7792J03379
40517a22392J61551Q0035j3323J2978J08608J23078L4589k6011J6543P1431K5237
40506D72324r5676j73248j55689j01412q2647r6425q3970j8950M7708M8586o494
40495b45893l5927P989Q2074J15134Q0225j0343j19664j73192j10892O858L6007
40484c67624m7267q1699M4974J98014J70257j6998j51798j35444p2231m9513q609
$$ y = [342295, 317853, 324830, 295263, 185899, 55064, -34182, -91826, -138251, -154054, -140753, -151684, -210622, -267328, -282087, -289133, -322945, -341246, -286318, -186337, -136460, -194242, -329442, -461054, -521178, -502834, -460445, -443544, -432668, -379119, -300310, -269741, -298343, -298787, -207436, -81543, -21429, -36714, -47024, 2233, 70795, 70524, -35854, -177979, -225771, -122392, 39159, 119194, 105871, 118849, 227457, 350535, 385124, 359113, 375656, 447087, 472324, 376648, 203400, 47711, -53701, -136348, -232773, -316743, -335693, -287985, -239399, -245893, -281820, -273831, -191757, -76623, 3602, -6741, -126405, -299597, -410489, -403631, -367624, -414891, -496590, -451616, -253602, -83345, -100343, -252141, -387585, -459816, -509329, -517938]
40473e17938J01414J87863J35668j7412j19103p7762N8938J71445J76299R0418
40463A89830Q377l328J6349j3090q9615j28720q4573q118K4765q483p4427j11877
40451b82910o7670M5372J36141J33292P6089M5088L1543l3596j32146j47560k7983
40440b24340J24957J72156Q7868l5151r0894n1876J6851L3853N789J9810J01907
40429A60930J49542P4886n1814j01736p3273n5451m9918K0421J34595J61976N7361
40418D27519o5158r7243o5377n1175p6631j10340j14441o2643K3124O0285Q567
40407a23513m1517J2225J10284J12661K6421j0368L8069P0199N3832O5354Q7023
40396D00670j3943k23274l13292j62856M4892Q8911Q983k1009K5649N0059K4287
$$ y = [-517938, -416524, -228661, -92993, -110405, -229508, -307270, -248332, -76887, 99412, 189830, 198207, 194879, 211228, 198138, 108523, -20197, -104770, -112888, -88123, -96606, -171033, -282910, -350580, -305208, -169067, -35775, 40314, 85402, 116945, 83349, -48797, -196357, -224340, -99383, 72773, 160641, 125490, 34596, -17280, -429, 33424, 39213, 59023, 160930, 310472, 385358, 333544, 231808, 158535, 103084, 53166, 73587, 208182, 370158, 427519, 362361, 265118, 199741, 148566, 71935, -38405, -152846, -215489, -192365, -132080, -123513, -165030, -152805, -42521, 70140, 96561, 86193, 124262, 194461, 248293, 313647, 400670, 386727, 163453, -149839, -312695, -267803, -178892, -169909, -190918, -165269, -115210, -90923]
40385i0923j864j1673K798R1304K34653K76636J18956r8553j70713j06638p2333
40374A71650j17986j42269r4198l4761k349L1006O4962O3284M1657M5800N0578
40363G7374k025p7242q2414j8867K5756L1679N9828J01645N9327p8238j63633
40352f6810p1489J25868K37300J70347J6858o5557k5797L6136k344j32610k29777
40341g875k11177j10694P686J11327J47192N2698j13095j71989o0119N4649R902
40330b91495j06775j03600J5636Q0124L0541j8013J7635Q6183J17570J01976M2431
40319b7787m8567j02740o2986J1406K4571P033O0477J56933J53132J5544j23467
40308F3549j58072j12510l0616Q2176J68132J28108j1843q6632k0209O1309K7089
$$ y = [-90923, -92787, -104460, -101662, -10358, 224295, 500931, 619887, 521334, 350621, 243983, 171650, 53664, -88605, -182803, -217564, -219913, -188907, -123945, -60661, -19004, 26796, 77374, 75349, -1893, -84307, -103174, -77418, -45739, 14089, 115734, 175061, 96823, -66810, -138299, -12431, 224869, 395216, 412074, 346517, 320720, 356856, 354512, 221902, -7875, -219052, -329746, -322060, -210733, -63541, -10843, -123938, -295927, -356046, -301397, -291495, -398270, -501870, -486234, -406110, -375569, -393582, -375947, -289764, -172194, -70218, -27787, -76354, -179094, -242080, -230674, -206103, -199070, -138593, 18340, 171472, 187016, 63549, -94523, -207033, -237649, -155473, 12659, 140767, 128924, 42292, 22083, 83392, 110481]
40297A10481o8530r3652l9071k78k0840n4378n3467k2390P767J8510K8255P7003
40285a10590J55438J75836Q2503l6257m8050K5512L5394o2565j43878j21866p0262
40274a18785o5210m3681O5209J71638J29202l9904j52918r5666N2745J38301J05539
40263A46470K4153j8659j3545j2031l9452o4518o1363n0027m6459l0705q647l2721
40251b07504r2387o8975R2733K45571K14527N3482l5012K269L5224j926l4239
40240B03763l6440q6150j69494j43465J3719J10044K2465j00320o5956P5555J38950
40229c7329Q5058K2874M992j2789m4636m7938r693M0557Q3183J00574O1750j2867
40217B33736l1333M3346J09958O3523m6127q7830l1568L8609N2081K928q4141
$$ y = [110481, 41951, -51701, -90772, -91050, -111890, -166268, -219735, -242125, -234358, -215848, -187593, -110590, 44848, 220684, 303187, 266930, 218880, 244392, 279786, 217221, 73343, -48523, -118785, -183995, -227676, -162467, 9171, 138373, 98469, -54449, -150115, -97370, 40931, 146470, 170623, 151964, 138419, 126388, 86936, 22418, -38945, -88972, -135431, -166136, -174783, -207504, -299891, -368866, -276133, -30562, 183965, 237447, 202435, 204704, 239928, 238002, 203763, 167323, 81173, -88321, -231786, -218067, -108023, -85558, -185878, -251834, -176279, -37329, 47729, 70603, 75595, 62806, 18170, -29768, -39461, 1096, 84279, 184853, 246603, 233736, 202403, 245749, 355707, 419230, 373103, 285273, 253705, 292314, 344395, 347323, 263182]
40206B63182j52661j23687M896J10411Q6554q357l7892J5961M8229N009m2787
40195A68858j2534P8455J38247J02613N027m8948j045P1426M6397o4439j21615
40184C62442o4043O593R62j9963L0982J12489J30514Q2926K3773l7651r7489r8299
40172D33236k3100K8381k1218q4386l6451P9641J18828N3988j5995m3209o8310
40161D21405r7096p8379p649N9582R3809R5796M2443o5492j34886p8862M0090
40150B90761Q2512K2975m7462p7963q8786p3871j1445M4460K0356m1918m2953
40139G6666M76j1400p0162o8255k5K3520j6824n906R1785J48234P3598m8334j03325
40126I0048r2523o3438k4551p96m5094j17738q4706P7001K01989J64643N9388
$$ y = [263182, 110521, -13166, -8270, 102141, 188695, 180338, 142446, 158407, 206636, 211645, 168858, 156324, 234779, 373026, 475639, 480666, 431718, 430673, 502099, 548496, 484057, 362442, 298399, 304992, 305954, 285991, 316973, 429462, 559976, 642902, 666675, 629024, 531535, 433236, 410136, 438517, 417299, 332913, 296462, 376103, 494931, 548919, 532924, 489715, 421405, 324309, 245930, 238281, 297863, 391672, 487468, 529911, 464419, 329533, 250671, 290761, 373273, 396248, 348786, 270823, 182037, 108166, 96721, 141181, 161537, 119619, 76666, 77142, 65742, -4420, -72675, -72700, -49180, -66004, -71910, 19875, 168109, 241707, 193373, 90048, -2475, -65913, -90464, -91260, -136354, -254092, -338798, -261797, -59808, 104835, 164223]
40115A64223L4702O2976J9560r3863j60612j39468j02123r5408q4632l6236L3488
40104c97393R5950J30628J16257N9408J6948L6956R4711J30544J22143P8337O178
40093D90667o2308o2383J2263N5681k5244j60869j90628p7715M4257N4289j4694
40082F3316n4996l2071N501K1086K7582L6555K6346j7243o1883o5046l7866l3208
40070a21927o2301o4090J0944J13480J35959L7049j06431j73584j07954L6998
40060c01857J41746J26660L3256k4306k296K7932Q122r170L5665P7724J5590j06239
40048B2827j37453m3795M5369L7495n640l655J0628k2518o5444m1991L7255R3929
40036g2993Q6782L0003n2647j26447j36248o5437K2400N6515M3779K9430J4503
$$ y = [164223, 198925, 261901, 281461, 187598, 26986, -112482, -214605, -310013, -394645, -430881, -397393, -301443, -170815, -54558, 4850, 21798, 58754, 153465, 284009, 406152, 484489, 490667, 428359, 365976, 378239, 433920, 408676, 247807, 57179, -20536, 23721, 78010, 63316, 8320, -23751, -18250, 2836, 30418, 66973, 93319, 76076, 14193, -50853, -88719, -121927, -184228, -248318, -237374, -123894, 12065, 49114, -57317, -230901, -338855, -301857, -160111, -33451, -195, -24501, -26797, 1135, 9257, 87, 35752, 113476, 129066, 22827, -114626, -158421, -113052, -75557, -81197, -84852, -74224, -96742, -162186, -204177, -166922, -72993, 13789, 43792, -8855, -135302, -271550, -336987, -314587, -258072, -214293, -184863, -170360]
40025a70360k1377n0779l2587K721j4507p4521q2541O804J16489J44613Q6888
40014h9157K0778j40R255J2841J820j0029j0953J294K0384L2251L0985L7124P1510
40001A27963R9671M8585p9660j57218p2700R5696J49881K9644j04246r2213J7954
39990F3357O5550r28r3191j24568q6438j4472L7266J5722o2878r8608l6576L7429
39978b98335K1852k9763J8562J68709K70643K21332P2145o6144j27125r9380l1054
39967A21442j8009r1016j35520l8407J10495J09957n9300j90086j28547M7144
39957b71847J72974J87839J20851J4570p3738r2276o3306m5492k0005O5946J44075
39946A39591Q0337q7306j53274m5914O7134N6812J0738J5321k7051j86457k96409
$$ y = [-170360, -191737, -242516, -275103, -272382, -286889, -361410, -443951, -437147, -320658, -176045, -89157, -68379, -68519, -59264, -46423, -44603, -54632, -65585, -64291, -43907, -11656, 19329, 56453, 127963, 227634, 276219, 196559, 39341, -33359, 62337, 212218, 241862, 137616, 45403, 63357, 128907, 127979, 34788, -89780, -176218, -190690, -153424, -137702, -200580, -299188, -335764, -298335, -276483, -306246, -287684, -118975, 151668, 373000, 445145, 379001, 251876, 152496, 121442, 103433, 12417, -123103, -161510, -51015, 58942, -358, -190444, -318991, -271847, -98873, 88966, 209817, 224387, 150649, 58373, -4933, -50425, -70430, -4484, 139591, 219928, 132622, -20652, -66566, 568, 57380, 68118, 83439, 56388, -130069, -426478]
39935d26478j78038N8847J68412J24346Q6528Q5482K820j46839j75374j7809J46340
39924b71763J57150Q8727R3052J60547J60184M4592r6129j57072j16101j8754
39914D4433P5430J21506R8171J5471q2245j38730j34074j02417p5797l2164M9130
39903a61286J04497M9153p4805j21183m2697L9142K2544k6678J298Q4641J20797
39892d577Q4053L0042p461l2019l6983k2082k0004m1735m1779N254N3788O8912
39880C5409Q2495J04675P1635l4956j10758p2565P485J9846j6507k4499j8040
39869D4220m3623m9968L0577J27455J16313J9366l2196p612M231l1147n0567k4993
39857A02056j136m912j6411l5592o7518o4348M758N7339j572j12325j32746n3095
$$ y = [-426478, -604516, -545669, -377257, -252911, -166383, -80901, -78081, -224920, -400294, -418103, -271763, -114613, -25886, 67166, 227713, 387897, 432489, 336360, 179288, 63187, 44433, 119863, 241369, 339540, 355011, 272766, 134036, -38, -102455, -178252, -210416, -161286, -56789, -7636, -82441, -203624, -246321, -207179, -184635, -211313, -210015, -125374, -4577, 79476, 109518, 102057, 70038, 33055, 10973, -9031, -50766, -92545, -87291, -33503, 35409, 117904, 222579, 294214, 259258, 148500, 75935, 83420, 103266, 86759, 62260, 44220, 597, -49371, -18794, 108661, 224974, 244340, 212144, 204532, 208763, 177616, 127049, 102056, 100920, 96008, 79597, 44005, -23513, -87861, -83103, -25764, -27336, -139661, -272407, -325502]
39845c25502P962N595J0583N0529O6530M2613L1474L4572p80m9463k1265P1984
39833g5168J09372M9594j8835m4320p3868j07487n6070Q4816J70199J05483j3054
39822A30662m7221L316N8236R0637J06792P6054j8665j16222j45419j14708p2581
39811d9119k7174L4214Q8038R7302O7864L9750L5652L8189P857p2454j55946j64321
39799f0148r1122k3871j6275o770O0614J14554O9486j0146j859O8913P3750J21
39787A77247m3439k5795k1559m1686j6201L9958K8370l7362k6084P5372J10585
39776B19406M344j14152j18375m7640J8361Q0651J24534O8379q0147j66842j06666
39765a18147j9512l3079q4304m7972N3401J05170P6147J7512l6081o3100l3292
$$ y = [-325502, -317540, -311945, -301362, -250833, -184303, -141690, -110216, -75644, -76424, -125887, -147152, -75168, 34204, 83798, 64963, 20643, -53225, -160712, -216782, -131966, 38233, 143716, 130662, 83441, 86757, 144993, 235630, 342422, 418476, 399811, 283589, 138170, 23462, -49119, -76293, -42079, 45959, 143261, 211125, 250875, 286527, 324716, 332573, 260119, 104173, -60148, -151270, -175141, -191416, -198186, -137572, -23018, 46468, 36322, 34463, 103376, 177126, 177247, 133808, 108013, 86454, 44768, 28567, 68525, 96895, 59533, 33449, 108821, 219406, 223750, 109598, -8777, -56417, -38056, 42595, 167129, 235508, 155361, -11481, -118147, -137659, -170738, -255042, -303014, -249613, -144443, -68296, -50784, -86865, -149965, -183257]
39754a83257K3547J7729n1369n4657O8724J90055J74989P8465L9246P7962J16017
39743D97451J05239L1247j15718k64154k60544o8302J30022J55006N6765j1831
39733B55181l9812j10517j93669j74096n5565L3445L4721K0706N1687Q9520P5988
39722a2411J6449l5211l4334J0046L6603J0932n642N6002J27708P3685q2891j61865
39710i29r6765k5822m2429n0740K0095N8704j8454q5607k0006O7752J8563j00435
39698b76073j18977m2050Q748K4990O7397R1305L2668k6192Q909N0829J301j1444
39686a88589J56251L27339K14338r1396k01895j3102J54492O5360j16469j46555
39676A59774m4335L8573O2012N0181j4025j04714j16827l0696L0055k843l9030
$$ y = [-183257, -159710, -141981, -193350, -248007, -179283, 10772, 185761, 264226, 303472, 381434, 497451, 602690, 633937, 518219, 254065, -6479, -74781, 55241, 210247, 267012, 255181, 215369, 104852, -88817, -262913, -318478, -285033, -250312, -229606, -177919, -88399, -12411, 4038, -31173, -65507, -55461, -18858, -7926, -13568, 42434, 170142, 243827, 160936, -929, -97694, -123516, -165945, -216685, -196590, -137886, -156340, -241947, -261953, -194201, -175638, -276073, -395050, -437100, -428352, -403362, -335965, -244660, -211992, -238184, -229275, -178446, -177145, -188589, -32338, 295001, 509339, 417943, 216048, 202946, 357438, 422798, 306329, 159774, 115439, 154012, 216024, 266205, 252180, 147466, 30639, -57, 29998, 27155, -11875]
39665a1875j2591l809p3901j32540q5793J2858O3160N4555J9803k8965m9463J6286
39653b32275J16639J21787L3103n969L6296J8248r6995j30046R101J26319M0094
39642C6302j24984j58760j02717j13599j35857p093J92153K08733K9948p0097
39632b45971M9715J94958J54018j636p3733k8690K0863J6808j1352m9817j01650
39621g6487j14966k8551J12431J82024J29143L1928k3183m3709p0959q0824j9558
39610b711Q5469J34179Q8261K6967L0965O9724O2862J0779j1404K4040N5816K4676
39598E99623n1530j13646j30972j13404p9764l5715J7966N8245L9181m6919j19804
39587B3261r0465K105K5485m1564n4366P1075J96640J53088n188r2379o5161k6032
$$ y = [-11875, -24466, -28275, -102176, -234716, -320509, -307651, -244491, -189936, -170133, -199098, -248561, -232275, -115636, 6151, 39254, 33285, 69581, 87829, -9166, -139212, -130111, -3792, 36302, -88682, -247442, -350159, -463758, -599615, -606708, -414555, -205822, -175874, -245971, -196256, -1298, 152720, 151084, 77351, 48661, 69524, 86332, 74980, 25163, -76487, -191453, -220004, -107573, 74451, 203594, 235522, 212339, 168630, 97671, 16847, -2711, 82758, 216937, 305198, 332165, 363130, 432854, 495716, 506495, 495091, 519131, 574947, 599623, 548093, 434447, 303475, 190071, 110307, 74592, 92558, 150803, 189984, 143065, 23261, -67204, -65099, -39614, -81178, -135544, -64469, 132171, 285259, 280071, 187692, 122531, 96499]
39575I6499k458P2179J63570J34344k2166j36471j13664n6478o5542q6267m9373
39564f5827o829j2022M17Q8009J65871J29922K4414m0295n8488q8756j08229m3957
39552a5770Q3198J65423J45283N7799m1650j10343j07441l3595L6090K7355m3547
39541A62802j07837j33754j21033n8372L5056P1315p497j16067j07430L5349J73877
39530a73591J89485J09121L6405J8399J6248k1342q4865j06080l7351P3161J15891
39519A35481M6135n9148j01256q0767p0886r4130r0339j6266P8219J10181P4291
39508f8485M9066Q8639J46665J35453L7816p6668j32233j02520m196J03708J27516
39497C04761L0733p9329n7357P1223J28423M6075l6624r743L5798o250n8919j5978
$$ y = [96499, 94041, 166220, 329790, 464134, 441968, 305497, 191833, 135355, 69813, -16454, -65827, -72656, -84678, -84261, 3748, 169619, 299541, 323955, 283660, 225172, 136416, 28187, -15770, 67428, 232851, 378134, 435933, 394283, 283940, 176499, 142904, 178994, 206349, 162802, 54965, -78789, -199822, -258194, -223138, -151823, -159320, -275387, -382817, -347468, -173591, 15894, 125015, 161420, 179819, 196067, 174725, 89860, -16220, -53571, 19590, 135481, 181616, 122468, 21212, -59555, -130441, -224571, -314910, -331176, -252957, -142776, -68485, -19419, 69220, 215885, 351338, 389154, 312486, 180253, 77733, 73537, 177245, 304761, 335494, 256165, 198808, 270031, 398454, 444529, 407905, 398162, 433960, 427710, 368791, 352813]
39485C52813M3571l365q0524l7078P0284O7280k6516m1834J8905r315j22238j24753
39473A07230J1993P2393l5583j23831o1648N046o3178j43701p5944O1481J01524
39462a44218N2747J9221R80l7568k9332P8685J77612J38186O357r0063j25352
39451D7255j26169o0648O6418J27233M5654n3730l6728J8232k9116j21813j03253
39440b26665J3370Q3747P8985Q9802J26742J09525L1410l6993q3963j42174j71548
39429a27762j08835J376P0345J12514J78447J99725P7643j13780j97475j45970
39419e3772q7448p3490k5651P4666J21624N4821m6418q5242n5930L26N2903P0884
39407e2727L5651j8102l3575k708L9328O2900M5208k5311j00203r8037k7975Q393
$$ y = [352813, 396384, 393019, 312495, 275417, 345701, 412981, 386465, 344631, 363536, 354221, 231983, 107230, 119223, 191616, 156033, 32202, -29446, -24400, -87578, -231279, -307223, -245742, -144218, -91471, -72250, -71270, -108838, -138170, -59485, 118127, 256313, 262670, 172607, 47255, -78914, -139562, -73144, 54089, 99743, 46013, 9285, 27517, -1599, -123412, -226665, -213295, -129548, -50563, 39239, 165981, 275506, 306916, 269923, 185960, 43786, -127762, -236597, -235221, -164876, -52362, 126085, 325810, 403453, 289673, 92198, -53772, -141220, -214710, -240361, -165695, -44071, 10750, -35668, -120910, -176840, -176514, -123611, -52727, -17076, -35178, -68753, -71461, -32133, 30767, 75975, 50664, -49539, -147576, -175551, -167158]
39395a67158r485K4217J35756J76205N1627j05711j43330j11727j10489p2806
39385c32901Q0423K13485J55557K017k8507M2234J1966j26274j61892k3860J14217
39374e3535J25226Q2944P1473N4842K785l1093j9247r751l1628o5104r9434j08929
39362h1451k4820J33608J88246M0133j23008p7939P8887R6588j090J9652J52139
39351D00945J30317j06213k83311k18692o0000J2621K8901N1870L2963k5144j2220
39340d7963O1182K9513j16667j53842K639J27118N4492m9935K713J03675P5143
39329H8068j008M5354J43903J07334l3272q4013p922M8963J0609n2523p5262o1535
39317A28696k1762K2500J2547n6416q2016m468P0579K4218q1613r9666j7103O2043
$$ y = [-167158, -176643, -152426, -16670, 159535, 211162, 105451, -37879, -149606, -260095, -332901, -252478, -38993, 116564, 118581, 90074, 132308, 144274, 18000, -143892, -167752, -53535, 71691, 154635, 226108, 280950, 283735, 252642, 233395, 223644, 192016, 126912, 27478, -81451, -106271, 27337, 215583, 255716, 132708, 54769, 133656, 230244, 229154, 248806, 400945, 531262, 425049, 141738, -76954, -136954, -124333, -95432, -43562, -10599, -35743, -47963, 13219, 42732, -73935, -227777, -225138, -98020, -43528, -93463, -90750, 12925, 88068, 87060, 132414, 276317, 383651, 350379, 266366, 258444, 307407, 318016, 265493, 190231, 128696, 106934, 129434, 141981, 85565, 3549, -919, 69660, 93878, 12265, -87401, -104504, -42461]
39305d2461R5995J21684J31266P4685k5276p8610n3361j0702j2995n5416q4098
39294F0711m9675L6439Q9099M0096n6217q0052j0674N7431O5002M3272J3268l6967
39282A71733n8011K4962J47139J41222m472r7701k9205O9891O1418J4160M2675
39271D83811Q4647J3197j28299j75444q0378L3608L5944p3498j68378j08108R8137
39260A5239K42265J40687r5230j70942j4146J26863N8361r5324j27284n5270k5010
39249B09n2138m4414J1541M9988N3139M9598L7522P690j2792j2545k0450k4754
39237D2594L3372J29422J37371J3965j15163j28639n7119Q397L7549K5899l9148
39226H8500j15961j28613q8342o6693l7017Q4162K25885K10064M8139m6953k409
$$ y = [-42461, 53534, 175218, 306484, 381169, 355893, 277283, 223922, 213220, 200225, 144809, 60711, 11036, 47475, 136574, 176670, 120453, 40401, 29727, 87158, 152160, 195432, 208700, 171733, 113722, 138684, 285823, 427045, 422573, 324872, 295667, 365558, 426976, 441136, 483811, 568458, 581655, 453356, 277912, 197534, 231142, 267086, 193588, 25210, -82898, 15239, 257504, 398191, 302961, 132019, 117873, 244736, 303097, 207773, 80489, 25219, 209, -51929, -96343, -84802, -34814, 18325, 67923, 105445, 113135, 100343, 87798, 67348, 42594, 75966, 205388, 342759, 356724, 241561, 112922, 55803, 64200, 101749, 127648, 88500, -27461, -156074, -244416, -311109, -348126, -263964, -38079, 171985, 220124, 173171, 170762]
39215A70762J9936n1110o3447M4420R0683k3557j15789m1996N2841J6592l7093
39204F2242K5933Q8611J6147o4477M034R9713L2054j10886j16318l012N4232K9730
39192A18003J7672J9186j561K1666J13723J27236j4557j19392k2843J04448L1873
39181C95454j35286j56892q5648j35240k50258j87096M6506J94825J65738J11841
39171c6056J17500J05174M7670P367k4359r4312j35509o9877Q184k3249q1538
39160a79005l2450M1939n567r1355m7509N6837N2371P723Q9758J93388Q4880j54986
39148A6024k14944n0442P3695L1415k8665p176J9347J8090M5553O5777K669n0033
39136g8690M2912J68370J11600o3558j11782k5919m940n3684L295J34929J25385
$$ y = [170762, 190698, 139588, 76141, 120561, 211244, 187687, 71898, 29902, 82743, 99335, 62242, 88175, 176786, 192933, 128456, 132490, 232203, 264257, 153371, 37053, 34041, 88273, 118003, 135675, 154861, 153300, 174966, 288689, 415925, 401368, 281976, 259133, 363581, 395454, 260168, 103276, 17628, -117612, -367870, -554966, -508460, -313635, -147897, -36056, 81444, 186618, 234288, 241655, 217296, 122984, -12525, -82402, -74218, -97467, -179005, -211455, -169516, -175083, -266438, -313947, -257110, -204739, -197016, -107258, 86130, 171010, 16024, -198920, -249362, -175667, -144252, -172917, -180093, -160746, -142656, -97103, -31326, -28657, -78690, -35778, 132592, 244192, 180634, 68852, 42933, 37993, -15691, -12396, 122533, 247918]
39125B47918j7194o3460J2591P82j29572j71241p5596k5476o6921m3632N7738
39114b74063P4881K2183Q7002K30435J97515j4187j09808J073P3508j0177o6105
39103B12257o831P108n6293R472K28301L14722J41175m9212o9038n0602j06307
39092E74752j01015L2365R7899k8500j75968j80280j18266q0452p584R5306Q3115
39081A91372m7225r5330k95O1952K4893L8281J27794J10815l3798q7014j179J206
39069B91472j29910j43843L9950J50028L2856j02807r7978r0768j57506j23311
39059c31817N5359J30468Q156n2921Q2259J64617K4953j09594l1501R9797R5510
39048A35286N5991R3420R2100j1894o2850j0179k9837j30425n3979K24893L46817
$$ y = [247918, 230724, 167264, 179855, 180637, 51065, -120176, -195772, -221248, -288169, -331801, -274063, -199182, -176999, -89997, 140438, 337953, 323766, 213958, 215031, 288539, 278362, 212257, 205426, 212534, 156241, 165713, 394014, 708736, 849911, 800699, 731661, 681059, 574752, 473737, 506102, 604001, 575501, 399533, 219253, 100987, 20535, 12951, 108257, 191372, 144147, 48817, 48522, 110474, 135367, 173648, 301442, 412257, 378459, 291445, 290266, 291472, 161562, 17719, 57669, 207697, 240553, 137746, 39768, -51000, -208506, -331817, -276458, -145990, -137834, -190755, -108496, 56121, 81074, -28520, -60021, 39776, 135286, 191277, 284697, 376797, 364903, 302053, 291874, 262037, 131612, 77633, 302526, 649343]
39037F49343J47650o0766l7135K1292p9521j80774j38156q9388r6056J8735K36335
39026C91559K54005P1026R8698M09007M87661Q1792l27421l02037r1741o6737
39016A005812j04090j0095K2179j34484j86266R793Q9927j27706k16092Q2551
39006D31529K97378L1360l12093k40935j128k1582j25475l20J10839q2407k53674
38995a66508l8863K35948J37319p8751J0362J93212R7559n5148O8279J96906p204
38984E93111k24269o5632J58959M6243j09762N9828K05345n6858l06660o8344
38974B31961K53987J23208j20612L6340K72533J33150l954K79251M77758J12070
38964A795692k13858R5327L94412k7661n09275j99330L16563J48878j61268K45038
$$ y = [649343, 796993, 736227, 699092, 720384, 640863, 460089, 321933, 232545, 136489, 155224, 391559, 645564, 716590, 815288, 1224295, 1711956, 1793748, 1466327, 1164290, 1072549, 1005812, 901722, 891627, 913806, 779322, 593056, 602849, 692776, 565070, 348978, 431529, 728907, 760267, 448174, 207239, 206111, 184529, 59054, 58734, 169573, 87166, -166508, -205371, 30577, 167896, 89145, 99507, 292719, 390278, 335130, 403409, 600315, 593111, 368842, 303210, 462169, 508412, 398650, 458478, 663823, 606965, 300305, 231961, 485948, 609156, 488544, 524884, 797417, 930567, 926613, 1205864, 1683622, 1795692, 1581834, 1677161, 2071573, 2043912, 1534637, 1335307, 1651870, 1800748, 1639480, 1884518]
38954A884518P48485M31906j7979M00476R39453N16716L354O80224J656479J488731
38944H732363J024392J653614K241956J274814M34926J965410M192688M543543
38936B6063706N173359R590459J5739720K0563432K9656322N0017873P0519961
38929B27324832O4037982J9520293l7389994o8421608o2701555m1308363k6226404
38922G4835183j9467640j3638857p893051n612021n543859m041392j737533j469072
38914A5431758k532622k259261r74044q31683j532591j216162j83974j43296q65281
38905D892844p90664m4973J9744m91185m01375J40078M2581n23853n06391l0237
38895B306569n2577m46340l40537Q6533k0642m54958l31339J75219J71112k21850
$$ y = [1884518, 2633003, 3064909, 3046930, 3447406, 4386859, 4903575, 4906929, 5587153, 7243632, 8732363, 9756755, 11410369, 13652325, 14927139, 15362065, 17327475, 21520163, 26063706, 31237065, 40827524, 56567244, 77130676, 106786998, 156804871, 227324832, 291362814, 310883107, 273493113, 205071505, 142369950, 101061587, 74835183, 55367543, 41728686, 33835635, 28223614, 22679755, 18638363, 16900830, 15431758, 12899136, 10639875, 9665831, 8834148, 7301557, 6085395, 5901421, 5758125, 4892844, 4102180, 4057207, 4076951, 3585766, 3184391, 3324469, 3367050, 2843197, 2336806, 2306569, 2253992, 1807652, 1467115, 1553648, 1533006, 1078048, 746709, 921928, 1093040, 871190]
38885H71190j32456L41509L05466k29882l75490Q741J76591n9618j20641J02091
38875H87501Q5712k04635k16877J11359K53785J03274P2169J89979P3131k20045
38865A135353k38644j2542J7353j26823m5874J69869P1496k33413k16840Q0465
38855F00400J16327j36224j62167J09719K04760J9094m4341Q7687M4832j87089
38845F52998j86945Q2374J76350l624o0605J14617J75924N1781Q1255K82970K37287
38834A604382j31255l68609k68963j52439j88310j25109R9695J49860o9266j83895
38824C66091j5937J10826j8072j44175m5832R7367J03329Q2420J06258L0414j43361
38813E29328j63773J6546J07620j9651j21313l7169N4121O179o2807o1161o7805
$$ y = [871190, 738734, 1080243, 1385709, 1155827, 780337, 789078, 965669, 906051, 785410, 887501, 973213, 768578, 551701, 663060, 916845, 1020119, 1092288, 1282267, 1355398, 1135353, 896709, 884167, 901520, 774697, 728823, 898692, 970188, 736775, 519935, 600400, 716727, 580503, 418336, 528055, 732815, 751909, 707568, 795255, 840087, 652998, 466053, 548427, 724777, 721153, 660548, 775165, 951089, 1002870, 1084125, 1367095, 1604382, 1473127, 1104518, 835555, 683116, 494806, 369697, 469392, 619252, 549986, 366091, 350154, 460980, 442908, 298733, 252901, 350268, 453597, 536017, 642275, 672689, 529328, 365555, 382101, 489721, 470070, 348757, 311588, 365709, 371888, 309081, 247920, 180115]
38802A80115o7510O6042K28841J50060j10624j78228K2364J41482K0718o6484
38792C86776L7498Q9825n8563j56383j5785J33643M7106j35055j70154r0103m3079
38781B5726k9367r895k8938o2902p66J05071N7095j16172j35740O7380K16949
38770H8441J49591M9446P3114J00367L3784l64O1722O1288p2890j67177j25247
38759B52075r1020j28514p2730J23479K29158J15964k0203j0396K8585k4582p1868
38748C29948m4490n8277j29817o5651J61035K59425P5544j29457j00420L0247
38738C28087M4026J1247P4831J33354M3120q8586r3940l1609l4648o3066l4388
38727B88428j0260m7940o1059q923p605q3648o5011J02967J99183Q0185p9281
$$ y = [180115, 112605, 178647, 407488, 557548, 446924, 268696, 291060, 432542, 453260, 386776, 424274, 514099, 455536, 299153, 283368, 417011, 464117, 329062, 158908, 68805, 25726, -3641, -13536, -42474, -105376, -106142, -1071, 56024, -60148, -195888, -128508, 88441, 238032, 287478, 360592, 460959, 494743, 494379, 556101, 617389, 544499, 377322, 252075, 161055, 32541, -40189, 83290, 312448, 428412, 408209, 397813, 426398, 401816, 329948, 285458, 227181, 97364, 31713, 192748, 452173, 527717, 398260, 297840, 328087, 372113, 383360, 458191, 591545, 634665, 546079, 452139, 420530, 385882, 322816, 288428, 278168, 230228, 169169, 160246, 152641, 68993, 3982, 106949, 306132, 386317, 307036]
38716C07036j01648p9480j18872j07655K1660R5826K0892o656J22798J70266k3638
38705C00529j80370k6563K09008J66821l3456k2083J71469J85874n8016k70736
38695D42477k83029k10302j35836k029J57210J93325R0423j2449m9560o2010m0500
38684H7720M4631J06038M7657n1670o8796n9786j32334k01975j24908K2356N6750
38673b74317l621p377L8929K0441k1130M2682J48237J16057k9733r2561k7184
38662h9577L1948M0987Q1351J39577J11913K5870J2822O3169M4345m4776p2361
38651C45268j9497L423k3222k2169j7268r5277j81670j13035N8771R9604l6537
38640a609j30576n1724N9681N2525r920J425P4931J10645O7058j6618o3696q974
$$ y = [307036, 205388, 125908, 7036, -100619, -78959, 16867, 37759, 31103, 153901, 324167, 300529, 120159, 93596, 302604, 469425, 435969, 413886, 585355, 771229, 713213, 442477, 159448, -50854, -186690, -188719, -31509, 161816, 252239, 239790, 190230, 128220, 87720, 132351, 238389, 286046, 234376, 165580, 105794, -26540, -228515, -353423, -331067, -274317, -277938, -285315, -246386, -225945, -247075, -204393, -56156, 59901, 30168, -62393, -89577, -57629, -16642, 64709, 204286, 316199, 342069, 354891, 418060, 462405, 417629, 345268, 325771, 329194, 305972, 283803, 266535, 171258, -10412, -123447, -64676, 34928, -1609, -132185, -183909, -124228, -71703, -81623, -80198, -5267, 105378, 172436, 155818, 92122, 83148]
38628H3148J09687J37974j472j54398j24759L4233J00566J5152o8062m6102K3227
38617A09194P6113J10791R4489o585r8773n5342N6878M8535q4328j42511m8080
38606F0381L6429j8163j17381j19486l5834L8765O2668L7343k4640o4381j6288
38595a60587P8115J00937K4011o4314j02817j04050n9386N8161J83814J99848
38585A53732J10323M3681N8378P4869K3319o2361j17272j07195k1396R1118J07822
38574C55018k2183j61163j50667m3166l037l7819k7727K5000O783o5768n5451
38563a80180L7219O5613Q773M512P1098N3876p7113j29530J461J51651J41594
38552A48974J6059r0930j44375j38593k1688J68966K54138J41770j9664m5713
$$ y = [83148, 192835, 330809, 329337, 174939, 50180, 84413, 184979, 200131, 132069, 85967, 109194, 185307, 296098, 390587, 384002, 285229, 229887, 286765, 335300, 250972, 108461, 60381, 96810, 78647, -38734, -158220, -194054, -155289, -92621, -55278, -79918, -144299, -160587, -82472, 18465, 42476, -21838, -124655, -228705, -288091, -229930, -46116, 153732, 264055, 307736, 366114, 440983, 464302, 401941, 284669, 177474, 156078, 247196, 355018, 332835, 171672, 21005, -22161, -25198, -63017, -90744, -65744, -58961, -124729, -180180, -142961, -77348, -68575, -64063, 7035, 60911, -16202, -145732, -144271, 7380, 148974, 165033, 74103, -70272, -208865, -230553, -61587, 192551, 334321, 314657, 268944]
38542B68944M6043J21664J34916J20352Q3561J9886l2154n0432p3918j23582j58392
38531C56888j56941j49111j32424o9375M602N050m0358r979R4479J24722L5766
38520F3319l0672Q108M3215n462l0076O5590J78361J69837P3408q733p5830j47537
38508C03528j50147m5484M7142K0219m0391m575P7166O8336k4570q9637j01116
38497F0471j06468q8207o126P2649M5882n5785j11303q1446j4603O5078J44123
38486g5735J54007O2025k6046j907O0313J6569r6231j05799J5755J07903P6280
38475A87134J1812O429J1513m0185r9314q2812p271M9106O1233N5724L4076k4978
38463A62467r7175j14542n6123N265j3023q6918j05904k6265N6963M6421m212
$$ y = [268944, 314987, 436651, 571567, 691919, 775480, 795366, 763212, 712780, 638862, 515280, 356888, 199947, 50836, -81588, -150963, -146361, -141311, -181669, -191648, -97169, 27553, 63319, 32647, 40755, 83970, 78508, 48432, 114022, 292383, 462220, 535628, 526895, 451065, 303528, 153381, 107897, 155039, 175258, 134867, 130292, 207458, 275794, 251224, 161587, 60471, -45997, -134204, -140330, -67681, -21799, -77584, -188887, -270333, -284936, -219858, -75735, 78272, 140297, 114251, 112344, 172657, 189226, 92995, -12804, 2951, 110854, 187134, 198946, 205375, 216888, 176703, 77389, -5423, -12694, 36412, 97645, 153369, 187445, 162467, 65292, -49250, -105373, -100108, -113131, -200049, -305953, -332218, -275255, -228834, -233046]
38452b33046L1798J51520K17287J59587N9179n046o0478j32055j53088p6402K3274
38441a7470N5956M4387N0251N2897R472l5525k2665m552o8095j62278j43551M882
38429b36291J28336J07085K798m8818r942N4943Q8988Q6008M8819k0847p9327
38418A21752n4452N0516J14197L7080r8255j14547J461O2643l4949j39566p9512
38407a33632N9326P2531l5840p9561k650N7892K3751k5480l3322m3347n3977O698
38395a87611J12197J36056O5797J9815J3184n9937j57401p9342J67823K87458
38385C18039J33597m6547j7711P1100j3478j61070j17304O2985J11825o404q3392
38374B51640m4812j8165m1727j1379O3354K9325j35102k51472k01714n8362P8364
$$ y = [-233046, -201248, -49728, 167559, 327146, 386325, 381279, 320801, 188746, 35658, -40744, -17470, 38486, 82873, 133124, 186021, 195493, 159968, 137303, 132751, 64656, -97622, -241173, -236291, -107955, -870, 1928, -46890, -56832, -1889, 87099, 173107, 221926, 201079, 121752, 67300, 117816, 232013, 269093, 170838, 56291, 57752, 120395, 85446, -54120, -133632, -74306, -1775, -37615, -117176, -119826, -61934, -38183, -63663, -96985, -140332, -194309, -187611, -75414, 60642, 126439, 146254, 159438, 99501, -57900, -137242, 30581, 318039, 451636, 405089, 387378, 458478, 445000, 283930, 166626, 229611, 341436, 335032, 251640, 206828, 188663, 146936, 135557, 198911, 228236, 93134, -158338, -360052, -418414, -340050]
38363c40050J78381J91210O1605j20117j70216o0983N1122P6759R0206J35484
38353I3401J28569K4149q5465j13632q3299l3094L9486R4044N6935l3048m3025
38342D5021L4786N0292m4027q1206N2900K03499J59484l2982j48053j08940n8432
38331G2342j02430j44324m3512J55835K57087J64687J9126J8049J46730J94538
38321G38128N4710j18782j32091j5472O0437M7102L3515L9571k8206j97098l49843
38310A31971l64519k29856p960K11087L11264K28289N1135n6605n3545l8654o9945
38299A12662q8447m5850J4789M6510N9557N3836q797j16490j78049j31389j8005
38288b99673Q0820J23255J09510O9396N4471Q1999R3837L4619n2374q2415n1205
$$ y = [-340050, -161669, 29541, 91146, -28971, -199187, -260170, -209048, -132289, -42083, 93401, 221970, 246119, 160654, 47022, -36277, -69371, -29885, 64159, 121094, 88046, 45021, 79807, 130099, 86072, 4866, 57766, 261265, 420749, 387767, 239714, 130774, 72342, -30088, -174412, -217924, -62089, 194998, 359685, 378811, 396860, 543590, 738128, 792838, 674056, 541965, 526493, 586930, 634032, 667547, 707118, 678912, 481814, 131971, -232548, -462404, -470364, -259277, 51987, 280276, 331411, 274806, 221261, 182607, 112662, 24215, -21635, -6846, 39664, 99221, 153057, 144260, 27770, -150279, -281668, -299673, -218853, -95598, 13912, 83308, 137779, 219778, 313615, 348234, 295860, 213445, 162240]
38277A62240j7224m252j2066o5120j40422j22119L0027J48700P7337n6569j5931
38266a5399J49216J57611m3818j77039o8869R5965R6476j59j7769K8312K0376
38255B24903j4562L9470J62213K09868J19355k8138j20513j07478k1405L6997
38245E00710q675r8650j03127k0759J4285m2715p1264r07O0868J3795p1041q2781
38233H9739l2687K2724Q6228J39487R8703l1386j00361l3178L7561q057q3346
38222A85427p4955n0321r8790j25896k9459N8544l7424k07766j95495j32J37564
38211d38703J27962J21811J89898K00140Q9617L326M2298Q2517j3004j62155j93560
38200E0147r6346K88K3429P319r320k9956n4099n5414j1207P3641J61725J94343
$$ y = [162240, 145016, 140764, 128698, 63578, -76844, -198963, -168936, -20236, 57101, 532, -15399, 133817, 291428, 247610, 70571, 1702, 97667, 194143, 193984, 176215, 204527, 224903, 210341, 249811, 412024, 621892, 741247, 713109, 592596, 485118, 463713, 500710, 492035, 393385, 290258, 269499, 283784, 241069, 169805, 168898, 229766, 243561, 172520, 89739, 57052, 79776, 166004, 305491, 404194, 372808, 272447, 239269, 276830, 268773, 185427, 110472, 60151, -38639, -164535, -193994, -135450, -172874, -380640, -576135, -576267, -438703, -310741, -188930, 968, 201108, 290725, 294051, 336349, 418866, 405862, 243707, 50147, -46199, -45911, -22482, -15163, -24483, -54439, -108538, -163952, -175159, -101518, 60207, 254550]
38188B54550J36941K3920o9388j01819q5281l9071K9180R4565J09339M3820p8989
38177C17767j87590k02880j06479K4505R1820Q8502P8356O9078R472o7715m0089
38166G4747R7145J63158M8270r4012o9338N4584O3238o0320j28654o5439k91j7974
38154F5114k6083M7787J06017M1993p6285j04659k7400M0928J4909p7052j42258
38143a36989j13151j2292N3459L409j05017j31456l0022R5083J30306P9246J8245
38132a49179r234j0650l264K666M014R814K5451L0918Q068j6122j29L8930L5974
38119c2743k7385q6135o8002K5060J22439J50449R4561J6218m399L8844O6370
38108B95277J5095q3033j50619j48271p9524K7580J03242P3405k7405o0070K8241
$$ y = [254550, 391491, 415411, 346023, 244204, 158923, 119852, 149032, 243597, 352936, 396756, 317767, 130177, -72703, -179182, -154677, -62857, 25645, 104001, 173079, 182551, 114836, 74747, 171892, 335050, 383320, 289308, 219970, 274554, 337792, 277472, 148818, 83379, 83088, 65114, 39031, 86818, 192835, 234828, 158543, 53884, 26484, 67412, 82321, 5269, -136989, -250140, -262432, -208973, -205564, -310581, -442037, -472059, -376976, -246670, -167424, -149179, -158413, -169063, -172327, -169661, -165647, -155833, -130382, -99464, -91396, -107518, -107647, -68717, -32743, -60128, -146263, -214265, -189205, -66766, 83683, 178244, 194462, 190063, 228907, 295277, 310372, 227339, 76720, -71551, -151075, -123495, -20253, 53152, 25747, -34323, -6082]
38097f082J06438N3367m3164k1387R0206J13497k088j14015j07356k8890K6232
38086F6758K9689r818p5264j09870o0026L0247O5726M4251M2563O0457J6310q4420
38074A6603j21970m6386M3884N8275K5820p62l0262o4284o1059k8840m1160r8143
38062c48284r1233K4754J43905J70213J44804J24983O4761o6589j61289j12580
38052a06555L292L3495j8232j8459O0604Q9509r125j27188j12088K9153J37502
38041c8092R8272k1635n9996L4522J39350J30440N0316K1255M3444R336r3109
38030C14103j42861q5255k4266m9853j01528q6444j9993M1548J03440J68166J65567
38019B82624N8204o1495q6903m2000j2776r000J577j158l2964k5796O7967J54113
$$ y = [-6082, 100356, 153723, 110559, 89172, 179378, 292875, 290787, 176772, 69416, 40526, 66758, 96447, 86629, 11365, -98505, -158531, -128284, -62558, -18307, 24256, 84713, 101023, 16603, -105367, -151753, -107869, -49594, -23774, -24536, -54798, -119082, -180141, -208981, -250141, -348284, -439517, -414763, -270858, -100645, 44159, 169142, 233903, 167314, 6025, -106555, -103263, -69768, -88000, -106459, -45855, 43654, 34529, -92659, -204747, -175594, -38092, 60180, 38545, -21451, 13071, 152421, 282861, 333177, 354432, 397876, 407212, 314103, 171242, 85987, 61721, 11868, -89660, -176104, -196097, -154549, -51109, 117057, 282624, 340828, 279333, 192430, 150430, 137654, 128654, 130231, 129073, 96109, 70313, 138280, 292393]
38007B92393J14341m376n6076j2101K8216J2377k1243n2286q9346q7966m175P9397
37995A99155L7539q2115r3685M6649J60364J04095m5673j43436j71333j85675
37985a74115j81142j21840l1307M6629J13919J63719J31801m262j40415j61515
37975c58528r3720m2236j9802M9355J71769K43678J84072K9521j17694j76309
37965a29894j24564j8180L4806j3033o8299q930J31493J93911J19951K9765K8195
37954A75221N1768n144j08005j39542p8996o812L4299O7884R2219P4167L1758
37943A88817J6490J2671l6295r8485p5184K6890P6713J4065o7069q4438p8293
37932a04118q1593k8202R7736J61769P5066k9597J1499J25345J19970j674o1954
$$ y = [292393, 406734, 402358, 346282, 334181, 362397, 374774, 353531, 301245, 211899, 123933, 119758, 199155, 236694, 154579, 60894, 107543, 267907, 372002, 326329, 182893, 11560, -174115, -355257, -477097, -508404, -461775, -347856, -184137, -52336, -56598, -197013, -358528, -452248, -494484, -514286, -464931, -293162, -49484, 134588, 164109, 46415, -129894, -254458, -272638, -237832, -250865, -319164, -328094, -196601, -2690, 117261, 147026, 175221, 226989, 221845, 113840, -25702, -104698, -111510, -77211, -9327, 82892, 157059, 188817, 205307, 217978, 181683, 83198, 8014, 34904, 111617, 125682, 58613, -25825, -104118, -185711, -213913, -116177, 45592, 120658, 91061, 102560, 227905, 347875, 346201, 284247]
37921B84247j0357J9352l5414o9076j5159M0320K2197k0457l6366n9477j01282
37910A8528r4783k3309K1780j3237n9173m9056p861L8915J10476J65953J08763
37899B16996k9978p9057Q608N9650k9134r5051K1009J80910J47288m5848j57099
37888A98294r9100o567J6908J637k4851p4636r4611r790J13373J16019k1257j50081
37876c4662j70432j19304l5250Q9225J86874J30114o0242j76902q9187Q1633J43761
37865e4372Q0982J2240p082k2665o1011q0867n0013j447J2891k610J0481P2732
37853i0741J04417J7415j28258j57116j6284J26027J11250J4328L816P0456P2226
37842A27536n247l5134J3465K7396l3610o1631M103P7816Q6979P1295N4363j9852
$$ y = [284247, 273890, 293242, 257828, 188752, 173593, 213913, 236110, 215653, 179287, 119810, 18528, -76255, -99564, -77784, -91021, -150194, -199250, -207111, -168196, -57720, 108233, 216996, 187018, 107961, 116569, 176219, 147085, 52034, 73043, 253953, 401241, 355393, 198294, 99194, 92627, 109535, 111172, 86321, 11685, -82926, -92716, 20657, 136676, 115419, -34662, -205094, -324398, -359648, -270423, -83549, 46565, -13677, -190579, -279766, -198133, -54372, 26610, 38850, 31768, 9103, -51908, -132775, -182788, -184235, -171344, -173954, -163473, -90741, 13676, 31091, -97167, -254283, -270567, -144540, -33290, -18962, -15146, 55310, 127536, 122289, 87155, 100620, 128016, 94406, 32775, 36878, 114694, 201673, 272968, 327331, 307479]
37830C07479j36973j61007m4042O0096K0201o6043l8211O3299O8303n4833j65893
37819a47624j60679p3085K0841Q4152J04009Q8832Q1550J05346J11104M6512m7756
37808B13202q5672n6010j6579J0429N0871R4342Q7141K4409k6565k4721j9204
37797B51643p4995j69061k06996j41882m0162O7j6558J6226J44564K53203J98548
37786B14597J0450j31797j21285k7158L5688M2764L1204K0900J2136K019k6460
37775F3058p6715r8376n4073j4802o9550j41586n8105J57452K49100Q1007j48014
37764a10604j80716l9196P9672J11751J27346J24371M6384l9305m231J07146J13059
37753C35677j6961j04966m1326O0248N5758l0635q5880p0604k1644K0710K3350
$$ y = [307479, 170506, 9499, -34543, 25553, 45754, -20289, -58500, 4799, 73102, 18269, -147624, -308303, -381388, -360547, -276395, -172386, -83554, -2004, 103342, 214446, 260958, 213202, 127530, 71520, 54941, 65370, 116241, 210583, 297724, 322133, 295568, 270847, 251643, 176648, 7587, -199409, -341291, -381453, -381386, -397944, -381718, -237154, 16049, 214597, 225047, 93250, -28035, -55193, -19505, 23259, 54463, 75363, 87499, 89518, 63058, -13657, -112033, -166106, -180908, -250458, -392044, -450149, -292697, -43597, 37410, -110604, -291320, -330516, -250844, -139093, -11747, 112624, 159008, 119703, 115472, 222618, 335677, 318716, 213750, 172424, 232672, 288430, 257795, 171915, 101311, 79667, 100377, 123727]
37742A23727l0109r5858j02685n0569j456K9607P1051Q4086l582j26373j03491
37731b05652R5917K58354J95786j6706j78977k18398j78943p6499P1510J53308
37721a00300P8308n2482o0447M2601O9427m9054j56436j11588J1192N4489M968
37710b69322k0655L6661J05902R6943J9629k7661K5964J27570J40994R119j51870
37699I3274j76130n1427P2059P5844m142o5510o5625k2750L3392O4127L8109j0273
37687a9052m538M9015M4507n1744j08681j3510J34649J51834L9566k9414J7792
37676B10424O2857M249r7984j46154j40569j13587m4494O8112J46154J39711J10059
37665A98778J12128Q5450k5703j32340j20262m0794k6368o6331m3161L2576K2476
$$ y = [123727, 93618, -2240, -104925, -155494, -156950, -127343, -56292, 27794, 24212, -102161, -205652, -109735, 148619, 344405, 327699, 148722, -69676, -248619, -325118, -253608, -100300, -21992, -74474, -134921, -92320, -22893, -71947, -228383, -339971, -328779, -274290, -269322, -289977, -253316, -147414, -50471, -30842, -58503, -32539, 95031, 236025, 245144, 93274, -82856, -134283, -62224, 13620, 9478, -56032, -121657, -144407, -111015, -46888, -8779, -19052, -23590, 25425, 69932, 18188, -90493, -104003, 30646, 182480, 222046, 192632, 210424, 273281, 277530, 179546, 33392, -107177, -220764, -265258, -197146, -50992, 88719, 198778, 310906, 396356, 370653, 238313, 118051, 77257, 50889, -15442, -58603, -26027, -3551]
37654c551q3852j16015K393J11475O1326n4718n8311M0386R3448O4789N4464J00013
37642B11847J16233M7595n0747j12073j29865j02831j3534R6612J27046M8761
37632B39044m3995o9692o8184j01755j25654o1554N0920J00136Q1610R7347J61165
37621B59388J49767J1877j11066q7423p960m0965j49314j43739L503J09040P7857
37610G0965L9817R5705J30472K9871r1283p5032j329n1713j79170j71244j1543
37599b14484Q6257K8610l0712J5795N0584l4794j33632j03491Q989P6495R0866
37588a59517J01208P0455m2433j48780j39174n4269R77L6709J11376J57975O7988
37577B515q4249r8835N4591J75861J14467l6848r5883k7346N1817L6873n9470
$$ y = [-3551, -87403, -203418, -201025, -89550, -28224, -82942, -141253, -100867, -7419, 57370, 111834, 211847, 328080, 375675, 324928, 212855, 82990, -19841, -33375, 63237, 190283, 239044, 195049, 125357, 57173, -44582, -170236, -231790, -180870, -80734, 876, 98223, 259388, 409155, 421032, 309966, 222543, 214583, 173618, 24304, -119435, -115932, -6892, 70965, 110782, 206487, 336959, 366830, 275547, 200515, 199186, 147473, -31697, -202941, -214484, -128227, -99617, -130329, -114534, -63950, -98744, -232376, -335867, -326878, -250383, -159517, -58309, 12146, -30287, -179067, -318241, -372510, -371533, -334824, -223448, -65473, 2515, -81734, -180569, -125978, 49883, 164350, 127502, 31619, 4273, 56090, 92963, 33493]
37566C3493j38610j22211l6484K0857J2546J0475O7944J12138N2518n5508o8654
37555a11496M1900J53459J55823O0618n3297j20617j16064p3033o8079j22978
37545b53764j51504p8302L4236P7096O8006J07263J85696J80387N1778q6322j23243
37534A1327p0913r75M1158L7222j720j9833J8176N1169j863j04753j42974q0889
37522b64868K3648J28257K05397J76911R273j55783j48281l1359j3317j04239
37512a74361r9617O0215J74243J09597n158l5387m6101j01138r2013M2428J37265
37501c0027N9709m0685K3342J48814J20155k4649q6949n8515q2085j34615o2576
37490a68081R5142J31416K8475j1579O6821P8099n4301j46985p6941J7773R469
$$ y = [33493, -105117, -227328, -263812, -242955, -230409, -219934, -151990, -39852, 12666, -42842, -111496, -69596, 83863, 239686, 300304, 247007, 126390, 10326, -62707, -130786, -253764, -405268, -483570, -449334, -372238, -304232, -196969, -11273, 169114, 220892, 134570, 11327, -59586, -60561, -19403, 17819, 16099, -3734, 14442, 65611, 63748, -41005, -183979, -264868, -241220, -112963, 92434, 269345, 278618, 122835, -25446, -56805, -70122, -174361, -273978, -213763, -39520, 70077, 64919, 29532, -16569, -117707, -209720, -167292, -30027, 29682, -11003, 12339, 161153, 281308, 256659, 169710, 111195, 29110, -105505, -168081, -72939, 58477, 86952, 75373, 142194, 220293, 165992, 19007, -57934, -40161, -30692]
37479c0692J201Q8301J26840k8185k31066k46333j14485n2850p7028q183J61097
37468d11383K02050K3101j39883m8040J97177L02857J77287J868n4369k7544l1173
37457A91948o2970l3019O8182J32184P6570m4154j13188r4657n0403l5470l6962
37446a939k1708P303K6792L5897N7541J04920J55585J59660Q7375k4672j01495
37435D85259j17979j17292j18483p6956K812K040j42093k62142j33422J77529
37425c00727L32545J59754j06278j44988L6660J74900J27904j0666j26635k06713
37415f4244k28930j20084J00865K68809K53070J10678j2476o1250p6482p9740
37405I0216m4287L4232J07359J23002P2654j0507q1996j17915j23038j02361m2125
$$ y = [-30692, -29491, 58810, 185650, 157465, -73601, -319934, -434419, -487269, -564297, -572480, -411383, -209333, -186232, -326115, -374155, -176978, 125879, 303166, 305034, 250665, 223121, 191948, 128978, 95959, 164141, 296325, 372895, 328741, 215553, 120896, 70493, 35023, -1939, -23647, -16344, 10448, 46345, 103886, 208806, 364391, 524051, 611426, 586754, 485259, 367280, 249988, 131505, 54549, 57361, 59401, -82692, -344834, -478256, -300727, 31818, 191572, 85294, -59694, -23034, 151866, 279770, 269104, 142469, -64244, -293174, -413258, -312393, -43584, 209486, 320164, 307688, 246438, 169956, 90216, 45929, 80161, 187520, 310522, 383176, 372669, 290673, 172758, 49720, -52641, -94766]
37394i4766N1606J19298J09824O1965M8908M6613m0656k01356k83058k01985p1367
37383d54974k2351n159Q8384J88246J25180p3649j73130o1900Q8255Q8288j070
37372b13880n231P8425J02111K1020m6152j3259O0983R2445Q7436Q3323O2702
37361C09923n7o0514m8662K5392P1219L1436m3532n5828J9030R8359R1046J0084
37349D47896m8069l3553l102k5829p5564o7378J9610J06707J05178J3329p8655
37338C60570p6645Q141M8280n0030j92191j84846r333J17979M5117q0317k6491
37327c9766J62512K24115O8487j03638j12138k6215L242l1493n5605o2831p3839
37316d7169m3281N8234J41200J02248j9713j03245j09876q1914k7827O6265J43231
$$ y = [-94766, -43160, 76138, 185962, 247927, 296835, 343448, 302792, 101436, -181622, -383607, -454974, -477325, -482484, -394100, -205854, -80674, -154323, -327453, -389353, -301098, -212810, -213880, -219111, -140686, -38575, -17555, -63707, -76966, -15983, 76462, 163898, 247221, 309923, 309866, 249352, 200690, 226082, 297301, 328737, 285205, 229377, 248407, 346766, 437812, 447896, 399827, 366274, 363172, 337343, 261779, 194401, 214011, 320718, 425896, 439225, 360570, 283925, 292066, 340346, 290316, 98125, -86721, -96054, 21925, 67042, -13275, -39766, 122746, 346861, 415348, 311710, 199572, 173357, 176599, 145106, 89501, 26670, -47169, -90450, -32216, 108984, 211232, 191519, 88274, -21602, -103516, -131343, -65078, 78153]
37305G8153J18912J3257o5682o3017j3699M0365P0195K1418j21847k38371j67070
37294c27386O7891K47186K20465P9719Q389M4690P7163K3131p5576j28194j08147
37283A29331p1983p9978j12637q8715K1149J33136J42373M9927n2804j03462j10201
37272a43864r0127m2630Q859J7506k1962n5819l5584L2798J03681J23931O6892
37261c6319k5634o1332o301O0600O4284N2456J04115J67458J20103k5686j19786
37250B93958q7400r839K7163K4484j7612j17592j93222r9616J24210K21520N9516
37239B25570j55559j66333k1751N3133K4157L8307J11183R6323k2257o5888L8560
37228A55445J18855K9134j23905j61214q8907k7293J607N5562J17603J15737N5705
$$ y = [78153, 197065, 210322, 144640, 81623, 67924, 108289, 178484, 199902, 78055, -160316, -327386, -259495, -12309, 208156, 287875, 296264, 340954, 418117, 441248, 365672, 237478, 129331, 57348, -22630, -135267, -223982, -202833, -69697, 72676, 122603, 69799, -33663, -143864, -233991, -276621, -267762, -250256, -272218, -328037, -363621, -330823, -227142, -103211, -36319, -61953, -123285, -129586, -68986, -4702, 47754, 151869, 319327, 439430, 413744, 293958, 206558, 196719, 223882, 248366, 230754, 113162, -80060, -179676, -55466, 166054, 225570, 70011, -96322, -118073, -64940, -40783, -2476, 108707, 205030, 182773, 116885, 155445, 274300, 303434, 179529, 18315, -70592, -97885, -96278, -40716, 76887, 192624, 248329]
37217B48329N71m7741j19535j62807r6641L1694Q0941J7123m7964l7822r72J2707
37205a22117L1878O4802M9084k2253m4519K9925P6506k2104j68836j73401k7807
37194c28842R4212R1716L7128J6520J6526N170p43L890j1018l2713l665O6339
37182d5480R2767N8444M2432N7740J198j49582k32764j25651M5878P8668j2025
37171a88375m1317N1676J39780J27117O3872K2140K989O58L2868O9359M2233l6119
37159B86881p1055l5562j4153n6748r8780q1849n0225n8262p1239l5076K6669
37148b59399N9659O3201O0220L8075j3110n0257l0840K0098M8837L9680j385p7064
37136a02285j57234j59934m5340J04266J64603J08253J1115n3031o9288n5289
$$ y = [248329, 248900, 201159, 81624, -81183, -177824, -146130, -65189, -48066, -96030, -133852, -134824, -122117, -90239, -25437, 23647, 1394, -43125, -13200, 63306, 41202, -127634, -301035, -328842, -234630, -142914, -105786, -89266, -72740, -67570, -68313, -64423, -75441, -108154, -111819, -45480, 47287, 105731, 148163, 205903, 207101, 57519, -175245, -300896, -255018, -176350, -188375, -229692, -178016, -38236, 88881, 152753, 174893, 177882, 178540, 211408, 280767, 323000, 286881, 215826, 180264, 166111, 109363, 10583, -71266, -121491, -179753, -250992, -286068, -259399, -199740, -136539, -76319, -38244, -51354, -101611, -132451, -112353, -63516, -23836, -25221, -102285, -259519, -419453, -464793, -360527, -195924, -87671, -76556, -129587, -198875, -254164]
37126b54164l5173l2034m4530l8434J0078P7430J21169J24524R6363N7693M2330
37115A25252O9196R7561O2326k4734p2352m0473j533k2081n6977l2448K7959M6709
37103A78405J8889O302K8654M3141K2316j7278n6847q6969q8364n3715j2237J6492
37091a211O3941J48068K01155J42359N974q6281q0853m2633m0608n7748m1100
37080B11063J3821O0788N6882L283n2624o3080m3089n6800j11710j17830j5813
37069a15109J00644Q5807n1730j47896j00162J1703N4476N643n9464p5756k7174
37058c19018O9688J59550J61021M7217j00044j65218j21266l7772K2720O5531
37048b17591J10653J30014Q3448j326m0348j647M4883K6041k1802k897Q7122J39870
$$ y = [-254164, -289337, -321371, -365901, -404335, -394257, -316827, -195658, -71134, 25229, 82922, 125252, 194448, 292009, 354335, 329601, 257249, 216776, 215243, 193162, 136185, 103737, 131696, 178405, 197294, 203596, 232250, 275391, 297707, 280429, 223582, 136613, 48249, -5466, -17703, -1211, 62730, 210798, 411953, 554312, 560286, 474005, 393152, 350519, 309911, 252163, 211063, 224884, 285672, 342554, 345837, 293213, 230133, 187044, 130244, 18534, -99296, -115109, -14465, 71342, 19612, -128284, -228446, -216743, -162267, -156624, -216088, -291844, -319018, -249330, -89780, 71241, 118458, 18414, -146804, -268070, -305842, -283122, -217591, -106938, 23076, 106524, 105198, 64850, 63203, 108086, 134127, 112325, 109428, 196550, 336420]
37036C36420Q3768j8371o3413l9001o726l493k1661n0925p4428m8963M3587J37878
37024B74672J41486M8063n7089j02404r4092p5905p0409o9136n1745q088M6464
37013a8183Q3556R0304O1954k2254j56281k39621j47624Q7538K60469K28689Q2123
37002C10670m613L29J4216Q885Q208k3464j27959k18476j66899k1738L1324n5348
36990b44865j26639p5901J0928L2474K9116O1348P4072R611n5518k6562L5831
36979b76105P72j18923j70933o8185J14079K38963K26323R0678o0684r1511J7831
36968i7695J10955L3363j46172j99813l6800J74407K25728J19006K0140K4297
36958B27416O6251N7112J4069M020J5587k9531j39087k05626j43425j2689O0376
$$ y = [336420, 420188, 401817, 338404, 299403, 292677, 289184, 267523, 216598, 142170, 93207, 136794, 274672, 416158, 464221, 407132, 304728, 210636, 134731, 64322, -4814, -56559, -64647, -18183, 65373, 155677, 217631, 195377, 39096, -200525, -348149, -260611, -142, 228547, 310670, 306057, 306386, 320602, 329487, 337695, 314231, 186272, -32204, -199103, -220841, -189517, -244865, -371504, -447405, -436477, -404003, -374887, -313539, -239467, -229856, -285374, -311936, -276105, -275333, -394256, -565189, -633374, -519295, -280332, -54009, 36669, -24015, -115526, -97695, 13260, 46623, -99549, -299362, -336162, -161755, 63973, 182979, 203119, 227416, 293667, 350779, 364848, 368868, 384455, 354924, 215837, 10211, -133214, -145903, -85527]
36947h5527N1514M3349P5452Q6229K6791n3900q4138o4099l4624o663K1927K3822
36935A33k2120q0778r9408p2904k5574L9658J16714J50010Q7211k5769p5532k6053
36923c4412K7215j6569j25651j70958q2649P3095J74518J60073N0150r8091k08604
36912b51883j92825k4234J79490K35169J06629l2624k0303P6747O8545p6419j86230
36901a17938j27778K7969J21142Q6827k1564j11321j07611n168R4279O8916n8268
36890a50515j22991l7161Q9206J14324N9801L6456M9546J1414q1343j19026m3403
36879a93692O6767J11980R2972P0448O4327M8414J5845j399K1493O5335Q6573
36868D49063O3672J2849m0125q4586j10061r3841l9602q790n5843j30918j13944
$$ y = [-85527, -34013, 9336, 84788, 171017, 197808, 143908, 59770, -4329, -38953, -45616, -23689, 133, -21987, -102765, -202173, -275077, -300651, -260993, -144279, 5731, 92942, 67173, -8359, -34412, -7197, -23766, -149417, -320375, -403024, -329929, -155411, 4662, 54812, -43279, -251883, -444708, -468942, -289452, -54283, 52346, 19722, -581, 76166, 144711, 68292, -117938, -245716, -217747, -96605, -9778, -31342, -142663, -250274, -255442, -161163, -92247, -150515, -273506, -310667, -221461, -107137, -47336, -10880, 38666, 50080, -31263, -150289, -193692, -126925, -14945, 78027, 148475, 212802, 261216, 277061, 275662, 297155, 362490, 449063, 512735, 525584, 485459, 400873, 290812, 196971, 157369, 148579, 92736, -38182, -152126]
36857a52126K6910J69387J76381O1596l6631k7759L6995M9357j3383o1360j3967
36846B15400P9179R1345n15o6131p882Q4449O9182k1651m3324K427m1355k00834
36834A60290k72296j14212J22549K00899J13395K7376K192m7206j33761j39024
36824g9798j1139J23990J23670J1515p2661n6186j951o330p3226j09500m1152
36813a92768R0673J78084J73999J21448O4302J993n5128o9724n1768o9574j42013
36802D9524j94443j67584r1852q530Q8925J77363J76024P9079J0390M4759P8688
36791B42343J357j07098j01160j4004N35p3882r8640j6768O1299L6292n0560j01499
36779b21785p2746J8976J12285J21289K5808p0854o2326J2764M4239K6916L3314
$$ y = [-152126, -125216, 44171, 220552, 282148, 245517, 217758, 254753, 304110, 290727, 229367, 215400, 294579, 385924, 385409, 319278, 311396, 395845, 465027, 443376, 400052, 402479, 361124, 160290, -112006, -226218, -103669, 97230, 210625, 238001, 240193, 192987, 59226, -79798, -90937, 33053, 156723, 168238, 95577, 39391, 37440, 31110, -42116, -151616, -192768, -102095, 75989, 249988, 371436, 435738, 437731, 382603, 312879, 261111, 191537, 49524, -144919, -312503, -404355, -412885, -323960, -146597, 29427, 108506, 118896, 163655, 242343, 243700, 136602, 35442, 21438, 21973, -51909, -150549, -167317, -106018, -69726, -120286, -221785, -294531, -275555, -163270, -41981, -16173, -87027, -149353, -136589, -92350, -65434, -32120]
36768c2120N0948O441o5978n2915L4516N9819j0702n4440j1766J6065m2085j00159
36756b02376o6793J5710P2931J08899J27984P9134k2049m5840N7009J29843J7947
36745B72399j88914k68405j59054p90P7704P5425L7955j3834n8701o9526n3125
36734c48866l7830k0030K3530P4494P9491K5931k9164k1619M3666Q9980N4224
36723f6193j9577j0515J16133K26262J80378L9358j6653L8540M3151p7897j74760
36712B78227j07290K6320L8512o5983j17051m1644N5311P0776L1844J1582J3889
36701A94493m965n0761p5693l9002L7482Q2350M8268l6152j02876j15156p7171
36690a39183p697M8132K5732o4463r8936o272Q1190j719j62310j42226P7017K04974
$$ y = [-32120, 18828, 25269, -40709, -93624, -59108, 711, -9991, -64431, -76197, -60132, -102217, -202376, -269169, -253459, -180528, -71629, 56355, 135489, 113440, 67600, 124609, 254452, 272399, 83485, -184920, -343974, -344764, -267060, -191635, -153680, -167514, -226215, -295741, -348866, -386696, -406726, -383196, -308702, -229211, -203280, -232444, -254063, -210397, -120417, -66193, -85770, -96285, 19848, 246110, 426488, 465846, 449193, 487733, 530884, 452987, 278227, 170937, 197257, 235769, 169786, 52735, 11091, 66402, 137178, 169022, 180604, 194493, 189528, 138767, 63074, 24072, 61554, 143904, 192172, 156020, 53144, -62012, -139183, -146880, -98748, -73016, -137479, -236415, -242687, -161497, -163216, -325526, -467752, -390735, -185761]
36678a85761P5401r5431n4463J00383J16167P561l072J15143J63023O8910L531
36667C11392P4694J49361Q9394k7572n8368k3936m0940j11350j25136m2533M0174
36656B35180J5292j08969k16822j96810n2622R0104J11206L0594k6705k812K3277
36645i9087k5333q1796j7585J51056K36792J11200j02947j63960k6244R2032J0940
36634H5068j53169j57456J0336J23933O6145j2788M1905J46583J33779J7641o1279
36623B40698p3628j06437j66677j54598m6539M2871K4868m6338p0563l3975Q914
36612c81404L0449N2054Q9652J14927Q5927J5635j7350L3232R4968O2846l7503
36601A43433q0242m6994o3831j73479k26108j10086N0192Q1968L3110O5016J58572
$$ y = [-185761, -110360, -205791, -260254, -159871, -43704, -36143, -39215, 75928, 238951, 307861, 311392, 386086, 535447, 624841, 597269, 538901, 514965, 474025, 362675, 237539, 195006, 235180, 250472, 141503, -75319, -272129, -324751, -234647, -123441, -92847, -119552, -122364, -99087, -124420, -206216, -223801, -72745, 164047, 275247, 172300, 8340, -17904, 74128, 85068, -68101, -225557, -215221, -91288, -25143, -37931, 3974, 150557, 284336, 301977, 240698, 167070, 60633, -106044, -260642, -307181, -264310, -239442, -285780, -356343, -390318, -381404, -350955, -298901, -209249, -94322, -8395, 7240, -10110, 23122, 118090, 180936, 143433, 63191, 16197, -47634, -221113, -447221, -557307, -507115, -425147, -392037, -327021, -168449]
36590a68449J43363o180j16691p9936J3426N0481M8492O7654R8155J02679Q0189
36579B33183L6055l5950j06356j14187m6882L7602P7552N2566j7546o9367l7540
36568I130L9648L1881q1503j28573J142J36249N7064j41504j74087r609R4903
36557a65259K3759l4504N7885J54125R6716j3545j2285N0124K8400n6431p8213
36546E0772l5028k9294p6369r6505o3232k6389j2544n653K631K0364O5456J05150
36534a00641N9225o5308j32304n7371N9430Q0539K1041j8634k3926m2868n9360
36523b80177k1448M8843R0078J04208J20410J05740K0228q5809j36118j40997
36513a75042j39436r1051M3585J64446J25322m8580j76077j57251o9418j3243
$$ y = [-168449, -25086, -31266, -147957, -227893, -214467, -163986, -115494, -47840, 50315, 152994, 233183, 269238, 233288, 126932, 12745, -34137, 3465, 81017, 133583, 116037, 46670, 9130, 48778, 80659, -844, -129417, -128275, 7974, 65038, -76466, -250553, -260162, -165259, -141500, -176004, -118119, 36006, 132722, 119177, 106892, 157016, 185416, 128985, 50772, 15744, -13550, -89919, -186424, -249656, -276045, -288589, -294242, -291611, -271247, -205791, -100641, -41416, -106724, -239028, -296399, -236969, -156430, -135389, -154023, -177949, -220817, -280177, -301625, -252782, -162704, -58496, 61914, 167654, 187882, 102073, -34045, -175042, -314478, -405529, -361944, -197498, -72176, -120756, -296833, -454084, -523502, -536745]
36503e36745J4690N7117R9720R4350L1149m4958p1066k3547M4713N5006J1803
36492b67768N988P4650J31484R4724P558m3125n0706m5180n060Q2123J42135J11039
36480B37862M6584K6220M205r1952j87522j49033j2612M6955k9307j19733j21513
36469c49846o6830j9526Q867J5829J671K0854J18787K12756J70876K0772o5146
36458F9064j3973O8100R0522R0180R5431M5273o8994j30679p3829n735l6072r3846
36446C5442m9023O4220Q9918k0248j44297j53223m9904N9176P8139J0007m6303
36435a26096j0257O8213P1723o074m3384J6751P2581L0883m6350o1965m7136p5878
36423a56989r8731j8384J13923J45247N9270M516N5303J00478L8157n5184n5838
$$ y = [-536745, -522055, -464938, -365218, -270868, -239719, -284677, -355743, -379290, -334577, -279571, -267768, -261780, -187130, -55646, 39078, 46636, 3511, -47195, -92375, -97435, -15312, 126823, 237862, 284446, 310666, 314871, 222919, 35397, -113636, -126248, -79293, -108600, -228333, -349846, -416676, -436202, -427335, -411506, -409835, -388981, -270194, -57438, 113438, 134210, 69064, 55091, 123191, 213713, 303893, 399324, 444597, 375603, 244924, 171095, 165360, 129288, 35442, -13581, 50639, 140557, 120309, -23988, -177211, -227115, -167939, -89800, -79793, -126096, -136353, -68140, 3583, -2491, -45875, -29124, 43457, 74340, 27990, -33975, -81111, -156989, -255720, -274104, -160181, -14934, 44336, 48852, 104155, 204633, 242790, 187606, 131768]
36412A31768O447R499n1686n6873L5108J00716K3624j33035k00775j09706M9929
36401a94984J48593J36385N0934k8108k6541N9748J30120O8719j05107k34738
36391E021k09269q7169R606N5462R6026J17753N5291p5521j54788j01649K5111
36380b64126J02617P7242r47m4163r977N9804P8717J0667q5403j23876q0263J1211
36368b68497J02148J32272M9248r9721j51959j0823J87626K09872K4255j56007
36358A8414j49415r068R3847Q4193J5235l5720l2906J2797N3086M4279J459k5215
36346G0986k8786m0223m4910J2379J18630J73303J15278j490r1726j27167j11178
36335D5096m5922L0327M5408j6698q4024r0107m1404K9207R9091J22150N1182
$$ y = [131768, 138215, 147714, 96028, 39155, 74263, 174979, 198603, 65568, -135207, -244913, -194984, -46391, 89994, 140928, 112820, 86279, 146027, 276147, 344866, 239759, 5021, -204248, -291417, -281811, -226349, -130323, -12570, 42721, -32800, -187588, -289237, -264126, -161509, -84267, -85214, -129377, -139354, -79550, -833, 9834, -75569, -199445, -279708, -268497, -166349, -34077, 15171, -84550, -236509, -247332, -59706, 150166, 174421, 18414, -131001, -140069, -46222, 37971, 53206, 17486, -15420, -2623, 50463, 94742, 96201, 70986, 42200, 1977, -42933, -30554, 88076, 261379, 376657, 375167, 283441, 156274, 45096, -826, 29501, 74909, 58211, -25813, -115920, -157324, -128117, -29026, 93124, 144306]
36324A44306o7556j16744o9837l0978o3368r1405m5101J5741J9187J5849P8094
36313b11812J52278J39314N6539m855k7378n0622o0716k4104J2032j7867p0704
36302a07895n7424J866J8527j860J6907N9209L9573j7621Q615J21620J76674J09989
36290C68180L0958J8028j1021j22235k09751j57294m4260l1861j10014j16658
36280c85928J4634J69616K20847J59198L8180j03176k17206k31516j19404N1436
36270d03319J80697K20028J78086Q5130j1922n3361j4522N6362Q0387K7599o2613
36259B82552j27392j22813l8643Q6823J68924J40986L2761n3121o0111l2370k9727
36248B47869m2001l1910j0997o101R168O5934J10686O4789l3885o0991M391L7085
$$ y = [144306, 76750, -39994, -109831, -140809, -204177, -295582, -340683, -324942, -305755, -289906, -211812, -59534, 79780, 136319, 131464, 104086, 53464, -7252, -31356, -19324, -37191, -107895, -165319, -163453, -144926, -146786, -129879, -70670, -31097, -48718, -40103, 81517, 258191, 368180, 399138, 417166, 406145, 283910, 74159, -83135, -127395, -159256, -269270, -385928, -371294, -201678, 19169, 178367, 216547, 113371, -103835, -335351, -454755, -403319, -222622, -2594, 175492, 260622, 248700, 195339, 180817, 237179, 317566, 345165, 282552, 155160, 32347, -6296, 80527, 249451, 390437, 423198, 370077, 309966, 277596, 247869, 205868, 173958, 162961, 156860, 166028, 231962, 342648, 407437, 373552, 312561, 316952, 354037]
36236C54037l9814j30333j12302j5158M4984L8675K7922M3800O0589O3790N2540
36225C88730j591j06956j81938j29046K2267J32415J15643J2337r9825j81565
36215b9529k07325j49912k5555R9034J68804J71220J07067j0450j20561j44300
36205a41507p5099M992K0602j8840m6381j1575P6259J53174J56699R8380N3318
36194B70022N2817M0900j6247n2419j6417J3721m2399r2838L452J70425J77778
36183E08795p090j46366r0228K328o1353j94652j85155l2628Q2626R6988J07413
36172H0678J39450Q9373o6234j87683j67496o7239P395M0343M2392j8443j24463
36161b31927j51429k4117J43249J84003J05121M8364N7391K9426q7272j86978
$$ y = [354037, 314223, 183890, 71588, 56430, 101414, 140089, 168011, 211811, 272400, 336190, 388730, 387139, 280183, 98245, -30801, -8534, 123881, 239524, 251861, 152036, -29529, -236854, -386766, -412321, -313287, -144483, 26737, 133804, 123354, 2793, -141507, -216606, -211614, -191012, -209852, -256233, -267808, -191549, -38375, 118324, 216704, 270022, 322839, 363739, 347492, 295073, 278656, 292377, 249978, 157140, 160592, 331017, 508795, 501705, 355339, 265111, 267439, 206086, 11434, -173721, -206349, -123723, -26735, 80678, 220128, 309501, 243267, 55584, -111912, -179151, -171756, -131413, -89021, -107464, -231927, -383356, -407473, -264224, -80221, 24900, 73264, 130655, 160081, 72809, -114169]
36151a14169j58959m5107L3296L8825K6668L4227M5730N0711O4846Q9702J04553
36140A70323J01547Q7445N3797j0605p9688j06977q3257l7266J3536O2557P3082
36129B44494P270r2297j20326l6946P9866J37333J22495O2748l5668j52095k11889
36118D985j54396j2579J26317K06464K06052J08674n4757j73331j50956k4137
36108H2336Q2606J07385Q9686O9275K5791o2142j55141j82005j12211P670Q6885
36097D0135Q1575N5592J00143J81850J56731j7296j81772j82089q0524m2425q4785
36086B7135r3274m2425j8692l0930J3980J11284J16050k3183j46199j02004L4427
36075a53831Q2446L895q4169q7465k4183L0955K2166l7588n4559N0492K02895
$$ y = [-114169, -273128, -318235, -284939, -246114, -219446, -185219, -139489, -88778, -23932, 65770, 170323, 271870, 359315, 413112, 402507, 322819, 215842, 132585, 95319, 108855, 171412, 244494, 251764, 159467, 39141, 2195, 82061, 219394, 341889, 404637, 368969, 216874, 4985, -149411, -161990, -35673, 170791, 376843, 485517, 430760, 257429, 106473, 82336, 164942, 272327, 362013, 431288, 457079, 394937, 239796, 57791, -54420, -46750, 40135, 121710, 177302, 277445, 459295, 616026, 598730, 416958, 234869, 154345, 111920, 27135, -66139, -108564, -127256, -158186, -144206, -32922, 83128, 59945, -86254, -188258, -153831, -71385, -67490, -151659, -239124, -263307, -232352, -210186, -247774, -302333, -251841, -48946]
36064d8946K20509N7169j00680o9045R2295J84325J40481O2394K8581Q756l2602
36053E43237o8355o8604m2353l1N4391Q1808K9851q2367j62004j52907j03460
36042B9206r4803j30339j28443k5381J28109J96055J07856l8002p3646L6002J59006
36031A65620J75634J04571J6801p0924j42812j27284j1517O1461m3544k26679
36021i8673k44523l5434J95215K53742J80609J18808Q7578J4673p9722q6828N31
36010C05976L6919p6001k30310k42875r8474M1684O5275K8663J7924R312m0044
35999a81951n6178N7136K28786K75246J47071j7912j03567j31212j30762n8466
35989B8191P3702J31598L7942r2309j11791l9250J7231L6826N4315M3397j9260
$$ y = [-48946, 171563, 228732, 128052, 59007, 151302, 335627, 476108, 538502, 567083, 575839, 543237, 474882, 406278, 363925, 363894, 418285, 500093, 529944, 447577, 285573, 132666, 29206, -65597, -195936, -324379, -349760, -221651, -25596, 82260, 44258, -29388, 6614, 165620, 341254, 445825, 462626, 391702, 248890, 121606, 110089, 171550, 128006, -98673, -343196, -378630, -183415, 70327, 250936, 369744, 457322, 471995, 392273, 305445, 305976, 342895, 266894, 36584, -206291, -304765, -263081, -197806, -169143, -151219, -141907, -181951, -238129, -180993, 47793, 323039, 470110, 452198, 348631, 217419, 86657, 28191, 101893, 233491, 271433, 179124, 67333, 28083, 45314, 82140, 136455, 179852, 160592]
35978A60592n0540J7789P9542p133j68797j97263o1204O2810P7288P3619J10450
35967I7153Q9425m9464j76649j43967P792J28271J54975J23553N7285l7712j10331
35956A40331j03102m1820j1923m7212r2683p9421o053O0149N9187J3585J852M1200
35944f5910N0229k1631r2469o5200J1129K1245j5786J8472J14719J19942j3257
35933F1483j29764r8225J1665O8129O4656O3900O2519K6704j5010j7757p18k556
35921I5026j8941m6955j10014j72659j28665M0358J89658J89422Q8086L835m2985
35910H6166p5981n1289N2454J22349N4902n5230m4940M7709L4204j19124k30459
35899a79239j74215m1404K4957J2270r976r601M475K0471J9220q197k1387K3034
$$ y = [160592, 110052, 127841, 207383, 200250, 31453, -165810, -227014, -164204, -86916, -13297, 97153, 186578, 137114, -39535, -183502, -175710, -47439, 107536, 231089, 288374, 250662, 140331, 37229, -4591, -16514, -63726, -156409, -235830, -241883, -181734, -122547, -108962, -107110, -65910, -15681, -37312, -129781, -194981, -183852, -162607, -178393, -159921, -45202, 74740, 61483, -68281, -166506, -154841, -86712, -22056, 41844, 104363, 131067, 116057, 98300, 97582, 95026, 76085, 29130, -80884, -253543, -382208, -341850, -152192, 37230, 125316, 129151, 86166, 10185, -41104, 11350, 133699, 188601, 133371, 88431, 136140, 170344, 51220, -179239, -353454, -394858, -369901, -357631, -367607, -377208, -372733, -352262, -333042, -341239, -362626, -339592]
35887c39592Q6094R1709N4276O1459J25415J59325J17490N1133M900l4167o4065
35876C13977n7556m6702r5659j62819j27766L014O8898J38o7208j8257N3096J7144
35864a19700o5551n5366K8429N7205J4779n375J8210K9244M2235J16433J85190
35853B45733J00039j19674k57102j84868l0154K9274k022j1979K3535M3862L0874
35842a32482J6131K814k1242k6056J5837N5143K0973o8868j27696j11162m1958
35831d18566M6179J13500R9515r28p3692r818J18122J33250J8255m5488M4861
35820B5190J45389P9605r5662j77985j02018J4136P2505R4362J09139Q5146J6681
35809B66488l0325k0754j4498o3466j12487p7087K4126Q9418O6835N240k3035
$$ y = [-339592, -253498, -161789, -107513, -46054, 79361, 238686, 356176, 407309, 412209, 378042, 313977, 256421, 209719, 114060, -48759, -176525, -173511, -104613, -104475, -171683, -189940, -136844, -119700, -185251, -240617, -212188, -154983, -140204, -145579, -127369, -98125, -55890, 60543, 245733, 345772, 226098, -31004, -215872, -246026, -216752, -218774, -230753, -207218, -163356, -132482, -116351, -113537, -134779, -160835, -144998, -89855, -68882, -137750, -265446, -376608, -418566, -372387, -258887, -159372, -160300, -233992, -243810, -125688, 7562, 25817, -19671, 25190, 170579, 250184, 154522, -23463, -125481, -111345, -38840, 55522, 164661, 249807, 266488, 236163, 215409, 200911, 137445, 24958, -52129, -28003, 61415, 128250, 133490, 110455]
35798A10455l043K4137J4300l3084o8811m2583L3649Q8070O7997j31m2067j2742
35786A36147O3611J12084O7049n8828j68028j75778j08033n3552k8953K8284J19853
35775f6144J42774M5099o4133n3776M0298P2914N941m7711r65R1165J27755R5538
35763C88755N3133K7213j7602j07589j92658j79895n1839P2376N5571p0864j25226
35752a48625k5582P9212K6732j01280r2968O7192J73114J12392J4269R929K4695
35741A39080n8229j65724j41675q395O3281K2327k045O7285J24756N7241p1908
35730B5994j13915l6692O3092J08001J03978P2606J3734m7763n5367j326L8366
35719A70708l120q9073j28377r6566m8285j5417L5765J20121J71105J20070M514
$$ y = [110455, 107412, 131549, 145849, 112765, 43954, 1371, 35020, 123090, 191087, 190956, 148889, 136147, 199758, 311842, 378891, 320063, 152035, -23743, -131776, -185328, -214281, -185997, -66144, 76630, 121729, 57596, 3820, 44118, 117032, 122973, 75262, 74297, 165462, 293217, 388755, 441888, 469101, 451499, 343910, 151252, -28643, -80482, -8106, 47465, -23399, -148625, -174207, -94995, -68263, -169543, -262511, -195319, -22205, 90187, 104456, 114385, 139080, 80851, -84873, -226548, -234943, -171662, -149335, -151380, -84095, 40661, 97902, 25994, -87921, -124613, -61521, 46480, 150458, 223064, 236798, 189035, 133668, 132342, 170708, 167588, 78515, -49862, -146428, -194713, -210130, -174365, -54244, 116861, 236931, 241445]
$$ [...]
##END NTUPLES=NMR SPECTRUM
##END=
