##TITLE=31Pdec_DE-123EXT4
H2O, 24 sc
 26.1.2026
##JCAMPDX= 6.0         $$ Bruker NMR JCAMP-DX V2.0
##DATA TYPE= NMR SPECTRUM
##DATA CLASS= NTUPLES
##ORIGIN= UXNMR, Bruker Analytische Messtechnik GmbH
##OWNER= root
$$ XWIN-NMR		Version 3.5
$$ Mon Jan 26 14:37:18 2026 Russian Standard Time (UT+4h)  she@DPX200
##.OBSERVE FREQUENCY= 81.013821
##.OBSERVE NUCLEUS= ^31P
##.ACQUISITION MODE= SIMULTANEOUS
##.ACQUISITION SCHEME= undefined
##.AVERAGES= 24
##.DIGITISER RES= 17
##SPECTROMETER/DATA SYSTEM= spect
##.PULSE SEQUENCE= zgpg30
##.SOLVENT NAME= CDCl3
##.SHIFT REFERENCE= (INTERNAL, CDCl3, 0, 198.062)
##AUDIT TRAIL= $$ (NUMBER, WHEN, WHO, WHERE, WHAT)
$$ ##TITLE= Audit trail, XWIN-NMR		Version 3.5
$$ ##JCAMPDX= 5.01
$$ ##ORIGIN= Bruker BioSpin GmbH
$$ ##OWNER= she
$$ F:/spectra/data/she/nmr/P31/2/pdata/1/auditp.txt
$$ ##AUDIT TRAIL=  $$ (NUMBER, WHEN, WHO, WHERE, WHAT)
(   1,<2026-01-26 14:36:04.92 +0400>,<she>,<DPX200>,
      <created by zg, POWCHK disabled, PULCHK disabled
       configuration hash MD5:
       00 E9 B6 7A A2 85 ED C7 34 08 36 98 17 FE 4E 26
       data hash MD5: 32K
       4E 91 E5 C4 CF 18 6D 95 16 13 1F BB 52 C3 36 C6>)
(   2,<2026-01-26 14:36:07.82 +0400>,<she>,<DPX200>,
      <Start of raw data processing
       efp BC_mod = 2 LB = 1.5 FT_mod = 6 PKNL = 1 PHC0 = 1327.022 PHC1 = 183.5008 SI = 64K 
       data hash MD5: 64K
       A5 A4 91 CB FA F8 42 B5 68 67 96 F2 45 5E 7E 6D>)
(   3,<2026-01-26 14:36:30.26 +0400>,<she>,<DPX200>,
      <pk PHC0 = 61.42992 PHC1 = -111 
       data hash MD5: 64K
       33 C3 2B A1 80 34 FA AD 32 40 3A C9 2F 03 0F 4D>)
(   4,<2026-01-26 14:36:36.46 +0400>,<she>,<DPX200>,
      <abs ABSG = 5 
       data hash MD5: 64K
       DD 16 F9 65 E2 19 4A FB BB B5 42 DF 9C A5 CE 6F>)
$$ ##END=
$$ 
$$ hash MD5
$$ AC 01 71 FB 36 7E DD 6F 88 1A 00 D6 29 37 62 D0
##$RELAX= 
##$RELAX= 
##$RELAX= 
##$RELAX= 
##$RELAX= 
##$RELAX= 
##$RELAX= 
##$RELAX= 
$$ Bruker specific parameters
$$ --------------------------
##$DU= <F:/spectra>
##$EXPNO= 2
##$NAME= <P31>
##$PROCNO= 1
##$TYPE= <nmr>
##$USER= <she>
##$AMP= (0..31)
100 100 100 100 100 100 100 100 100 100 100 100 100 100 100 100 100 100 
100 100 100 100 100 100 100 100 100 100 100 100 100 100 
##$AQSEQ= 0
##$AQ_mod= 1
##$AUNM= <au_zg>
##$AUTOPOS= <>
##$BF1= 81.014009
##$BF2= 200.13
##$BF3= 200.13
##$BF4= 200.13
##$BF5= 200.13
##$BF6= 200.13
##$BF7= 200.13
##$BF8= 200.13
##$BYTORDA= 1
##$CFDGTYP= 0
##$CFRGTYP= 5
##$CHEMSTR= <none>
##$CNST= (0..31)
1 1 145 1 1 1 1 1 1 1 1 1 1 1 1 1 1 1 1 1 1 1 1 1 1 1 1 1 1 1 1 1 
##$CPDPRG= <waltz16>
##$CPDPRG1= <>
##$CPDPRG2= <waltz16>
##$CPDPRG3= <>
##$CPDPRG4= <mlev>
##$CPDPRG5= <mlev>
##$CPDPRG6= <mlev>
##$CPDPRG7= <mlev>
##$CPDPRG8= <mlev>
##$CPDPRGB= <>
##$CPDPRGT= <>
##$D= (0..31)
0 1 0 0 0 0 0 0 0 0.06 0 0.03 2e-05 3e-06 0 0 0.0002 0 0 0 0 0 0 0 0 0 
0 0 0 0 0 0 
##$DATE= 1769423764
##$DBL= (0..7)
120 120 120 11 120 120 24 19 
##$DBP= (0..7)
150 150 150 150 150 150 150 150 
##$DBP07= 0
##$DBPNAM0= <>
##$DBPNAM1= <>
$$ [...]
##$SUBNAM3= <"">
##$SUBNAM4= <"">
##$SUBNAM5= <"">
##$SUBNAM6= <"">
##$SUBNAM7= <"">
##$SUBNAM8= <"">
##$SUBNAM9= <"">
##$SW= 400.765351723535
##$SWIBOX= (0..15)
0 1 3 0 0 0 0 0 0 0 0 0 0 0 0 0 
##$SW_h= 32467.5324675325
##$TD= 32768
##$TD0= 1
##$TE= 0
##$TE2= 300
##$TE3= 300
##$TEG= 300
##$TL= (0..7)
0 120 53 12 22 120 120 120 
##$TP= (0..7)
150 150 150 150 150 150 150 150 
##$TP07= 0
##$TPNAME0= <>
##$TPNAME1= <>
##$TPNAME2= <>
##$TPNAME3= <>
##$TPNAME4= <>
##$TPNAME5= <>
##$TPNAME6= <>
##$TPNAME7= <>
##$TPOAL= (0..7)
0.5 0.5 0.5 0.5 0.5 0.5 0.5 0.5 
##$TPOFFS= (0..7)
0 0 0 0 0 0 0 0 
##$TUNHIN= 0
##$TUNHOUT= 0
##$TUNXOUT= 0
##$USERA1= <user>
##$USERA2= <user>
##$USERA3= <user>
##$USERA4= <user>
##$USERA5= <user>
##$V9= 5
##$VALIST= <valist>
##$VCLIST= <CCCCCCCCCCCCCCC>
##$VD= 0
##$VDLIST= <DDDDDDDDDDDDDDD>
##$VPLIST= <PPPPPPPPPPPPPPP>
##$VTLIST= <TTTTTTTTTTTTTTT>
##$WBST= 1024
##$WBSW= 4
##$XGAIN= (0..3)
0 0 0 0 
##$XL= 0
##$YL= 0
##$YMAX_a= 6019
##$YMIN_a= -7804
##$ZGOPTNS= <>
##$ZL1= 120
##$ZL2= 120
##$ZL3= 120
##$ZL4= 120
##$ABSF1= 198.0616
##$ABSF2= -202.7028
##$ABSG= 5
##$ABSL= 3
##$ALPHA= 0
##$AQORDER= 0
##$ASSFAC= 0
##$ASSFACI= 0
##$ASSFACX= 0
##$ASSWID= 0
##$AUNMP= <proc_1d>
##$AZFE= 0.1
##$AZFW= 0.5
##$BCFW= 0
##$BC_mod= 2
##$BYTORDP= 0
##$COROFFS= 0
##$CY= -3
##$DATMOD= 1
##$DC= 0
##$DFILT= <>
##$DTYPP= 0
##$F1P= 0
##$F2P= 0
##$FCOR= 1
##$FTSIZE= 65536
##$FT_mod= 6
##$GAMMA= 0
##$GB= 0
##$INTBC= 1
##$INTSCL= 9.790993e-09
##$ISEN= 30
##$LB= 1.5
##$LEV0= 0
##$LPBIN= 0
##$MAXI= 10000
##$MC2= 0
##$MEAN= 0
##$ME_mod= 0
##$MI= 50
##$NCOEF= 0
##$NC_proc= -8
##$NLEV= 6
##$NOISF1= 182.463
##$NOISF2= 159.3651
##$NSP= 0
##$NTH_PI= 0
##$NZP= 0
##$OFFSET= 198.0616
##$PC= 4
##$PHC0= 1388.452
##$PHC1= 72.50079
##$PH_mod= 1
##$PKNL= yes
##$PPARMOD= 0
##$PSCAL= 0
##$PSIGN= 0
##$REVERSE= no
##$SF= 81.0140089999434
##$SI= 65536
##$SIGF1= 159.3651
##$SIGF2= -187.1042
##$SINO= 113.3802
##$SIOLD= 16384
##$SREGLST= <1H.CDCl3>
##$SSB= 0
##$STSI= 65536
##$STSR= 0
##$SW_p= 32467.5324675325
##$SYMM= 0
##$S_DEV= 0
##$TDeff= 32768
##$TDoff= 0
##$TI= <>
##$TILT= no
##$TM1= 0
##$TM2= 0
##$TOPLEV= 0
##$USERP1= <user>
##$USERP2= <user>
##$USERP3= <user>
##$USERP4= <user>
##$USERP5= <user>
##$WDW= 1
##$XDIM= 65536
##$YMAX_p= 419511447
##$YMIN_p= -21491632
$$ End of Bruker specific parameters
$$ ---------------------------------
##NTUPLES= NMR SPECTRUM
##VAR_NAME=  FREQUENCY,     SPECTRUM/REAL,   SPECTRUM/IMAG
##SYMBOL=    X,             R,               I
##VAR_TYPE=  INDEPENDENT,   DEPENDENT,       DEPENDENT
##VAR_FORM=  AFFN,          ASDF,            ASDF
##VAR_DIM=   65536,         65536,           65536
##UNITS=     HZ,            ARBITRARY UNITS, ARBITRARY UNITS
##FACTOR=    0.49542278885378, 1,            1
##FIRST=     16045.7642231865, 0,            0
##LAST=      -16421.768244346, 0,            0
##MIN=       -16421.768244346, -21491632,    0
##MAX=       16045.7642231865, 419511447,    0
$$ Real data points
##PAGE= N=1
##DATA TABLE= (X++(R..R)), XYDATA
$$ [...]
36951d71945k534807p58112Q80614R72954R15423J421544P99206j497165k853184
36942c125472j403760P61613Q53978m77902q89369j68372M06493Q00412J575549
36933a666830J952855J130818K24475M35777P39859o8459o65906N26901J971625
36924D581115J334193j67913L19567J863058O63627l477005o032507m187055n16041
36915e618961J354288J330931J082745O72599m84038j374790o93202P96155J275553
36906a658720M52133m95776q27493p14421l78366J35971P38527J455779K213199
36897I20833K246727Q78473q37720q26980R88706K067926O57809j790823k873843
36888A431108k363024j554728q51534J75913J222405J524376J149055N79575l07006
$$ y = [-471945, -3006752, -3764864, -2884250, -1911296, -995873, 425671, 1224877, -272288, -3125472, -4529232, -3767619, -2913641, -3391543, -4280912, -4449284, -4042791, -3242379, -1666830, 286025, 1416843, 1641318, 2077095, 2816954, 2748495, 2082589, 2609490, 4581115, 5915308, 5747395, 6066962, 7930020, 8593647, 5116642, -915865, -5102920, -5618961, -4264673, -2933742, -1850997, -1178398, -1662436, -3037226, -3730428, -2934273, -1658720, -1206587, -1702363, -2529856, -3244277, -3622643, -3486672, -2748145, -1292366, 920833, 3167560, 4046033, 3208313, 2381333, 3370039, 5437965, 6095774, 4304951, 1431108, -931916, -2486644, -3338178, -3162265, -1939860, -415484, 733571, 1313146, 1006140]
36879A006140j463543j759933n22516Q15913N30949n63489k94329J206349J505932
36870D61473k19282j753700j145400P36261K084255K608156K605278J375230j358240
36861E394031l606455l041800l67613J389637R37224n5016j42738k65329j539010
36852a297069k783001k129315q860J475602J603813J417597J246508J67044j587084
36843a894765k006417l50232J179053O01110o03956K84108K829459L933782K367434
36834F339576O3664j322613k319560l224995k599055L7929K219728J573055o07452
36825A60277j202619K93206J622610J480004Q05820L83539l41263j480056j951986
36816b30468j435562j182271j766890j751141n2774J782365J513093m57861j605978
$$ y = [1006140, -457403, -2217336, -2739852, -1923939, -1392990, -1956479, -2250808, -1044459, 461473, 242191, -1511509, -2656909, -1920648, 163607, 2771763, 5377041, 6752271, 5394031, 1787576, -1254224, -1621837, -232200, 705024, 650008, 507270, 241941, -1297069, -4080070, -6209385, -6218245, -4742643, -3138830, -1721233, -474725, -307681, -1894765, -3901182, -4251414, -3072361, -2471251, -3075207, -2791099, 38360, 3972142, 6339576, 6403240, 5080627, 2761067, -463928, -3062983, -3025054, -805326, 767729, 160277, -1042342, -749136, 873474, 2353478, 3159298, 3542837, 3201574, 1721518, -230468, -1666030, -2848301, -4615191, -6366332, -6419106, -4636741, -3123648, -3581509, -5187487]
36807e187487q13920M89152Q42279O32562P96921J094086P82932J25553l8079
36798a276001J95659n8035q39276j070681l07074L26304k41826j262809j160408
36789e694147J27329J131847J177844J269595K150753K862051K235199P50499
36781F010970l30813q22514j165122q92773N66021J926506J146206j217915k075237
36772C145329j89443J695139P47169j782459k536425r65151L85438N4214o24399
36763g0588l70593L2571k96691m25767O99862K023953J665513k46120j701794
36754A310346j551882o55342k17619k61976j78253J12824J36441l93863j170067
36745b869391j454098o32601J069655K455808K371243R50176m77655p60410J06970
$$ y = [-5187487, -6001407, -5512255, -4669976, -4037414, -3240493, -2146407, -1363475, -1237922, -1276001, -1080342, -1138377, -1977653, -3048334, -3355408, -3029104, -3270930, -4533739, -5694147, -5566818, -4434971, -3257127, -1987532, 163221, 3025272, 5260471, 6010970, 5680157, 4857643, 3692521, 2799748, 3365769, 5292275, 6438481, 5220566, 3145329, 2955886, 4651025, 5398194, 3615735, 1079310, 114159, 499597, 553811, -70588, -441181, -408610, -705301, -1131068, -431206, 1592747, 3258260, 3012140, 1310346, -241536, -896878, -1114497, -1376473, -1554726, -1441902, -1305461, -1699324, -2869391, -4323489, -4956090, -3886435, -1430627, 940616, 1890792, 1413137, 652727, 759697]
36736G59697J296270J908600J386759j85495j852530k342814j341994M9059N42676
36727B20228Q9287m27094o50403j068560j740659j672246k00968J614135K066303
36718a769977J093897L15314N78047P84425j28063j289599j247966k98032J54981
36709a806973O268L45220J112117R88965l5581k31358Q77635J339294N4155r19627
36699A730115N00828K706178K518918k2145j937337j917827j614765k130824k237558
36690b404417j001337L87805O56982K07636l57821j389937k535611k051996M62591
36681h026105K529939K012621K34493l64089j60501j146042k783800k316282P51318
36672i268448L457529L455892J884216J092998J484041J956665K011645J880501
$$ y = [759697, 2055967, 3964567, 5351326, 5165831, 3313301, 970487, -371507, -322448, 220228, 309515, -117579, -767982, -1836542, -3577201, -5249447, -5450415, -3836280, -1769977, -676080, -360766, 217281, 1001706, 873643, -415956, -1663922, -1961954, -1806973, -1800705, -1455485, -343368, 645597, 610016, 378658, 1256293, 2595587, 2649742, 1730115, 2230943, 4937121, 7456039, 7433894, 5496557, 3578730, 1963965, -166859, -2404417, -3405754, -3017949, -2360967, -2153331, -2511152, -3901089, -6436700, -8488696, -8026105, -5496166, -3483545, -3249052, -3613141, -3773642, -4919684, -7703484, -10019766, -9268448, -5810919, -2355027, -470811, 622187, 2106228, 4062893, 6074538, 7955039]
36664G955039J422521L20745r10532j173122j30546J201737J351787j34768k050824
36655G852037k624477j531986l20118l05195q22287n84128M6929j77885q49900
36646F82990l19819J200234J388307m26725j609653r39K552289K661311J15334
36637F243329k295552k917406k565769j917633l97493J661318K333304R73476
36629A117574l08586J84529Q73451m85000k628857k231089P82233K568002Q92092
36620G64349j573585j284359J137209K367149J363888N1252k54460j96841k22219
36611B152383J27389L67687p49812k445734k073091O72631K461055J074835j169632
36602D17711j172974J72385R5527j047465o94741R58727R99813j150698k612579
$$ y = [7955039, 9377560, 9698305, 8787773, 7614651, 7484105, 8685842, 10037629, 9902861, 7852037, 5227560, 3695574, 3375456, 3070261, 2247974, 1663846, 1710775, 1532890, 682990, 363171, 1563405, 2951712, 2524987, 915334, 914395, 3466684, 6127995, 6243329, 3947777, 1030371, -1535398, -3453031, -3850524, -2189206, 144098, 1117574, 808988, 993517, 1866968, 1381968, -1246889, -3477978, -2695745, -127743, 764349, -809236, -2093595, -956386, 1410763, 2774651, 2825903, 2571443, 2374602, 2152383, 2279772, 2647459, 1897647, -548087, -2621178, -1948547, 512508, 1587343, 417711, -755263, -582878, -487351, -1534816, -2229557, -1270830, -271017, -1421715, -4034294]
36593d034294j789285o78320j010957j260268M31925K811704L369195J996184
36585a64116N77186L5599k31135o69110r95759r50813n03869K71327Q60764O10525
36575a159401j11976j74946L57481N3316j259036j528357M21620K572888K444167
36566A615756P60289J09770Q65387R59911n34506k010535j880352o25696L46186
36557c93790N23131L22173K65162O52815J420815J971053J570052J06751j708261
36548D729901k793915k383893q30879K42689m57084j955086j939565n0225J410101
36539d027956R22970M6614P29511K065070J866957K23497r27320r78801r48728
36530a028186j043791m55600M53732K36036r82707j170794N13168K119888J409977
$$ y = [-4034294, -5823579, -6501899, -7512856, -8773124, -8341199, -5529495, -2160300, -164116, 413070, 448669, 217534, -451576, -1447335, -2398148, -2902017, -2630690, -1769926, -1159401, -1271377, -1446323, -1088842, -1035526, -2294562, -3822919, -3401299, -828411, 1615756, 2376045, 2485815, 3351202, 4311113, 3776607, 1766072, -114280, -739976, -393790, 129341, 451514, 716676, 1369491, 2790306, 4761359, 6331411, 6438162, 4729901, 1935986, -447907, -1278786, -1036097, -1493181, -3448267, -5387832, -5438057, -4027956, -3104986, -3058372, -2328861, -263791, 1603166, 1826663, 899343, -79458, -1028186, -2071977, -2527577, -2073845, -1837809, -2820516, -3991310, -3478142, -1358254, 51723]
36521E1723j232085l229039k548051K83335K503646J802830q47955k030689l53130
36512e599415J542515J046748l08191M31192K430538K336531R458j243428l44154
36503C01794K1771j395927j998506r6094J827327J277802j24881K34660J461068
36494A509014J129197l48359q13788k90147m09349j018819o70154K51841Q6975
36485e73589q77426q16115K68075O14975O0345K38969J245409J270023K05312
36476A635978M01091K521483L609491J296772k347092l581946k123972r92255
36468D19550j908849l256486k836124q08722R37437J335348J080218J250250J770977
36459b016401J686681P04565k30521k04854M13540N98777J04165m94431q77740
$$ y = [51723, -1180362, -4409401, -6957452, -6674117, -4170471, -2367641, -3215596, -5246285, -5599415, -4056900, -3010152, -3318343, -2887151, -456613, 1879918, 1889376, 645948, 301794, 323565, -1072362, -3070868, -3166962, -1339635, -61833, -186714, 47946, 1509014, 2638211, 2289852, 1476064, 1185917, 776568, -242251, -912405, -660564, -573589, -1451015, -2267130, -1999055, -1384080, -1323735, -1084766, 160643, 1430666, 1635978, 2037069, 4558552, 8168043, 9464815, 7117723, 3535777, 1411805, 419550, -1489299, -4745785, -7581909, -8390631, -7453194, -6117846, -5037628, -3787378, -2016401, -329720, 374845, 144324, -60530, 353010, 951787, 1055952, 561521, -316219]
36450c16219j183739j260915p29698R7610L10678k88818p84618m19808M52364
36441d123163J126749J576964K095970K347290J546278l71651k255799k694791
36433g52153j414940L92013J196115N53303o43872j194500o28749O63516J902222
36424G2955K411112K006502J059703J0929j038856j951777k187028j534671q26174
36415a977305q48064q60406L42953K015350K018599J78191j081022m01804M38164
36406a75344k93588j190420j46837J733460J560893p76414k330762j278303J100676
36397a796639K745805K860980J444235r65176k620147j759098Q71633K495447
36389C277040J848567M43234j79395l79114p75338p74929m4897K83012o09369
$$ y = [-316219, -1499958, -2760873, -3490571, -3392961, -3082283, -3371101, -4155719, -4575527, -4123163, -2996414, -1419450, 676520, 3023810, 4570088, 4198437, 1942638, -752153, -2167093, -1775080, -578965, -25662, -669534, -1864034, -2492783, -1829267, 72955, 2484067, 4490569, 5550272, 5561201, 4522345, 2570568, 383540, -1151131, -1977305, -2825369, -3685775, -3342822, -1327472, 691127, 869318, -211704, -613508, -175344, -468932, -1659352, -1806189, -72729, 1488164, 711750, -1619012, -2897315, -1796639, 949166, 3810146, 5254381, 4289205, 1669058, -90040, 781593, 3277040, 5125607, 5568841, 5389446, 5010332, 4234994, 3460065, 3415168, 3698180, 3088811]
36380C088811j593753j275291k64524k27530j335495k076635j324034M66099K000499
36371b541853K415936J869781J128048M72774o09680k049797k284768k46704K235946
36362C89683K177919l42275k072182j214174L94490P21956M13259N21647L0760
36353A021083j865342l157432j704445R36875J517719M498p65384J18521O09536
36344c284371k50369n94039Q45975K374337K040808O17872L4787L06399o3095
36335B028304j404564k361618j886804m99006O09989R65273J035842J347264J607183
36326A441863R97886m66856j368926m13189J678848K706721J522743p28458k027366
36317C343266j440953M27967K187780K595149J350900p12309k456333l342637
$$ y = [3088811, 1495058, 219767, -44757, -272287, -1607782, -3684417, -5008451, -4542352, -2541853, -125917, 1743864, 2871912, 3344686, 2735006, 685209, -1599559, -1846263, 389683, 2567602, 2225327, 153145, -1061029, -666539, 55417, 468676, 990323, 1021083, -844259, -4001691, -5706136, -4769261, -3251542, -3247044, -4012428, -3893907, -3284371, -3534740, -4128779, -3282804, -908467, 1132341, 1750213, 1785000, 2091399, 2028304, 623740, -1737878, -3624682, -4123688, -3513699, -2548426, -1512584, -165320, 1441863, 2439749, 1972893, 603967, 190778, 1869626, 4576347, 6099090, 5370632, 3343266, 1902313, 2330280, 4518060, 7113209, 8464109, 7751800, 5295467, 1952830]
36309A952830l259972k052077m1333J486479J512201P84160Q43811J675396J771652
36300D673147O45448l51230k41222R3246m61227j410751j552289p87228O4565
36291F72459N91322R13219R99801P91525O03072O17267L69269n59733j745884
36282C252317k450909k459970j810455l87735J410217K346654J757298P32645
36274B390062P48861J585530J843209J124683K68909l50985j150615j923894j825398
36265B710362j110670j149573k044521k022167k85640J242311O19836j076453
36257c116515j391279j62478P00467N31940N14401J017686R27369J21839L3331
36248h23239P65291K90233j858707k693252p9345L150373K670251r46916k913754
$$ y = [1952830, -1307142, -3359219, -3400552, -1914073, -401872, 382288, 1226099, 2901495, 4673147, 5318595, 4967365, 4726143, 4819389, 4358162, 2947411, 1395122, 607894, 672459, 1263781, 2177000, 3176801, 3968326, 4571398, 5188665, 5557934, 4998201, 3252317, 801408, -1658562, -3469017, -3856752, -2446535, -99881, 1657417, 2390062, 3138923, 4724453, 6567662, 7692345, 7961254, 7610269, 6459654, 4535760, 2710362, 1599692, 450119, -1594402, -3616569, -3902209, -2659898, -2040062, -3116515, -4507794, -4670272, -3969805, -3437865, -2923464, -1905778, -978409, -856570, -823239, -57948, 232285, -1626422, -4319674, -4399019, -1248646, 1421605, 474689, -2439065]
36239b439065j020265J864957K587622J539463M72780l68259j078791o69889J012671
36230A901224K047725J308261O22552J687155K736380J237314j572006k245687
36222G722918m71489O74582k60191j309770q99102k27456o39883j320538j118355
36213B150716n14620k52392J78663J208847J905768J417404L25415o04245j517577
36204D297979k192254j468324N35820J468214m7755j870144j296178Q04750J492610
36195A724718M33393m494Q95202R72142r25426k640256j812065O91183K163834
36186A498231J599257J83389r12520j565423j795633j316629k94029M20564L28345
36177a854448L2849M09160J242651J326768J17927j271741j350899k05029P18353
$$ y = [-2439065, -3459330, -1594373, 993249, 2532712, 3005492, 2637233, 1558442, 888553, 1901224, 3948949, 5257210, 5879762, 7566917, 10303297, 11540611, 9968605, 7722918, 7251429, 7926011, 7665820, 6356050, 5456948, 5229492, 4589609, 3269071, 2150716, 1636096, 1383704, 1562367, 2771214, 4676982, 6094386, 6419801, 5815556, 4297979, 2105725, 637401, 1173221, 2641435, 2593680, 723536, -572642, 232108, 1724718, 2158111, 2153617, 3048819, 4020961, 3095535, 455279, -1356786, -665603, 1498231, 3097488, 3280877, 2368357, 802934, -992699, -2309328, -2603357, -2182793, -1854448, -1821599, -1412439, -169788, 1156980, 1274907, 3166, -1347733, -1552762, -834409]
36168h34409P68182R18654K004236L214018L188619J810755r119j614991k675511
36159F770434k672671j532109k78005J47571K73665J049054J907020J457692j31767
36150F990884j159651q57275j91274l403j4744m4693n28128j248351j204214m52958
36140A286193m33110j569244k248901j350733j43570j70207p19158k17771J038645
36131d527856J578638J346021J466405J887181J410192R111r10778p66095m82885
36122A009934o52448p66745o47244p96263p92464O62843L123084L802972J201758
36113F145427k206954k839222n79497J497247J404055J43041n96190n39017q2791
36104B346099P56141J649849J536877J07036j188953r19021R3420k62343k296028
$$ y = [-834409, -66227, 852427, 2856663, 6070681, 9259300, 11070055, 11060936, 9445945, 6770434, 4097763, 2565654, 2287649, 2435220, 2708885, 3757939, 5664959, 7122651, 6990884, 5831233, 4973958, 4782684, 4779281, 4764537, 4719844, 4191716, 2943365, 1739151, 1286193, 853083, -716161, -2965062, -4315795, -4459365, -4629572, -5348730, -5566501, -4527856, -2949218, -1603197, -136792, 1750389, 3160581, 3169692, 2258914, 1492819, 1009934, 357486, -409259, -1056503, -1852766, -2645230, -1982387, 1140697, 4943669, 6145427, 3938473, 1099251, 519754, 2017001, 3421056, 3564097, 2967907, 2428890, 2346099, 3102240, 4752089, 6288966, 6396002, 5207049, 4288028, 4381448, 4119105, 1823077]
36095A823077l863551l229961j299817p6736J27815N55131J483503J567339J58076
36086b755124j190768o67465J266217K617498K582474K012759J394644J59337
36078E419572j594722k438815j645443m79948k72414m69790q0049J87759o93960
36069b067810j402136L33537L641745M675530J833292j737537k488568j125069
36061A662984o68329j600608j868656q87735l10692o07840L6110K306492L865447
36052A927173K659763J66647p96923j42442l972r37379j267148l38387R3126j277978
36042H2480k959736k686859o57384Q44924N51553n34646r18205l51621N20960
36033f108534J234596J602200J382591N73480k05564k30936M37440J017920R74028
$$ y = [1823077, -2040474, -5270435, -6570252, -6646988, -6519173, -5964042, -4480539, -2913200, -2755124, -3945892, -4613357, -3347140, -729642, 1852832, 3865591, 5260235, 5419572, 3824850, 1386035, -259408, -739356, -1011770, -1481560, -1561609, -1373850, -2067810, -3469946, -3136409, 505336, 5180866, 7014158, 5276621, 2788053, 1662984, 994655, -605953, -2474609, -3362344, -3673036, -4280876, -4244766, -1938274, 1927173, 4586936, 4753583, 3956660, 3814218, 3810246, 2872867, 1605719, 1267332, 1360458, 82480, -2877256, -5564115, -6221499, -5376575, -4825022, -5359668, -6277873, -6629494, -6108534, -4873938, -3271738, -1889147, -1315667, -1521231, -1752167, -1314727, -296807, 677221]
36024F77221N11009K9345m37553r20750j043027m32649M70913O66759j00444p99025
36014a378201l72654P47681J055798m6453j289352r55086J039966K915629K832906
36005D550234O59199j983165l120781j966550M53756K027845J331488r48657k582591
35996a579222k101247k89030R86657J049519P72726Q31908O72068l52800j671069
35987a680490k089016j238937K34890J547063K157553J706464M33620n51583l04791
35978B14773P18529J261501R63583N30487L00183k30154j281342k284175k747635
35969b554250k577634j370094J218171L956271M517112K414285M13o41135l46255
35960D616884r15978j984026j935361q87775k77101k3915J190923K849797K637770
$$ y = [677221, 1188230, 1217575, 780022, -140728, -1183755, -1616404, -1145491, -478732, -579176, -1378201, -1750855, -1003174, 52624, 6171, -1283181, -2238267, -1198301, 1717328, 4550234, 5209433, 3226268, 105487, -1861063, -1407307, 620538, 1952026, 1003369, -1579222, -3680469, -3969499, -2982842, -1933323, -1160597, -328689, 343379, -9421, -1680490, -3769506, -5008443, -4773553, -3226490, -1068937, 637527, 1071147, 519564, 214773, 933302, 2194803, 3158386, 3688873, 3989056, 3758902, 2477560, 193385, -2554250, -5131884, -6501978, -5283807, -1327536, 3189576, 5603861, 5604274, 4963139, 4616884, 3700906, 1716880, -218481, -1106256, -1383357, -1407272, -216349, 2633448, 5271218]
35951E271218K18699j689267j215660M2192j09212j038408p69055O56476J511191
35942B878174J130378K56073p15471j884122k686470k400275j470407o86907M01135
35933e177892K329085L592987K221827o13919j425921N23926J855051J33414k397030
35924A041528k320529j28170J024450L22405p0256R45610J714192P68425r19502
35915B378153j635595j113039l6979J141165J875179J373152p8559q38484j79526
35906B885467L40506p33128k088415j358264J113687K487866J448612k33025p26183
35897C137123n63199q82443j173617n32868K09216l08929j445757j401883k71022
35888c233379L3188q97140j039922P45070K531114J998616j48491j269965m73897
$$ y = [5271218, 5489917, 3800650, 2584990, 2627182, 2517970, 1479562, 710507, 1366983, 2878174, 4008552, 4264625, 3549154, 1665032, -1021438, -3421713, -4892120, -5579027, -5177892, -2848807, 744180, 2966007, 2352088, 926167, 1450093, 3305144, 3438558, 1041528, -1279001, -1407171, -382721, -60316, -130572, 815038, 2529230, 3297655, 2378153, 742558, -370481, -407460, 733705, 2608884, 3982036, 3903477, 3064993, 2885467, 3225973, 2492845, 404430, -953834, 159853, 2647719, 4096331, 3863306, 3137123, 2573924, 1691481, 517864, -15004, 194212, -114717, -1560474, -2962357, -3233379, -3200191, -4097331, -5137253, -4392183, -1861069, 137547, -10944, -1280909, -1754806]
35879a754806O37920O17967j68619p07362p14657l86147J86755Q28410J208265
35870b52274J294468J281776R49684j28268j564645k259065j882375j373613j458303
35861e392615j546538p95033N15344J520812K061650K441587K362956J256355
35853B424518m28830j351075q98460J34444P18571P15550N38634L32126p8245
35844B107233p77637j591824k067665j588892o136J722118K130773Q48625q69342
35835i2747j571476j119442l73981J11069M45443P77504J020578J097964Q69913
35826A164825k9818j543218k424945j141765J981614M308424L431340j12548l368913
35817B264996m038943k341793J055J595800J898204R84843k94269n70714N31810
$$ y = [-1754806, -1116886, -498919, -667538, -1374900, -2089557, -2475704, -2288949, -1460539, -252274, 1042194, 2323970, 3273654, 3145386, 1580741, -678324, -2560699, -3934312, -5392615, -6939153, -7734186, -7218842, -5698030, -3636380, -1194793, 1168163, 2424518, 1995688, 644613, -253847, -119403, 599168, 1314718, 1853352, 2185478, 2107233, 1329596, -262228, -2329893, -3918785, -3924921, -2202803, -72030, 776595, -92747, -1664223, -2783665, -3157646, -3046577, -2601134, -1823630, -803052, 294912, 1164825, 1135007, -408211, -2833156, -3974921, -1993307, 2315117, 5746457, 5633909, 2264996, -1773947, -4115740, -4114685, -2518885, -620681, 364162, 69893, -500821, 30989]
35808C0989J438365M13594j690937j980425N71894L205346K679269m83488k793150
35799A391457k425762j083863r09699j485015j087038L91550J376808R63188r4821
35790b963195p28339p72347n88507k95640J66693N88805N21322j72043q44474
35781e087725m34839J233735K679764K151846k0157j513916r91798J86516K04245
35772a592329m51563m8212J393844K130183J455659M19614l35858j357268k434458
35763h20388j982839M19674K565582K253141K58455q79742k46500Q28698J058881
35754C454962N86086J22082j03193l17954p94636j522694k007773j726778r97543
35745c307441o88014p47468j10688J302287J835927N23057j004842o76839R19176
$$ y = [30989, 1469354, 1882948, 192011, -1788414, -1216520, 1988826, 4668095, 4184607, 1391457, -1034305, -2118168, -3027867, -4512882, -5599920, -5208370, -3831562, -2868374, -2963195, -3691534, -4463881, -5052388, -5348028, -5181335, -4592530, -4071208, -4243251, -5087725, -5522564, -4288829, -1609065, 542781, 522624, -991292, -1983090, -1796574, -1592329, -2043892, -2092104, -698260, 1431923, 2887582, 3307196, 2971338, 1614070, -820388, -2803227, -2383553, 182029, 2435170, 2693625, 1813883, 1567383, 2396081, 3454962, 4041048, 4163130, 4059937, 3741983, 2947347, 1424653, -583120, -2309898, -3307441, -3995455, -4742923, -4853611, -3551324, -1715397, -1192340, -2197182, -2874021, -1954845]
35736a954845J547171Q02471L75579R53810J112151j85155j842180k235770j254059
35727b680827P977O17219L69989j78037l7713J014108J686033P70201p81813r93098
35717b05961K7249J23115j398912k444468j228614J190299K646202K529946J508603
35708B747459R8906j103623j078724K77040J461562J256447L21024j47799j32355
35699C699937m5935L38927Q88234N16029q47841j262166L63743J964780J167434
35690F783142r71992j773252j268995j520575k341893j444344R83136J652670
35682I7897p07754k980836k215055K19472J240234O16239L73722J085572J382186
35673h88323N85944l78609o28961k41429M53388J165169J254840K34985j249257
$$ y = [-1954845, -407674, 394797, 770376, 1724186, 2836337, 2651182, 809002, -1426768, -2680827, -2672850, -2055631, -1685642, -1863679, -1901392, -887284, 798749, 1568950, 787137, -205961, -178712, -55597, -1454509, -3898977, -5127591, -3937292, -1291090, 1238856, 2747459, 2846365, 1742742, 664018, 941058, 2402620, 3659067, 3980091, 3832292, 3699937, 3654002, 3992929, 4881163, 5397192, 4549351, 3287185, 3650928, 5615708, 6783142, 5811150, 4037898, 2768903, 1248328, -1093565, -2537909, -1554773, 97897, -609857, -3590693, -5805748, -5586276, -4346042, -3729803, -3356081, -2270509, -888323, -302379, -680988, -1309949, -1551378, -1097990, 67179, 1322019, 1557004, 307747]
35664C07747j908169j404491o68654m85301m95118O7591J103089J582586Q04815
35655a095905n30393r16586J18130J267008J084403j02660p97342m98477p6540
35646a548362p2302k5682J91541k05236j452593k385994j966446p72202m3705
35637h280981O0059L32055J133220J958238K115288J332749N709q99303p03764
35628b946730N3470K69263n3324J30779R21958R68136l34751j521306j065121
35619c577626L96664J127818P34490K31461K96139P07379J058980R43971n1631
35610A867645j459312j638195L43701K953696L638501J849113n25005j598707
35602E431437j257739n04032m6601K17755Q01163J705537J864905K41470k233466
$$ y = [307747, -1600422, -3004913, -3673567, -4158868, -4653986, -4586395, -3483306, -1900720, -1095905, -1626298, -2542884, -2424754, -1157746, -73343, -176003, -973345, -1471822, -1548362, -1620664, -1646346, -1454805, -1660041, -3112634, -5498628, -7465074, -8237276, -8280981, -8220922, -7888867, -6755647, -4797409, -2682121, -1349372, -1343663, -2242966, -2946730, -2893260, -2623997, -2677321, -2546542, -1624584, -656448, -991199, -2512505, -3577626, -3180962, -2053144, -1318654, -1087193, -791054, -83675, 975305, 1919276, 1867645, 408333, -1229862, -886161, 2067535, 5706036, 7555149, 7030144, 5431437, 4173698, 3669666, 3623065, 3840820, 4641983, 6347520, 8212425, 8453895, 6220429]
35593F220429l019559j118678J305313J631757L8139j318230j357314p08431j23358
35584A550068L6087n95157j630251j537243K42435J701953R11643o76035k02963
35575a99463J943148K554176O38553j243965j290954q92552j528239k110608j144502
35566c274406P38140K117410K753305K693831J339616r72109k260661j483604
35558A651522j70792J19362J36124Q89468J206294k72360k170169k071794j27916
35549h10261J516671K047253K215324J935101L58849j812630k623121j682042
35541A145144o17106n57168j059393j558784j898448j352168P61521L171939L430513
35532A466050J169976j218180j733926q79968p3994K56942K17881k69163p99783
$$ y = [6220429, 3200870, 2082192, 3387505, 5019262, 5057401, 3739171, 2381857, 1673426, 1550068, 1586155, 990998, -639253, -2176496, -1934061, -232108, 679535, 3500, -199463, 1743685, 4297861, 4936414, 3692449, 2401495, 1508943, -19296, -2129904, -3274406, -2536266, -418856, 2334449, 5028280, 6367896, 5395787, 3135126, 1651522, 1480730, 1600092, 1736216, 2625684, 3831978, 3559618, 1389449, -682345, -810261, 706410, 2753663, 4968987, 6904088, 7262937, 5450307, 2827186, 1145144, 528038, -29130, -1088523, -2647307, -4545755, -5897923, -5136402, -1964463, 1466050, 2636026, 1417846, -316080, -1196048, -1270042, -1013100, -795219, -1064382, -1864165]
35523a864165n08060M01549N02970o14692j342101l36232J387945J845543P12134
35514A84891n16454m36442R57890K388685K294752L60008j782573k272902j415382
35505b37527r66134j063776p018K266463K971013M14350k906035l413065j231286
35496d173015N98483P04042M67676Q49466Q85173j00666r98804o32947M97681
35487a902911J124584Q70396K93150j9255P0610J72719l04920j193645j227683
35478b116955L66998K255148K291562L87970j360250j555457r59283o97344o43083
35469b030694l64378k07419m01304k95299M04847P13066j18911j090200p85479
35460d175771M88373J252902J017167N36699K88556L1027l12753n65844r22853
$$ y = [-1864165, -2372225, -1970676, -1467706, -2082398, -3424499, -3760731, -2372786, -527243, 184891, -331563, -768005, 189885, 2578570, 4873322, 5233330, 3450757, 1177855, -237527, -1203661, -2267437, -2274455, -7992, 2963021, 3377371, 471336, -2941729, -4173015, -3574532, -2870490, -2402814, -1553348, -668175, -768841, -1767645, -2400592, -1902911, -778327, 92069, 385219, 365964, 436574, 609293, 304373, -889272, -2116955, -1749957, 505191, 2796753, 3184723, 1824473, 269016, -690267, -1387611, -2030694, -2395072, -2602491, -3003795, -3299094, -2894247, -2181181, -2300092, -3390292, -4175771, -3687398, -2434496, -1417329, -880630, -592074, -561047, -873800, -1439644, -2362497]
35451b362497j485515j442517r1591J513873J578536L08047j65246R42107J767231
35442E62428P86147o73036n24859P36037Q28115p02944j733155o96318J202202
35433b15383J721145N12609o57575k82565J053690J413960j55683k356565k977624
35424a943991j335351J171527K871903L254338K368628J64821k539420l621725
35416C90730j910872O44375R16841j294485k894269j609508J189687K552393J491922
35407e23186m62077j320510m44202J033290J176760n78305k186798j274506J245086
35398c334448J864406m94084k519575j173195J908425L017804J616108R4509m55593
35389E24357r22245j196164r3522J504347R70498j653835k905622j117512P46239
$$ y = [-2362497, -3848012, -5290529, -5382120, -3868247, -2289711, -1981664, -2146910, -1204803, 562428, 1348575, 675539, 150680, 886717, 1714832, 1011888, -721267, -1417585, -215383, 1505762, 2018371, 1360796, 1078231, 2131921, 3545881, 3390198, 1033633, -1943991, -3279342, -2107815, 764088, 4018426, 6387054, 6551875, 4012455, 390730, -1520142, -875767, 41074, -1253411, -4147680, -5757188, -4567501, -2015108, -523186, -985263, -2305773, -2749975, -1716685, -539925, -1118230, -3305028, -4579534, -3334448, -1470042, -1964126, -4483701, -5656896, -3748471, -730667, 885441, 979950, 524357, -397888, -1594052, -1687574, -183227, 787271, -866564, -3772186, -4889698, -4143459]
35380d143459k77868k414870k031798O68178K244653J398650L38216P07200J208325
35371b302773K08018j567459k253817j380280j2681Q26838J014210J057734J496431
35362b913779K279386K635519J947939O39432l53690p38606p73674l72652O27935
35353B977810J453554Q98841r47846k598325l056407k726367k125058r74950O95233
35344f403515J694428J048796l94923q54621J59537J427948J739061J187122O12126
35335B15959M00965K47637j19460l46367K01848J505992K595915K522471J466911
35326H691871M02583k72229j067759k165794k629913j548244M15228J460103P60867
35317D046713n03316o60143K67585N72805p86581k529843k470428l24869J863814
$$ y = [-4143459, -4421327, -6836197, -8867995, -8199817, -5955164, -4556514, -4218298, -3511098, -2302773, -2094755, -3662214, -5916031, -7296311, -7308992, -6482154, -5467944, -4410210, -2913779, -634393, 2001126, 3949065, 4588497, 4234807, 3496201, 2722527, 2349875, 2977810, 4431364, 5330205, 4382359, 1784034, -1272373, -3998740, -6123798, -7098748, -6403515, -4709087, -3660291, -4055214, -4909835, -4750298, -3322350, -1583289, -396167, 215959, 616924, 864561, 745101, 398734, 600582, 2106574, 4702489, 7224960, 8691871, 9094454, 8822225, 7754466, 5588672, 2958759, 1410515, 1825743, 3285846, 4046713, 3543397, 2883254, 3150839, 3723644, 2937063, 407220, -2063208, -2388077, -524263]
35308e24263K287421J355475N80922M72850N00986L96647K29273l72987j684714
35299C241610k703985j970686K20668J748848J213474n87783k093393k632243
35291c563490k116285m75129J602118K472212J345595l72132o96909M40135J371091
35282G206R87403k02229j102146j126285l29740O74185Q96603j55422j653151
35273b003576k077909q40090J092470K208975J820607M97703n86914q02405n81564
35264a272703n60286m35426M68477J493730Q91405j513969l247055k106319P88170
35255e493976K480675K068248J208665R49240K28596j785746l681519l459767
35247g485584j273324P45309J056186K27288k6423J223970L130662L816783K299293
$$ y = [-524263, 1763158, 3118633, 3699555, 4172405, 4673391, 5070038, 5299311, 4926324, 3241610, 537625, -1433061, -1212393, 536455, 1749929, 1162146, -931247, -3563490, -5679775, -6154904, -4552786, -2080574, -734979, -1107111, -1804020, -1363885, 7206, 994609, 792380, -309766, -1436051, -1765791, -1091606, -195003, -350425, -2003576, -4081485, -4921575, -3829105, -1620130, 200477, 698180, 111266, -691139, -1272703, -1832989, -2268415, -1799938, -306208, 585197, -928772, -4175827, -6282146, -5493976, -3013301, -945053, 263612, 1212852, 1441448, -344298, -4025817, -7485584, -8758908, -8013599, -6957413, -6730125, -6756548, -5532578, -2401916, 1414867, 3714160]
35238C714160k79042j721514j169989Q2696L83221k60259m65072N10775J667633
35229B462609J395904n22416k429832k569471j126565O7869j06982p90277o02094
35220d221255M37813J180219R31725p818q67491p48908Q25265K807569K987332
35211C324451P45216j484203j214108N03028P45165o41623j024384L12553Q70513
35202B136608m81181j038820J241286L591127K148201j841809l327319n77551
35194A850542K579131K330306l35123j907022j203504O1329L91370J52741J99395
35185D119165L48726j75089j406116k406287k372237j523288o08742Q0729O49553
35176c293586R16090P53011Q78052J900188K525257O70999k874873m165255j240575
$$ y = [3714160, 3435118, 1713604, 543615, 626311, 1009532, 749273, 284201, 794976, 2462609, 3858513, 3336097, 906265, -1663206, -2789771, -2721902, -2828884, -3619161, -4221255, -3783442, -2603223, -1671498, -1679316, -2546807, -3295715, -2470450, 337119, 3324451, 4069667, 2585464, 1371356, 1874384, 2619549, 1977926, 953542, 1266095, 2136608, 1655427, 616607, 1857893, 5449020, 7597221, 5755412, 2428093, 1850542, 4429673, 6759979, 6424856, 4517834, 3314330, 3375659, 3767029, 3919770, 4119165, 4467891, 4292802, 2886686, 480399, -1891838, -3415126, -4023868, -3943139, -3293586, -2377496, -1624485, -746433, 1153755, 3679012, 4350011, 1475138, -2690117, -3930692]
35167c930692K388803K063680j466917l047107m26212K796723K415721j040006
35159b46007l810837l731475j728565K68970J229312J350447J558056K362347
35151b747752K925726K083336L72297l50425L68014R49336M95293J30789N39480
35142D766094L01434j493845k866469j632691Q04902J104720j157247k987895
35134c160997k301209k26769J250313J642371J285511L76136l99586O793J299448
35125b27989J774514Q41671J8171L54652N65989p13097k242799j775114M72476
35116i31526K036774J649780N00043o3593j93406l14441O9911J194900J800092
35107E748534N31044j823775k826397j328672R84498J475330m86197k950911l605347
$$ y = [-3930692, -1541889, 521791, -945126, -3992233, -4418445, -1621722, 793999, -246007, -4056844, -7788319, -9516884, -9247914, -8018602, -6668155, -5110099, -2747752, 177974, 2261310, 2633607, 2283182, 2651196, 3600532, 4095825, 4226614, 4766094, 5067528, 3573683, 707214, -925477, -120575, 984145, -173102, -3160997, -5462206, -5688975, -4438662, -2796291, -1510780, -1134644, -1534230, -1527437, -227989, 1546525, 2388196, 2406367, 2761019, 3327008, 2613911, 371112, -1404002, -931526, 1105248, 2755028, 3255071, 3191478, 2998072, 2683631, 2753542, 3948442, 5748534, 6279578, 4455803, 1629406, 300734, 1285232, 2760562, 2274365, -676546, -4281893]
35098d281893k038755L03693J901270K341427J928925R59532j77338p52057l39582
35089a54778M02900L23820p37851j669861j501454m90389N58389J411741K165404
35080C07921K343272J240316p82876k253294k235427j379228q20762o14521k3859
35071d218458R52009J340225O78731j11110P1815R18290J069320l4669j391163
35062g25010j776230j292345j031040j423831j631173p98957O41237J503363J433076
35053e100910J226856J454260J536812P53257l87713o53812J56496Q77710O43992
35044E06948P9876K42508R49776J025128Q3835p95467n31629L89316M19574j053065
35034A316800k735121k737364o57480J965178L246834K650665R75307q13246k137195
$$ y = [-4281893, -6320648, -6016955, -4115685, -1774258, 154667, 1114199, 936861, 184804, -154778, 248122, 571942, -165909, -1835770, -3337224, -3827613, -3269224, -1857483, 307921, 2651193, 3891509, 3108633, 855339, -1380088, -2759316, -3580078, -4194599, -4218458, -3266449, -1926224, -1247493, -1358603, -1286788, -368498, 700822, 666153, -725010, -2501240, -3793585, -4824625, -6248456, -7879629, -8678586, -8037349, -6533986, -5100910, -3874054, -2419794, -882982, -129725, -517438, -1171250, -1014754, -137044, 506948, 586824, 829332, 1779108, 2804236, 2888071, 2092604, 1560975, 1950291, 2369865, 1316800, -1418321, -4155685, -4813165, -2847987, 398847, 3049512, 4024819, 3211573, 1074378]
35025A074378k465669j410045M21020J424447O96009n97649m53650J339000K725750
35016B753591J922427l53972j867647j548698l33271M33690M44371J39078j16452
35007A473117j20308K27106N82043L35295l90229o28735j25767j25067j421872
34998a94417k385478p59199K663499M255334K164623j160064k318188j243352
34990A022758l57641n81240n04421O43122J431745L93031j694689k663757j467918
34981c779010P80340J992471J141026o38823j156944K84236J955151J921854M71799
34972B972100p18229j087717j345054j591077j108951K6126Q95813J377274K049930
34963A470215K413540J325902m50499n61070J227484K066155J47521k457054k849208
$$ y = [1074378, -1391291, -2801336, -2380316, -955869, -259860, -857509, -1311159, 27841, 2753591, 4676018, 4322046, 2454399, 905701, 572430, 1006120, 1450491, 1589569, 1473117, 1352809, 1579915, 2161958, 2497253, 2107024, 1478289, 1352522, 1227455, -194417, -2579895, -3339094, -675595, 3579739, 5744362, 4584298, 2266110, 1022758, 665117, 83877, -420544, 222578, 1654323, 2047354, 352665, -2311092, -3779010, -2998670, -1006199, 134827, -503996, -1660940, -1376704, 578447, 2500301, 2972100, 2253871, 1166154, -178900, -1769977, -2878928, -2852802, -1956989, -579715, 1470215, 3883755, 5209657, 4759158, 4198088, 5425572, 7491727, 7639248, 5182194, 2332986]
34954B332986j250856Q0269K20055k29972q87804j396412p68883R53005J701798
34945G54186K82651j173797k75132J555578J283180n45028n87421J664152L011609
34936E969978J716289k87272j289904k209738l565254l523058j164102J125925
34928c227136R40881p04779j475850j168213p41182P4612J559710K115944M90617
34919b135396j402323q94006J115807J382931n92808j967182j214599j74042m88432
34910f370050q46752N20751K626411L038907J334006o19288j379765j341965j356677
34901d394422j276503n35933N43832R74565N91788M40599J192348J927384J441189
34892I04847K52439o4986N33320K82249j596514l361223k952748n73996J847783
$$ y = [2332986, 1082130, 1162399, 1382454, 1152482, 264678, -1131734, -1900617, -947612, 754186, 1036837, -136960, -412092, 1143486, 2426666, 1881638, 1294217, 2958369, 5969978, 7686267, 7398995, 6109091, 3899353, 334099, -3188959, -4353061, -3227136, -2286255, -2991034, -4466884, -5635097, -6376279, -6301667, -4741957, -2626013, -2135396, -3537719, -4431725, -3315918, -1932987, -2525795, -4492977, -5707576, -5881618, -6370050, -7216802, -6696051, -4069640, -1030733, 303273, -316015, -1695780, -3037745, -4394422, -5670925, -6206858, -5663026, -4688461, -4096673, -3656074, -2463726, -536342, 904847, 1157286, 1092300, 1625620, 1907869, 311355, -3049868, -6002616, -6576612, -4728829]
34883d728829K753742J748327m51377j965533j068850J304559J909189n26577
34875a025349l039871k398236L15253J670883J146405J149257K283039K206776
34867B308157j02660k155723j557450N01508J099250o04226k938660m022424l224001
34858a0696229j154808P67903J355648Q99280P70527J493266K157440K023419
34850b383554J504570J085962N09887l21076p77413n27683r2786K10360P46105
34841d5628J360724R76398p28164k344690k434394j317865l11919n7915m14853
34832e318306j075477j407174n88707J156104K281003J770253M78005j98826p6365
34823b979490K65764O70722J046342P61076l56205j193367q06992k197j23338
$$ y = [-4728829, -1975087, -226760, -678137, -2643670, -3712520, -2407961, -498772, -1025349, -4065220, -6463456, -6148203, -4477320, -3330915, -2181658, 101381, 2308157, 2205497, 49774, -1507676, -1006168, 93082, -511144, -3449804, -7472228, -10696229, -11851037, -11083134, -9727486, -8828206, -8057679, -6564413, -4406973, -2383554, -878984, 206978, 716865, 395789, -381624, -909307, -1002093, -791733, -45628, 1315096, 2291494, 1563330, -781360, -3215754, -4533619, -4845538, -4903453, -5318306, -6393783, -7800957, -8389664, -7233560, -4952557, -3182304, -2704299, -2903125, -2979490, -2713726, -2043004, -996662, -235586, -591791, -1785158, -2592150, -2594347, -2717685]
34814b717685q58776p08223O81125K028328K178987J209331j62438j263268j582443
34805a195062j008294O0769J261387K492311L217717K476357L82410j384567j652558
34796D650470j288480j389844j166452N11866K433238K280229J69576j463874
34788D736729j524684j298170j437107n97659J681975L075903J427062j797221
34780D266828l068114j230484J329558J817827J8609j984606k171756m03935J678681
34771B52608K390667J658380P85315O69681Q06557K01439j284132k765450l128866
34762d13801j925111O6420J233587P49840k78900j07428J291074K238729J774008
34753D628418P26648K7006n71208j293470j293875n4054J214063J005971k86790
$$ y = [-2717685, -3576461, -4284684, -3603559, -1575231, 603756, 1813087, 1650649, 387381, -1195062, -2203356, -2142587, -881200, 1611111, 4828828, 7305185, 7687595, 6303028, 4650470, 3361990, 1972146, 805694, 1317560, 3750798, 6031027, 6200603, 4736729, 3212045, 1913875, 476768, -120891, 1561084, 4636987, 6064049, 4266828, 1198714, -31770, 1297788, 3115615, 3134224, 1149618, -1022138, -1426073, 252608, 2643275, 4301655, 5086970, 5756651, 6563208, 6764647, 5480515, 2715065, -413801, -2338912, -2272492, -1038905, -289065, -567965, -675393, 615681, 2854410, 4628418, 5355066, 5382072, 4810864, 3517394, 2223519, 2169465, 3383528, 4389499, 4102709]
34744D102709j045015q66396q85368j716127k421967j845547m7646J874945K776841
34735g3571K164627N11696j044570j758888j891970j855127j297989K4425R86672
34726d234695J91477j621086j908068K62545K583831K450757M25119p75282j13024
34717b738426Q05935O86668N24851J594586K872786K223230k74233j981804j128379
34708B585214Q60618J415003J83263r93168r77676o54793j146346k060877k214889
34699c003651j211546M41201K126593L282928L320799K211160Q29379K578m52010
34690G547431j072235j628734j557462j067245p10059k09566R25424J833426J054345
34681E115325r46087j881715r47911p5221p00036j278403R750J749070J241085
$$ y = [4102709, 3057694, 2191298, 1305930, -410197, -2832164, -4677711, -4725357, -2850412, -73571, 2091056, 2602752, 1558182, -200706, -2092676, -3947803, -5245792, -5221367, -4234695, -4043218, -5664304, -7572372, -7309827, -4725996, -2275239, -1850120, -2625402, -2738426, -1932491, -1245823, -720972, 873614, 3746400, 5969630, 5695397, 3713593, 2585214, 3445832, 4860835, 5044098, 4050930, 3073254, 2418461, 1272115, -788762, -3003651, -4215197, -3773996, -1647403, 1635525, 4956324, 7167484, 7996863, 7999441, 7547431, 6475196, 4846462, 3289000, 2221755, 1511696, 1302130, 2227554, 4060980, 5115325, 4169238, 2287523, 1339612, 1264391, 564355, -714048, -704298, 1044772, 2285857]
34672B285857r26417j473290L33761J348211m10930k354820j085717K532220M598709
34663D847584L324536N37670j412682k050752k118125k307789k844703l145296
34655e169557k085423K91938J954964J244330o27673j279267o94084p06033j349618
34646h420423o52619J562870K709206J398262l50070m17264L75430M20373K05700
34637c168535P11297Q90509m88521j884843q16926K095484L720916K725016P26738
34628D511135p13511j725146k524721k530481j701874r80186q51295q41365o03844
34619g961288j66965P26706J989700K315826Q87387m62203P41955L500237M016999
34610E588354R99429k476130l309833j954277m55130M63222P27542k47145j994582
$$ y = [2285857, 1359440, -113850, 219911, 1568122, 1157192, -1197628, -2283345, 248875, 4847584, 8172120, 8709790, 7297108, 5246356, 3128231, 820442, -2024261, -5169557, -7254980, -6963042, -5008078, -3763748, -4391421, -5670688, -6364772, -7070805, -8420423, -9073042, -7510172, -4800966, -3402704, -3752774, -4170038, -3794608, -3374235, -3168535, -2457238, -1566729, -2055250, -3940093, -4757019, -2661535, 1059381, 3784397, 4511135, 3797624, 2072478, -452243, -2982724, -4684598, -5664784, -6516079, -7357444, -7961288, -8128253, -7401547, -5411847, -3096021, -2208634, -2670837, -1928882, 1571355, 5588354, 6587783, 4111653, 801820, -1152457, -1607587, -1144365, -416823, -663968, -2658550]
34601b658550k243900O6682K601779K649885R69588L29342J311571K017251J327062
34592F370710J01243p08774j129826j266801r40791l55503P8273N13444J243411
34583C905386J805671J524148N70199m43955j372738k135925k242013j791040
34575a80267j936339k977756l093915p74815K362456L270038J478327o65025j456103
34566c973399j376695j169107n19112Q33812K294973L205435L271463K214524
34558D781894L02512j001300n34245N85106K51432j451377k361973j611264o81557
34549a720772o54355o31688K15366J025153Q44144K30360P0589J34118r5361l43264
34539i25710l22343m59083q47520n56769R46901K549098K664737J086129r80140
$$ y = [-2658550, -4902450, -4835768, -2233989, 415896, 1385484, 1714826, 3026397, 5043648, 6370710, 6471953, 5763179, 4633353, 3366552, 2425761, 2070258, 2148531, 2661975, 3905386, 5711057, 7235205, 7805404, 7361449, 5988711, 3852786, 1610773, -180267, -2116606, -5094362, -8188277, -8963092, -6600636, -3330598, -1852271, -2517296, -3973399, -5350094, -6519201, -7038313, -6204501, -3909528, -704093, 2567370, 4781894, 5084406, 4083106, 3548861, 4133967, 4385399, 2934022, 572049, -1039215, -1720772, -2375127, -3006815, -2791449, -1766296, -922152, -691792, -621203, -487085, -582446, -925710, -1248053, -1707136, -2554656, -3111425, -2164524, 384574, 3049311, 4135440, 3155300]
34530C155300k090170j437727N43204K124604J845563L73834l42458J49520M62178
34521D783848k3401k40553K38118J55519j023410j766457j013367q4782k85469
34512G40046m65179Q64587K524990K244283K11239j357409j504453j096886o57612
34503A503606M5141N32625K61q65141n30365Q34765J378208K82174j328528k293014
34493d40268k439338j634658K32997K035571K112387O76536l11587j30673j39898
34484c8931r35610r14988R21897K671087K000279k98124j336046j62807J232491
34475C139248J002063k26153p36694k14734K31446O6796J69751J277678K407080
34466G116481J887184j36592j502408q98646K68928J826j276186j484383k02851
$$ y = [3155300, 1065130, -372597, 170607, 2295211, 4140774, 4514608, 4172150, 4321670, 4783848, 4760447, 4519894, 4758012, 4913531, 3890121, 2123664, 1110297, 1025515, 740046, 274867, 1139454, 3664444, 5908727, 6119966, 4762557, 3258104, 2161218, 1503606, 1548747, 2081372, 2081633, 1216492, 686127, 1520892, 2899100, 3181274, 1852746, -440268, -2879606, -4514264, -4281267, -2245696, -133309, 543227, 231640, 100967, -38931, -974541, -1889529, -967632, 1703455, 3703734, 3405610, 2069564, 1906757, 3139248, 4141311, 3915158, 3178464, 2963730, 3195176, 3261972, 3431723, 4709401, 7116481, 9003665, 8867073, 7364665, 6466019, 6734947, 6736773, 5460587, 3976204, 3773353]
34457C773353O92363q2954j444317j707532p52080M11892J176396J554793J607037
34448E228951J417117J168098P77223k7586r93193j389951j067374p09507p11329
34439C692449n84659J37087J145251J859880J976974J296110j24787j405653j460412
34430F532240n38176q2293o29431j032647l74135N81638O89018P9298m19746n46075
34420D259691l30035M95971J773142K435513J780216M46699p71206k068273l455482
34411D566236l600056j483129J528598L012630K497631J520702J007074L60285
34403I409971q02163j693597j571452o92039K94026R30057Q07380j47059j104976
34394E430148j038919r0460O96853R79487J360831K014750K267292J767628R62594
$$ y = [3773353, 4465716, 4382762, 2938445, 1230913, 478833, 890725, 2067121, 3621914, 5228951, 6646068, 7814166, 8591389, 8563803, 7570610, 6180659, 5113285, 4403778, 3692449, 3107790, 3244877, 4390128, 6250008, 8226982, 9523092, 9398305, 7992652, 6532240, 5994064, 5911771, 5282340, 4249693, 3875558, 4457196, 5146214, 5225512, 4805766, 4259691, 3929656, 4425627, 6198769, 8634282, 10414498, 10861197, 10089991, 8021718, 4566236, 966180, -516949, 1011649, 4024279, 6521910, 8042612, 9049686, 9409971, 8607808, 6914211, 5342759, 4650720, 4944746, 5874803, 6682183, 6535124, 5430148, 4391229, 4300769, 4997622, 5977109, 7337940, 9352690, 11619982, 13387610, 14350204]
34385A4350204J51253q45021j770292j779318o34193Q32986J804476K207239K153007
34376A6470341J572837O66085j54804r23089j818197k226796j288466N43005J816762
34367A4657678K125450K362021K736830K318666J060804L34918N61685L07837
34359B6465889j002649j526226O0055J913234J650020K12963M12444K408535L501774
34350C4096039K326429O06366L56334J613802L471206N225901N826468M291935
34342E7814480J729749J064203L413939O229500O475536M491528L189043M260837
34334H8668815O690623Q560683R015585Q586399Q500732R556068J1185034J2133902
34326A62897841J2461891J3813562J6836724J9566446J9933378J8964417J9436785
$$ y = [14350204, 14501457, 13656436, 11886144, 10106826, 9472633, 10305619, 12110095, 14317334, 16470341, 18043178, 18709263, 18554459, 17631370, 15813173, 13586377, 12297911, 12840916, 14657678, 16783128, 19145149, 21881979, 24200645, 25261449, 25596367, 26158052, 26465889, 25463240, 23937014, 23997069, 25910303, 27560323, 27773286, 28185730, 30594265, 34096039, 36422468, 37028834, 37385168, 38998970, 42470176, 47696077, 53522545, 57814480, 59544229, 60608432, 64022371, 70251871, 76727407, 81218935, 84407978, 88668815, 95359438, 103920121, 112935706, 121522105, 130022837, 139578905, 150763939, 162897841, 175359732, 189173294, 206010018, 225576464, 245509842, 264474259, 283911044]
34319B83911044K1673849K2957454K1509963J8850151J7060709J5506465J1979657
34312D13449292O062155m68648o147193j1007633j5255405j8399030k0290758
34305C47942780k1788974k3470313k4425356k3330484k0451079j7710310j6629056
34298B00137208j6696116j6049584j3680215j0790803r650715j0816359j1962892
34291A10490524j0452044o909112m677999n175828n760789l901533j631140k780949
34283F9201130o532115p654707m067965k92580r84758m254607m964230k431465
34275C8018703m63758o94454o95076P66853J206982r90482l306914l056276j626898
34266B9158680j715180k664278k021373j78665K58532r26246j242228Q9770Q03135
$$ y = [283911044, 305584893, 328542347, 350052310, 368902461, 385963170, 401469635, 413449292, 419511447, 419042799, 412895606, 401887973, 386632568, 368233538, 347942780, 326153806, 302683493, 278258137, 254927653, 234476574, 216766264, 200137208, 183441092, 167391508, 153711293, 142920490, 133269775, 122453416, 110490524, 100038480, 93129368, 88451369, 83275541, 77514752, 73613219, 71982079, 69201130, 62669015, 55014308, 50946343, 50653763, 49669005, 45414398, 40450168, 38018703, 37554945, 36860491, 36165415, 36932268, 38139250, 37148768, 33841854, 30785578, 29158680, 27443500, 24779222, 22757849, 22579184, 22837716, 21911470, 20669242, 20759012, 21562147]
34257B1562147m57334j778098j049371Q11685J424222K81296j069729j317690
34249A8407128o02382L8723l70140j866020l202791l013617j516002j77417L84393
34240H081875Q54331J319310O24987j478008l068193k242548M34801K802274L476033
34231A0804862K341906j30158k657232l270259j388654Q55322J000489n50980
34223G005296j396294o85239K03419M14528P97149J772684K067571P33908j037697
34214I875325j463483n56370L21956O33111J038448J815256K110680J069922r60928
34205A3883917k688811l091502k277205j228381o70997k81656O66517J942178
34197F254060K322048J226436l21431j044959j175271j871741l099701l333376
$$ y = [21562147, 21104813, 19326715, 18277344, 19089029, 20513251, 20794547, 19724818, 18407128, 17804746, 17843469, 17473329, 15607309, 12404518, 9390901, 7874899, 7697482, 8081875, 8936206, 10255516, 10880503, 9402495, 6334302, 4091754, 4526555, 7328829, 10804862, 13146768, 13016610, 10359378, 7089119, 5700465, 6555787, 7556276, 7005296, 5609002, 4923763, 5127182, 5541710, 6338859, 8111543, 10179114, 10913022, 9875325, 8411842, 7855472, 8177428, 8810539, 9848987, 11664243, 13774923, 14844845, 13883917, 11195106, 8103604, 5826399, 4598018, 3927021, 3645365, 4311882, 6254060, 8576108, 9802544, 9481113, 8436154, 7260883, 5389142, 2289441, -1043935]
34189a043935j782507J66839O50880j84059n43320L85824J443764J415158P13862
34180A222506L94553M52778K25652j20034J84457R85915J221781N94725M5829
34171E208162K24160N58649L15867l68529j009335j437342j472258q44481P6958
34162A251851M64338M02186Q65916J755320J522139k00146j321237l15266J061319
34153E486420L27703j682824k145581r31154p14792k225951k791494q21534J318244
34144d180963R79924o01209m23972J527089K491428J292795j90665j02969J053579
34135A845037J809981J751206J232013L00560j021148k067272k127636j445249
34127B77492q65167o31058k54704L58518M36034m85484j420015q58676J153134
$$ y = [-1043935, -2826442, -2659603, -2008723, -2192782, -2736102, -2350278, -906514, 508644, 1222506, 1617059, 2069837, 2295489, 2175455, 2359912, 3345827, 4567608, 5162333, 5208162, 5432322, 5990971, 6306838, 5938309, 4928974, 3491632, 2019374, 1174893, 1251851, 1716189, 2118375, 2984291, 4739611, 6261750, 6061604, 4740367, 4425101, 5486420, 5814123, 4131299, 1985718, 1054564, 339772, -1886179, -4677673, -5499207, -4180963, -3201039, -3802248, -4226220, -2699131, -207703, 1085092, 894427, 791458, 1845037, 3655018, 5406224, 6638237, 6938797, 5917649, 3850377, 1722741, 277492, -587675, -1218733, -1473437, -1114919, -678885, -1164369, -2584384, -3443060, -2289926]
34118b289926K758335K495514R81910k11373n88666o89907o46217q3046P13982
34109B440606Q62244K80995j21067N8460R2830n95092j454516j590946q49404
34100h75890K13805Q70102O56909p7519k32420O02196J169821K77613r87464o33936
34090I83217Q74575J029184o49501j655458n89002N89189P3872o95025J20679
34081H1730J113335n5084k225262k075717P34589L041948K812966J330414L12770
34072E071689m44013j627212k724102k847767j861175q2075J888164K849339J998718
34063B221566M27469P1508J015114J487355O65472l91891q83148j297450j743589
34054A572406j269905K65650J415283J162445J77800o58451j275567j247316L38318
$$ y = [-2289926, 468409, 2963923, 3945833, 3734460, 3145794, 2455887, 1809670, 1726624, 2440606, 3302850, 3583845, 3462778, 3521238, 3614068, 3018976, 1564460, -26486, -875890, -662085, 208017, 864926, 787407, 554987, 1157183, 2327004, 2604617, 1617153, 983217, 1857792, 2886976, 2237475, 582017, -6985, 582204, 656076, -38949, 81730, 1195065, 1139981, -1085281, -3160998, -2426409, 615539, 3428505, 4758919, 5071689, 4627676, 3000464, 276362, -2571405, -4432580, -4514655, -2626491, 222848, 2221566, 2649035, 2720543, 3735657, 5223012, 5888484, 5496593, 4613445, 3315995, 1572406, 302501, 568151, 1983434, 3145879, 3323679, 2665228, 1389661, 142345, 480663]
34045D80663K697948L080448L19685k952666l398069j031974J430901K149013
34037B775949J414703L04272k60066K67238J399726J739621P23141n93255j268104
34028F503225j652067j860108q73081J255959K130750J18205k784008l610539
34020g71664k616320k050615j930426m06498K131212K936712J317033j51282K20703
34011a321145P94550l29062k280124k986590j803080P24063L750094N495049L878039
34002E921794m34142l492422k603401J56691J034822l36611j470090j350783j153875
33993c728017j093718J65267K413442L182162J442449l99640m0501J055635j10700
33984B886379l223004m693807k605238P75794K276548J722528J138521J381249
$$ y = [480663, 3178611, 6259059, 6578744, 3626078, 228009, -803965, 626936, 2775949, 4190652, 4494924, 4234858, 4502096, 5901822, 7641443, 8364584, 7771329, 6503225, 4851158, 2991050, 2117969, 3373928, 5504678, 5622883, 2838875, -771664, -3387984, -5438599, -7369025, -7775523, -5644311, -2707599, -1390566, -1541848, -1321145, -526595, -855657, -3135781, -6122371, -7925451, -7201388, -3451294, 2043755, 5921794, 5487652, 1995230, -608171, -451480, 583342, 246731, -1223359, -2574142, -3728017, -4821735, -4656468, -2243026, 939136, 2381585, 1981945, 1941444, 2997079, 2886379, -336625, -5030432, -7635670, -6859876, -4583328, -2860800, -1722279, -341030]
33976c41030J489725R10840M12969N13482O31418M29045N88945J379337J701100
33967G715831P26425n44875p47966l68715q98019k255341k801800j871592o42753
33958a688805k36820l98836m40598k01450L46353J252306J936935J557762M44860
33949B571707o859O84907J436267J378347R72360P77219N11465R2118J78525P50788
33939I346844N67531q39862j999042j591710l96589K59499O19115J354187J614170
33930H934143L48802j337165j453058k01060N10817K71054M10472J070204O60751
33921I214960j168292k459732j921999r50220j352431k622699k888513j506492
33913e655418M88674J762819J674892O51917J14265J081345K485446K197251J99743
$$ y = [-341030, 1148695, 2059535, 2472504, 2985986, 3617404, 4046449, 4635394, 6014731, 7715831, 8442256, 7897381, 7149415, 6780700, 5882681, 3627340, 825540, -1046052, -1688805, -1925625, -2324461, -2765059, -2966509, -2620156, -1367850, 569085, 2126847, 2571707, 2564848, 3249755, 4686022, 6064369, 7036729, 7813948, 8325413, 8417531, 8596056, 9346844, 9914375, 9074513, 7075471, 5483761, 5087172, 5346671, 5965786, 7319973, 8934143, 9282945, 7945780, 6492722, 6291662, 6802479, 7073533, 7484005, 8554209, 9214960, 8046668, 5586936, 3664937, 2714717, 1362286, -1260413, -4148926, -5655418, -5166744, -3403925, -1729033, -1077116, -962851, 118494, 2603940, 4801191, 5000934]
33904E000934r93619k5734J072080p5664k476035l161581j332396J007665K062918
33895A078568J893285J191582K37413p28933j451482k082509k597645k109647
33887d569368j13494J967502K180303Q39408P0934N08697N49577o01006j359007
33878e26454l96169J037081J029835r6935n58429J15514P97426P70619M13238
33869B585726N8593m02050p59793n54337n650J79738K2997K33596P94819P13464
33859B867103l98782j513793j608286j082078r32598j079562n11285J023597K383657
33850h52027K362190J070150l60829j073768j061203o78400j46507L55956N59039
33841A74601L63423p993l76156q37613j275841r92040M87821K296952K709406
$$ y = [5000934, 4007315, 3981581, 5053661, 4977997, 2501962, -659619, -1992015, -984350, 1078568, 2971853, 4163435, 4400848, 3671915, 2220433, 137924, -2459721, -4569368, -4682862, -2715360, -535057, 304351, 375285, 883982, 1433559, 832553, -526454, -922623, 114458, 1144293, 1047358, 488929, 604443, 1401869, 2172488, 2585726, 2644319, 2242269, 1482476, 928139, 922489, 1102227, 1125224, 1358820, 2153639, 2867103, 2468321, 954528, -653758, -1735836, -2668434, -3747996, -4259281, -3235684, -852027, 1510163, 2580313, 2219484, 1145716, 84513, -593887, -740394, -384438, 174601, 538024, 530031, 153875, -683738, -1959579, -2951619, -2463798, -166846, 2542560]
33832B542560J072248j266919k345891j543311J60460J474928J868179J519692
33824C481946P20862m03729j558540j909375o93954J422876K337988Q56781j408107
33815B846748j853467l96573O01956J12339j19175J077211J843258K55320k076662
33806B290955k134300j98063O20177o90551j676748n09543J428872K147950J758195
33797C036944J146569J04780j482034k320476j449079J2654N29093K97085J04726
33788a9738m87681j787311k159119j40808K478651K466419k28913k328279j799588
33779d006367J165J165052J633853J919946J735835J044485N55647J38540j290337
33770B897819l179331k884310M81186L791930L768713J479409L75866R93795O62450
$$ y = [2542560, 3614808, 2347889, 1998, -1541313, -1380853, 94075, 1962254, 3481946, 4202808, 3799079, 2240539, 331164, -362790, 1060086, 3398074, 4254855, 2846748, 993281, 596708, 1198664, 1311003, 1191828, 2269039, 4112297, 4367617, 2290955, 156655, -41408, 578769, -111782, -1788530, -2298073, -869201, 1278749, 3036944, 4183513, 4288293, 2806259, 485783, -963296, -950642, -421549, -124464, -19738, -507419, -2294730, -4453849, -4594657, -2116006, 350413, 121500, -2206779, -4006367, -4005202, -2840150, -1206297, 713649, 2449484, 3493969, 4049616, 4188156, 2897819, -281512, -3165822, -2684636, 1107294, 4876007, 6355416, 6731282, 7725077, 8387527]
33761H387527j775716m009972l726210j627526J16943O69298N58992K24758k18474
33752a400380n15404n78398q01020j402238j887005j630644n86247Q47092K116424
33743e837820K522454J692957L17355l68133j11921J72514K1452J54018J075196
33734c61928K021392K055189J303119L64944n62660j206704r91625k73104n03964
33725A844659j806570j813026R95536L973227L197518p08380k907970j110380
33717A664614J320454O92699j572290j629182P22902K176686J328996L23274O38311
33708E666464N47871j618904m126327m027105j419515P67755Q07053n2749p518
33699c462975Q66805J343874R88846L47546j52608m71763l79599M20820J458680
$$ y = [8387527, 6611811, 2601839, -1124371, -2751897, -2634954, -1965656, -1406664, -1181906, -1400380, -1915784, -2494182, -3295202, -4697440, -6584445, -8215089, -8801336, -7954244, -5837820, -3315366, -1622409, -1305054, -1673187, -1785108, -1612594, -1591142, -1437124, -361928, 1659464, 3714653, 5017772, 5382716, 4820056, 3613352, 2621727, 2348623, 1844659, 38089, -1774937, -779401, 3193826, 6391344, 5682964, 2774994, 1664614, 2985068, 3677767, 2105477, 476295, 1199197, 3375883, 4704879, 5028153, 5666464, 6214335, 4595431, 469104, -3558001, -4977516, -4209761, -3402708, -3455457, -3462975, -2596170, -1252296, -263450, 84096, -68512, -540275, -919874, -499054, 959626]
33690I59626J582401L40402j153146j241127M71705K594494L166974J376183j589071
33681F508441l275066k143485N40107J608035m56367l388454l652593p74913K224733
33672b809562K790176J600975P55008P32252M50028o18519j772231k115839j276904
33663b264616M54901J897717J617680k07853j407905n43980Q79727N59987j059481
33654g3823j512352k13243P84748K06466o26034k07244R39908J552453J461433
33645B312312J014454J31482r24756j152702k89551N44390O45478P60776J276846
33636D318729J032525o11371k116915j959947j041107r10046r35313L51405K107464
33627B35424K096219K92447j091718j066513p56363p46465k36569O68259N05951
$$ y = [959626, 2542027, 2882429, 1729283, 488156, 959861, 3554355, 6721329, 8097512, 6508441, 3233375, 1089890, 1629997, 3238032, 2781665, -606789, -4259382, -5034295, -2809562, -19386, 1581589, 2336597, 3068849, 3518877, 2900358, 1128127, -987712, -2264616, -1809715, 88002, 1705682, 1497829, 89924, -454056, 425671, 985658, -73823, -1586175, -1799418, -1014670, -808204, -1434238, -1641482, -701574, 850879, 2312312, 3326766, 3458248, 2533492, 1380790, 1091239, 1635629, 2281107, 3041883, 4318729, 5351254, 4739883, 2622968, 663021, -378086, -1288132, -2223445, -1872040, 235424, 2331643, 2624090, 1532372, 465859, -290504, -1036969, -1273538, -605279, -99328]
33618i9328p52576r47753R00947K680656K275841O60145l6523J5850q52581k439369
33608A405309k546911k77758K467025L307010J949654q7062j410561j791999j764995
33599A249712j810642j954422j886466j299884j62266J093030J599714P51759
33591b419465q16183j478644m32358J234198J986299J760125J455406J145755
33583B435133K16497j024334j448065q31046m1407M77056R05906Q74303o4903
33574A499140q00286K45402K066384J702270j206402l197203j843121P42413J346684
33565E55281K75471j36603K33847k77749j535201j678198m54036M61494M96114
33556b059580Q19705J687614J749326O12839k56122k2550K14941m62951j272470
$$ y = [-99328, -851904, -1799657, -898710, 1781946, 4057787, 4717932, 4681409, 4697259, 3844678, 1405309, -1141602, -1419360, 1047665, 4354675, 6304329, 6217267, 4806706, 3014707, 1249712, -560930, -2515352, -4401818, -5701702, -5863968, -4770938, -3171224, -2419465, -3235648, -4714292, -5146650, -3912452, -1926153, -166028, 1289378, 2435133, 2651630, 1627296, 179231, -651815, -693222, -216166, 689740, 1564043, 1499140, 698854, 944256, 3010640, 4712910, 3506508, 309305, -1533816, -791403, 555281, 830752, 694149, 927996, 650247, -884954, -2563152, -3017188, -2555694, -2059580, -1239875, 447739, 2197065, 2809904, 2553782, 2531232, 2746173, 2283222, 1010752]
33547A010752j335872j079085r20802k22157J156236J765242O15886q60298o30873
33538e00971R60722J832616J328990Q39747J157687J081153m93460k420918k581671
33529A203895p55083J123786J599355J302464J371261J457130N57716q47407j178079
33520E835038k55952L22907j72012l29279J004065K604107K640608J357880K93217
33511A3300579k12080q06814j147154k82732J232111J766551J240057J259556
33503A6350074K323490K944365K198125J228435J260582J747071J603536J002511
33495C0658189Q43438J425717K509262L731729M275454L251939J183114r7660
33487D7781182J26038M05418m85081j526199j268708m27788p80670k224773k980649
$$ y = [1010752, -325120, -1404205, -2325007, -2547164, -1390928, 374314, 990200, 129902, -500971, 459751, 2292367, 3621357, 4461104, 5618791, 6699944, 6206484, 3785566, 1203895, 448812, 1572598, 3171953, 4474417, 5845678, 7302808, 7860524, 7013117, 5835038, 5579086, 5901993, 5729981, 5400702, 6404767, 9008874, 11649482, 13007362, 13300579, 13088499, 12281685, 11134531, 10851799, 12083910, 13850461, 15090518, 16350074, 18673564, 21617929, 23816054, 25044489, 26305071, 28052142, 29655678, 30658189, 31501627, 32927344, 35436606, 39168335, 43443789, 46695728, 47878842, 47781182, 47907220, 48312638, 47827557, 46301358, 45032650, 44604862, 43824192, 41599419, 38618770]
33478C8618770k510775k217431k918478l460794k700396j469961j351129k282689
33470A9707117k719408j932986q53299l45321J03131J046194J381397l77476l301225
33461A2708124m446206k743223o63180o51990j583076q50344J294816K319130
33453E384051J804396K003408L464473L360693j01328m129924m570543j221997
33445E993229K279055L023508J328805p89472j845180j634965r85794p85528q08817
33436E774841j59551P67518K39105j899027k990864j106369J608625J592795r13743
33427B913330k129756k42297K113237J760687q84759k982918k987381j636341
33419d076198j86462P74159J062973P38739L51452N51016J185231J284219K53862
$$ y = [38618770, 36107995, 33890564, 30972086, 27511292, 24810896, 23340935, 21989806, 19707117, 16987709, 15054723, 14201424, 13856103, 13959234, 15005428, 16386825, 16009349, 12708124, 8261918, 5518695, 4855515, 4203525, 2620449, 1770105, 3064921, 5384051, 7188447, 9191855, 12656328, 16017021, 15915693, 11785769, 7215226, 5993229, 8272284, 11295792, 12624597, 11835125, 9989945, 8354980, 7369186, 6583658, 5774841, 5615290, 6382808, 6621913, 4722886, 1732022, 625653, 2234278, 3827073, 2913330, 783574, 541277, 2654514, 4415201, 3530442, 547524, -2439857, -4076198, -4262660, -3488501, -2425528, -1686789, -1335337, -784321, 400910, 1685129, 1938991]
33410A938991j204826j767565j021600J24888P13723Q32296R41827P44715k60476
33401A041973j429983j505809n51529L5862k46111k71391O07454J289512P87274
33392b42748n6072j2190N66016O70217M86127O91825P27270m31348k158649k529202
33382b288754p87118J718251K982061J940744q18499l065360k532941L24723K191662
33373c35231Q86735j692584k396539j263010o46735r36355l35829J239611J434353
33364d045584n51552k174026j166247J339571K833596K687316J810800O49818
33356A383692p04543j464143q93745L72194R65493M14989o02416j191026q77063
33347b596568J42501J005634J031198P05136R81948J558376J053603q12837k520352
$$ y = [1938991, 734165, -1033400, -2055000, -1930112, -1216389, -384093, 557734, 1302449, 1041973, -388010, -1893819, -2445348, -2409486, -2655597, -2926988, -2319534, -1030022, -242748, -298820, -311010, 255006, 925223, 1411350, 2103175, 2830445, 2399097, 240448, -2288754, -3075872, -1357621, 1624440, 3565184, 2746685, -318675, -2851616, -2526893, -335231, 551504, -1141080, -3537619, -4800629, -5447364, -6383719, -6719548, -5479937, -4045584, -4597136, -6771162, -7937409, -6597838, -3764242, -1076926, 733874, 1383692, 679149, -784994, -1678739, -1306545, -341052, 73937, -528479, -1719505, -2596568, -2454067, -1448433, -417235, 287901, 1269849, 2828225, 3881828, 3068991, 548639]
33338E48639k693235j538061Q3308J664987K599137K152797O88236l74614n40589
33329B590605q15095j558678j454531J30481J342849K09787k175042k739021l67216
33320d835861K806285M023626K673449L62955r84112r64611q93224j980191l424471
33311c216155l194809q52720J620378K357451J729229J115647P62441M1268j006602
33302f43872j630910j439495o12282N12647J382209J307256K48251r68053j614070
33293c458319j606727r51759K84388J236221Q83642j51461q5255J150661J434516
33284a264093j62493j615650j074336K76024M67484P2311Q49011K394287K748156
33275B690701J533062O6567j018282j922814k067196q13338N78008K33108j249410
$$ y = [548639, -2144596, -3682657, -3599349, -1934362, 664775, 2817572, 3505808, 3131194, 2590605, 1775510, 216832, -1237699, -1107218, 235631, 445418, -1729624, -4468645, -4835861, -2029576, 1994050, 4667499, 5030454, 4046342, 3081731, 2188507, 208316, -3216155, -6410964, -7263684, -5643306, -3285855, -1556626, -440979, 321462, 362730, -643872, -2274782, -3714277, -4326559, -3813912, -2431703, -1124447, -876196, -1844249, -3458319, -5065046, -6016805, -5732417, -4496196, -3612554, -3764015, -3849270, -2698609, -1264093, -1426586, -3042236, -4116572, -3840548, -3373064, -3300753, -2451742, -57455, 2690701, 4223763, 4290330, 3272048, 1349234, -717962, -1531300, -953292, -720184, -1969594]
33266a969594j482716k8084J105101Q57561L70956L70676j0966r04148p87780
33257b478994P32651J529476J02030j718901j283650Q87667J826515L65829j329610
33248a366987q00707J500794K834660J538365r85622j995138p66408O86264N18719
33239A163940n05336n42874L56102M88943o83379j749863j492177k81863R10835
33230b335672J563598J434855O09813j18774j14859r8352j064957k139641j369247
33221c633236J105748K676098J761943j09728o58423K69392J215747J232932M71388
33212D331861l75532m70618M17745J189428N94779o88812p96603K13090R4476
33203D509814j949984l626918k907852r46624J02134L14085R38905J636869J179158
$$ y = [-1969594, -3452310, -3480394, -2375293, -1517732, -1146776, -776100, -787066, -1691214, -2478994, -1746343, -216867, -114837, -1833738, -3117388, -2229721, -403206, -37377, -1366987, -2167694, -666900, 2167760, 3706125, 2720503, 725365, -41043, 645221, 1163940, 658604, 115730, 471832, 960775, 277396, -1472467, -2964644, -3246507, -2335672, -772074, 662781, 1272594, 1153820, 1038961, 940609, -124348, -2263989, -3633236, -2527488, 148610, 1910553, 1800825, 1142402, 1411794, 2627541, 3860473, 4331861, 3956329, 3485711, 3903456, 5092884, 5687663, 4998851, 4202248, 4415338, 4509814, 2559830, -1067088, -3974940, -4921564, -4819430, -4505345, -3566440, -1929571, -750413]
33194g50413l2228m71026J3046K66992K0255O9143N45915P99765P99659R82884
33184B243992R57652O1227j024247j008452k07679j36122q54041p28055P69689
33175G3964J924758J190993p76549k255992k361990j201403N76883J700536J009752
33166a19048q96795j848266p43732J030699J607099R13568j0880p75735j375895
33157b218985j164338K43472J601906J313221j40268p83701j79675N8785p63341
33148b032924j043072L02551J506903M50126j736382k042296j20013J210678L39768
33139c164661r27026o75646J03918k11744o02607R00654L381715L866095J738213
33130D408911m52328q72663m59779m24516l06212K32887R814j505427k463367
$$ y = [-750413, -782641, -1253667, -1240621, -973629, -953374, -884231, -338316, 461449, 1261108, 2243992, 3201644, 3262871, 2238624, 1230172, 1022493, 886371, 32330, -695725, 73964, 1998722, 3189715, 2413166, 157174, -2204816, -3406219, -2829336, -1128800, -119048, -1015843, -2864109, -3607841, -2577142, -970043, -56475, -67355, -843090, -2218985, -3383323, -3139851, -1537945, -224724, -364992, -1148693, -1328368, -1269583, -2032924, -3075996, -2773445, -1266542, -816416, -2552798, -4595094, -4715107, -3504429, -3164661, -4091687, -4767333, -4663415, -4875159, -5477766, -4577112, -1195397, 2670698, 4408911, 3956583, 3083920, 2624141, 2199625, 1893413, 2126300, 2136114, 630687, -1832680]
33121a832680j160137J018825J384556j06411r00630L72402K185131K476128J156261
33112D593445l39128r66770q81763p73397q32977m63674P89184K117602K010017
33103E252539K34733j558736j764079n95210O12616J050323P55157J67257N7781
33094D212381R58225J966640J288022j151525k982121k493318j063514r14417
33086a79627j770111j721552l46654J228354K541220L685798L630957J322325
33078H390710j722307k656374j384437p56856k167820l595138k956875r64874
33070g813971O19429J393182J569437Q36175m19079n00806J184984K551179J488624
33061I09154j081291k616197k344912j352464k16914J258300K429205K160953
$$ y = [-1832680, -2992817, -1973992, -589436, -695847, -1596477, -1224075, 961056, 3437184, 4593445, 4254317, 3287547, 2405784, 1632387, 799410, 335736, 1124920, 3242522, 5252539, 5487272, 3928536, 2164457, 1569247, 2181863, 3232186, 3987343, 4154600, 4212381, 5170606, 7137246, 8425268, 7273743, 4291622, 1798304, 734790, -179627, -1949738, -3671290, -4017944, -2789590, -248370, 3437428, 7068385, 8390710, 6668403, 4012029, 2627592, 1870736, -297084, -3892222, -6849097, -7813971, -7194542, -5801360, -4231923, -3395748, -3814827, -4315633, -3130649, -579470, 909154, -172137, -2788334, -5133246, -6485710, -6702624, -5444324, -3015119, -854166]
33053h54166Q96098M77065J512550K472088J906137K66089j064905j462989j149297
33044B998670m97661Q806k09740j087604j577128q04395N84802R65920j91808
33035A89862j394306q34623J195313K411254J345368p26810j444784m04560O27425
33026I64139L98492l33249l76477J77816O88108J283746K202260K537324J145452
33017H687611j339396k753045j961035k07372M78785m81580j943273k424072j366829
33008c310206N63342K037771K152480J232585L64114m14n69385j980193l390145
32999b900051l027990l64649K777092L806243J987070r00834k520511k164392
32991c308022q42668K91302J031987J740029K437070K606950J815607L66793p62027
$$ y = [-854166, 41932, 518997, 2031547, 4503635, 6409772, 6675861, 5610956, 4147967, 2998670, 2501009, 2509815, 2300075, 1212471, -364657, -1169052, -584250, 381670, 189862, -1204444, -2039067, -843754, 1567500, 2912868, 2186058, 741274, 336714, 964139, 1362631, 1029382, 652905, 830721, 1518829, 2802575, 5004835, 7542159, 8687611, 7348215, 4595170, 2634135, 2426763, 2905548, 2423968, 480695, -1943377, -3310206, -2746864, -709093, 1443387, 2675972, 3040086, 3039672, 2470287, 490094, -2900051, -5928041, -6292690, -3515598, 290645, 2277715, 1376881, -1143630, -3308022, -4150690, -3859388, -2827401, -1087372, 1349698, 3956648, 5772255, 6139048, 5377021]
32982E377021p41148L12826J382272J342231k39945k674124m235456l314015l41983
32973c132321J858344R51104j762798k649532m81635K035174K352027J551570
32965G21933J890557K698643J531131j401672l021625j844178J8227J66569r31342
32956a71757j274565k19873J195892J798621J221036N4983m59718K90119J200026
32947C634764P32485p53853j480083j051399p98442j001585j51476K074843L475262
32938D680516K474290N26604m08839q35690k003790k979648k109122k76168J28235
32929h03612j011498j483787m07315O29294M57634L2229M31062J023105P09455
32920d23433k71979q06256m26287L34556O67390K34193m39421l40235P79200J766400
$$ y = [5377021, 4635873, 4948699, 6330971, 7673202, 7433257, 4759133, 523677, -2790338, -3132321, -1273977, -322873, -2085671, -4735203, -5216838, -3181664, -829637, 721933, 2612490, 5311133, 6842264, 5440592, 2418967, 574789, 593016, 759585, -171757, -1446322, -1666195, -470303, 1328318, 2549354, 2604337, 2144619, 2434738, 3634764, 4367249, 3613396, 2133313, 1081914, 283472, -718113, -869589, 1205254, 4680516, 7154806, 7681410, 7272571, 6436881, 4433091, 1453443, -655679, -931847, -803612, -1815110, -3298897, -3706212, -3076918, -2619284, -2587055, -2155993, -1132888, -423433, -695412, -1501668, -1927955, -1593399, -926009, -691816, -1131237, -1471472, -692272, 1074128]
32910A074128J373270r3507j238082j374189r01308j79558Q01867J671153J739420
32901B873194J044713M50105M57992N81066P1443j143231k251478k125417n47203
32892e88816R65317N16997j501053k403605p84521J397607J745092Q54889P27068
32883I28975J147114M81320p45780l52179J484960K082263P27842r453J323599
32874G068661K535645J543235j91756m54099j43152j330515l104405k755974m33409
32865B734231P32580o42089k294949j972342m79565K65352K60590P17192J545477
32856H66477J501003M41379l26128j45125J8492o46841j221314l67904J414780
32847A534819K195423J222243j32564l98759J51277L43787j72880r18375j547191
$$ y = [1074128, 2447398, 2353891, 1115809, -258380, -1159688, -1339246, -537379, 1133774, 2873194, 3917907, 4368012, 4826004, 5407070, 5478513, 4335282, 2083804, -41613, -588816, 376501, 893498, -607555, -3011160, -3795681, -2398074, -652982, 201907, 928975, 2076089, 2557409, 1811629, 1459450, 2944410, 5026673, 5754515, 5745062, 7068661, 9604306, 11147541, 10955785, 10501686, 10358534, 9028019, 5923614, 3167640, 2734231, 3466811, 2824722, 529773, -1442569, -1922134, -1656782, -1396192, -679000, 866477, 2367480, 2808859, 2482731, 2337606, 2356098, 1709257, 487943, 120039, 1534819, 3730242, 4952485, 4819921, 4421162, 4572439, 4916226, 4743346, 3824971, 2277780]
32838B277780j864641j463276l33988O22319O25105Q2102k56182n48618j189062
32829b048461j592144r80454J97778R74081J299876J355193M15976j639225k724574
32820d741954j051186J499248J619672j79457k83921J815637K347509l00241k367495
32811a642188o60798K156105J911646m60601j050053L23304L72889j479074k004564
32802b533334K85485K659441K483838P44207k48887q4298L32013N37431L26254
32793D502150n34182j357645r47215K10287N6168j701379k436372l49350K481344
32784g6194K793785N62967j416614j519762o75190j24696N2073n1060p98937j971570
32774c225198k360484j222261N92519J570516J096459l08979j756138k486917
$$ y = [2277780, 413139, -1050137, -1384125, -761806, -136701, -54599, -310781, -859399, -2048461, -3640605, -4621059, -4423281, -3449200, -2149324, -794131, -378155, -2017380, -4741954, -5793140, -4293892, -2674220, -2853677, -3137598, -1321961, 1025548, 725307, -1642188, -2302986, -146881, 1764765, 1304164, 254111, 577415, 950304, -528770, -2533334, -2247849, 411592, 2895430, 3639637, 3390750, 3306452, 3638465, 4175896, 4502150, 3967968, 2610323, 1663108, 1873395, 1929563, 228184, -2208188, -2557538, -76194, 2717591, 3280558, 1863944, 344182, -331008, -455704, -403631, -454691, -1253628, -3225198, -5585682, -6807943, -6215424, -4644908, -3548449, -3857428, -5613566, -8100483]
32766h100483k028013m86963J312788K348322K141211R81796l55805r98173m62403
32757e647723P93552J520962R40489k05979n11548J23789K44484r81754k206430
32748e930158j455347J252659L869616M651279L530981J403880p49639k024262
32740D549009k117602j883613k223331k408555j006268J370929K185806N76297
32732i57328j164455r36072K71941N26748J79350O64474J491188J173721L45088
32723A594655R58206K537469K251714o99351l488392l525335j660681k38090J07503
32714b162302J72996K44512J08538L4551L29902O29507O95985J059289J796532
32705B909510J698222J1006j860315j981836o47245J77535j24687j71185Q70159
$$ y = [-8100483, -10128496, -10615459, -9302671, -6954349, -4813138, -3831342, -4187147, -5185320, -5647723, -4854171, -3333209, -2392720, -2598699, -3110247, -2986458, -2741974, -3723728, -5930158, -7385505, -6132846, -2263230, 2388049, 5919030, 7322910, 6573271, 4549009, 2431407, 547794, -1675537, -4084092, -5090360, -3719431, -1533625, -957328, -2121783, -3057855, -2785914, -2259166, -2079816, -1415342, 75846, 1249567, 1594655, 2552861, 5090330, 7342044, 6642693, 3154301, -371034, -2031715, -2269805, -2162302, -1989306, -1744794, -1636256, -1601705, -1271803, -642296, 53689, 1112978, 2909510, 4607732, 4618738, 2758423, 776587, 129342, 306877, 182190, 11005, 881164]
32696H81164J839690J439973J71785o28488p56677r44657j221432p99159L90823
32687C73022J257025J092048O12046P50508J150995Q12228k49605j130254j617692
32678C050321k330318l152245k950499j420512O3101K76440k45002l19300K05951
32669f822063Q70818J578189J971286J042512j091139k181898o03784J792307
32661c443772J902074j28545j278077m36048J21338j218484k590057j401028J976794
32652f495805M811541N096591K949198O6844j383892n22733R46775M82127j849621
32643D101025l373528k693819j339255o66780K45734J989330K693836R05935j467251
32634C95227j806298p21825m69445q69371j24881J222348Q10502j221568j993187
$$ y = [881164, 2720854, 4160827, 4332612, 3704124, 2947447, 2002790, 781358, -17801, 373022, 1630047, 2722095, 3334141, 4084649, 5235644, 6047872, 5798267, 4668013, 3050321, 720003, -2432242, -5382741, -6803253, -6740152, -6463712, -6708714, -7028014, -6822063, -5951245, -4373056, -2401770, -1359258, -2450397, -4632295, -5236079, -3443772, -1541698, -1670243, -2948320, -3384368, -3263030, -4481514, -7071571, -8472599, -6495805, -1684264, 3412327, 6361525, 6428369, 5044477, 4521744, 5468519, 5950646, 4101025, 727497, -1966322, -3305577, -3972357, -3726623, -1737293, 956543, 1862478, 395227, -1411071, -2132896, -2602341, -3471712, -3596593, -2374245, -1563743, -2785311, -4778498]
32625d778498m21062J302666J581239J535316J975781J407353r30242k690131
32617a017578j656798N90655J062967Q0093N16292K785691L727569J202286k670827
32608D620350m265571k876734q31088k3222K0791O77869K189269L633556M108262
32599G253482L203639Q18679k475558m916902m545459j403431J927782K834883
32591B697115J388697k23068o33657n40496r22024j279964n29728J022308J728831
32582B708014P20072q77955j357495n78402O9046k36215o64969k48424M50535
32573a5793K54301o02222q08354k27276j55305r63256j213544n0810J126763P99548
32563a855948j38195K63870J917103K836635K063057O85067o8251k06042k30393
$$ y = [-4778498, -5199560, -3896894, -2315655, -780339, 1195442, 2602795, 1672553, -1017578, -2674376, -2083721, -1020754, -940661, -424369, 2361322, 6088891, 7291177, 4620350, 354779, -2521955, -3353043, -3376265, -3355474, -2677605, -488336, 3145220, 7253482, 10457121, 11275800, 8800242, 3883340, -662119, -2065550, -137768, 2697115, 4085812, 3862744, 3229087, 2688591, 1766567, 486603, -43125, 979183, 2708014, 3428086, 2550131, 1192636, 614234, 683280, 447065, -217904, -466328, -15793, 238508, -363714, -1172068, -1399344, -1554649, -2517905, -3731449, -3782259, -2655496, -1855948, -1994143, -1730273, 186830, 3023465, 5086522, 5771589, 5703338, 5497296, 5266903]
32554E266903k97545m07902m67758r2455P64863J196512M52617o04071n21822
32545E289342M22434N23120o33051j460186q87540N604k81736j529528k333405
32536h84946j969193r19071p7140K4289m20622o98096n00622l60509m83723J80742
32526f108891K314761M188912L266947l9417k348461j670646K00839O26124m06712
32517B3456j082598n80434L83409R10367O82455J06573L18845J968148L573057
32508F303278K726966l74948k606079k189285j065338j341934j775293l55860
32500f78493J553459R77249j764593l293594k145805m18893j27765o82166o88195
32491g268796Q3197J335573K851436L717501K819017Q24667j57192L78639N79140
$$ y = [5266903, 4969358, 4561456, 4093698, 4001243, 4766106, 5962618, 6415235, 5811164, 5289342, 5711776, 6234896, 5601845, 4141659, 3254119, 3259723, 2977987, 1448459, -884946, -2854139, -3773210, -3850350, -3826061, -4246683, -4944779, -5445401, -5805910, -6289633, -6108891, -3794130, 394782, 3661729, 3622312, 1273851, -396795, -195956, 430168, 23456, -1059142, -1639576, -1256167, -345800, 336655, 443228, 762073, 2730221, 6303278, 9030244, 8655296, 6049217, 3859932, 2794594, 1452660, -322633, -678493, 874966, 1852215, 87622, -3205972, -5351777, -5770670, -5898435, -6580601, -7268796, -7185599, -5850026, -2998590, 718911, 3537928, 4362595, 4205403, 4584042, 5163182]
32482E163182n83999j473963n59064Q55734O33837p26968q41888Q33704K079419
32473E379994R72266j602635l148739k492675q49470j02262n30602p56068K0526
32464c109665O44292k12194j591200j218300J068644K683917J782903k16161p51447
32455i19211M59983J503652J003400n91046k039347k423302j420263M89535K068728
32446a867871K279561J206012k88885j413274j586124m84681J266953K098447
32438A210138J166001m04379r13975l33182n9596p13102j403016j214833k64719
32429b930663R44558K126155K744460J948411k71759k446088k953278j820714
32421b658918n72061k43007j17907J120114L217162M118827K417192n46009k050421
$$ y = [5163182, 4579183, 3105220, 2546156, 3401890, 4035727, 3308759, 2466871, 3300575, 5379994, 6352260, 4749625, 1600886, -891789, -1741259, -1843521, -2374123, -3130191, -3109665, -2465373, -2677567, -4268767, -5487067, -4418423, -1734506, 48397, -167764, -919211, -459228, 1044424, 2047824, 1456778, -582569, -3005871, -4426134, -3936599, -1867871, 411690, 1617702, 1328817, -84457, -1670581, -2155262, -888309, 1210138, 2376139, 1971760, 1057785, 724603, 665007, -48095, -1451111, -2665944, -2930663, -1986105, 140050, 2884510, 4832921, 4561162, 2115074, -838204, -2658918, -3230979, -3473986, -3591893, -2471779, 745383, 4864210, 7281402, 6735393, 4684972]
32412D684972j346559l51613o65637j371538q43538N09455R31102Q0630o56345
32403I70929m74555j11864l11388p81808j062519j155821r14304l4872R18795
32394b957407P83925l57012r28331j94912N03921j41070j333913j488296n74206
32385f687301K95045P74670J193520J184024J72929j046631r93874K59182J190884
32376c657552J256411J432453K004876J734822R4992j373805j196276j20802K50436
32367D25555q5784j9790M89742M38689l05049p14338l13339J59274J9423n24782
32357d30399r99822j117673m57358J168474K709214K419528O1521k358598k807874
32348a812987j490370j98218p0572q36978j776824k420700k409223j518701l5079
$$ y = [4684972, 3338413, 2986800, 2321163, 949625, 106087, 615542, 1546644, 1627274, 970929, 496374, 384510, 73122, -708686, -1771205, -2927026, -3841330, -3876202, -2957407, -2173482, -2530494, -3458825, -3653737, -3149816, -3290886, -4624799, -6113095, -6687301, -6392256, -5617586, -4424066, -3240042, -3067113, -4113744, -5107618, -4848436, -3657552, -2401141, -968688, 1036188, 2771010, 2866002, 1492197, 295921, 175119, 425555, 339771, 319981, 809723, 1248412, 943363, 229025, -84314, 74960, 94383, -430399, -1430221, -2547894, -3005252, -1836778, 872436, 3291964, 3353485, 994887, -1812987, -3303357, -3501575, -3572147, -4409125, -6185949, -8606649, -11015872, -12534573, -12569652]
32339a2569652J330317K003890J850153J103589K85945o9347K4159q322l63642
32330f412910k81667R54844K666682L220798J934878q2556j206210r50211j69450
32321c25802j6138q87819k060248k201699o40286J643046K662510J436781q71346
32312a261001k170222j610438j52232Q68056J116876J038418Q71337M98431M9824
32303g50951k8145L88796R26900J304188J507385J217943o9475j829164k397046
32294B70431j127622K15547k14902j254080j43334K900494M154268J565370j961953
32285D404219k531582o50816J24524j115677j624502J41960J874672J026753j298943
32276C50608k087303o61173Q51082P33643m19798j082552p70773k32657k98290
$$ y = [-12569652, -11239335, -9235445, -7385292, -6281703, -5995758, -6065105, -6040946, -6049268, -6412910, -6694577, -5739733, -3073051, 147747, 2082625, 2000069, 793859, -156352, -325802, -341940, -1229759, -3290007, -5491706, -6131992, -4488946, -1826436, -389655, -1261001, -3431223, -5041661, -5193893, -4325837, -3208961, -2170543, -1299206, -800775, -750951, -779096, -390300, 536600, 1840788, 3348173, 4566116, 4496641, 2667477, 270431, -857191, -641644, -856546, -2110626, -2253960, 646534, 4800802, 6366172, 4404219, 1872637, 1221821, 1346345, 230668, -1393834, -1251874, 622798, 1649551, 350608, -1736695, -2397868, -1546786, -813143, -1232941, -2315493, -3086266, -3318923, -3617213]
32267c617213q75176j000622q584J386463J713144O16836o15309p78426j70354
32258c349241L31538P12626J306250J548145O76243n36877k99910J567107K857861
32249D813742J689801r37975k420937j900384j011241j175563j543521n98062
32241c084140J096472J373622k65255j530838m34277J765748K229546M72632j188918
32232D34592j064835m0729M60066O31460J178653J485362O03982o81127o20231
32223B387193P76934J458607J92842j617025j764482m8883J649076J721906L97875
32214E154043j075646k031067k637013k950433k571917j464449l39304L67312
32206g548474J216762K554584L232644K012477k2277l38663J385662K430292Q49031
$$ y = [-3617213, -4492389, -5493011, -5501595, -4115132, -2401988, -1785152, -2400461, -3178887, -3349241, -3017703, -2305077, -998827, 549318, 1225561, 688684, 388774, 1955881, 4813742, 6503543, 5565568, 3144631, 1244247, 233006, -942557, -2486078, -3084140, -1987668, -614046, -879301, -2410139, -2844416, -1078668, 1150878, 1623510, 434592, -630243, -670972, -210906, 420554, 1599207, 3084569, 3688551, 3007424, 2387193, 3164127, 4622734, 4815576, 3198551, 1434069, 1385186, 3034262, 4756168, 5154043, 4078397, 2047330, -589683, -3540116, -6112033, -7576482, -7915786, -7548474, -6331712, -3777128, -544484, 1467993, 1445716, 1107053, 2492715, 4923007, 5772038]
32197E772038j685002k354604j006748M13671J079179J662736K114979J479408
32189G475657o432p79495l43974L5270m60243j020143q88579o22570q16353r70374
32179A602764n87435k04759l59744n59781k32516K40817L70009N03712R39062
32170A712129R85816Q0109q91099o44574N57339J197552M99395q67787j873445
32161G55435k000576j213585N7436R50596R01402K72117k60211o24995j040642
32152b203023j203828o63118K54723P75747P85475P67760Q00547N41331J56536
32143A2150K61610P72858P53490k27656j308587j353744k98105Q94836J331504
32134H38356J002419O32007P42939Q47974l2805j784278k794573j887615q4463
$$ y = [5772038, 4087036, 1732432, 725684, 1139355, 2218534, 3881270, 5996249, 7475657, 7469225, 6689730, 6345756, 6381026, 5920783, 4900640, 4012061, 3389491, 2573138, 1602764, 1015329, 810570, 450826, -108955, -341471, -100654, 269355, 773067, 1712129, 2697945, 2778054, 1886955, 1242381, 1799720, 2997272, 3496667, 2628880, 755435, -1245141, -2458726, -2401290, -1450694, -549292, -277175, -537386, -1162381, -2203023, -3406851, -4069969, -3815246, -3039499, -2254024, -1486264, -685717, -144386, 12150, 273760, 1046618, 1800108, 1572452, 263865, -1089879, -1387984, -493148, 838356, 1840775, 2472782, 3215721, 4063695, 4030890, 2246612, -547961, -2435576, -2520039]
32125b520039O54271P0488l68961Q104J78570n09205r74018j24046J255586J589893
32115g39357P20594k08946n54826o28322o33664l28686K95345R53052J621519
32106D96709K278536K286733J145425k32809l32653O56660P67509r13743k721953
32097C430414k730717j406970n64688n49068k26433N62203N19487o99457j328876
32088b994105J59034K618002L413281J615563j034431k240425j443756J1562M26117
32079E30842o33244j944031j882393k15668J610600K129603J313977Q8297r17383
32070H0600j467872j232460k01876P68101R07314Q11278J585029K782189K626121
32061F658424O50150j279756j378781k73895R1057r32164k305093k997697k873689
$$ y = [-2520039, -1865768, -1795280, -2164241, -2156137, -1977567, -2486772, -3460790, -3584836, -2329250, -739357, -18763, -227709, -782535, -1410857, -2044521, -2373207, -2077862, -1124810, 496709, 2775245, 5061978, 6207403, 5974594, 5641941, 6298601, 7066110, 6152367, 3430414, 699697, -707273, -1271961, -1821029, -2047462, -1485259, -965772, -1665229, -2994105, -2835071, -217069, 3196212, 4811775, 3777344, 1536919, 93163, 104725, 530842, -102402, -2046433, -3928826, -4144494, -2533894, -404291, 909686, 997983, 80600, -1387272, -2619732, -2821608, -2053507, -1146193, -334915, 1250114, 4032303, 6658424, 7308574, 6028818, 4650037, 4376142, 4467199, 3535035, 1229942, -1767755, -4641444]
32052d641444k048861n23461J255550K237373J681494N5139j196765q76761P56221
32043c301515K007578J400523n78899j938416j568333m25528P3348o8893K1321
32034d378814M39262N65725L64600M01004O85333O10224L6781n82862j135816
32025b994563j762545j817009l23829K095851L177036J790048l51384q80594J84315
32016h82674R12233M00765l11708k43544J57146J67045P2807L59662M18818p29984
32006C20566k628276l420316k013508N41198K228269K103555P92486m82573q38779
31997c397378j85940N85920K86714r41430j184012Q73718L491841L506673O54008
31988C690114j685399j042582P30926M23026j611372k059717K36452K491935J926891
$$ y = [-4641444, -6690305, -7213766, -5958216, -3720843, -2039349, -1984210, -3180975, -4057736, -3301515, -1293937, 106586, -472313, -2410729, -3979062, -4404590, -4331242, -4400135, -4378814, -3939552, -3373827, -3009227, -2608223, -1922890, -1312666, -1275885, -1858747, -2994563, -4757108, -6574117, -6897946, -4802095, -1625059, 164989, -186395, -1066989, -882674, 29559, 430324, 118616, -124928, 32218, 199263, 272070, 631732, 1050550, 320566, -2307710, -5728026, -7741534, -7200336, -4972067, -2868512, -2076026, -2558599, -3397378, -3583318, -2997398, -2710684, -3652114, -4836126, -3962408, -470567, 3036106, 3690114, 2004715, 962133, 1693059, 2116085, 504713, -1555004, -1318552, 1173383, 3100274]
31979C100274p02311k694054k873595k031120j019300k3522P19121Q16921L29495
31970d378091l00364p48080o71005M24413K313023L478885K541856J75939j473414
31961A363162j382481n76144j90230J62504J273830K561464K679323J500716J67173
31952G559317q12207k078015l605917l881566k041072K94893R41333K35132K94717
31943c093385J445721J688884K44157p72499L67426K023613J527142q13371k284703
31934C32985j612668p6486Q04263O49962m14926j722458j635594O10909K780932
31925b83081J873339j341404k813886q92318J442505J283123j74590k90303Q33165
31916c63450J316730Q06451K41729k69019q67809n13434J291138K455532Q06675
$$ y = [3100274, 2397963, -296091, -3169686, -5200806, -6220106, -6243628, -5524507, -4707586, -4378091, -4678455, -5426535, -6097540, -5673127, -3360104, 118781, 2660637, 2836576, 1363162, -19319, -595463, -785693, -623189, 650641, 3212105, 5891428, 7392144, 7559317, 6747110, 4669095, 1063178, -2818388, -4859460, -4564567, -3623234, -3388102, -3093385, -1647664, 41220, 285377, -487122, -119696, 1903917, 3431059, 2617688, 332985, -1279683, -1356169, -551906, 98056, -316870, -2039328, -3674922, -3064013, -283081, 1590258, 248854, -2565032, -3457350, -2014845, -731722, -906312, -1196615, -363450, 953280, 1759731, 2001460, 1732441, 864632, 351198, 1642336, 4097868, 4904543]
31907D904543k138946k849362q03652J143290J309636R98052J401889J758088
31899E723538J461735J273478J293962K64700j798374k686961j322324J98088
31891D407842k42529j495828j185240M76434J251226L20994j015137j501261q61716
31882A54785Q84379L132429M115489K576169j08950j300468n58517R1255n87738
31873H398833j559673j775170j844105k346273k220952m99550J452387J326475
31865I31972q09891k335045j524001K34220M61228j118290k455305k031476n90232
31856i236820L59649P10948J380267K242763J884769j57738k088301j818621L08877
31847f414207J913263J585094L82527L3021O74124J147479Q98063N35497N68100
$$ y = [4904543, 2765597, -83765, -887417, 255873, 1565509, 2563561, 3965450, 5723538, 7185273, 8458751, 9752713, 10017413, 8219039, 5532078, 4209754, 4407842, 4165313, 2669485, 1484245, 1960679, 3211905, 3532899, 2517762, 1016501, 154785, 1039164, 4171593, 8287082, 10863251, 10754301, 9453833, 8895316, 8986571, 8398833, 6839160, 5063990, 3219885, 873612, -1347340, -1846890, -394503, 931972, 122081, -2212964, -3736965, -3502745, -3041517, -4159807, -6615112, -8646588, -9236820, -8877171, -8166223, -6785956, -4543193, -2658424, -2816162, -4904463, -6723084, -6414207, -4500944, -2915850, -2533323, -2500302, -1826178, -678699, 219364, 754861, 1322961]
31838A322961N36251j78293j272010j810849j335659k13679Q91106J412495J010244
31829C62567K4673l08992R54272K852860L091477Q31992j920572k551174q67468
31820B469635R54531R92651p07097k613518l027144j324852J206558K226043R44486
31811A121293p73000j014054n38929j101189j971577q36515J963337L187932J529966
31802A567264k66756L07776J813006J652650L45543J99243J220318J357489N9348
31793H255881j261325j965589k667736l038620j851216L91001J389718L46766
31785d01120q76245p22107K2577J73827J55745O96347J129470N18104o67843j331343
31775a302588j259193p35792L16556J613407J934743O41709j012108j408400p15818
$$ y = [1322961, 1859212, 1680919, 408909, -1401940, -2737599, -2951278, -2060172, -647677, 362567, 387240, 78248, 1032520, 3885380, 6976857, 7808849, 5888277, 3337103, 2469635, 3424166, 4416817, 3709720, 1096202, -1930942, -3255794, -2049236, 176807, 1121293, 348293, -665761, -1204690, -2305879, -4277456, -5113971, -3150634, 37298, 1567264, 1300508, 1608284, 3421290, 5073940, 5419483, 5618726, 6839044, 8196533, 8255881, 6994556, 5028967, 2361231, -677389, -2528605, -2137604, -747886, -401120, -1277365, -1999472, -1976895, -1803068, -1647323, -950976, 178494, 696598, 28755, -1302588, -2561781, -3297573, -2981017, -1367610, 567133, 1208842, 196734, -1211666, -1927484]
31766a927484k04140r6000L83323J234626J520212R00078M7801m39848m66637
31757I51931K4152P62396O87953p99128k280364j691258N78763J775376N70106
31748E79927j053964q26505N19787O73021o19594j375226n37758O44121P84319
31739a211872L23107M87799J325226J759030J136320p5695r49140r24372j49298
31730A721105N90422M62230m91465j193588p05785N87386J413178J116525K11186
31721C711194n58015j080007j545994j765272j318015k40075Q49208J334239J102562
31712D89825M73479j25889l33390M5466P95554J190365N68113p00166j212430
31703A190927j31961J423760J516624K4343j019210k96212Q66817O47132l43973
$$ y = [-1927484, -2131624, -2227624, -1844301, -609675, 910537, 1810615, 1858416, 1418568, 951931, 976083, 1738479, 2426432, 1627304, -653060, -2344318, -1765555, 9821, 579927, -474037, -1300542, -780755, -107734, -727328, -2102554, -2640312, -1996191, -1211872, -888765, -400966, 924260, 2683290, 3819610, 3743915, 2794775, 1870403, 1721105, 2311527, 2773757, 2282292, 1088704, 382919, 970305, 2383483, 3500008, 3711194, 3153179, 2073172, 527178, -1238094, -2556109, -2796184, -1946976, -612737, 489825, 963304, 837415, 504025, 549491, 1345045, 2535410, 3103523, 2403357, 1190927, 1058966, 2482726, 3999350, 4023693, 3004483, 2708271, 3575088, 4222220, 3878247]
31694C878247j69458J036762J169800k30960j021377l3511Q17130k95845j875498
31685C275290j405895M89756R72353m85097j354212j39146J383564J043941n98555
31676C181999j435119q15953Q7462K40931k14307o62156q05675o81899l88542
31667a493259M0047N33106P65621L11912o78286j303131r42977j49573J37537
$$ y = [3878247, 3708789, 4745551, 5915351, 5684391, 4663014, 4629503, 5446633, 5150788, 3275290, 1869395, 2359151, 3331504, 2846407, 1492195, 1353049, 2736613, 3780554, 3181999, 1746880, 930927, 1018389, 1259320, 1045013, 382857, -422818, -1104717, -1493259, -1453212, -920106, -154485, 157427, -520859, -1823990, -2766967, -2916540, -2779003]
$$ [...]
##END NTUPLES=NMR SPECTRUM
##END=
