##TITLE=31Pdec_DE-119_oil4_b
, 64 sc
 25.12.2025
##JCAMPDX= 6.0         $$ Bruker NMR JCAMP-DX V2.0
##DATA TYPE= NMR SPECTRUM
##DATA CLASS= NTUPLES
##ORIGIN= UXNMR, Bruker Analytische Messtechnik GmbH
##OWNER= root
$$ XWIN-NMR		Version 3.5
$$ Thu Dec 25 15:06:47 2025 Russian Standard Time (UT+4h)  she@DPX200
##.OBSERVE FREQUENCY= 81.013821
##.OBSERVE NUCLEUS= ^31P
##.ACQUISITION MODE= SIMULTANEOUS
##.ACQUISITION SCHEME= undefined
##.AVERAGES= 64
##.DIGITISER RES= 17
##SPECTROMETER/DATA SYSTEM= spect
##.PULSE SEQUENCE= zgpg30
##.SOLVENT NAME= DMSO
##.SHIFT REFERENCE= (INTERNAL, DMSO, 0, 198.062)
##AUDIT TRAIL= $$ (NUMBER, WHEN, WHO, WHERE, WHAT)
$$ ##TITLE= Audit trail, XWIN-NMR		Version 3.5
$$ ##JCAMPDX= 5.01
$$ ##ORIGIN= Bruker BioSpin GmbH
$$ ##OWNER= she
$$ F:/spectra/data/she/nmr/P31/2/pdata/1/auditp.txt
$$ ##AUDIT TRAIL=  $$ (NUMBER, WHEN, WHO, WHERE, WHAT)
(   1,<2025-12-25 15:05:19.21 +0400>,<she>,<DPX200>,
      <created by zg, POWCHK disabled, PULCHK disabled
       configuration hash MD5:
       00 E9 B6 7A A2 85 ED C7 34 08 36 98 17 FE 4E 26
       data hash MD5: 32K
       81 D1 53 97 C1 2D 93 97 96 70 2A 9B 79 47 95 72>)
(   2,<2025-12-25 15:05:21.89 +0400>,<she>,<DPX200>,
      <Start of raw data processing
       efp BC_mod = 2 LB = 1.5 FT_mod = 6 PKNL = 1 PHC0 = 1352.676 PHC1 = 51.10034 SI = 64K 
       data hash MD5: 64K
       72 BB C4 66 C2 E3 E1 22 1E 4D A9 E7 0A F7 5D DA>)
(   3,<2025-12-25 15:06:00.07 +0400>,<she>,<DPX200>,
      <pk PHC0 = -75.16144 PHC1 = 347.9998 
       data hash MD5: 64K
       32 D7 1B 75 87 CD 16 6A 35 45 78 E7 E9 B2 51 EB>)
$$ ##END=
$$ 
$$ hash MD5
$$ F5 F7 30 87 90 AC 62 60 9C 2E FB 62 0A 77 E3 3F
##$RELAX= 
##$RELAX= 
##$RELAX= 
##$RELAX= 
##$RELAX= 
##$RELAX= 
##$RELAX= 
##$RELAX= 
$$ Bruker specific parameters
$$ --------------------------
##$DU= <F:/spectra>
##$EXPNO= 2
##$NAME= <P31>
##$PROCNO= 1
##$TYPE= <nmr>
##$USER= <she>
##$AMP= (0..31)
100 100 100 100 100 100 100 100 100 100 100 100 100 100 100 100 100 100 
100 100 100 100 100 100 100 100 100 100 100 100 100 100 
##$AQSEQ= 0
##$AQ_mod= 1
##$AUNM= <au_zg>
##$AUTOPOS= <>
##$BF1= 81.014009
##$BF2= 200.13
##$BF3= 200.13
##$BF4= 200.13
##$BF5= 200.13
##$BF6= 200.13
##$BF7= 200.13
##$BF8= 200.13
##$BYTORDA= 1
##$CFDGTYP= 0
##$CFRGTYP= 5
##$CHEMSTR= <none>
##$CNST= (0..31)
1 1 145 1 1 1 1 1 1 1 1 1 1 1 1 1 1 1 1 1 1 1 1 1 1 1 1 1 1 1 1 1 
##$CPDPRG= <waltz16>
##$CPDPRG1= <>
##$CPDPRG2= <waltz16>
##$CPDPRG3= <>
##$CPDPRG4= <mlev>
##$CPDPRG5= <mlev>
##$CPDPRG6= <mlev>
##$CPDPRG7= <mlev>
##$CPDPRG8= <mlev>
##$CPDPRGB= <>
##$CPDPRGT= <>
##$D= (0..31)
0 1 0 0 0 0 0 0 0 0.06 0 0.03 2e-05 3e-06 0 0 0.0002 0 0 0 0 0 0 0 0 0 
0 0 0 0 0 0 
##$DATE= 1766660718
##$DBL= (0..7)
120 120 120 11 120 120 24 19 
##$DBP= (0..7)
150 150 150 150 150 150 150 150 
##$DBP07= 0
##$DBPNAM0= <>
##$DBPNAM1= <>
##$DBPNAM2= <>
##$DBPNAM3= <>
##$DBPNAM4= <>
##$DBPNAM5= <>
##$DBPNAM6= <>
##$DBPNAM7= <>
##$DBPOAL= (0..7)
0.5 0.5 0.5 0.5 0.5 0.5 0.5 0.5 
##$DBPOFFS= (0..7)
$$ [...]
##$SUBNAM3= <"">
##$SUBNAM4= <"">
##$SUBNAM5= <"">
##$SUBNAM6= <"">
##$SUBNAM7= <"">
##$SUBNAM8= <"">
##$SUBNAM9= <"">
##$SW= 400.765351723535
##$SWIBOX= (0..15)
0 1 3 0 0 0 0 0 0 0 0 0 0 0 0 0 
##$SW_h= 32467.5324675325
##$TD= 32768
##$TD0= 1
##$TE= 0
##$TE2= 300
##$TE3= 300
##$TEG= 300
##$TL= (0..7)
0 120 53 12 22 120 120 120 
##$TP= (0..7)
150 150 150 150 150 150 150 150 
##$TP07= 0
##$TPNAME0= <>
##$TPNAME1= <>
##$TPNAME2= <>
##$TPNAME3= <>
##$TPNAME4= <>
##$TPNAME5= <>
##$TPNAME6= <>
##$TPNAME7= <>
##$TPOAL= (0..7)
0.5 0.5 0.5 0.5 0.5 0.5 0.5 0.5 
##$TPOFFS= (0..7)
0 0 0 0 0 0 0 0 
##$TUNHIN= 0
##$TUNHOUT= 0
##$TUNXOUT= 0
##$USERA1= <user>
##$USERA2= <user>
##$USERA3= <user>
##$USERA4= <user>
##$USERA5= <user>
##$V9= 5
##$VALIST= <valist>
##$VCLIST= <CCCCCCCCCCCCCCC>
##$VD= 0
##$VDLIST= <DDDDDDDDDDDDDDD>
##$VPLIST= <PPPPPPPPPPPPPPP>
##$VTLIST= <TTTTTTTTTTTTTTT>
##$WBST= 1024
##$WBSW= 4
##$XGAIN= (0..3)
0 0 0 0 
##$XL= 0
##$YL= 0
##$YMAX_a= 2813
##$YMIN_a= -11210
##$ZGOPTNS= <>
##$ZL1= 120
##$ZL2= 120
##$ZL3= 120
##$ZL4= 120
##$ABSF1= 0
##$ABSF2= 0
##$ABSG= 0
##$ABSL= 0
##$ALPHA= 0
##$AQORDER= 0
##$ASSFAC= 0
##$ASSFACI= 0
##$ASSFACX= 0
##$ASSWID= 0
##$AUNMP= <proc_1d>
##$AZFE= 0.1
##$AZFW= 0.5
##$BCFW= 0
##$BC_mod= 2
##$BYTORDP= 0
##$COROFFS= 0
##$CY= -3
##$DATMOD= 1
##$DC= 0
##$DFILT= <>
##$DTYPP= 0
##$F1P= 0
##$F2P= 0
##$FCOR= 1
##$FTSIZE= 65536
##$FT_mod= 6
##$GAMMA= 0
##$GB= 0
##$INTBC= 1
##$INTSCL= 9.790993e-09
##$ISEN= 30
##$LB= 1.5
##$LEV0= 0
##$LPBIN= 0
##$MAXI= 10000
##$MC2= 0
##$MEAN= 0
##$ME_mod= 0
##$MI= 50
##$NCOEF= 0
##$NC_proc= -9
##$NLEV= 6
##$NOISF1= 182.463
##$NOISF2= 159.3651
##$NSP= 0
##$NTH_PI= 0
##$NZP= 0
##$OFFSET= 198.0616
##$PC= 4
##$PHC0= 1277.515
##$PHC1= 399.1001
##$PH_mod= 1
##$PKNL= yes
##$PPARMOD= 0
##$PSCAL= 0
##$PSIGN= 0
##$REVERSE= no
##$SF= 81.0140089999434
##$SI= 65536
##$SIGF1= 159.3651
##$SIGF2= -187.1042
##$SINO= 113.3802
##$SIOLD= 16384
##$SREGLST= <1H.CDCl3>
##$SSB= 0
##$STSI= 65536
##$STSR= 0
##$SW_p= 32467.5324675325
##$SYMM= 0
##$S_DEV= 0
##$TDeff= 32768
##$TDoff= 0
##$TI= <>
##$TILT= no
##$TM1= 0
##$TM2= 0
##$TOPLEV= 0
##$USERP1= <user>
##$USERP2= <user>
##$USERP3= <user>
##$USERP4= <user>
##$USERP5= <user>
##$WDW= 1
##$XDIM= 65536
##$YMAX_p= 240273022
##$YMIN_p= -441758747
$$ End of Bruker specific parameters
$$ ---------------------------------
##NTUPLES= NMR SPECTRUM
##VAR_NAME=  FREQUENCY,     SPECTRUM/REAL,   SPECTRUM/IMAG
##SYMBOL=    X,             R,               I
##VAR_TYPE=  INDEPENDENT,   DEPENDENT,       DEPENDENT
##VAR_FORM=  AFFN,          ASDF,            ASDF
##VAR_DIM=   65536,         65536,           65536
##UNITS=     HZ,            ARBITRARY UNITS, ARBITRARY UNITS
##FACTOR=    0.49542278885378, 1,            1
##FIRST=     16045.7642231865, 0,            0
##LAST=      -16421.768244346, 0,            0
##MIN=       -16421.768244346, -441758747,   0
##MAX=       16045.7642231865, 240273022,    0
$$ Real data points
##PAGE= N=1
##DATA TABLE= (X++(R..R)), XYDATA
$$ [...]
##PAGE= N=2
##DATA TABLE= (X++(I..I)), XYDATA
9424 -4820909 -4351910 -3876812 -4291537 -5328487 -4218251 1056008 7399224 8686102 3042330
9415 3042330 -4866961 -10027098 -12356297 -13664258 -12658020 -7059066 834781 5313158
9407 5313158 4491509 2723364 4395958 8219720 9760287 7643041 4727516 3925559 5076755
9398 5076755 5992340 5065329 2712125 1351248 3781258 10033741 15624847 14872001 7334323
9389 7334323 -240591 -294128 7392330 15469574 16941240 11568447 4041380 -1783864 -4870267
9380 -4870267 -5017363 -2249212 1569762 3354744 2342594 1053565 1374938 1686532 -115353
9371 -115353 -2554320 -2562577 -701667 -823214 -3990219 -6150184 -3630033 1697395 5124169
9362 5124169 5053353 3469101 1811593 -291645 -2436895 -2936307 -1755251 -1253379 -2660487
9353 -2660487 -3987737 -2992100 -342849 1969681 3746853 5858026 7468232 6464871
9345 6464871 2425044 -2834467 -7513166 -10731013 -11401513 -8680014 -4304097 -2401210
9337 -2401210 -5434049 -11259459 -15235753 -14523372 -9566852 -2323277 5514794 12469800
9329 12469800 16575524 15954167 10856729 4722118 1586490 1602914 607918 -4357148 -10493162
9320 -10493162 -12476387 -9245083 -4669196 -1893375 -505816 147019 -1401011 -5829438
9312 -5829438 -10547682 -12473213 -11576135 -9954099 -9118840 -9565464 -10823361 -10382195 -5267581
9303 -5267581 3026955 7809081 4324965 -4457588 -11982320 -15477999 -15659881 -11870322
9295 -11870322 -3000516 7528338 13164231 11614153 7080952 4553016 5263852 7936752
9287 7936752 10631110 10774770 7079303 1988953 -1432865 -5056583 -13265420 -24278920
9279 -24278920 -29732306 -25400788 -16943237 -11367436 -7710884 -1107359 7609996 12192294
9271 12192294 9309415 1851347 -5249173 -8779578 -8046081 -5634852 -6259846 -11253571
9263 -11253571 -15516673 -13858988 -8955891 -8238046 -13607761 -19482264 -21129556 -19303823
9255 -19303823 -15476288 -8662471 -350010 2695962 -3990641 -14838060 -19591048 -15677410
9247 -15677410 -10126038 -8485115 -6991739 853712 13138813 20167895 16446701 7475110
9239 7475110 2047330 1209235 -648156 -5446987 -8450548 -7025688 -6121328 -10406988 -15415893
9230 -15415893 -13155787 -4607658 799385 -1153139 -3646339 98398 6109193 5634813
9222 5634813 -1960148 -8877834 -10231231 -9109172 -9221752 -8569338 -4219385 465287 -1440212
9213 -1440212 -11164434 -21790614 -25651515 -21199113 -11889027 -1608207 6800273 11292116
9205 11292116 12197144 12863800 15822379 19091469 19169890 16779058 15769997 16413184 14435093
9196 14435093 8257260 2721847 2576168 5693582 6538840 3985766 1632214 1688216 2460060
9187 2460060 1492508 -1870206 -6565872 -9755113 -7710563 -63786 7546176 8640254
9179 8640254 3505038 -1729876 -3267718 -3032713 -3844510 -5586054 -7243241 -8629885 -8354189
9170 -8354189 -3904354 3821336 9259583 8213694 2706541 -2703354 -6888848 -11143219
9162 -11143219 -14020337 -11220394 -902884 13398384 25659527 31721509 30922703 25234684
9154 25234684 17599313 10468650 5269642 2682197 2701183 4531762 7366151 11225405
9146 11225405 15901745 19218876 18113432 12052560 4086339 -1933920 -4039254 -2245100
9138 -2245100 1900909 5351050 5297918 1982264 -1808414 -4667901 -7883837 -11827086 -13544401
9129 -13544401 -10167297 -3270742 2422279 4134865 3250895 2897721 4612533 7104032
9121 7104032 7298234 2688249 -6756069 -18731681 -30012432 -37202175 -37472495 -30790040
9113 -30790040 -21220592 -13889478 -10438463 -9099377 -8555575 -8968444 -9437615 -7897997 -4309513
9104 -4309513 -956378 1204010 3493761 6141462 7359385 6806088 6487937 7139014 7532522
9095 7532522 8482827 12711165 18637865 19618320 12959018 4955014 2524422 3974194 3042716
9086 3042716 -1644068 -6872673 -11506982 -16418938 -19601813 -17862285 -12847399 -9722600
9078 -9722600 -10147135 -11685876 -13417731 -16215846 -17616630 -13007484 -3515183 2912978
9070 2912978 757027 -6811372 -12743402 -13498720 -10151937 -5872544 -4031952 -5682881
9062 -5682881 -7560833 -5333939 717528 6495143 10291660 13630134 15768530 13296642
9054 13296642 7028810 3377595 5623767 9028735 8605021 6960050 9369668 14837229
9046 14837229 17946163 17405500 16777072 17369741 15984250 10617676 4124338 572207 783620
9037 783620 2979448 5800743 9115862 12846339 16216903 18071849 17644316 15127425 11545003
9028 11545003 8216802 6499031 7271495 9656112 11005738 9888482 8611385 10630387
9020 10630387 15617952 19501175 19426461 16050464 10885381 4795524 -61215 -494783 3612934
9011 3612934 8322357 10466225 10649983 9930000 7120582 2037694 -1823116 -1222254 2459279
9002 2459279 5690525 7242181 7156219 3960495 -3070167 -10605244 -14181978 -13393148 -10891033
8993 -10891033 -7793677 -3805888 -326687 1009748 1962888 5215838 8723480 7472232
8985 7472232 1203852 -4640406 -6846246 -8340324 -11978859 -14900744 -12460322 -4792179
8977 -4792179 3836675 10004145 12369817 9947738 2886921 -5652701 -11566533 -13802355
8969 -13802355 -13989801 -12479343 -7785010 -636563 4366508 3278305 -2363880 -7070626
8961 -7070626 -6952729 -2144153 5258782 12947696 17922482 17298577 11461917 4567353 -142154
8952 -142154 -4003875 -9644687 -15679491 -18227705 -17076850 -16075642 -16522690 -14345030 -6214009
8943 -6214009 4754163 12473770 14918342 14580704 13510259 11384108 8060499 4806377
8935 4806377 2298977 -472452 -4417877 -8576807 -10680399 -9020738 -3935194 1954435
8927 1954435 5220765 4026162 -628712 -5553812 -6981289 -2932548 4281052 9066659
8919 9066659 8598745 6783779 8683134 12074644 9999757 2145720 -2926984 295059
8911 295059 6472070 8121705 6530002 7767415 12070462 14389768 12945552 10009316
8903 10009316 5746970 -1226225 -7493330 -6493269 2235716 11579001 15838578 15604078
8895 15604078 12830945 7563876 1728127 45043 3713516 7684267 7218581 3269065
8887 3269065 -858796 -3663310 -3795656 623445 7343751 9261950 3011782 -5136754
8879 -5136754 -6651206 -1410418 3492840 3439738 95657 -3092239 -4601087 -4353083 -3369010
8870 -3369010 -4181996 -8768984 -15660415 -20780997 -20921836 -15485088 -6566304 899341 1375001
8861 1375001 -5598071 -12994031 -12755769 -4442454 4949577 9248874 8513256 6342473 4756387
8852 4756387 3032801 154382 -3065060 -4574463 -3676953 -2316595 -2662287 -3819570 -2768960
8843 -2768960 1471075 6848994 11532306 15268360 16984889 14628775 8922769 3717114
8835 3717114 495355 -3791805 -10700168 -16156579 -16471717 -14958148 -17101301 -21368512
8827 -21368512 -21038275 -14675796 -8672594 -8251201 -11253446 -13034394 -13049816 -13343233 -13651018
8818 -13651018 -12139920 -10092789 -12173248 -20819550 -32124327 -38897595 -37478598 -30171646
8810 -30171646 -21017004 -11599051 -2800221 1899584 -709543 -7726909 -11845374 -10046389
8802 -10046389 -6334143 -4376921 -2465283 1383735 4375115 3329289 4446 -2720689
8794 -2720689 -6099945 -11460046 -14515428 -10493274 -2626719 1403158 -12374 -2411769
8786 -2411769 -4418442 -8877751 -14849455 -16773119 -13234920 -9081102 -6823372 -3397628
8778 -3397628 2035370 4967839 4062298 5115379 11249842 16084194 13216240 6708651
8770 6708651 4620749 6558089 5904068 1562036 -1298090 -1383104 -3583410 -9658880 -13832853
8761 -13832853 -10888450 -3752277 390503 -1585647 -7157596 -12513526 -15446357 -14705243
8753 -14705243 -9122282 1227677 12969221 19646408 16252335 4755715 -6376485 -9806790
8745 -9806790 -5691098 346131 3677684 3504781 1277377 -1116330 -2523104 -3748617
8737 -3748617 -6449770 -9440653 -8414318 -1692462 6147329 9541474 8757614 7868207 7922066
8728 7922066 6599673 3448305 563594 -1709241 -5039972 -8717775 -9412885 -6074659
8720 -6074659 -1076252 4006482 9347753 12965569 11178299 5092239 1718082 5325220
8712 5325220 11443856 12926922 8981226 4820477 4904130 9733534 16936302 22184586 21210491
8703 21210491 14420506 7840846 6418490 8396141 9472785 9720299 11726088 14132102
8695 14132102 13016263 9129377 7674624 10074188 11619873 9055127 5254487 3855313
8687 3855313 4071171 4062330 4914373 6956335 5880003 -2084877 -13236209 -19853266 -19355979
8678 -19355979 -15106695 -9425592 -2121440 3756535 1902620 -8147348 -17340213 -17266135
8670 -17266135 -10538773 -6221113 -7429352 -8967307 -6269809 -966238 3329773 5855644
8662 5855644 7271447 7251902 6141541 6037119 7204607 5704357 -1854854 -12408193 -18967068
8653 -18967068 -18964163 -16725049 -16998296 -19255653 -20110622 -18708092 -16809433 -14704602 -10289467
8644 -10289467 -2887158 4284081 7172065 5778668 4664324 8296729 16255179 23129436
8636 23129436 23184484 15496527 4734389 -3340846 -7096016 -9142137 -11382950 -11785209
8628 -11785209 -7708286 -1241785 1682474 -1866677 -8224969 -11747240 -11138299 -9414949
8620 -9414949 -9265029 -11039542 -14443311 -19069029 -22795798 -22328370 -16736316 -9005011 -3005736
8611 -3005736 10790 1271849 2237741 3579243 5441611 7623610 9844978 12229258
8603 12229258 14921659 17180995 17982678 17744635 18040660 19096809 19129822 17051345 14327801
8594 14327801 12885532 12333253 10690302 7149808 2845259 -727140 -3099075 -4814298
8586 -4814298 -6350648 -6813717 -4361832 736973 4448665 3296474 194323 1855711
8578 1855711 8942504 13312850 8496894 -846248 -4733242 -609259 5216080 7544371
8570 7544371 7483653 7301746 6402230 4931422 6305984 12283203 18614804 19367634 13862636
8561 13862636 6415838 777027 -2190620 -2425402 400797 5493379 10640686 14200293
8553 14200293 16651979 19774320 24133918 27052503 23976347 13857713 2891561 -268787
8545 -268787 5718642 12905760 14059134 11790275 14149647 22932475 30941925 31142483 24536810
8536 24536810 17270217 12769556 9364938 4602759 -657262 -3307491 -2281961 -519336
8528 -519336 -1789987 -5971139 -9117106 -8865176 -7838640 -9636126 -12622481 -10755838 -1212368
8519 -1212368 11144506 18430444 17757728 13238737 10579396 11192899 12197424 11314107 10054469
8510 10054469 10871816 12086054 8421449 -1910692 -12652661 -14945830 -7229803 2793525
8502 2793525 6772020 4149121 714358 610412 2368539 2783133 2187236 3945129 9315609
8493 9315609 15005801 16948656 15144581 12780017 11148756 8269294 3283321 -851461
8485 -851461 -1520107 -1130324 -4142124 -10281809 -14550346 -14405062 -13153585 -14437446 -16425438
8476 -16425438 -14382531 -7431929 80120 3489023 1970450 -1792671 -4015323 -2027536
8468 -2027536 3638825 8734204 8741072 4038538 343080 2472102 8220383 10058697 3324162
8459 3324162 -8201327 -15465303 -12549705 -1734799 9123236 13614161 11726099 9022690
8451 9022690 11242038 18974968 27220154 30483327 28181501 24179275 21240122 17912635
8443 17912635 11925871 4600947 -656755 -3374981 -6439242 -11035366 -14071463 -12363826
8435 -12363826 -7389612 -3548439 -2679677 -2759194 -1961541 -1569542 -3738319 -8048222 -12112359
8426 -12112359 -14949344 -17602766 -19981973 -19387670 -14236309 -7887751 -5574684 -7315004
8418 -7315004 -7301613 -1962281 4656462 6528312 3842220 1112825 -1130436 -6840981 -16177804
8409 -16177804 -22849087 -22564438 -19277777 -19002132 -21065840 -20253421 -15221431 -9701927 -6487787
8400 -6487787 -5152486 -5522242 -8667003 -13646800 -17222836 -17856018 -16646465 -13657599 -7312991
8391 -7312991 1057040 6115295 4723592 437697 -925024 1977166 6177212 9069882
8383 9069882 9955380 8623612 5724934 3850968 5286458 8667117 9971650 6816252
8375 6816252 350272 -6396379 -10383113 -9708986 -5002385 828212 5889962 11272159
8367 11272159 17611777 21207127 17143388 6180292 -4982634 -11136996 -13332778 -15173761
8359 -15173761 -17266983 -17341645 -13977144 -8051144 -1279723 5106971 10365662 13578301
8351 13578301 13195515 8214668 855460 -3466579 -1497877 3366213 5322559 4366625
8343 4366625 5653343 10076976 11321047 5390373 -2201354 -3779406 -81540 2629606
8335 2629606 3242296 6114472 11334656 12657428 7372209 1510620 1356300 4825908 5745183
8326 5745183 2818174 -505010 -2186520 -2407970 -243298 4631522 7468658 1888623
8318 1888623 -10545317 -19264708 -16291064 -5578419 2426088 3116231 963664 1679461
8310 1679461 5205243 7377837 5760020 1832659 -1639021 -3609943 -4666220 -4789263
8302 -4789263 -2460475 3287732 10517391 15391171 15773790 12795480 8700148 4794879
8294 4794879 2370227 3654442 9536879 17117147 21958698 22864307 22338418 22157592 21029092
8285 21029092 17688243 13780754 11436737 9661304 6039333 1493254 233266 4092907
8277 4092907 9295127 10520472 6829212 1896890 -626658 4497 2898907 7042836
8269 7042836 10517105 10323295 5350022 -1086816 -4096821 -3122392 -2862056 -6968440 -12618065
8260 -12618065 -13633702 -8225167 -1145471 1898545 -282539 -4771042 -7919411 -7385259
8252 -7385259 -3288972 1023430 1500860 -1436154 -2395380 1874641 7125764 6978632 2109498
8243 2109498 -597197 1945657 4788059 2443071 -3482227 -7083674 -5888036 -2618295
8235 -2618295 -644591 -354311 522454 4635427 12270800 19730028 21826071 17326414 10364399
8226 10364399 5195072 1871500 -854406 -1249033 2769164 8143374 8614762 2931840
8218 2931840 -2541289 -1215576 5868372 11243517 9003215 517061 -7310560 -8988012
8210 -8988012 -5637843 -2822145 -3486758 -5217210 -5299605 -5178663 -6889785 -7957286 -4687796
8201 -4687796 822203 2585832 -112547 -1129377 3260693 8881683 10598689 10139594
8193 10139594 12390990 16735235 17233667 10906613 1828522 -3674448 -3564570 -1305322
8185 -1305322 -1857783 -6647440 -12103386 -13845807 -12195128 -11467834 -13379490 -14295339 -10961473
8176 -10961473 -5967260 -4299790 -6396668 -8125237 -6683722 -3329266 -830981 -1177235
8168 -1177235 -5383592 -12510481 -18682728 -19725780 -15425068 -9618949 -6247238 -6802697
8160 -6802697 -10642258 -15251803 -16725375 -12861419 -6044259 -867216 996364 1355720
8152 1355720 1542606 1000539 -54586 150885 2113593 4091374 4901877 5132868 4613209
8143 4613209 1515558 -4259112 -9041035 -8908836 -4123638 1419175 4237543 3829947 2395956
8134 2395956 3008000 7077234 12768114 16553760 16549260 13568045 9512025 6412356 6333725
8125 6333725 9415693 11870298 8964466 937010 -6569559 -8722609 -5505865 906716
8117 906716 9029810 16786760 21216274 22160140 23222329 26308709 28135631 25196828 19206995
8108 19206995 13912767 9306927 3556692 -1564647 -2611134 -832636 -1036615 -3918082
8100 -3918082 -4821587 -1203813 3574206 5639716 5287792 3944306 679416 -4869350 -9265802
8091 -9265802 -8927331 -5345121 -3182970 -4080399 -5377437 -4548639 -2131730 -83952 588321
8082 588321 50237 -993211 -1507486 -439913 2713923 7442717 11749001 12544114 8410758
8073 8410758 2613043 1162412 6255661 13504656 17744270 19614460 23208247 28482042
8065 28482042 30225510 25104748 16131653 8830139 5931161 7274175 11686643 16328909
8057 16328909 16693933 10734604 2004190 -4087503 -6330037 -7507015 -9328158 -10920669
8049 -10920669 -11796104 -12488561 -11966611 -8329259 -3000342 -123921 -79380 2031163 8461999
8040 8461999 13578510 11014917 2939167 -3247026 -5417120 -7647497 -11183716 -11399220
8032 -11399220 -5698948 1250626 3366517 209871 -4582015 -8119257 -8510837 -4075083
8024 -4075083 3777605 9627019 9898071 7528066 7392174 9540896 10767893 10214634 8684243
8015 8684243 4662554 -3323897 -11700730 -15236892 -15039093 -16986648 -21930656 -24115228
8007 -24115228 -20809930 -16702962 -15808881 -15355254 -11807721 -7358611 -5431361 -4534333 -2244299
7998 -2244299 -1176723 -4478635 -8475504 -6969515 -1038842 2767863 3006624 4147451
7990 4147451 6503328 4059988 -4803405 -12372725 -12250378 -8584098 -8643338 -11109115 -8916650
7981 -8916650 -979017 6244302 8157052 6580020 4716903 3541748 4188683 8115928
7973 8115928 12672196 11704990 3946771 -3320802 -2957199 2741941 5749178 3085518 -978483
7964 -978483 -2547730 -2649738 -3108771 -2364397 1774247 7602250 10720643 9184876 5484226
7955 5484226 3312044 3533120 3735828 1339662 -3355831 -7618910 -9585736 -9991964 -10097796
7946 -10097796 -9439050 -7244682 -4846754 -4305557 -5238978 -5657137 -5701132 -7455845 -10671950
7937 -10671950 -12084498 -10212803 -7593020 -6594723 -6429590 -6560282 -9175747 -14382914 -16221829
7928 -16221829 -8992445 3763546 12142453 11776945 7720794 5723204 5037059 2389005
7920 2389005 -1317299 -2093483 1520434 7044532 11210902 12694670 12891110 15063395 20843609
7911 20843609 26539587 25599549 16624393 6273864 1705522 2575619 3612238 2884520
7903 2884520 3408664 7454218 13341365 18205491 20744532 20672305 18169085 14653006 11965847
7894 11965847 10160590 7870732 5134361 3831352 4743114 5899370 4539785 -338971
7886 -338971 -7342901 -13332534 -15202677 -12733743 -9187984 -7248747 -5373586 -875487
7878 -875487 4465615 5991594 3456414 2004041 4221935 5681004 1401291 -6716867
7870 -6716867 -12485183 -12867563 -9265156 -3810558 1269341 2315105 -2468599 -8324285
7862 -8324285 -7458300 1299942 10127793 11247066 5129453 -2249985 -7107959 -9697656
7854 -9697656 -10662457 -9466533 -6263479 -2292337 2190268 8082824 14508540 17501878
7846 17501878 13518359 4113477 -4105908 -4933025 1932581 10906454 16143276 17026395
7838 17026395 17656714 20944766 24348776 22683009 14759048 5516856 808447 1366530
7830 1366530 3306309 3666217 3228652 3675724 4489632 4451758 4585421 6967670 10911641
7821 10911641 12877332 10795216 6385033 2257412 -1194095 -4466478 -6460219 -5798707
7813 -5798707 -3617974 -2232579 -1059285 3356087 12254683 21785343 26882162 26823650 25282331
7804 25282331 25418944 26461573 25126490 19212005 9525403 -702474 -7597712 -8491304
7796 -8491304 -3318170 5080063 12376354 15322116 13364793 7833653 162672 -8058318
7788 -8058318 -13644913 -12792092 -5246333 3757228 8163531 7618668 7100077 9674518 12135002
7779 12135002 9371605 1162138 -7709602 -13222421 -15534235 -16597445 -16819795 -15489840
7771 -15489840 -13232608 -12173359 -13344981 -14757780 -12734222 -5511760 4271695 10964544
7763 10964544 10622920 4836405 -711411 -2096454 -858923 -727624 -1529533 843000 7555950
7754 7555950 13231562 12517046 8251421 8197684 13629052 16797266 12228596 5286110 4676652
7745 4676652 10223073 14455335 14350056 13889883 14451116 10623906 -556895 -12153304
7737 -12153304 -14559221 -7102485 2155512 5863387 2423996 -6060881 -15753514 -21682362
7729 -21682362 -20922589 -15654191 -10336462 -6527221 -3271171 -976259 -832004 -1545810 -1386967
7720 -1386967 -2816620 -9585203 -18845259 -22121877 -16104973 -7162565 -2449188 -1600329
7712 -1600329 -876879 -761476 -4097595 -9480454 -11944471 -9214208 -3025012 4814111 13396494
7703 13396494 20099933 21211488 16072718 7900817 129014 -5687475 -8560323 -7869425
7695 -7869425 -5237081 -3889626 -4819319 -5344018 -2601579 2759053 7206029 7869934 5218806
7686 5218806 2907944 4638697 10059064 14168447 12102803 4235711 -4546237 -9809807
7678 -9809807 -10330747 -7150619 -2543469 434842 196657 -1123494 -14344 3333712 4732628
7669 4732628 1610259 -3571257 -7056884 -8911504 -12129653 -17490176 -21508937 -20125471
7661 -20125471 -13675933 -7555647 -7479299 -13810564 -21063753 -23508400 -20530430 -15652749
7653 -15652749 -11447253 -7374039 -2396578 2292563 3946385 1011686 -4809798 -9035044
7645 -9035044 -8126092 -3625857 -873032 -2066527 -2880551 1252217 7775155 10279199 7944879
7636 7944879 6358489 8341315 9304352 4123151 -5307334 -12202386 -12013215 -5572320 2044605
7627 2044605 4029115 -3421233 -16141033 -24374592 -22779146 -15815021 -10936593 -9391590
7619 -9391590 -7043999 -1788933 3988406 7254759 7168609 4698544 2123628 2123318 4914350
7610 4914350 7247615 6514680 4499123 4533121 6465618 7443554 6379892 4426148 2114804
7601 2114804 -479411 -1492178 1078523 5488721 7329180 4820650 411648 -2792858
7593 -2792858 -3520075 -1617092 1986483 4464776 3254026 -475456 -2924814 -2375367 -475891
7584 -475891 815119 766520 -1284884 -5267739 -8390571 -7349594 -3399453 -2151959 -7131514
7575 -7131514 -15904300 -23420412 -26926792 -26958687 -25755643 -25393459 -25716828 -24105527 -19066062
7566 -19066062 -13198011 -10062832 -9244974 -7744566 -4956618 -2240025 1008686 5568010
7558 5568010 7633363 2333559 -7676474 -13939213 -13621363 -11934760 -11314915 -6802918
7550 -6802918 3421366 11205811 8985527 895533 -4154391 -5456746 -8528968 -14176041
7542 -14176041 -18339402 -20554008 -23745025 -26365116 -23030103 -13454932 -3607120 2586957
7534 2586957 6037574 6858703 3358631 -2275845 -4717813 -3734488 -4347399 -6569464 -3233292
7525 -3233292 7724771 16749311 14923012 6633063 2415018 3481107 1862528 -5961415
7517 -5961415 -14078787 -16494484 -14443630 -12097937 -10226266 -7186255 -2875099 1153247
7509 1153247 3488034 2726268 -2575756 -11520261 -19545326 -21792635 -17811977 -11529664
7501 -11529664 -6543699 -2764338 1910864 7909352 13268015 16158100 16553508 14939286
7493 14939286 10838916 3968415 -3865846 -9527375 -11253850 -9828009 -7364492 -5626425
7485 -5626425 -4897022 -3705326 -566286 3261115 4526832 2992144 3192946 8131902 13450587
7476 13450587 12625230 6977775 4714410 9194696 14256074 14071667 12196306 15919606
7468 15919606 25037926 31718276 30275102 22446356 13264850 5830795 1020482 -652154
7460 -652154 1316799 6527721 12839318 16748838 16121707 13062994 12048609 14199190 15786357
7451 15786357 13744555 9672099 6290619 3393728 576247 539778 4908515 9203719
7443 9203719 7715705 2486320 1734928 8952468 18595123 23530598 22183672 17112997
7435 17112997 11037170 6327798 4819145 5825575 6681625 6321115 5724783 4504182 720649
7426 720649 -5136842 -10053719 -13389822 -17266281 -20553779 -18011008 -8605933 555507
7418 555507 3264713 2942301 6846134 14693498 19286649 17050377 11979038 9134718 9281754
7409 9281754 10578058 11333186 10112661 6483266 2630637 1777485 4665952 9609669 15138787
7400 15138787 19679309 19813388 13182364 3245730 -2931153 -2349974 1987241 7071035
7392 7071035 13294425 20375367 24302526 21529546 13854202 6588882 3359926 4223166
7384 4223166 7145098 9767900 10908703 11137724 10876662 8582604 3263835 -1983401 -2794436
7375 -2794436 43655 1335381 -714204 -2281852 -812280 1285011 2086973 3549936
7367 3549936 6053795 5542161 1109260 -115372 7710925 19188963 24382148 22246061
7359 22246061 19479292 18562715 16216214 13015128 14405087 20035235 21227702 13151966
7351 13151966 2194949 -3392606 -3961853 -4651163 -6655603 -7970578 -8569876 -9108764 -7847861
7342 -7847861 -4533160 -4336467 -11528867 -20877621 -21892272 -11805653 987349 7075094
7334 7075094 5009198 -761975 -6417764 -10804884 -13594870 -14038472 -11377013 -6021834
7326 -6021834 -421032 2263575 1285600 -1166577 -3614224 -7273162 -12463037 -15620338
7318 -15620338 -13221971 -6983361 -1656098 940377 2062736 1799315 -794311 -4179760
7310 -4179760 -5801480 -6750529 -9791222 -12582459 -8941417 1283120 9407601 8448638
7302 8448638 2013637 -1262894 1309377 5307282 6460266 4553291 1174157 -2437223
7294 -2437223 -5159856 -6162225 -5522578 -3562402 -521049 2063106 1583096 -2083405 -4947974
7285 -4947974 -3088885 2783812 8743963 11949564 11580971 7749692 2486441 104415
7277 104415 3062280 8286632 10691853 9469295 7675660 6596317 4565420 1272254
7269 1272254 -960010 -1125819 -1184560 -2435419 -3333244 -2446015 -872669 11980 915794
7260 915794 2862373 4788004 4560844 1143168 -5249941 -13507799 -21154683 -25449665 -26320305
7251 -26320305 -26517359 -27543720 -27231805 -22974989 -15795877 -9495337 -6961168 -8584444
7243 -8584444 -12713233 -16144733 -15839182 -11923512 -7559777 -4507472 -1175581 2916402
7235 2916402 3885922 -1342645 -8612500 -10126123 -4072543 3719521 7797966 8279674 7458095
7226 7458095 6060442 4653927 4410166 4058874 78589 -7252045 -12015850 -10554119 -7340508
7217 -7340508 -8028602 -9849729 -5497098 4683086 11558262 9421460 2986231 -619448
7209 -619448 -1653816 -5414435 -13348061 -20838268 -22569508 -17076621 -7066613 2237081
7201 2237081 6079668 3925687 -220275 -2563742 -3278134 -4216205 -5167429 -4911246 -4107247
7192 -4107247 -4076958 -4053347 -2774195 -1611115 -2648535 -4568164 -4258884 -2019579 -1140423
7183 -1140423 -2556767 -4376634 -6770802 -11883070 -17595495 -17461368 -10161007 -3523447
7175 -3523447 -4135020 -7353923 -4158833 4773462 9473853 5028708 -2007161 -3958586
7167 -3958586 -2370841 -3385578 -7140933 -7951063 -3814901 256588 70271 -966696 3496743
7158 3496743 13103255 19772999 17054824 7701517 194126 -422308 3956304 8650461
7150 8650461 10635528 9142852 5544203 3849416 8052175 16769256 22974765 21498685
7142 21498685 14708387 8330362 4264516 1226007 182441 3732879 10422528 15162080
7134 15162080 16447842 18053017 21431775 21670603 15032270 6392327 3501813 5869684
7126 5869684 5538950 -912818 -7130207 -6170464 -295209 2543690 -517158 -4669158 -5186084
7117 -5186084 -3237791 -2305719 -2165667 375373 6044620 11511399 13277078 10767263 5340945
7108 5340945 -1076573 -5360166 -4102942 2262126 7958601 7408005 1545952 -4064301
7100 -4064301 -6708524 -8644569 -11496914 -12539636 -8828595 -2287938 2404554 3792905
7092 3792905 4693467 7625650 11705328 14550762 15367614 15065946 14230866 12077881 7569720
7083 7569720 1306294 -4039715 -5642495 -2994883 1820616 6011098 7357620 4115035
7075 4115035 -4105961 -14172578 -20016441 -17839023 -10516488 -4980379 -5018020 -8100741
7067 -8100741 -9570012 -8325524 -7192915 -8299110 -9436483 -5906172 3771855 14597071
7059 14597071 18847979 13658178 3850098 -3412643 -5374548 -3863994 -707203 3807334
7051 3807334 8215496 9394897 6573515 3335706 3182927 4398745 1850523 -6291077
7043 -6291077 -15496948 -18818138 -13006885 -1164146 9559899 13470570 11126986 8604875
7035 8604875 10825045 16089433 18696331 16103150 10906335 5935716 917028 -4518744
7027 -4518744 -7657591 -5466852 960880 7321690 10540824 10188557 6834087 1960878
7019 1960878 -1206573 -253575 2618155 2241346 -3312172 -10689481 -15963155 -18397993 -18472646
7010 -18472646 -15627495 -10545185 -7121131 -8815685 -14011696 -17596212 -16552166 -11976470
7002 -11976470 -6529312 -2287632 -508724 -940501 -1280432 629119 3862030 5247096
6994 5247096 3143059 -933822 -3973641 -3290946 2283690 10524240 15573865 12641041
6986 12641041 3677060 -3971151 -5478383 -3183432 -2580883 -5811053 -10453293 -13114742
6978 -13114742 -12587138 -10303213 -8918459 -10008370 -12496196 -13810589 -12835064 -10939305
6970 -10939305 -9819924 -9101523 -6435242 289641 10387462 19482138 22270022 17565383
6962 17565383 9725238 3707549 259594 -1939612 -1730276 2726683 8794758 11298746
6954 11298746 10042578 10088537 13186871 14643634 11595974 8826381 11657063 17368415
6946 17368415 19234926 16025620 11591366 7278143 1438036 -4300388 -5252928 -1238096
6938 -1238096 2242415 2456851 3524669 8948769 14918612 15521345 11574414 9525630 12793218
6929 12793218 18155594 20380518 17179429 9508342 -82396 -8480094 -13332538 -14442773
6921 -14442773 -13160327 -10436377 -6620506 -2945005 -1354794 -2201327 -3540331 -3616834 -2812402
6912 -2812402 -2004799 -315787 3412275 7287095 7037596 1061970 -6883199 -11431552 -10909751
6903 -10909751 -7671894 -4662180 -3707083 -5945330 -10867818 -15057077 -15013877 -11855180 -10192631
6894 -10192631 -11406149 -11528694 -7815086 -3796729 -4151833 -7106041 -6724859 -2012548 1179747
6885 1179747 -1545598 -6814620 -7767334 -2402684 4697617 7956793 6180669 2467717
6877 2467717 44544 -1054458 -2985639 -6256219 -8258521 -6455075 -1806301 2473008
6869 2473008 4776516 6059819 7552500 9399471 11252577 12278985 10712598 5414101
6861 5414101 -1966568 -8291113 -12627635 -16663484 -20973994 -23054036 -20399450 -14256231
6853 -14256231 -8890827 -7357543 -8448696 -7740559 -2055377 6597401 12336626 11593225
6845 11593225 6860945 2959739 1288296 255694 -343336 497878 881971 -3121804 -11092685
6836 -11092685 -16918350 -16224164 -11797720 -8853891 -7900840 -5931647 -2730330 -1835421 -5409136
6827 -5409136 -11218457 -15110196 -14585957 -10052945 -4365527 -975696 -776733 -758299 2845498
6818 2845498 10253801 18022021 22369609 21231725 14517340 5189730 -615625 1636351
6810 1636351 8947137 12885310 9519737 4345524 4380627 7783798 5979363 -4185166
6802 -4185166 -15463333 -19528338 -17205163 -15526738 -17153844 -17884411 -14322952 -8740420
6794 -8740420 -4621892 -1813758 1016033 2615568 1531413 -287230 -203599 860578 1345664
6785 1345664 4438042 14619468 28722114 36624735 33210787 24692611 19867897 19379732
6777 19379732 18057235 14837349 14546314 19858137 26180447 26527330 19270793 9343544
6769 9343544 2792564 1629007 3911935 7347643 11111913 14136976 14144314 10739012 8095181
6760 8095181 11173155 19122087 25617998 26551499 24278545 22904630 22547263 20694463 16862147
6751 16862147 12927654 9956765 7155974 3510781 -1138258 -6058801 -9494676 -9436753
6743 -9436753 -5673120 -421853 3624343 5002182 3497204 575438 -190893 3813548
6735 3813548 9860174 11805322 7909692 3322885 2626294 3491326 1007089 -4679958 -9003523
6726 -9003523 -9257040 -6381540 -1910311 3140985 7260684 9733094 12371851 17160147
6718 17160147 22921058 26724198 27261407 24419530 17711246 8569714 2044173 1793131
6710 1793131 4754587 5342618 3786010 5099300 10159386 13477889 10820484 3938937
6702 3938937 -3862865 -12020904 -20009382 -24392233 -22146118 -14990820 -7809760 -3879234
6694 -3879234 -3130731 -3718952 -3723518 -1982389 1725572 7076895 12976147 16599647 14946168
6685 14946168 9352560 6043886 8760290 12680142 9943211 152784 -9156746 -11963677
6677 -11963677 -9048294 -4277510 -759580 -923359 -5149570 -9467587 -9458438 -6903655 -7140383
6668 -7140383 -9537453 -7552040 116251 6055523 5163225 1758596 1052384 774373 -2235373
6659 -2235373 -3539202 2182156 9899525 9018992 -1701984 -12160520 -14167696 -9669125
6651 -9669125 -4585663 -973680 1883769 3261386 1588877 -2406855 -5275923 -3347364
6643 -3347364 4001742 12467498 15313795 9825776 744070 -4254208 -1608064 6383281
6635 6383281 14323736 16498582 10258207 -170808 -6199908 -4852235 -3151449 -8233633
6627 -8233633 -16605527 -19351984 -15299415 -11304675 -10381112 -7965081 -1382177 4841322
6619 4841322 6358299 5296865 5266626 5378426 3674997 2272761 4195597 7899783 9523459
6610 9523459 8710644 7989969 7521042 4529312 -1870223 -8155417 -9503283 -4392661 3676663
6601 3676663 8474120 6078421 -1377197 -7653634 -8449140 -4659568 -236700 950682
6593 950682 -3509510 -12709454 -20718314 -20218961 -10370192 1090254 5778998 3004752
6585 3004752 -1460523 -2673719 -176376 3921965 7668916 10333601 12238550 13306686
6577 13306686 11747989 5966999 -1863432 -6652715 -5807035 -1356390 3967395 9271148
6569 9271148 12872170 11685515 6265461 2405486 3781428 6595257 6056627 4510407
6561 4510407 6990094 11286260 9948278 1895902 -5130028 -5042754 -186219 4211319 6563878
6552 6563878 7324542 6287112 5041214 7581830 14397627 19588738 18092772 12720480
6544 12720480 9584681 9261638 7657130 3869733 1359385 1320881 294779 -4178773 -9701108
6535 -9701108 -12715252 -12801970 -11206571 -7814038 -2187679 4093616 8823318 12333311 17137202
6526 17137202 24189311 30777493 32685345 28202255 19905451 12344306 7704018 4159801
6518 4159801 -836565 -6344433 -8525517 -5296059 1409228 8385597 14262918 18921567
6510 18921567 21607209 21298301 18014441 12410518 5002121 -2786807 -7884068 -8076480
6502 -8076480 -5132087 -3387394 -4665018 -6121604 -4007559 1491212 6262037 6789828
6494 6789828 3823104 1321286 2158587 5401632 7951287 8064371 6274631 3508367 368995
6485 368995 -1324876 1219709 8153361 15243424 17926033 16018533 12352166 8237232
6477 8237232 3507917 194712 1732230 7293229 10600894 6841037 -1457069 -7667642
6469 -7667642 -8454359 -5704020 -2570951 -300136 1360513 2880517 4710864 7356974
6461 7356974 11208146 16101901 20448388 21180570 16336720 8092547 1341830 -1461526
6453 -1461526 -2089070 -2569376 -2363820 -1199299 -1612956 -5622488 -11035927 -14358724 -15524096
6444 -15524096 -16061156 -14281746 -7107683 3631366 11584418 13473670 12179797 11143592
6436 11143592 9977448 7620853 5694685 5456388 4521001 522851 -3816234 -3381557 2069830
6427 2069830 7052788 7452838 5647681 7022491 12881055 18410944 17493149 8786998 -3004094
6418 -3004094 -11454170 -13514909 -10397126 -4672699 1846110 7516183 10352890 9592033
6410 9592033 6915849 4815418 3948723 2909559 341512 -3496378 -7243055 -9929395
6402 -9929395 -11664152 -12812349 -12680430 -9664006 -3250424 4530345 10355766 12157206
6394 12157206 10161491 6259275 3057812 2388954 3367907 2923645 -103405 -2531399 -759857
6385 -759857 3821105 6163544 3770395 -1521709 -7465532 -13070335 -16063940 -13550592
6377 -13550592 -7146135 -3023830 -3964869 -5424337 -3129243 -487724 -3095720 -8817404
6369 -8817404 -10131834 -5648731 -2222713 -3942317 -5332407 603244 11807687 19295948
6361 19295948 17700918 9437929 -478239 -9212847 -15178137 -16504006 -13101694 -8270548
6353 -8270548 -5402214 -3517807 1434880 10283124 17815334 18105282 11816480 6228694
6345 6228694 7721835 15578118 23659524 26903960 25167719 21502668 18209676 15204845
6337 15204845 11763857 8786382 8221847 10128729 11574598 9466944 3708603 -3362953
6329 -3362953 -9481824 -12909792 -11837790 -6085161 928285 4582125 3667470 500484
6321 500484 -3111887 -7040364 -10189264 -10561664 -8845254 -8221630 -9321651 -9158559 -6695722
6312 -6695722 -5327185 -7426753 -10486964 -11510801 -11040342 -9548108 -4751490 2669947
6304 2669947 5562299 -788727 -9837112 -11517340 -6237470 -2548081 -2437778 663638
6296 663638 8109079 11306754 5494119 -1218458 236582 6097630 6542858 1442702 -406408
6287 -406408 3845241 6599060 1903298 -5570742 -7393314 -2180653 4772111 9618764
6279 9618764 12991297 15573766 15066417 9725757 2810069 185822 3057037 6039758
6271 6039758 4630407 2096343 4922418 12506676 16731157 12934883 6071206 3045344
6263 3045344 3565975 3003346 791198 407770 2688372 4658013 4722863 4255831 3869102
6254 3869102 2608890 1444789 3196089 7751085 11169536 10912698 8469539 5602926
6246 5602926 2024178 -1308622 -915683 3840893 7519560 4844666 -1884970 -5604446
6238 -5604446 -3366465 1345044 4198888 3943765 1017824 -3742916 -8145042 -9501860
6230 -9501860 -7572334 -4458934 -1263943 2542009 6223498 7648853 7024466 7271677 9199314
6221 9199314 10129105 9634823 12270339 20283750 27182690 24656401 14371647 6332885
6213 6332885 5419096 6450716 4593243 3518362 8184414 14664177 14166756 5372273 -3701457
6204 -3701457 -6407267 -4733092 -4461959 -7320039 -10295635 -10133405 -6262850 -731733 3193898
6195 3193898 3403846 1019138 -622463 504139 3366420 5424712 4562770 -82266 -7069540
6186 -7069540 -12455166 -13112038 -10636180 -9367983 -10068043 -8904513 -4116686 102115 -555069
6177 -555069 -3774972 -4078565 -1591516 -2476464 -9966791 -19119968 -22665979 -19421533 -14229490
6168 -14229490 -10949038 -8506596 -4123199 2084137 7411271 10196805 10808207 9042208
6160 9042208 3365306 -5444007 -12103803 -11625104 -5709095 -795208 647389 2833444
6152 2833444 8730105 13383028 9451962 -2238897 -12280011 -13358702 -7980910 -4119670
6144 -4119670 -5569160 -8808919 -8596073 -4442794 -454418 551787 889802 4701632 12004725
6135 12004725 18484413 21083313 20800554 19095619 15013374 8311961 2480479 1036142
6127 1036142 2583446 3276686 2949810 4660061 8589566 10822795 8969864 5260086 2840379
6118 2840379 2209317 2578496 3678469 4670865 4064103 2308791 1819028 2909171 2781009
6109 2781009 649700 658168 6474513 15308950 20820391 20461801 16638369 12030478 7685005
6100 7685005 5101574 5909732 8599256 8939759 5108473 38316 -2653105 -3085380 -4020529
6091 -4020529 -6821119 -10081872 -11724668 -11406394 -10817611 -11698176 -13564330 -14208117 -12971312
6082 -12971312 -12055457 -13136942 -14356949 -13197479 -10990281 -11109380 -13342624 -14115893 -12347722
6073 -12347722 -10408046 -8341375 -2652980 6345539 11305342 6775481 -2415182 -7233806
6065 -7233806 -6271039 -5515700 -7995805 -10304028 -9349030 -6053453 -1233091 6071568 14234171
6056 14234171 18851491 19499175 20979040 24564869 24045108 15437868 5182934 1971359
6048 1971359 4342745 4024625 -816812 -4102512 -3095876 -2290074 -4022273 -3287892 3702364
6039 3702364 11931044 14131406 10988156 8951201 9921282 8907329 2197911 -6555425
6031 -6555425 -10185971 -5948175 1724703 5793225 3440893 -1686547 -4111635 -2519353
6023 -2519353 236274 2186597 4408717 7784546 10716181 11408371 9749727 5492690
6015 5492690 -2461896 -12843395 -20925705 -23437746 -22248159 -20379107 -16970960 -10054035
6007 -10054035 -2330806 649367 -2142413 -5862674 -6397628 -4911577 -4918000 -7588879 -11039247
5998 -11039247 -12347631 -9747691 -4466896 -346247 132718 -1164794 -1301490 -1466456 -5237344
5989 -5237344 -11840936 -15570366 -13253943 -8299831 -5101103 -3042147 692654 5075978
5981 5075978 6142447 3011462 -673526 -1639188 -637010 -470034 -2295832 -4912692 -6622658
5972 -6622658 -6838529 -6229604 -5894600 -6402236 -7344763 -7515442 -5500667 -772672 5099233
5963 5099233 8860152 8388443 5009511 1848467 79102 -1561479 -3463786 -3609517 -479878
5954 -479878 4372805 8339947 10833668 12186588 10712502 4228200 -4935889 -9729380
5946 -9729380 -5799555 2358812 5723705 1202956 -5220394 -6877190 -4710560 -4072883
5938 -4072883 -5494636 -3868004 2513060 7281145 3769273 -5715535 -12541916 -12067636
5930 -12067636 -7160402 -2208994 1664618 4417565 4303290 97905 -5813204 -9059610
5922 -9059610 -7570952 -3108968 980193 2875471 3567887 5262844 8252194 10164130
5914 10164130 9321165 7548488 7436044 7755010 4847615 -1230111 -5390642 -3705534 1838511
5905 1838511 6519178 8524364 9379492 10528199 11820568 12555754 12225642 10759705 9324885
5896 9324885 10265090 15013048 22243347 28502137 30143789 24992737 14064783 2425993
5888 2425993 -3519789 -1229923 6044528 12974753 16672707 17294082 16107908 14097871
5880 14097871 11156337 5902934 -2216146 -10089285 -12340711 -7036659 1385391 6075257
5872 6075257 3734671 -3423657 -9679192 -9665883 -3160232 3233216 2447518 -3873620 -6515103
5863 -6515103 -966797 6071187 6130359 582191 -2587618 -463825 2975103 5339564 8873418
5854 8873418 14052348 16712203 14461912 11146082 11454500 14461021 15944834 14684322
5846 14684322 13023482 12656687 12869900 12112779 8882833 2023719 -7143351 -13578930 -12548366
5837 -12548366 -5399582 1410091 4164368 6085849 11486129 18001605 18624169 11327851
5829 11327851 2521329 -941205 107017 -107041 -4069556 -9474074 -14207104 -17821742
5821 -17821742 -18197525 -12084784 -688566 9589042 14160430 14465253 13513584 11688801
5813 11688801 9659544 10545958 14617012 15656806 8181937 -3975528 -11592263 -10950439
5805 -10950439 -5778157 3501 5534169 9568951 9872076 7002944 3948863 1336536
5797 1336536 -2480484 -6387335 -6912867 -4534521 -3917975 -6097986 -6081386 -1004145 4686036
5788 4686036 5998708 4729695 5377300 7307324 6326469 2087103 -1392067 -2314216 -3774808
5779 -3774808 -8753978 -15151365 -17363570 -12309429 -3649830 367823 -5286704 -16447942
5771 -16447942 -23212682 -19676972 -8368209 4515791 14405345 18179341 13956030 4793496
5763 4793496 -973882 2228477 10526240 15834892 16243363 16969649 21779710 27803137 29305894
5754 29305894 23314776 11190362 -2228592 -10622858 -10727253 -6277366 -4894859 -9447954
5746 -9447954 -14399017 -12249987 -1970904 10716716 20041261 24634775 25523636 22693936
5738 22693936 15883997 7588463 2125445 675587 -356901 -4061238 -8080128 -7891666
5730 -7891666 -3696072 -201457 166127 -420060 -357296 -1495854 -4706756 -6720111 -4763574
5721 -4763574 -1402774 -1083887 -3750823 -5276237 -2951489 2268249 7703460 10629741
5713 10629741 9579906 6580231 6487387 11407422 17396870 19356255 17189267 14083968
5705 14083968 11094766 7485660 4468860 3772186 3544151 593052 -3705602 -4609906 -1262815
5696 -1262815 1963926 1948093 104076 -1735687 -4274499 -8000700 -11208550 -12355160 -11312109
5687 -11312109 -7412314 125263 8727073 13235648 11775410 7640033 4230447 1724958
5679 1724958 -148654 -316695 835027 940980 -119678 274066 1753680 -131972 -6004290
5670 -6004290 -8857287 -3072967 6786904 11682017 9621656 5911312 4253284 3715002
5662 3715002 3409690 4062333 4653881 2725948 -1087128 -3071601 -1862469 -269378 -994905
5653 -994905 -3714391 -6757913 -8627907 -7979900 -5579753 -5949105 -12713578 -22012973 -25377589
5644 -25377589 -20479406 -14289266 -13391712 -15751479 -15429713 -11661928 -8761727 -8999879 -10052000
5635 -10052000 -9372158 -7813927 -8041205 -10904674 -14106354 -14319481 -10930506 -7273007 -6832267
5626 -6832267 -8720279 -9273290 -8001989 -8505839 -12314375 -15345978 -12934333 -5824315 1331864
5617 1331864 5265253 5439992 2436059 -1961339 -4704067 -4439632 -3232730 -2999727 -2359202
5608 -2359202 -17752 1331271 -1037154 -3927011 -1781808 4317039 7116463 3537482
5600 3537482 -1269633 -2447034 -2460876 -5604468 -9681641 -8604417 -1683495 4622272 4586790
5591 4586790 -516721 -4901006 -4797194 -1377188 1800178 3199848 4698613 8240555
5583 8240555 11929130 11429321 5645024 -1111892 -3774174 -1664701 2070545 4210711
5575 4210711 3172055 -935953 -5754213 -7671185 -5639767 -2816998 -2302750 -2709231 -643032
5566 -643032 3621115 6225509 5143174 2449008 1151841 2589773 6931070 12905238
5558 12905238 16382008 12736123 2320728 -9170979 -17409137 -23390259 -28386865 -28666405
5550 -28666405 -20274320 -7584583 -899432 -3798709 -7952157 -4247728 4666581 8558130
5542 8558130 4739626 1954146 7160285 14956276 15438718 8321944 2126400 968915
5534 968915 110363 -4174004 -7993950 -6959444 -3752112 -3252942 -4549895 -3763407 -1699431
5525 -1699431 -2205569 -4593430 -4241567 -441174 2422655 2112505 1477204 2976949 5153617
5516 5153617 6100767 6267277 6412825 6624889 8364879 13340054 19352791 21824704 20661173
5507 20661173 20608250 23216669 24185689 21341776 19127330 20809509 21740133 16220859 7101243
5498 7101243 2176468 3466689 6166729 6705625 5848370 4312144 1010080 -3535307 -6346813
5489 -6346813 -5637658 -2525094 907294 2694657 1028200 -3514203 -6471006 -3718137
5481 -3718137 3115094 8472942 9349632 6767308 2167250 -3250127 -6154027 -3066606
5473 -3066606 4307944 9650893 9021894 4269481 -712777 -3492173 -2574044 2418440 8837343
5464 8837343 12907448 14712294 17837765 23109872 26709949 26063519 23420372 21251368
5456 21251368 18204650 13129739 9794580 12901010 20559159 24919121 20900770 11812833
5448 11812833 5423100 5770499 9785315 11704075 9793348 7331126 6970899 6889544 4654971
5439 4654971 2305866 3494035 6805599 6822479 2081598 -2801724 -4046988 -3091002 -2320293
5430 -2320293 -1139875 885692 1182935 -1798855 -4849521 -4176782 -951570 1092258 1512327
5421 1512327 2442752 3391716 1340869 -3798150 -7723288 -7028144 -3446365 -1383829 -2700054
5412 -2700054 -5357160 -6662418 -6329909 -5404185 -2963436 3477375 12727699 17626523 11833180
5403 11833180 -1660554 -12739463 -15291496 -12482760 -10452673 -11084612 -12635574 -13474191
5395 -13474191 -12800477 -10735262 -9406182 -10555517 -10860816 -4495575 7259842 14368472
5387 14368472 10020690 -390559 -6839053 -6713372 -3907116 -219712 5310130 11050031
5379 11050031 13801863 13889298 13055286 9067133 -445522 -9885507 -9644456 841719 11341579
5370 11341579 13848890 10512764 6572952 2810193 -1078550 -2125303 1382952 5426729
5362 5426729 5723153 4601243 7278774 13446870 17662244 17186157 14896853 14351736 15662259
5353 15662259 17022621 17569363 17446727 16531501 14329163 10840834 6899372 3276702 -401017
5344 -401017 -4841422 -8751206 -9136967 -5733251 -3309315 -6395041 -12684957 -15494133 -12642693
5335 -12642693 -8806120 -8385015 -10274806 -11334948 -11218889 -11416120 -12354612 -13493078 -13870066
5326 -13870066 -11371364 -4713281 2529283 4087299 -380967 -3104761 1861925 10303742
5318 10303742 13617294 9639348 2974570 -2663782 -6816815 -8638553 -6895587 -3601913
5310 -3601913 -2549198 -3649146 -3100662 292457 3325076 3818608 3617072 4637059 5654455
5301 5654455 4984251 3402840 2541877 2791737 4171040 6649588 8233241 5754922 -317524
5292 -317524 -4569756 -2794181 2582546 6033766 6355842 7406884 11915206 17437614 19179483
5283 19179483 15305152 8845239 4956540 6340395 11012527 14692471 15004752 12340257
5275 12340257 7373095 485364 -5813180 -7295558 -3206771 1469997 2012624 489352
5267 489352 2796833 10174530 17490095 19908816 17542571 12899153 7562931 3106481
5259 3106481 1968353 4669180 8063677 8904684 8015797 8850733 12856247 18184054 22183879
5250 22183879 23198018 20382869 13821413 5245137 -2293276 -5713801 -3169307 4408036
5242 4408036 12349252 15009585 11511097 7318525 7925179 12176751 14261326 11228605
5234 11228605 5737401 2146441 3032369 9120120 18896912 27566602 29694900 24412002
5226 24412002 16027802 8990518 4488752 1995822 860428 -295527 -2322689 -2777598
5218 -2777598 1790439 9449822 13063190 9118714 2226028 -1919374 -3459940 -4454638
5210 -4454638 -2973863 2841152 8222215 6459088 -1202241 -7205512 -8736444 -9899383
5202 -9899383 -12045545 -9687833 402059 12086481 16744978 13496585 8050480 4282490
5194 4282490 1806832 324689 1332509 4957369 8615044 10170589 10502669 11735460
5186 11735460 13994000 15146255 13805579 11783537 12472942 16481373 20172134 19781677
5178 19781677 15876684 11970230 9869294 8995064 9455217 12104826 15182044 14830145 10753521
5169 10753521 8062552 10837388 16166566 17538898 12772431 5630928 180257 -3408630
5161 -3408630 -6610713 -8292596 -5021702 3809696 12478299 12917460 3361898 -8698862
5153 -8698862 -14171208 -11557046 -6020321 -1086814 4135922 9555627 11420181 7669514
5145 7669514 2082106 -296906 539713 845585 -1230614 -4291656 -6582166 -7338230 -6158732
5136 -6158732 -3701258 -2588715 -5394470 -11702297 -18393788 -22387146 -22414511 -19562591 -17206683
5127 -17206683 -18530066 -22300313 -22896546 -16815667 -7647591 -2010129 -1781029 -3321094
5119 -3321094 -3607194 -3575776 -4801566 -6037645 -5159041 -3205916 -4254275 -10586627 -18824630
5110 -18824630 -22340961 -18355446 -11523352 -8704588 -10864644 -12662426 -9798008 -3360451
5102 -3360451 3830768 11125574 17775170 20113886 14843259 3822222 -7261558 -14017915
5094 -14017915 -15260196 -11899409 -6884033 -4592194 -6837746 -10186029 -10114160 -7034744
5086 -7034744 -5243222 -6596482 -8441804 -7681361 -4006150 933690 4893539 5443844 1619798
5077 1619798 -4267342 -8263376 -8367092 -5177998 64025 5724109 8757076 6421200
5069 6421200 -565033 -8456902 -13862105 -14976614 -10824735 -2697412 3976972 3233401
5061 3233401 -4526818 -11980296 -12798196 -8244927 -4707584 -6315479 -11132170 -13435612
5053 -13435612 -9065687 292049 7718806 7330874 454031 -5665564 -5571301 -594317 4129714
5044 4129714 5762824 5575056 5657951 5661007 3772227 613854 339129 5751014 12910658
5035 12910658 13923785 6347309 -3297574 -7623690 -6959947 -6573102 -8122863 -8722893 -7225318
5026 -7225318 -6016748 -5998613 -4608277 -628861 2836138 2694944 698365 1405068 6451927
5017 6451927 12628439 15242671 12540090 6927564 1881832 -2118814 -7076350 -12460579
5009 -12460579 -13820094 -9140358 -3807010 -4644430 -10386221 -13390403 -10714887 -7650611
5001 -7650611 -8704735 -10790660 -8816429 -3602384 272179 1654926 2993816 4712282
4993 4712282 4378483 1909145 1325163 5295134 10696376 12351793 9888511 7836119 8759633
4984 8759633 9449813 5978585 325479 -1516397 2294383 6543303 5046050 -2929374
4976 -2929374 -12922563 -19096683 -17213563 -7634139 2909412 6250948 1817346 -2814365
4968 -2814365 -2585589 -1501759 -4873955 -10040416 -10653098 -6674602 -3497001 -3181339 -3099806
4959 -3099806 -2125938 -1866236 -2183451 -1238041 347814 657493 974766 3544174 6027340
4950 6027340 4571257 1362222 1783558 4422968 2106473 -6261776 -13370824 -15092089
4942 -15092089 -15974672 -19773112 -22526768 -19958059 -14955715 -12037856 -9902483 -5604708
4934 -5604708 -1983892 -4470860 -12530625 -19683508 -21434341 -19408499 -17689331 -17479849
4926 -17479849 -16009622 -10568526 -3427485 -464655 -3097386 -5056344 -1240519 3999272
4918 3999272 3627246 -608728 -2015374 -1828192 -7570950 -18525143 -24164283 -19675837
4910 -19675837 -12657751 -10566981 -11066090 -9410103 -6759004 -6141183 -7411789 -10203866
4902 -10203866 -14998738 -18866411 -18187708 -17140590 -23570766 -34857254 -39809070 -36971135
4894 -36971135 -37167999 -44033163 -47633544 -43500459 -41433287 -46983060 -50941952 -47450626
4886 -47450626 -45562921 -51077063 -54488920 -50388268 -50229591 -60610072 -69136826 -69484698
4878 -69484698 -77260802 -99228367 -114593113 -117164533 -142919989 -205427525 -229245489
4871 -229245489 -119771866 96535652 271057865 297546461 221920875 156450239 139428014
4864 139428014 130304586 103298323 79210185 74030072 73073839 64473299 58326486 61381048
4856 61381048 62394351 53774766 45006586 44653843 46982772 44551561 39082903 33415061
4848 33415061 25896133 17956299 15260602 17260432 16765714 12716612 11932491 15732236
4840 15732236 16975427 13771305 14074899 21873491 29523251 29306545 23739218 19368499
4832 19368499 18023724 18546642 20159908 20354201 15924183 9167306 6877468 10952893
4824 10952893 16218403 18770212 19277205 17106983 9921734 1248804 -629750 5245832
4816 5245832 10004176 8209864 5146733 6457245 9070997 8226506 5903003 5669897 5583718
4807 5583718 3078938 1503958 4807491 10044037 11696192 9627521 6700204 2774168
4799 2774168 -1973667 -1728018 8455599 22711626 29523124 26831859 23992885 27279419
4791 27279419 31327472 28806013 22096038 19113920 20909969 20497266 14094077 7178205
4783 7178205 6293774 9318487 8934523 3605055 -1080262 -2244866 -4259791 -10514156 -16642850
4774 -16642850 -17137771 -14178422 -13366046 -13765694 -9773634 -1645690 3707535 3006440 483494
4765 483494 102663 855209 2049004 6443211 14519312 21369944 23297011 22637399 22180051
4756 22180051 19789259 13331801 6587012 4660610 6441007 6899249 4672721 2353425
4748 2353425 1117678 221581 635637 4070158 8807705 11256854 11713739 13998837 18641769
4739 18641769 20776211 16598700 8686682 2792384 1468130 2685489 3231306 1788686
4731 1788686 -432462 -804623 2477855 8451910 14132103 17596090 19470986 20842183
4723 20842183 21121421 19709558 18898154 22137296 28323391 30623278 24084126 13160134
4715 13160134 7784815 11658436 18399610 20744651 19320475 19084277 20591907 19645981
4707 19645981 14150921 6754722 1000630 -1406133 147527 4862197 9385341 10451141
4699 10451141 8899333 8201324 9529995 11613404 14417672 18404354 20623836 16996915
4691 16996915 9177361 3742680 3181781 3134953 657698 -447624 3974792 11440112 16315748
4682 16315748 16728868 14181316 9648923 4276378 1324997 3111270 7527707 10874550
4674 10874550 12436443 13484268 14144503 14480923 16135151 19098662 19249081 13608262 6369564
4665 6369564 4788735 9709644 14794886 15118551 11946492 8165093 3374801 -4050529
4657 -4050529 -12697570 -18769633 -20523383 -20332740 -21639243 -24101999 -23012419 -15130948
4649 -15130948 -4496939 514360 -3285195 -10392218 -14175525 -14518348 -15105256 -16233193
4641 -16233193 -14593251 -8796545 -1179753 5433905 9812161 11881982 12875488 14715430
4633 14715430 16472582 13330335 3112662 -7597267 -9065288 -402637 8759899 9622335
4625 9622335 2994459 -4585793 -8975189 -9881399 -7737143 -3068681 2194950 5703099
4617 5703099 6903006 7057541 7810703 10603878 16062132 22469293 26050331 24631735 20522919
4608 20522919 18182328 19268551 21453811 22047537 21027637 19610251 17227030 12022652
4600 12022652 4608809 -701578 -245214 4180400 7022632 5557737 2528175 1599737
4592 1599737 2842297 4602389 7661865 14510708 25179131 36389478 44639805 47902198
4584 47902198 44695694 34579601 20521339 8271677 1624521 -470306 -1031838 -983608
4576 -983608 260089 1519473 48360 -4543655 -8802278 -9224460 -6193933 -2571855 577478
4567 577478 4616168 9893509 14161190 15244399 13391718 10220357 7494730 7751178 12888491
4558 12888491 19933851 21611849 14947167 6731451 5783299 11747574 17136906 19080837
4550 19080837 21834051 26907233 28490659 22340265 13236077 8921506 10776215 14747081
4542 14747081 17739674 18571244 15903472 10261457 5978647 6663482 10440206 13447301
4534 13447301 15718721 19295772 22824860 23135986 20733113 18578639 16364999 11370947
4526 11370947 4984522 3097003 8692954 17854961 24292059 24890067 20318292 13454691
4518 13454691 8313902 7928705 11826848 16527955 18530898 16192521 10247031 4026318
4510 4026318 1115762 678996 -2307861 -9271537 -13551606 -8120504 4329986 13835133
4502 13835133 14325136 7912473 -127509 -5299606 -4240054 2666169 9094245 8791421
4494 8791421 3872532 1894006 5164322 9110908 11023467 13027945 15133562 13034480
4486 13034480 5975765 213457 632365 4161887 5369698 3883648 2376796 1518780
4478 1518780 1139810 2946580 8006287 13932279 17493777 17704606 14748335 9522750 5924205
4469 5924205 8727442 16411306 20959258 18132107 12932760 10921849 9613420 4279601
4461 4279601 -2117442 -1907252 6263689 15357711 18080666 12833274 3178005 -4428220
4453 -4428220 -4262373 2870440 8998070 7935886 2689832 73569 1201318 2677544
4445 2677544 4228127 8247505 13095889 13839237 9827108 5650190 4375083 5306651 8259028
4436 8259028 13830669 18890565 18181244 11953173 6254750 4055378 2058400 -1514868
4428 -1514868 -2416559 2359114 7866587 6595860 -2379888 -13227075 -19541499 -17754678
4420 -17754678 -7819696 5435145 13939140 13335819 7312718 2824945 3179530 7937388
4412 7937388 16046294 25061681 30107830 28584168 24399767 22885603 22901061 19326667 12688160
4403 12688160 9926937 14188847 19705770 19917301 15996780 13118125 11590187 6895982
4395 6895982 -2461888 -11798104 -15690051 -13619612 -9223493 -5889384 -3952965 -1091131
4387 -1091131 4827573 12479667 17287792 16383161 12566714 11061610 12912297 14641217
4379 14641217 14376600 14311512 15673538 15291462 10114114 2121037 -4563311 -8677134 -10046371
4370 -10046371 -5737529 6105229 19662683 25344474 21489962 16317747 16129878 17523034
4362 17523034 15096182 11330381 12492464 17687604 19098768 13181441 5671084 3588190
4354 3588190 6586207 9009889 7890448 5793090 6493931 10211154 13690846 14078779 11932636
4345 11932636 10182038 10508502 11739844 12165555 12206011 13502832 15968232 17336730 15956418
4336 15956418 12939537 10763929 10047079 8603620 4461033 -463247 -1201957 4789499
4328 4789499 14167747 21033021 22507479 19364350 13058757 5430685 54049 -608201
4320 -608201 636604 -1003518 -4561517 -4376880 -56407 1467131 -2821419 -5800706 -1144190
4311 -1144190 5616076 4971243 -1931378 -5898904 -4566028 -4321575 -7455320 -8205876 -4303104
4302 -4303104 -2217955 -5822344 -8727734 -4715294 1772091 3838288 4585020 11158352
4294 11158352 20146851 20462399 10486657 1258279 157879 1593307 -1278167 -4579020
4286 -4579020 -936267 7659978 12966058 12982702 12610650 13313512 11106160 5886123 4438856
4277 4438856 10588631 18558301 20501831 16154829 10657330 6540438 2772295 -722711
4269 -722711 -2502909 -2395315 -1008121 2261394 7182574 10332832 8910903 5538882 4816835
4260 4816835 6257891 5710616 3160468 3197616 6852591 8719605 4614256 -2323954 -5902854
4251 -5902854 -4041568 499826 3659654 2447501 -3506107 -10858635 -14899194 -13795124
4243 -13795124 -8640100 -178625 10640957 19516405 21694751 18792494 17214511 18705520
4235 18705520 18660642 15470075 14165695 17215178 18910368 14129613 6450382 1633139
4227 1633139 -1287538 -5707524 -9344083 -8174125 -4811229 -4954031 -7780950 -7505551 -3045365
4218 -3045365 1052957 2491477 3354526 4844428 6005199 7392807 10459553 13715475
4210 13715475 14612035 14332775 15624718 17305683 16448922 14338932 14079013 13913759 9982819
4201 9982819 4813008 5476237 12800569 19247260 18616536 12237021 5081170 1147248 2571759
4192 2571759 7738120 10686781 7997395 4991913 8600900 15736581 16841158 10267702
4184 10267702 4299011 4354460 6926910 7574521 6570187 4839133 2256367 1841796 7830060
4175 7830060 17541563 22618415 20166785 15543263 13065202 11708891 10807696 11645262 12513667
4166 12513667 10587835 8753590 11360203 14183369 9853505 2246958 2147463 9119706
4158 9119706 13107048 14125984 22150014 35616168 40895682 37410458 40357031 52187368
4150 52187368 57804531 57173748 69152342 83655128 47753103 -62553947 -183004184
4143 -183004184 -221045331 -165048930 -89097511 -53258029 -47103708 -38620066 -28875114
4136 -28875114 -32684562 -40976112 -34720929 -16996930 -4800866 -1844174 -704943 -903599
4128 -903599 -5533040 -8798537 -4063020 3049833 3985204 1557957 1462944 -914604 -10040416
4119 -10040416 -15749347 -6593019 8923468 12447150 3212165 -2319087 3325047 9971683
4111 9971683 8545692 2842200 -1009163 -3959243 -8251304 -12018023 -13795660 -14943230
4103 -14943230 -15038186 -11727357 -6683251 -4966618 -7391844 -9931311 -10969984 -12388206
4095 -12388206 -13545145 -11596639 -7993492 -7057985 -7694318 -4397390 2697077 6832025
4087 6832025 4955005 1019853 -2404683 -7201648 -12202853 -11859709 -6424828 -4926695
4079 -4926695 -12600242 -22501751 -25342143 -21271621 -15857364 -10507039 -4304646 -633786
4071 -633786 -3477187 -9198654 -9685081 -3345642 3206547 4585640 2320266 418831 -8885
4062 -8885 -206754 -1300239 -3987296 -8520194 -13896542 -18427054 -21300393 -22292798 -20551618
4053 -20551618 -15765712 -10179832 -6937283 -6111650 -4693586 -1212989 1787180 1130446
4045 1130446 -2809909 -6893579 -9049448 -9404213 -8006682 -3811757 2879026 8480722
4037 8480722 8798191 3695369 -2632391 -6600771 -8762555 -11257792 -13438019 -12303485
4029 -12303485 -6776865 608639 6323209 8346623 6258181 1362507 -2534189 -1064595
4021 -1064595 5973274 13202958 14887695 10733648 4895126 345615 -3241863 -6336913
4013 -6336913 -7404982 -5315410 -1773491 622930 1544436 2285143 3074328 3356195 3885201
4004 3885201 5440987 5640695 990160 -6695380 -10183330 -5990726 135437 1017220 -2064540
3995 -2064540 -3029111 -2081724 -5216727 -12266095 -13997093 -5069579 6830475 10491069
3987 10491069 5170123 -1119775 -4067473 -6738948 -11781149 -16703470 -18216107 -16400130
3979 -16400130 -12837624 -8243468 -3739770 -1630277 -2820176 -4902489 -4192200 830347
3971 830347 8100191 13216022 12830789 8003987 3217752 948435 -797782 -3677639 -4758307
3962 -4758307 -1068336 3809670 3187591 -3112569 -8163482 -7748142 -5365653 -5648857 -8005816
3953 -8005816 -9740301 -10836864 -11677694 -9791755 -3747568 2189677 2587932 -895787 -807154
3944 -807154 6309244 15944388 22521708 25810382 27852456 27102662 20065507 7785093
3936 7785093 -3492391 -9092554 -10379070 -10986303 -11268533 -9029635 -3908959 2243691
3928 2243691 8439825 14310233 17041242 13070654 4171680 -2510937 -2968878 -920424
3920 -920424 -842516 -750312 3266605 8952351 10805612 9174433 9391672 12245253 12692604
3911 12692604 9341157 7961163 12475661 18623399 20630021 19059268 17499542 15876308
3903 15876308 12322227 8414402 7041831 7160530 5782520 3530369 3108377 3445560 709205
3894 709205 -5141954 -9909922 -11587011 -12426271 -13757206 -13387090 -9776923 -4763211 -125514
3885 -125514 5094375 11708830 17858219 21537222 22840349 21537370 15597543 5406074
3877 5406074 -2992679 -3011947 4708177 12681192 14322124 9044795 948975 -4217343 -1624052
3868 -1624052 8716178 19647094 22243646 15340638 6939531 4473956 6679292 7446350
3860 7446350 4608011 1065591 -923789 -2089236 -3073511 -3034474 -1910615 -841388 218387
3851 218387 2104581 3197457 423757 -5267832 -8555783 -7034042 -4772811 -5589295 -6924426
3842 -6924426 -4817685 -1325202 -1050090 -2483822 441706 8536668 15574461 17049334
3834 17049334 14572267 10306059 3669958 -3754811 -6622082 -3430057 -95179 -826245
3826 -826245 -744347 5879523 14633506 16650394 12653573 11652370 15616006 15588749 6386946
3817 6386946 -3791926 -4448888 3021236 9282803 10712039 11205262 12641794 11848546 7586524
3808 7586524 3525518 2254794 1930466 1228914 2465454 6683097 10385330 11236958 12902663
3799 12902663 19015155 25400824 24571687 16539155 8518129 3779356 -2168962 -12081638
3791 -12081638 -20266457 -19942856 -12844666 -6344549 -3891291 -3413837 -3154569 -3479520 -3584902
3782 -3584902 -1882657 -165577 -2440492 -8386778 -12531455 -11851861 -10067611 -11765473
3774 -11765473 -15819476 -17835386 -16218760 -12142591 -5779955 2952903 10769517 12763273
3766 12763273 8789674 4747131 5778786 10304405 12572307 9942457 5979632 6519039
3758 6519039 13496728 22705484 27579442 25537234 20471535 18375765 20746682 23335560
3750 23335560 21382326 14610690 6425658 -236388 -4548883 -6065671 -3692422 2676442
3742 2676442 10607149 16265831 17025589 13102417 7606311 4943916 7322933 11899676
3734 11899676 13242574 10138477 7830214 10925399 16199246 16593077 11219486 5956651
3726 5956651 3614284 -231268 -8773389 -17210394 -19423485 -17068689 -15890178 -15852799 -11973600
3717 -11973600 -4089748 1236523 -272212 -5327189 -8516740 -8430419 -6699820 -5105122
3709 -5105122 -5266383 -7332983 -7639908 -1903133 7746529 13637660 12604182 10172160 11679131
3700 11679131 14381587 13031899 9002690 7839401 10062267 10439212 5817959 -1412008
3692 -1412008 -7786061 -12246184 -14464016 -13611763 -10527107 -8747406 -11652182 -19191923
3684 -19191923 -27705948 -32468507 -31075940 -25325164 -19274196 -15076820 -11967920 -9468258
3676 -9468258 -8947755 -10716213 -12234618 -11213068 -8292131 -5038090 -2158888 -1608589 -6561295
3667 -6561295 -15853727 -22056574 -19570593 -11764059 -5316063 -589072 6172041 13464417
3659 13464417 15268080 11187452 8106463 9768567 11567560 8937820 4944979 4901738
3651 4901738 7674315 7638243 3312950 -561788 667937 6165500 10816584 10408113 5484917
3642 5484917 343207 -2080209 -3258494 -5323158 -5858845 -332650 10388430 19385799
3634 19385799 21737087 19035946 14322129 7502990 -673262 -4530129 940074 12019506
3626 12019506 19110851 17833299 13133149 11404985 12068882 9257602 246004 -10134130
3618 -10134130 -13912527 -8143457 1949066 8227752 7483639 3200593 216790 -282653
3610 -282653 -5856 -15844 369639 2226578 6102201 11898956 18403388 23070718 23283433
3601 23283433 18431655 11079435 5963606 6600062 11783236 16365771 16790879 14594480
3593 14594480 12620455 9700346 2754730 -6634430 -12261256 -10692568 -4727199 1603287
3585 1603287 7455827 12999461 17109266 19903184 23754430 28486026 29051659 22138580
3577 22138580 12431227 7686592 9117372 11063314 9222600 4859089 1312042 727073
3569 727073 4442249 12148138 19299077 19203336 10262142 -836316 -5256632 -558920 7816853
3560 7816853 12586167 11241859 7249682 5337030 5976619 5517440 2025441 -1197124 101172
3551 101172 5108203 9267877 10606226 11044952 11469765 9740383 5188457 1336817 1127808
3542 1127808 1813323 -1860683 -10266102 -17974866 -20306450 -17780197 -13116931 -6842830
3534 -6842830 1370042 8571660 9717310 4137232 -2002859 -2057500 3819122 10167977 13636837
3525 13636837 15472822 16980409 16749649 14053819 11603918 12278362 15238577 17670924
3517 17670924 18571791 18570092 17929688 17245520 18182897 20614267 20903207 16466090 10366580
3508 10366580 7405972 7110518 5439104 2615336 3304079 8091158 10780829 6914252
3500 6914252 133381 -3349904 -2554952 -107630 3621250 9890546 17201349 22319870
3492 22319870 24688030 25726097 24791819 20259556 13973980 9668131 6644462 243523
3484 243523 -9822219 -16602910 -14374982 -6107059 1018721 4402483 6339503 7996810
3476 7996810 7872308 5344993 1351711 -4235386 -11709494 -17940155 -18311661 -13399229 -9295858
3467 -9295858 -9374960 -10096095 -7848586 -5462098 -7068968 -9611484 -5799722 4882714 13915097
3458 13915097 13942829 6908050 -24312 -3144573 -4103983 -5473161 -7470021 -8663731 -8096308
3449 -8096308 -6474109 -5579170 -6202767 -7078944 -6822662 -6066437 -5872852 -4989477 -1489265
3440 -1489265 3328019 6064550 6258553 6379718 6345237 2883530 -3896271 -8574014 -8499050
3431 -8499050 -8882952 -14676292 -21213148 -19658242 -10083016 -2139062 -2312409 -6710461 -8200493
3422 -8200493 -5319465 -1312999 1413177 2373448 1385129 -573052 -455048 3766268 9723878
3413 9723878 12768095 11319684 8487605 8473526 12573877 18626392 23469857 25891726 27451494
3404 27451494 30048747 32666440 31642918 24892396 14929746 6628437 2471469 1094972
3396 1094972 178257 -795823 -1323737 -2092553 -4481396 -7684021 -8369965 -4866934 -377786
3387 -377786 573128 -1337046 -358814 6562638 14993746 18241107 15407807 11526852 10769010
3378 10769010 12274467 12412431 8767248 1720636 -6078024 -11586911 -14022591 -15529606
3370 -15529606 -18168234 -20978950 -21512262 -19416734 -16604824 -14485868 -13082842 -12421955
3362 -12421955 -12545194 -12187462 -9523765 -4542118 757377 4424845 5589633 4156163
3354 4156163 1163544 -1268236 -2138181 -2852080 -4515439 -5429594 -3900770 -1968205 -2674799
3345 -2674799 -4528573 -2908164 2985668 8738882 10861231 10299933 8948536 6871218
3337 6871218 4669155 4652487 7245171 9350541 8661169 6857238 6325474 6580492 6602961
3328 6602961 8077867 12926465 19144861 22319333 20865576 17618672 16481635 18700278
3320 18700278 21813687 21661749 16638108 10219102 7214148 7131801 4307590 -3996713 -12706214
3311 -12706214 -14356397 -7024270 5076288 16134386 21442552 18599047 9851141 1799839
3303 1799839 -539533 1376172 2847978 2334453 1830220 2480043 3166395 2665256 351579
3294 351579 -4358705 -10409059 -13814546 -11037790 -3300480 4891697 10589002 13115407
3286 13115407 11535526 5641466 -648425 -1152554 5870976 15526217 21687323 22290858
3278 22290858 18831610 13577636 8711069 5983899 5442074 5559471 5567058 6600447 9909891
3269 9909891 14914924 19429554 20979518 18038581 11325904 4080839 -104685 -26348 3010424
3260 3010424 7040121 10304247 11276553 9715670 7405699 6411058 7098610 9015275 12158566
3251 12158566 15170642 13991957 5987155 -5017244 -11600059 -11130468 -7886855 -6195817
3243 -6195817 -5355277 -3087618 -262746 991921 1504236 3811440 7634149 9760333 8555032
3234 8555032 6178071 5633427 7183776 8492405 7335484 3356876 -2218073 -7449998
3226 -7449998 -10177620 -9018770 -5284286 -3336566 -6868298 -14047736 -18223114 -14867896
3218 -14867896 -6344265 1786842 7434547 12499324 18053302 22289712 23267471 20912727
3210 20912727 15967474 9489717 3884640 1888934 3516509 5869451 6600856 5684688
3202 5684688 3489812 -251957 -4525775 -6634238 -5416754 -3071380 -2325477 -3503134
3194 -3503134 -5648972 -8336061 -10351213 -8657258 -1644200 7441031 13127998 13741192
3186 13741192 12542748 12848925 14424687 15424725 15533232 15312067 13833372 9555172 3760237
3177 3760237 825371 3469262 8929613 12003542 11704007 12537311 18223941 26161642 30009874
3168 30009874 26802622 19735303 14407386 13822973 16681674 19060447 17864128 13745766
3160 13745766 10414046 10250796 11333181 9816817 4392199 -2690546 -7853834 -8354047
3152 -8354047 -4106940 851229 949086 -4224708 -8121672 -5712549 -1375374 -3077117 -10067517
3143 -10067517 -13067346 -7483637 427925 3426627 3120746 5281553 10026764 12589919
3135 12589919 11379570 9359160 8012134 5100556 -776625 -7262945 -11264735 -12366626
3127 -12366626 -12041083 -11285140 -10168004 -8520276 -6026306 -2162007 3120306 8387952
3119 8387952 10691237 7588403 261325 -6206193 -7631821 -5617194 -5312439 -8259869
3111 -8259869 -10584703 -9275120 -6636118 -5935988 -5588060 -1438492 6531356 13469057 15411124
3102 15411124 12854169 8490437 4140207 802425 -305781 1581355 5296814 7667158
3094 7667158 5697799 -215680 -5499234 -5604591 -1617408 209154 -4303428 -12252462
3086 -12252462 -17362132 -16853147 -12525045 -6630447 201008 6983824 11077862 10408753
3078 10408753 6422992 3843034 6505892 12684748 15451097 9685664 -1431291 -9263549
3070 -9263549 -9203731 -4604841 -986162 -51008 -810943 -2527431 -3809702 -2428279 506218
3061 506218 -525858 -8027732 -15638844 -14925135 -6759616 -630616 -2434444 -7582862 -7483441
3052 -7483441 432518 10494028 14516118 9068417 -1445734 -8845496 -9154090 -5398908
3044 -5398908 -1649966 2624122 9349885 16087539 18289443 15908302 12945816 11011913
3036 11011913 7987401 3015086 -1635454 -4035436 -4049681 -1325141 4163930 9645803
3028 9645803 11882145 12001945 13710077 16889921 17885676 16029820 14160870 12115491 6076655
3019 6076655 -3892794 -11877647 -14117708 -13142932 -11333510 -6749691 892058 6428200
3011 6428200 6563075 5659881 8586270 12414770 11463954 6750970 3682407 3188819 2177705
3002 2177705 1021207 3435550 9279975 13939308 15343949 16053771 17792929 19248073
2994 19248073 20358278 23718425 29680116 33863950 31742688 23467590 13229441 5946084
2986 5946084 4536060 7613295 9724604 6727241 1017748 -1422005 1075500 4271739
2978 4271739 4248320 1472429 -1796214 -4351348 -5272924 -3750606 -964182 715896 1306759
2969 1306759 3072082 6138328 7646879 6352015 4604942 4346962 4636581 5045304 8026589
2960 8026589 15103937 23117366 26958721 24521519 17279924 8146674 795003 -1105673
2952 -1105673 3155079 9881713 14277279 14711353 13130128 12647896 15262364 20084617 23301148
2943 23301148 22041747 18497531 17200242 17929976 15614024 8736497 2944673 3091863
2935 3091863 5989141 5381631 825892 -3187568 -4550429 -4956823 -5432403 -5099054 -3571705
2926 -3571705 -698357 4731898 11906147 15484523 11562319 5056746 5016857 12365290 18423018
2917 18423018 16826724 10898711 6890325 5543605 3879815 840814 -3001954 -8164874
2909 -8164874 -14566401 -19121401 -18530631 -13346284 -7038020 -2580983 -1609545 -4361859 -8037994
2900 -8037994 -7711904 -1748175 5783606 10760263 14454245 19787969 24582047 23451373
2892 23451373 15825640 7548408 3835009 4025158 4186043 2254178 -411516 -832845 2840060
2883 2840060 9340426 15369051 19622936 24361156 31250877 37499313 38842980 34840726
2875 34840726 28052190 19579876 9494686 511360 -3747273 -4064484 -4118347 -3260961 3275969
2866 3275969 15053418 23468364 22296154 16526764 15521622 20590485 25134190 25356884
2858 25356884 24479033 25752530 26935659 24465470 19695643 17579431 20222539 24299152
2850 24299152 25079636 21607574 17267084 15882961 18137681 21773189 24060459 23208218
2842 23208218 18698930 12340680 8385648 9815500 14027568 14875630 10040004 3816181
2834 3816181 1182784 1844368 2440943 2285086 3698502 7707266 12253350 14428712 12666892
2825 12666892 7465807 1715880 -651437 1709161 5982112 8500524 7953138 3835468
2817 3835468 -5090431 -17029445 -24387428 -20374082 -8109757 2054095 4876531 4672010
2809 4672010 6210358 7375756 4734269 1194015 1870384 4796941 2660794 -5817297
2801 -5817297 -12465524 -10406506 -3627235 -1381924 -5499291 -8658500 -5519407 -354400
2793 -354400 -589940 -6108186 -9419748 -5423066 3382623 11719971 17271348 19995858 19648465
2784 19648465 16948978 14506559 13349844 10572075 3743293 -4187029 -8345106 -9117526
2776 -9117526 -11446950 -17051004 -21765598 -21611122 -17550785 -12454805 -6672283 784271
2768 784271 8624017 13400222 12811622 7865310 2340670 239934 2434745 5533138 5335208
2759 5335208 1417567 -3059192 -5502909 -5739200 -4425350 -2742468 -3610493 -9405892 -17289718
2750 -17289718 -20357961 -15560960 -7773024 -3769624 -4498879 -5794873 -4838001 -2987812
2742 -2987812 -2931100 -5354560 -8493698 -9827347 -8353598 -5510827 -3208635 -1294481 1360540
2733 1360540 3623360 2790057 -812752 -2884755 -363583 4813443 8738196 10030255
2725 10030255 9618487 8337075 6854549 6224102 6514388 6255046 4643932 2737612 1500388
2716 1500388 892943 1851937 6181073 12930230 18136822 20061644 20923032 20976632 15665184
2707 15665184 3264397 -8782140 -11676528 -7302118 -5543961 -9991621 -13308819 -8513689
2699 -8513689 1176150 7099694 5655983 392072 -3870843 -5305180 -4333658 -1699061
2691 -1699061 1916616 5582540 8472196 10859222 14342733 20002932 26259654 30233084
2683 30233084 31803521 33982751 37740103 39110262 34307649 25763420 19530582 17722113
2675 17722113 17118961 14832787 11681364 9583804 8787851 8501046 7909897 6070361 2874348
2666 2874348 268608 336423 2152953 2875113 1982293 1883061 3959652 6523141 7493048
2657 7493048 7108353 7110186 8603803 11238553 13518447 13828101 11702894 7476828 682701
2648 682701 -8745742 -16755775 -16636382 -7521588 2026379 3683466 -73081 -752438 2995855
2639 2995855 4401438 551818 -2643031 113961 5869157 9002448 9155695 9193283 9160719
2630 9160719 6927588 2596482 -1608651 -4519374 -6315091 -6947169 -6471830 -5682823 -4724221
2621 -4724221 -2451949 1506824 5511128 7586511 6784082 2873578 -2641479 -5200446
2613 -5200446 -788287 7942658 12915165 9673363 1724384 -5573727 -11126763 -15638318
2605 -15638318 -17415874 -14621148 -9031912 -4099335 -1242096 -525416 -2304267 -5371916
2597 -5371916 -6226426 -3345541 212039 1451027 2052872 5011205 9202390 11189498 10616235
2588 10616235 10048159 10757866 12000240 13255774 14127037 13233661 10156756 7379041 7606280
2579 7606280 10151586 12159943 12258574 11389411 11671053 15332138 21827662 25254421 19611854
2570 19611854 8876321 5580799 14593397 24215264 20350444 4959591 -7853036 -11017608
2562 -11017608 -10319601 -11942547 -14012821 -12811326 -9631569 -7867142 -8453855 -11003665
2554 -11003665 -15370837 -20146071 -23269100 -25216701 -27694799 -28730482 -23949332 -13789358
2546 -13789358 -4371020 545665 3761523 8904085 15103594 19731395 22304957 23090326
2538 23090326 21269585 16867030 11745638 7290547 4024845 3903841 8702018 15348424
2530 15348424 17919171 15685060 13769494 14060633 11970507 5624249 1635483 6163329
2522 6163329 15190003 19881005 18058878 14238883 11126647 7680213 4229326 3275182
2514 3275182 5211034 8105801 11662481 17042982 22852433 25445997 23431660 18350518
2506 18350518 11133309 1737025 -7604455 -12722120 -12039432 -7892466 -2949279 1835466
2498 1835466 5548447 6881543 6171099 5186791 4292291 2458484 531741 1350575 5434850
2489 5434850 9396627 10305908 9326155 9118998 9517587 8133306 4493679 1519760 2585532
2480 2585532 7963166 14443493 18344763 18890440 18360328 18871118 20010547 20320611 19688058
2471 19688058 18616039 16391853 12540010 9497103 10670510 15396637 19036025 19406906
2463 19406906 19950967 23988711 28462056 27285924 19969472 12702223 10151056 10021410
2455 10021410 7938111 4575168 4144213 7103142 8714681 5716951 950790 -635962
2447 -635962 1881456 5681026 8732404 11064929 12414168 11854449 10104708 9516125 10699019
2438 10699019 10933007 7141339 -304603 -7281575 -9138582 -4801609 1622920 4577638
2430 4577638 3736323 5108507 12895337 22164023 23910146 16749526 8573582 5890645
2422 5890645 6743095 6254998 4041120 2260758 189016 -4420630 -10454359 -14183142 -14060406
2413 -14060406 -11537516 -7921603 -3350188 1732159 6555698 10886902 14139564 15058821
2405 15058821 14299202 15328391 20001231 25031125 25933123 22764691 18657068 14620682
2397 14620682 10031462 6717623 7416406 10503675 11363602 9481276 9282061 12936750 17246817
2388 17246817 19349301 20589422 22036578 20737815 14427196 6761442 3542604 5603161
2380 5603161 9272395 12262326 14778661 15549149 11642901 3591613 -3015583 -3568864 -109842
2371 -109842 1484686 -950286 -3622363 -2310002 2008674 4501462 2439639 -2036747
2363 -2036747 -5192324 -6034562 -6398773 -7773511 -9479992 -9926164 -8691736 -6960127 -5952530
2354 -5952530 -5054968 -2234137 2778756 6573642 5498982 973599 -1441968 800513
2346 800513 4042665 4127330 1978337 441523 -1296660 -5406490 -9253854 -7074216 1923167
2337 1923167 11857934 17488859 18939169 18097596 15215279 11663902 11684719 17175452 23167396
2328 23167396 22770304 15877347 9644944 10430358 17644143 25324738 27457633 21786177
2320 21786177 10969629 1183878 -1918112 2453879 9702140 14105395 13796596 11486528
2312 11486528 10453632 10576730 9199445 5447388 1777270 578213 1343364 2831207
2304 2831207 5849727 10980137 14991685 13379889 6509070 -131735 -2241045 -316307
2296 -316307 3114016 6150978 6728157 3304259 -1901443 -4126118 -2585271 -1927276 -4593429
2287 -4593429 -6065124 -1910842 4206428 5371253 2116498 1566595 5763457 7413398
2279 7413398 -114659 -13325583 -22737849 -23497057 -18176767 -10976577 -3579345 2951889
2271 2951889 6023295 3799042 -1684665 -6055435 -7339446 -7421833 -8245701 -8433917 -5432761
2262 -5432761 106697 4485523 5409811 4056730 2414442 973331 -48511 367098 2136959
2253 2136959 2889576 687060 -3121971 -5390272 -4574392 -1351719 2857577 6307814 7006928
2244 7006928 4372840 414750 -2008511 -1554753 1599321 6547746 11300297 13523015
2236 13523015 13252798 12952150 13195627 11020192 5231516 236235 283497 2374625 601338
2227 601338 -3765546 -3457185 2808167 6902044 3187280 -2593499 -1870346 3825518 5486140
2218 5486140 399765 -3872900 -479714 7325159 10677057 5796487 -2732305 -7778912
2210 -7778912 -6407814 -1481452 1796237 1062935 -797324 980338 6830200 11311420
2202 11311420 9040034 1107188 -6357138 -9617772 -10842146 -13342521 -15790356 -13847658
2194 -13847658 -6822141 353269 2825221 1334812 313289 2065885 5306148 8731409
2186 8731409 12875939 17449041 19504517 16575812 10404600 5124044 1997139 -1696505
2178 -1696505 -7893993 -13830442 -14457783 -8143219 1126889 6966788 5579776 -1476708
2170 -1476708 -8328979 -9256708 -3734721 2897593 4912626 2174847 -652550 -448079 1122311
2161 1122311 1136251 -524393 -2354673 -4179169 -6239953 -6744704 -3579491 1698579 4587057
2152 4587057 3047529 -225419 -1986161 -2829919 -5774981 -11545156 -16883178 -17683211 -13364000
2143 -13364000 -7969761 -6468898 -9734224 -14184061 -16840476 -18648523 -20986306 -21307454
2135 -21307454 -16012037 -6671774 717184 2694559 652655 -3805942 -11012148 -19527330
2127 -19527330 -25144219 -25944270 -24357580 -22117221 -17795527 -12083612 -10083641 -13660555
2119 -13660555 -16230474 -11256803 -2494443 1034182 -2012658 -4779738 -3691406 -2488721
2111 -2488721 -3672348 -3421988 1631056 8088241 10181577 6924641 1656189 -2636833
2103 -2636833 -4644331 -3937916 -1871581 -1633642 -4808026 -8763629 -9185602 -4577336 2477435
2094 2477435 7473283 7163118 2209036 -3006456 -4710774 -3645665 -2824381 -2408308 -36856
2085 -36856 4232068 7372709 8313340 9455851 12225910 14789529 15365497 14291368 11946681
2076 11946681 8584792 6908976 9831661 14394431 13764984 7652288 4374150 8832305
2068 8832305 14960949 15440301 12574929 12310085 12882670 8660683 1954208 687134 4988931
2059 4988931 6308058 1529877 -1499764 3639169 11923273 14559211 10918920 7014656
2051 7014656 5841118 4989763 2142073 -1800410 -4754117 -5667654 -4938401 -4242014 -5172285
2042 -5172285 -7180098 -8364369 -8777003 -10373191 -12820452 -12736489 -8986905 -5373123 -5289213
2033 -5289213 -6622670 -5207170 -849756 3678638 7504622 11387053 14126686 13813498
2025 13813498 12141963 12966408 16218944 17546443 15038811 12239731 12550609 14181861
2017 14181861 13348264 9746741 5686024 1723162 -3061473 -7093297 -6524972 -510399
2009 -510399 6521586 9578893 8304691 5766062 3694400 1477213 -832235 -1612957 -531465
2000 -531465 389286 181456 1112073 4958410 8847764 8289534 3835870 930089 2461599
1991 2461599 5229681 5562835 4839949 6265978 8886492 9115376 7083935 6871917 9876715
1982 9876715 12022724 9441578 4046005 1090059 2883178 7001101 9511437 8061254
1974 8061254 2827713 -3399753 -6490415 -4351752 835993 5164663 7485384 9545881
1966 9545881 11835462 11987436 8645707 4815122 5000330 9747025 15232462 18263079 19562253
1957 19562253 21306242 23176724 22655887 18814601 14173174 12113475 13039421 13845020 11336618
1948 11336618 5830171 943360 -97274 2692853 7021400 10938877 13306037 12600896
1940 12600896 7698532 506470 -4306303 -4036351 -1447904 -1770796 -6488958 -11613178
1932 -11613178 -12189413 -7372856 -864728 2852027 2582196 1187685 2029059 4428667 3947400
1923 3947400 -1692228 -8401788 -9673923 -4115660 3321523 7377819 7197974 5053441
1915 5053441 3511105 4785613 9808119 16123190 19156488 17491587 14589911 13262287
1907 13262287 11215079 5321082 -1902875 -4395686 -464072 5406933 8745157 9351960
1899 9351960 8791744 7393287 5359279 3924535 3519494 2950894 1928319 2131236 4050014
1890 4050014 5121454 3362767 1033537 2037583 6843063 12415673 16141624 17223507
1882 17223507 15143296 10053719 4803316 3320740 5781556 7814227 6055494 2621860
1874 2621860 2211190 6011583 10525704 11934155 9720373 5971538 2993964 2367592 4699785
1865 4699785 8608336 10604920 7967970 2109351 -2538861 -3775686 -4183454 -7115292
1857 -7115292 -11773578 -14673582 -15075765 -15753046 -17891608 -18287461 -13367711 -4202586 4081316
1848 4081316 6762069 2662590 -5279513 -11359474 -10954025 -4814127 1577246 3822930
1840 3822930 2169010 -1033450 -4123850 -4973440 -1144066 5648583 8940129 5582924
1832 5582924 1177325 2512414 7673335 9889933 8730250 9603998 12868955 12112093 4845083
1823 4845083 -3117594 -6790691 -8211761 -10073346 -10380003 -7950626 -6464672 -7618944
1815 -7618944 -6547855 -217706 5686279 5557068 3918648 7814246 13546227 11430351
1807 11430351 1763305 -4675982 -2432002 2246308 2808565 1256837 2192038 5239092
1799 5239092 7287661 6953123 4024583 -566077 -2501322 2273570 9717782 10268238 2259292
1790 2259292 -4093883 -274520 9473360 15757853 16678030 16529750 16652589 14683213 10277319
1781 10277319 5435703 969753 -2380010 -1601471 4743245 12438492 16266918 16604268
1773 16604268 16661933 15959374 12346791 8199504 7962051 10703579 11635679 10373114 10977046
1764 10977046 13783662 14200563 10796122 7846225 7660836 6682504 2463140 -1008204 707352
1755 707352 5174536 6439262 3393268 472083 924322 2934158 2777203 -253900 -2899577
1746 -2899577 -1575279 3200039 6718778 5262140 351452 -3793928 -5918934 -8326622
1738 -8326622 -12444632 -16755980 -19220746 -19044895 -15846593 -9801338 -3134952 949667
1730 949667 1427975 -310553 -3203562 -7137357 -10912348 -12112058 -9400577 -3473638 3473907
1721 3473907 7660516 5446605 -1641233 -6076551 -3024392 2369910 2009664 -2937877
1713 -2937877 -4358809 -950997 -524424 -6573739 -11566845 -8185793 62064 4952568
1705 4952568 4316663 992629 -3718992 -9103727 -11449191 -7874705 -1257256 3880092
1697 3880092 7571907 11500524 13406999 10592166 6245998 5641482 7885061 8053818 6034105
1688 6034105 6148487 8648535 9054978 6642258 6241063 9418189 10452189 4783565 -3345768
1679 -3345768 -5931000 -1119954 5511228 8172261 6502220 4155314 3349936 1907072
1671 1907072 -3236824 -9946735 -11536280 -5362429 2711468 5941580 5439753 6306527 8000603
1662 8000603 5466770 -1200608 -5638515 -4549377 -1451583 278590 1465275 2126162
1654 2126162 -796392 -7225270 -11516217 -10458009 -8355107 -9428386 -10285479 -6016414
1646 -6016414 97772 141547 -6568189 -11599506 -7730734 3592139 15610047 22994671
1638 22994671 24370708 21611722 18475733 18357358 22016680 27394802 31107039 30171843
1630 30171843 24256643 17152198 13756885 14159053 13215290 7795530 1369331 -1370229
1622 -1370229 -1176033 -1400635 -1100657 3596656 12132073 18941643 20826148 20322837 20586726
1613 20586726 20938478 19185503 15122635 9952468 4833934 1475757 1577381 4055954
1605 4055954 5220961 3403566 1109359 750908 778959 -1219017 -3622293 -2746024 741210
1596 741210 1146760 -5096353 -14006593 -17869111 -13559116 -5279059 698833 2140387 1208851
1587 1208851 721218 1988963 5371750 10187408 13608216 12297456 6703751 1726363
1579 1726363 1196833 3438557 4556811 4283269 5188688 7223953 7423379 5540512 5613531
1570 5613531 9767322 13859001 12478047 6314204 1225461 772337 2775713 3457495 2290780
1561 2290780 1504453 2394122 3878673 4601086 5168944 7254884 10597920 12352411 10614862
1552 10614862 7528891 6741315 8182239 8283206 5942446 4720221 6873528 8525092
1544 8525092 4846569 -1769037 -3672695 1901480 9514440 13673942 15503955 18137783
1536 18137783 19444351 14542469 4291668 -3766458 -3779276 2646349 10034053 14983926
1528 14983926 16691329 14674303 9438616 4326320 3478399 7441293 12515302 14659614
1520 14659614 12654256 7625509 1547699 -3138915 -4359093 -2389218 -171475 -424440
1512 -424440 -2879595 -5133882 -5477210 -3920000 -1342042 839802 756552 -2079511 -4799448
1503 -4799448 -3157673 3331142 9687176 10400335 5305416 -669713 -2764004 -17928
1495 -17928 5299891 9671915 10086442 6430170 2763187 3902257 9622903 14310075 13683659
1486 13683659 9638920 6484732 4827492 2531548 168379 969809 4922869 7086258
1478 7086258 3770420 -2489175 -6385799 -6097927 -3655385 -769653 2608757 5879763
1470 5879763 6655857 3042014 -3983868 -10982472 -14419118 -12725991 -6697153 1679200
1462 1679200 10270746 16384997 16582315 9189886 -2618302 -12156825 -14560773 -9841462
1454 -9841462 -1145216 7510815 11853693 9566617 3559468 -251020 -322803 -1033931 -4496697
1445 -4496697 -5555935 411495 8753616 11067861 7059949 3563155 2636162 -1074129
1437 -1074129 -9492255 -15623367 -13209495 -6194116 -3494262 -7896178 -14572866 -17823463
1429 -17823463 -15078444 -6577079 4332893 11507185 10477230 2783470 -6074187 -12147991
1421 -12147991 -14943564 -15642900 -15758967 -16192934 -15702938 -12003652 -6092137 -2792526 -4312267
1412 -4312267 -6081722 -2784915 3721376 6961442 4848571 1384591 9962 114879
1404 114879 402708 1079285 1690125 839418 -692581 -236967 2147009 3159581 1922288
1395 1922288 2108971 5995665 10197174 10715689 9120046 9604896 12113065 12973009 11164860
1386 11164860 8947876 6234808 -283226 -10375639 -17224209 -14912323 -6291052 627028
1378 627028 2475478 2338970 2561727 1318846 -1977654 -3073475 1172587 6444514 5698433
1369 5698433 -908418 -5701891 -3194140 4437874 12382807 18942152 23906673 25294808
1361 25294808 21631125 15497720 11255527 9987755 9382396 8022045 7153137 8013432 9409167
1352 9409167 8882458 5822289 2952788 3994021 9033316 13250215 12286737 8119590 6554397
1343 6554397 9125206 11400593 9953168 6486212 3318670 -447565 -5234077 -7832189
1335 -7832189 -5945812 -2473301 -1266217 -1806419 -2096572 -3224117 -6181609 -7748444 -5578026
1326 -5578026 -4464683 -10519652 -20714530 -25367410 -20447776 -10639560 -734560 8412616
1318 8412616 14819130 14409041 7851593 1954851 1367388 4282490 8512853 15630761 25766911
1309 25766911 33867575 35198111 30556876 23113438 14503378 6864249 3689230 4890436
1301 4890436 5378299 2159584 -1496717 -2427468 -3002545 -5647906 -6907461 -2795511 3632392
1292 3632392 6084268 3762716 767049 -759861 -1342572 -316968 2857630 5061272
1284 5061272 3065670 -575525 -741231 2408893 4794362 6652146 12452902 21940743
1276 21940743 28055911 26150140 19844137 14849006 11501078 6974417 1622091 -1039469
1268 -1039469 303748 2412801 999840 -4424157 -9684315 -10284270 -6474968 -2530407
1260 -2530407 -645262 1617485 5963368 8822217 6062769 10813 -2966440 -836850
1252 -836850 2861290 5603352 8497246 11740076 12518796 9293770 4344278 275353 -2686163
1243 -2686163 -4376699 -3223311 659295 3714528 2736271 -1437776 -5773617 -8688743
1235 -8688743 -10208657 -10326196 -9029463 -6681657 -3006084 2990182 10780405 17238707
1227 17238707 19239720 16792857 12840562 10473437 10534193 11094377 9194817 4069146 -1380641
1218 -1380641 -3306501 -926850 3113927 5823217 6125139 4841489 3881417 4702157 6184907
1209 6184907 5132756 414872 -4878246 -7258748 -6943060 -5904599 -4335330 -2360379
1201 -2360379 -2693476 -6915195 -10850592 -9004526 -2820616 974369 157467 -438984 3264222
1192 3264222 9651379 15365403 19114221 20275593 18603804 16596086 17335006 18991417
1184 18991417 16736598 10964534 7370958 7484776 6315001 1870827 -905151 184298
1176 184298 -991364 -8717478 -16795401 -17621702 -14129307 -14206054 -17620467 -17747253 -13647501
1167 -13647501 -10996980 -11771825 -11791390 -9058801 -6671730 -6085117 -4497644 -850879 1791501
1158 1791501 2162263 3641125 8486213 13557884 14406814 10406668 4123382 -1337770 -3261205
1149 -3261205 -964918 2470468 3472403 3602981 7871956 16343155 21930365 18974038
1141 18974038 10572304 4769463 5832414 11249311 15256485 13876720 8479488 5240435
1133 5240435 8814709 16160960 19606763 16444191 11768183 10851462 12870288 14004813
1125 14004813 12709097 9425013 4797619 1141793 2336463 8840781 15472957 17482596
1117 17482596 16421895 16585483 18010906 17129450 12958550 8607569 7072963 8633728
1109 8633728 11812601 14164324 13087015 8840156 5733729 7048020 9829073 8646156
1101 8646156 3849249 1379743 3886383 6914021 5740889 1606846 -1626969 -3149982
1093 -3149982 -3813540 -2249271 2692906 7228837 5793678 -875914 -5858932 -5656137 -4865962
1084 -4865962 -8474160 -13798526 -14582339 -10213595 -5460224 -2408090 1336915 6093264
1076 6093264 7937885 5431396 3233669 5399968 9192157 9710406 7312496 5753199
1068 5753199 5591531 4603959 2916105 2252589 1155408 -3270416 -8974498 -10117525 -5407668
1059 -5407668 97419 2630720 3676352 4692437 3811936 801409 -172327 3083473 6069183
1050 6069183 3962540 -708224 -1689811 2143816 6358940 7648552 6411937 3908230
1042 3908230 1195021 182686 1829466 3806070 3373248 1647443 1299710 1080756 -2777029
1033 -2777029 -9764108 -14323109 -12941982 -8289366 -4960876 -4256434 -4660761 -4886123 -4717675
1024 -4717675 -4391587 -4185298 -3688441 -1672906 1937272 4994879 6394605 9177101 16748841
1015 16748841 26479137 31355253 28646442 22759099 18271817 14448083 8906908 2844084
1007 2844084 -650075 -865601 914326 3870696 6767295 6604560 1616912 -5233409 -8679063
998 -8679063 -6885007 -2953620 -1391892 -4593662 -11429791 -17144859 -15940010 -6564454
990 -6564454 4848042 9892198 6160949 -921519 -4093349 -608155 6614336 12093034
982 12093034 12218368 8451479 6247418 9503291 16215048 20661433 19261109 13206733
974 13206733 6585055 3628022 6337414 12109650 14562722 9787475 1559385 -2674544
966 -2674544 -963105 1316998 -779759 -5874039 -9554274 -10111236 -8637324 -6070203 -2905030
957 -2905030 -142030 1913088 4390004 7321330 8148213 5344102 1889375 1938007 5105321
948 5105321 7582079 8292538 9792298 12584475 13011366 9014456 4433764 4159242 7020159
939 7020159 7198774 2147020 -4265990 -6984512 -5348254 -2142535 909912 4700829 10391206
930 10391206 17050080 21750221 21433309 15201144 5798211 -1579374 -3546580 -1972897
922 -1972897 -1684037 -4019801 -4514194 1249953 11089933 18543858 21206311 22950078 26856820
913 26856820 29960021 27873711 21451120 14718417 8350114 452242 -6846121 -7843898
905 -7843898 -2288164 1481579 -3626789 -14027233 -20288300 -19008470 -14964017 -12580651
897 -12580651 -10758615 -7148608 -2807484 160605 2717729 7466183 14138777 18956981
889 18956981 18480392 12823752 5237423 -468206 -2177153 -169071 3812878 8082213
881 8082213 11661708 13907533 14213199 12305446 8648076 4594396 1968880 1615309 2059423
872 2059423 908632 -1562808 -1862595 1926913 6358288 6444302 2480627 -422206 144510
863 144510 584544 -2943122 -8679697 -11644427 -9625004 -4269438 1935835 6835072 7979112
854 7979112 4236731 -1710670 -4879062 -2619661 3493052 10081256 14538310 15442664 12646814
845 12646814 7793494 3564348 1827708 2958160 6352389 10302393 11981637 9574540
837 9574540 4501919 -225007 -3817320 -7750484 -11877827 -13364005 -10842970 -7152105
829 -7152105 -5748774 -6128188 -5264949 -2429592 239085 1535342 2612623 4141694 4767903
820 4767903 3694600 2584097 2965221 3292458 937724 -3553056 -6505575 -5384988 -912374
811 -912374 5247691 12339161 18794479 21021423 16552490 7714688 -97203 -3802263 -4626295
802 -4626295 -5003674 -5734430 -6702364 -8100894 -9337688 -8082761 -2357182 6562906 14477593
793 14477593 17611142 15305275 10018077 5473609 4344966 6526080 9189242 8987613
785 8987613 4889640 -566454 -2763332 1290243 9676513 16453868 17170181 13396834 10514226
776 10514226 11429894 14555281 17800858 21259022 24415924 23923530 17544755 8910550 4793501
767 4793501 7486356 12389969 13407705 8499064 -372913 -10097296 -17629021 -20102363
759 -20102363 -16165071 -7677310 797416 5056099 4407425 1883377 873242 1645738 2199813
750 2199813 2337560 4440810 8857616 11156413 7152497 -705771 -5805632 -6025817 -5832342
741 -5832342 -8783885 -12280745 -12552166 -11329547 -13013711 -16617082 -15576352 -6724251 4351569
732 4351569 9369095 6607436 1525274 -506299 955071 3588028 5975694 7730503
724 7730503 8457565 8809966 11007939 15821587 19973445 19181519 13316774 5820326 -1583575
715 -1583575 -9962831 -18302023 -21557973 -16192531 -5407237 3441268 5249230 -83597
707 -83597 -8682204 -14627223 -13687504 -7922065 -4537584 -7652452 -13307350 -15033806 -11575464
698 -11575464 -6041124 -677087 3161768 2727639 -2965692 -9457457 -11736849 -11349766 -12957619
689 -12957619 -15435600 -13343921 -6663222 -1469290 -366162 -26966 514159 -2235644 -7203222
680 -7203222 -6583656 2247712 10551283 10223236 5060083 2926693 3122046 367076 -3460299
671 -3460299 -1700319 5172853 9709315 9261982 8920084 11960911 15321727 16252697 16494042
662 16494042 17586298 17919088 16624572 15129957 12900319 6885172 -2593171 -10361497
654 -10361497 -13137403 -13064494 -12318332 -9358202 -3701877 427965 -602077 -4436882 -6530639
645 -6530639 -6377226 -6350085 -7207594 -8495964 -10791446 -13630984 -13630327 -8949635 -3701128 -3327414
635 -3327414 -6899931 -8796035 -7356475 -6664135 -9128604 -11455316 -10218444 -7350100 -6734807
626 -6734807 -7896234 -6866085 -2406911 2232707 4194237 4514025 5157011 5072351 2222666
617 2222666 -1517400 -1321052 3803927 8649541 8584964 5900381 5831493 8079499 6962688
608 6962688 77593 -7699468 -10476314 -8178594 -5011237 -3766270 -4199135 -5403708 -7222804
599 -7222804 -9609925 -11947137 -12921333 -11059751 -6402736 -1400053 1558527 3237778 5941704
590 5941704 9197670 10305115 9367373 9743243 12282922 13446155 11530796 10611672 14678801
581 14678801 21082442 23936661 21783736 17743242 13698406 8619322 2062011 -4215781
573 -4215781 -7989878 -7687041 -3028069 3162049 6067945 5083459 6324034 14420102 24021831
564 24021831 25340778 17233251 8462397 5737714 7132641 8849946 11505071 15974178
556 15974178 18882172 17537544 15418534 17007618 19508516 15681312 4486879 -6474034
548 -6474034 -10257401 -8049170 -5269740 -3507940 145116 6655505 11575852 9876120
540 9876120 2744284 -3032217 -2815989 1046522 3410978 2998721 2190852 1825737 156600
531 156600 -2925812 -4420812 -2276264 1895359 5462306 7588121 8165666 6727508 4226811
522 4226811 3438338 5496298 8016760 8458727 7172513 5275749 2178277 -2127460 -4807914
513 -4807914 -3673300 -1282966 -2094207 -6539199 -11018312 -12645969 -10874949 -5904942 493023
504 493023 3589694 -70840 -6915830 -9486768 -6189040 -3382577 -6306523 -12411423 -15962940
495 -15962940 -15065691 -11148650 -5372333 544649 3021759 746535 -1767226 700750
487 700750 6503619 9147608 6334714 2381437 1446134 3104075 5815808 10023362 15189875
478 15189875 17693126 15415067 12006498 12578921 16182543 16320030 9162303 -1583174
470 -1583174 -8684185 -8266229 -2130242 4908370 8828588 8573045 5727739 2466041 -7302
461 -7302 -1206779 -839376 592549 1720086 2057828 2804111 4467827 5097465 3250899
452 3250899 1572588 3955923 9250608 11778227 9387605 7163162 10446016 17051080
444 17051080 19882886 15668028 7677675 649836 -3542323 -5145894 -4655301 -2813998
436 -2813998 -709946 967997 1953938 2035346 1835156 2945129 5247166 5222860 86833
427 86833 -6768969 -8343849 -3017292 2662157 2093304 -3585858 -8323038 -9031700 -7330500
418 -7330500 -5326914 -3702916 -3576032 -6336785 -10523805 -11669256 -7036405 926452 7237744
409 7237744 9537115 9433443 9455955 10116538 10203616 9044210 7628967 7375339 8242261 8582504
399 8582504 6850883 3121562 -943045 -3134713 -1996107 1906739 5823333 6911815
391 6911815 4982006 2499032 1567722 1597567 145246 -4582043 -11821045 -17745583 -17454892
382 -17454892 -9680722 357940 5391958 4147939 2214422 3839206 6540453 6475870
374 6475870 5472112 8079757 13665317 16684056 14469503 9949152 6242747 3249548
366 3249548 739164 264513 1838954 2470975 478826 -1874777 -2387765 -2327489 -3124065
357 -3124065 -2924995 48586 3492146 4365436 3909141 4800962 5238135 1328451 -5374044
348 -5374044 -8715614 -7086323 -5800135 -8056214 -9010477 -2982890 7246716 13259805
340 13259805 11248255 5053047 728 -1991570 -1271162 1349068 3943887 4117154 2065610
331 2065610 1040831 3250264 6816940 8145830 5968309 1778548 -2287671 -4333681
323 -4333681 -2805852 1856084 6117120 6442616 3822693 2684034 4287461 3997373 -2315912
314 -2315912 -11152007 -14587517 -10422527 -4958196 -4189123 -6183170 -5330113 -916538 3245034
305 3245034 5865334 8875713 10889444 6578998 -4367598 -13202925 -12163881 -5033500
297 -5033500 -1788291 -4664992 -6146895 -912908 6725334 9538756 6301741 766975
$$ [...]
##END NTUPLES=NMR SPECTRUM
##END=
