##TITLE=31Pdec_DE-119_oil4
, 64 sc
 25.12.2025
##JCAMPDX= 6.0         $$ Bruker NMR JCAMP-DX V2.0
##DATA TYPE= NMR SPECTRUM
##DATA CLASS= NTUPLES
##ORIGIN= UXNMR, Bruker Analytische Messtechnik GmbH
##OWNER= root
$$ XWIN-NMR		Version 3.5
$$ Thu Dec 25 13:48:01 2025 Russian Standard Time (UT+4h)  she@DPX200
##.OBSERVE FREQUENCY= 81.013821
##.OBSERVE NUCLEUS= ^31P
##.ACQUISITION MODE= SIMULTANEOUS
##.ACQUISITION SCHEME= undefined
##.AVERAGES= 64
##.DIGITISER RES= 17
##SPECTROMETER/DATA SYSTEM= spect
##.PULSE SEQUENCE= zgpg30
##.SOLVENT NAME= DMSO
##.SHIFT REFERENCE= (INTERNAL, DMSO, 0, 198.062)
##AUDIT TRAIL= $$ (NUMBER, WHEN, WHO, WHERE, WHAT)
$$ ##TITLE= Audit trail, XWIN-NMR		Version 3.5
$$ ##JCAMPDX= 5.01
$$ ##ORIGIN= Bruker BioSpin GmbH
$$ ##OWNER= she
$$ F:/spectra/data/she/nmr/P31/2/pdata/1/auditp.txt
$$ ##AUDIT TRAIL=  $$ (NUMBER, WHEN, WHO, WHERE, WHAT)
(   1,<2025-12-25 13:35:46.07 +0400>,<she>,<DPX200>,
      <created by zg, POWCHK disabled, PULCHK disabled
       configuration hash MD5:
       00 E9 B6 7A A2 85 ED C7 34 08 36 98 17 FE 4E 26
       data hash MD5: 32K
       79 4D 33 47 52 A6 49 A9 42 B3 40 3E 96 CD 20 B3>)
(   2,<2025-12-25 13:35:57.65 +0400>,<she>,<DPX200>,
      <Start of raw data processing
       efp BC_mod = 2 LB = 1.5 FT_mod = 6 PKNL = 1 PHC0 = 1394.193 PHC1 = 51.10034 SI = 64K 
       data hash MD5: 64K
       95 9B ED 01 7A D5 D6 C5 98 89 73 AC AC 14 EC 91>)
(   3,<2025-12-25 13:37:18.59 +0400>,<she>,<DPX200>,
      <pk PHC0 = -52.65231 PHC1 = 0 
       data hash MD5: 64K
       A3 02 E6 F2 56 FA F1 B4 A5 51 31 3F 0A 4E 47 DD>)
(   4,<2025-12-25 13:37:23.17 +0400>,<she>,<DPX200>,
      <abs ABSG = 5 
       data hash MD5: 64K
       EF D1 7D 37 2A 58 30 38 7B F4 E9 B4 C0 FF 45 9C>)
(   5,<2025-12-25 13:38:05.15 +0400>,<she>,<DPX200>,
      <pk PHC0 = 11.13511 PHC1 = 0 
       data hash MD5: 64K
       9B A4 B8 3B B6 67 1B 32 A5 04 AC 59 E5 CD BA 2A>)
(   6,<2025-12-25 13:38:11.21 +0400>,<she>,<DPX200>,
      <abs ABSG = 5 
       data hash MD5: 64K
       99 8F 68 E0 4D DB 72 0E 0C E8 1D 37 95 E5 3D 69>)
$$ ##END=
$$ 
$$ hash MD5
$$ 9B B8 37 2D C5 4C 13 4D 7A 1F BB FE 78 15 BA 62
##$RELAX= 
##$RELAX= 
##$RELAX= 
##$RELAX= 
##$RELAX= 
##$RELAX= 
##$RELAX= 
##$RELAX= 
$$ Bruker specific parameters
$$ --------------------------
##$DU= <F:/spectra>
##$EXPNO= 2
##$NAME= <P31>
##$PROCNO= 1
##$TYPE= <nmr>
##$USER= <she>
##$AMP= (0..31)
100 100 100 100 100 100 100 100 100 100 100 100 100 100 100 100 100 100 
100 100 100 100 100 100 100 100 100 100 100 100 100 100 
##$AQSEQ= 0
##$AQ_mod= 1
##$AUNM= <au_zg>
##$AUTOPOS= <>
##$BF1= 81.014009
##$BF2= 200.13
##$BF3= 200.13
##$BF4= 200.13
##$BF5= 200.13
##$BF6= 200.13
##$BF7= 200.13
##$BF8= 200.13
##$BYTORDA= 1
##$CFDGTYP= 0
##$CFRGTYP= 5
##$CHEMSTR= <none>
##$CNST= (0..31)
1 1 145 1 1 1 1 1 1 1 1 1 1 1 1 1 1 1 1 1 1 1 1 1 1 1 1 1 1 1 1 1 
##$CPDPRG= <waltz16>
##$CPDPRG1= <>
##$CPDPRG2= <waltz16>
##$CPDPRG3= <>
##$CPDPRG4= <mlev>
##$CPDPRG5= <mlev>
##$CPDPRG6= <mlev>
$$ [...]
##$SUBNAM3= <"">
##$SUBNAM4= <"">
##$SUBNAM5= <"">
##$SUBNAM6= <"">
##$SUBNAM7= <"">
##$SUBNAM8= <"">
##$SUBNAM9= <"">
##$SW= 400.765351723535
##$SWIBOX= (0..15)
0 1 3 0 0 0 0 0 0 0 0 0 0 0 0 0 
##$SW_h= 32467.5324675325
##$TD= 32768
##$TD0= 1
##$TE= 0
##$TE2= 300
##$TE3= 300
##$TEG= 300
##$TL= (0..7)
0 120 53 12 22 120 120 120 
##$TP= (0..7)
150 150 150 150 150 150 150 150 
##$TP07= 0
##$TPNAME0= <>
##$TPNAME1= <>
##$TPNAME2= <>
##$TPNAME3= <>
##$TPNAME4= <>
##$TPNAME5= <>
##$TPNAME6= <>
##$TPNAME7= <>
##$TPOAL= (0..7)
0.5 0.5 0.5 0.5 0.5 0.5 0.5 0.5 
##$TPOFFS= (0..7)
0 0 0 0 0 0 0 0 
##$TUNHIN= 0
##$TUNHOUT= 0
##$TUNXOUT= 0
##$USERA1= <user>
##$USERA2= <user>
##$USERA3= <user>
##$USERA4= <user>
##$USERA5= <user>
##$V9= 5
##$VALIST= <valist>
##$VCLIST= <CCCCCCCCCCCCCCC>
##$VD= 0
##$VDLIST= <DDDDDDDDDDDDDDD>
##$VPLIST= <PPPPPPPPPPPPPPP>
##$VTLIST= <TTTTTTTTTTTTTTT>
##$WBST= 1024
##$WBSW= 4
##$XGAIN= (0..3)
0 0 0 0 
##$XL= 0
##$YL= 0
##$YMAX_a= 3531
##$YMIN_a= -12514
##$ZGOPTNS= <>
##$ZL1= 120
##$ZL2= 120
##$ZL3= 120
##$ZL4= 120
##$ABSF1= 198.0616
##$ABSF2= -202.7028
##$ABSG= 5
##$ABSL= 3
##$ALPHA= 0
##$AQORDER= 0
##$ASSFAC= 0
##$ASSFACI= 0
##$ASSFACX= 0
##$ASSWID= 0
##$AUNMP= <proc_1d>
##$AZFE= 0.1
##$AZFW= 0.5
##$BCFW= 0
##$BC_mod= 2
##$BYTORDP= 0
##$COROFFS= 0
##$CY= -3
##$DATMOD= 1
##$DC= 0
##$DFILT= <>
##$DTYPP= 0
##$F1P= 0
##$F2P= 0
##$FCOR= 1
##$FTSIZE= 65536
##$FT_mod= 6
##$GAMMA= 0
##$GB= 0
##$INTBC= 1
##$INTSCL= 9.790993e-09
##$ISEN= 30
##$LB= 1.5
##$LEV0= 0
##$LPBIN= 0
##$MAXI= 10000
##$MC2= 0
##$MEAN= 0
##$ME_mod= 0
##$MI= 50
##$NCOEF= 0
##$NC_proc= -9
##$NLEV= 6
##$NOISF1= 182.463
##$NOISF2= 159.3651
##$NSP= 0
##$NTH_PI= 0
##$NZP= 0
##$OFFSET= 198.0616
##$PC= 4
##$PHC0= 1352.676
##$PHC1= 51.10034
##$PH_mod= 1
##$PKNL= yes
##$PPARMOD= 0
##$PSCAL= 0
##$PSIGN= 0
##$REVERSE= no
##$SF= 81.0140089999434
##$SI= 65536
##$SIGF1= 159.3651
##$SIGF2= -187.1042
##$SINO= 113.3802
##$SIOLD= 16384
##$SREGLST= <1H.CDCl3>
##$SSB= 0
##$STSI= 65536
##$STSR= 0
##$SW_p= 32467.5324675325
##$SYMM= 0
##$S_DEV= 0
##$TDeff= 32768
##$TDoff= 0
##$TI= <>
##$TILT= no
##$TM1= 0
##$TM2= 0
##$TOPLEV= 0
##$USERP1= <user>
##$USERP2= <user>
##$USERP3= <user>
##$USERP4= <user>
##$USERP5= <user>
##$WDW= 1
##$XDIM= 65536
##$YMAX_p= 492942475
##$YMIN_p= -146842523
$$ End of Bruker specific parameters
$$ ---------------------------------
##NTUPLES= NMR SPECTRUM
##VAR_NAME=  FREQUENCY,     SPECTRUM/REAL,   SPECTRUM/IMAG
##SYMBOL=    X,             R,               I
##VAR_TYPE=  INDEPENDENT,   DEPENDENT,       DEPENDENT
##VAR_FORM=  AFFN,          ASDF,            ASDF
##VAR_DIM=   65536,         65536,           65536
##UNITS=     HZ,            ARBITRARY UNITS, ARBITRARY UNITS
##FACTOR=    0.49542278885378, 1,            1
##FIRST=     16045.7642231865, 0,            0
##LAST=      -16421.768244346, 0,            0
##MIN=       -16421.768244346, -146842523,   0
##MAX=       16045.7642231865, 492942475,    0
$$ Real data points
##PAGE= N=1
##DATA TABLE= (X++(R..R)), XYDATA
$$ [...]
$$ plain form
7375 -6639995 -7588846 -6345663 -4952184 -4736730 -3941530 -301195 5730594 11138396 12937982
7366 12937982 10769290 7570433 6754001 8039358 7902447 5108182 2732211 2429499 363315
7357 363315 -6871693 -15029940 -16531985 -11028897 -6183499 -7712357 -13478777 -18066335
7349 -18066335 -18645409 -15291102 -9768462 -5550517 -5543515 -8340824 -9523885 -7273591 -3563286
7340 -3563286 301750 5102215 9856419 11245720 8974353 7678217 10757502 15407018
7332 15407018 16553823 13288552 8584004 4317592 -593275 -7256923 -13503774 -14414779
7324 -14414779 -7504831 2176625 5338042 -132872 -4383977 2407414 15836486 22476945
7316 22476945 18237108 12419313 12090571 12458324 7598334 1665709 1659132 5411744 5608845
$$ packed form
7375f639995r48851J243183J393479K15454P95200L640335O031789N407802J799586
7366A2937982k168692l198857q16432J285357j36911k794265k375971l02712k066184
7357C63315p235008q158247j502045N503088M845398j528858n766420m587558
7349a8066335n79074L354307N522640M217945P002k797309j183061K250294L710305
7340c563286L865036M800465M754204J389301k271367j296136L079285M649516
7332A5407018J146805l265271m704548m266412m910867o663648o246851r11005
7324a4414779O909948R681456L161417n470914m251105O791391J3429072O640459
7316B2476945m239837n817795l28742L67753m859990n932625o577L752612J97101
$$ plain form
7307 5608845 1996683 888824 4132946 6428565 3678329 -2199554 -7211253 -9137761
7299 -9137761 -7363180 -3112359 300703 1011936 1342544 3428378 4257628 -85910 -7157111
7290 -7157111 -10821273 -9799409 -7387456 -3796040 3873483 13688385 18568607 15990385
7282 15990385 11436119 9769812 9499102 8404419 8218735 9498263 7854507 736157
7274 736157 -6700745 -8283794 -5752454 -5070568 -6721079 -6134236 -2183660 1290413 2270912
7265 2270912 2845414 3754252 2049539 -3589523 -9093657 -9161315 -3065059 5235876 10966659
7256 10966659 11603756 8158026 4606640 4591911 7964480 11788070 14454914 16534225 17687295
7247 17687295 16009334 11476099 6976604 4272351 1804681 -1403022 -2722477 -84951
$$ packed form
7307E608845l612162j107859L244122K295619k750236n877883n011699j926508
7299i137761J774581M250821L413062P11233L30608K085834Q29250m343538p071201
7290g157111l664162J021864K411953L591416P669523R814902M880222k578222
7282A5990385m554266j666307k70710j094683j85684J279528j643756p118350
7274G36157p436902j583049K531340O81886j650511N86843L950576L474073R80499
7265B270912N74502R08838j704713n639062n504134o7658O096256Q300935N730783
7256A0966659O37097l445730l551386j4729L372569L823590K666844K079311J153070
7247A7687295j677961m533235m499495k704253k467670l207703j319455K637526
$$ plain form
7239 -84951 3219212 2307748 -1586614 -1852106 4233764 11057595 11635332 6122674 630573
7230 630573 -692620 671652 1458487 1281722 2266851 5347612 8421555 8440399 4760758
7221 4760758 -220887 -3755939 -5121008 -4729117 -2233675 2385680 6114608 3976863
7213 3976863 -5599251 -17623843 -24108567 -20621231 -9401333 2623391 8505231 5837210
7205 5837210 -1749704 -8106233 -10106615 -9117019 -7587628 -6463198 -6142631 -7078348 -8241697
7196 -8241697 -7672937 -5884754 -5775575 -7586451 -7483621 -3504567 949763 2795375 4356077
7187 4356077 8401253 12115310 11750686 9821221 10670787 11512603 6133784 -3698564 -9557485
7178 -9557485 -9411521 -9942779 -13858445 -14593063 -7945593 -310390 580323 -3876672 -7958218
$$ packed form
7239h4951L304163r11464l894362k65492O085870O823831N77737n512658n492101
7230F30573j323193J364272P86835j76765R85129L080761L073943J8844l679641
7221D760758m981645l535052j365069L91891K495442M619355L728928k137745
7213C976863r576114j2024592o484724L487336J1219898J2024724N881840k668021
7205E837210p586914o356529k000382R89596J529391J124430L20567r35717j163349
7196h241697N68760J788183J09179j810876J02830L979054M454330J845612J560702
7187D356077M045176L714057l64624j929465Q49566Q41816n378819r832348n858921
7178i557485J45964n31258l915666p34618O647470P635203Q90713m456995m081546
$$ plain form
7169 -7958218 -10398395 -11769022 -9210292 -1696814 4125772 1772569 -4724929 -6647047
7161 -6647047 -4250314 -5702022 -13251036 -19268585 -17254218 -9641246 -2886474 -491451
7153 -491451 -2458252 -6775230 -9932793 -9673485 -7650757 -6052501 -2922862 4318957 12208270
7144 12208270 14452496 11292137 8633579 7500618 2299706 -8022949 -14743173 -9962693
7136 -9962693 2753591 13002116 15253134 12172495 9331574 10116152 13676723 15377024
7128 15377024 11280408 3549221 -1516547 -1832930 -1818606 -4606195 -6840972 -4583920 -109984
7119 -109984 1722882 1025713 2014341 5977648 9418055 9168296 6348398 4734610 6708394
7110 6708394 10979703 13858162 13215822 10827868 9484218 8800439 6654326 4044947 4521700
$$ packed form
7169g958218k440177j370627K558730P513478N822586k353203o497498j922118
7161f647047K396733j451708p549014o017549K014367P612972O754772K395023
7153d91451j966801m316978l157563K59308K022728J598256L129639P241819P889313
7144A2208270K244226l160359k658558j132961n200912j0322655o720224M780480
7136i962693J2716284J0248525K251018l080639k840921P84578L560571J700301
7128A5377024m096616p731187n065768l16383J4324k787589k234777K257052M473936
7119a09984J832866o97169R88628L963307L440407k49759k819898j613788J973784
7110F708394M271309K878459o42340k387954j343650o83779k146113k609379M76753
$$ plain form
7101 4521700 8389268 11644149 11839422 11115874 12053210 14314144 16675518 18296371 16791776
7092 16791776 10040790 1787911 -280066 4642279 7144769 -189395 -11870117 -16424892
7084 -16424892 -10970603 -3089666 -224454 -2799753 -7050175 -9741318 -9733835 -8070572 -6766615
7075 -6766615 -6017902 -3927124 -384534 1312875 -1132660 -5591786 -8710416 -9685091 -8719942
7066 -8719942 -5385899 -1280155 -341001 -3192621 -5318721 -4466168 -4933328 -9671325 -13299518
7057 -13299518 -9563868 -1629771 2415411 1245644 -103255 127759 -877318 -3810520
7049 -3810520 -7176537 -12561898 -21506402 -27999061 -23673772 -11392145 -4114456 -7710202
7041 -7710202 -13738287 -12930808 -7526285 -5180270 -7636418 -11308579 -13726926 -13513674 -8157880
$$ packed form
7101D521700L867568L254881J95273p23548R37336K260934K361374J620853j504595
7092A6791776o750986q252879k067977M922345K502490p334164j1680722m554775
7084a6424892N454289P880937K865212k575299m250422k691143P483J663263J303957
7075f766615P48713K090778L542590J697409k445535m459126l118630r74675R65149
7066h719942L334043M105744R39154k851620k126100Q52553m67160m737997l628193
7057a3299518L735650P934097M045182j169767j348899K31014j005077k933202
7049c810520l366017n385361q944504o492659M325289J2281627P277689l595746
7041g710202o028085Q07479N404523K346015k456148l672161k418347K13252N355794
$$ plain form
7032 -8157880 2258344 11877394 14828235 12359522 10039837 9623642 7792092 2023501
7024 2023501 -5621364 -10241605 -7844113 1374858 11804456 16047571 11649327 3253683
7016 3253683 -2676009 -3582295 -966775 2266067 3306827 866856 -3286265 -6060857
7008 -6060857 -7078667 -8808459 -12313910 -15618536 -16751607 -15558633 -12389111 -8338472
7000 -8338472 -6544069 -8916775 -11666837 -9341016 -3648398 -1989050 -6017771 -8929681
6992 -8929681 -6748699 -4496686 -6583588 -8686021 -5831940 -2216017 -4884082 -12141112
6984 -12141112 -16707580 -17347849 -18719712 -21458601 -21315857 -18116491 -17154359 -20080377 -21538087
6975 -21538087 -17284726 -9913456 -4059953 -880739 241119 -1003491 -3949378 -5812939
$$ packed form
7032h157880J0416224R619050K950841k468713k319685m16195j831550n768591
7024B023501p644865m620241K397492R218971J0429598M243115m398244q395644
7016C253683n929692r06286K615520L232842J040760k439971m153121k774592
7008f060857j017810j729792l505451l304626j133071J192974L169522M050639
7000h338472J794403k372706k750062K325821N692618J659348m028721k911910
6992h929681K180982K252013k086902k102433K854081L615923k668065p257030
6984a2141112m566468o40269j371863k738889J42744L199366R62132k926018j457710
6975b1538087M253361P371270N853503L179214J121858j244610k945887j863561
$$ plain form
6967 -5812939 -5192028 -4248604 -5485114 -8743332 -12909350 -17862029 -22786260 -24974844 -22758700
6958 -22758700 -18374337 -16009280 -17503971 -20900643 -22733613 -21462690 -19127021 -19112258
6950 -19112258 -21566633 -22540032 -19454392 -15491071 -15222738 -17188418 -15323368 -7940333
6942 -7940333 -587723 1658683 646340 1248491 4133163 5698946 3530730 -1093036
6934 -1093036 -5499781 -8157297 -9070723 -9187715 -9452998 -9744677 -9036889 -6875138 -3886381
6925 -3886381 -619444 2840892 5582737 5688897 2480436 -2067502 -5271128 -6358807
6917 -6358807 -6181471 -5194464 -3245686 -1170458 -982642 -3638968 -7372726 -9313989 -8579987
6908 -8579987 -6487691 -3415866 2530620 11735879 19459243 19708931 13248333 8071275
$$ packed form
6967e812939O20911R43424j236510l258218m166018m952679m924231k188584K216144
6958b2758700M384363K365057j494691l396672j832970J270923K335669J4763
6950a9112258k454375r73399L085640L963321K68333j965680J865050P383035
6942g940333P352610K246406j012343O02151K884672J565783k168216m623766
6934a093036m406745k657516r13426j16992k65283k91679P07788K161751K988757
6925c886381L266937L460336K741845J06160l208461m547938l203626j087679
6917f358807J77336R87007J948778K075228J87816k656326l733758j941263P34002
6908h579987K092296L071825N946486R205259P723364K49688o460598n177058
$$ plain form
6900 8071275 9948396 15588545 17898582 15160886 11067862 7652586 3342783 -1849843
6892 -1849843 -4110358 -978288 4189709 5359434 269440 -7676603 -13256436 -14342808
6884 -14342808 -13288593 -13545009 -15041623 -14324693 -9980598 -5520947 -4527022 -5066697 -2537512
6875 -2537512 3248667 8098202 10106825 11531377 13272164 12354041 7134872 1103316
6867 1103316 -1471693 -984412 -868101 -2698888 -5469153 -7884442 -8884305 -7413375 -4083574
6858 -4083574 -1866995 -3052622 -6674396 -10635324 -14492943 -17765770 -17561636 -11670368
6850 -11670368 -3363486 734299 -1744178 -6317386 -7478132 -4338150 804921 6633632
6842 6633632 12762531 17038609 16337704 10640436 3977447 103159 -1207726 -2224233
$$ packed form
6900H071275J877121N640149K310037k737696m093024l415276m309803n192626
6892a849843k260515L132070N167997J169725n089994p946043n579833j086372
6884a4342808J054215k56416j496614P16930M344095M459651R93925n39675K529185
6875b537512N786179M849535K008623J424552J740787r18123n219169o031556
6867A103316k575009M87281J16311j830787k770265k415289r99863J470930L329801
6858d083574K216579j185627l621774l960928l857619l272827K04134N891268
6850a1670368Q306882M097785k478477m573208j160746L139982N143071N828711
6842F633632O128899M276078p00905n697268o662989l874288j310885j016507
$$ plain form
6834 -2224233 -3156102 -2198871 1022476 4625919 7201307 8800259 8727955 5503448 686862
6825 686862 -314537 5784977 15349345 21974486 23696683 22748591 19940231 13902633 5531327
6816 5531327 -1550600 -5861045 -9448741 -13289276 -14977016 -12480139 -6914713 -177012
6808 -177012 6858295 12352938 13554103 11107648 9721762 11635078 12671453 8233823
6800 8233823 415171 -4913929 -6157913 -6866044 -9539881 -12658545 -13810605 -12356888
6792 -12356888 -8617160 -3218712 2165819 5591244 6951967 7961272 9972404 12835324
6784 12835324 15282197 15338250 11596537 5701516 2102140 3158119 5806655 5509388 2124372
6775 2124372 -1005186 -2353377 -2877713 -2296790 829752 5023872 6290008 3774331 969521
$$ packed form
6834b224233r31869R57231L221347L603443K575388J598952p2304l224507m816586
6825F86862j001399O099514R564368O625141J722197r48092k808360o037598q371306
6816E531327p081927m310445l587696l840535j687740K496877N565426O737701
6808a77012P035307N494643J201165k446455j385886J913316J036375m437630
6800H233823p818652n329100j243984p08131k673837l118664j152060J453717
6792a2356888L739728N398448N384531L425425J360723J009305K011132K862920
6784A2835324K446873N6053l741713n895021l599376J055979K648536k97267l385016
6775B124372l129558j348191n24336N80923L126542M194120J266136k515677k804810
$$ plain form
6766 969521 -430517 -3732498 -11332425 -18929182 -19664633 -12510029 -3015190 3468711 6061145
6757 6061145 6217856 4797666 2363976 154335 -810114 -760267 -563328 -672692 -1096110
6748 -1096110 -1847662 -3030727 -4587015 -5832666 -5195537 -1278959 5077614 10667867 12988634
6739 12988634 12584739 10835031 6621079 -1833323 -11943224 -17403617 -15610705 -11236144
6731 -11236144 -9598365 -9187077 -4776348 3765740 10824650 13124061 13293956 13984106 13433549
6722 13433549 9803211 5616004 3754615 2204534 -2410352 -8086391 -9400723 -5315167
6714 -5315167 149053 4948177 11177093 18743292 22123953 16880969 6328103 -1760420
6706 -1760420 -3645950 -2402001 -3372677 -8964730 -17243846 -23915545 -25641918 -22136493
$$ packed form
6766I69521j400038l301981p599927p596757p35451P154604R494839O483901K592434
6757F061145J56711j420190k433690k209641r64449M9847J96939j09364m23418
6748a096110p51552j183065j556288j245651O37129L916578O356573N590253K320767
6739A2988634m03895j749708m213952q454402j0109901n460393J792912M374561
6731a1236144J637779M11288M410729Q542088P058910K299411J69895O90150n50557
6722A3433549l630338m187207j861389j550081m614886n676039j314332M085556
6714e315167N464220M799124O228916P566199L380661n242984j0552866q088523
6706a760420j885530J243949r70676n592053q279116o671699j726373L505425
$$ plain form
6698 -22136493 -15358022 -7662200 -1619207 198107 -1958293 -3439509 7448 6202749
6690 6202749 9096912 7262667 5275098 6086256 7349023 7078276 7365755 9303424 9476301
6681 9476301 5870505 2749887 4484649 8264558 8735374 6911367 7992379 12112307
6673 12112307 14087502 12017370 9706121 9940662 11365258 13347109 18136889 25675192
6665 25675192 31102270 30711401 26814945 23380972 19665979 12012533 677110 -8728768
6657 -8728768 -11111772 -7321201 -2936799 -2350081 -4788824 -6381470 -5241803 -2842759
6649 -2842759 -518360 2484843 6005047 7083537 4131569 694438 1133405 3829600
6641 3829600 2917163 -3499820 -10831423 -13997044 -12459680 -8952923 -6624191 -7968855
$$ packed form
6698b2136493O778471P695822O042993J817314k156400j481216L446957O195301
6690F202749K894163j834245j987569Q11158J262767k70747K87479J937669J72877
6681I476301l605796l120618J734762L779909M70816j824007J081012M119928
6673A2112307J975195k070132k311249K34541J424596J981851M789780P538303
6665B5675192N427078l90869l896456l433973l714993p653446j1335423r405878
6657h728768k383004L790571M384402N86718k438743j592646J139667K399044
6649b842759K324399L003203L520204J078490k951968l437131M38967K696195
6641C829600r12437o416983p331603l165621J537364L506757K328732j344664
$$ plain form
6633 -7968855 -13141109 -18277202 -18460176 -13495520 -8316159 -6875415 -8040605 -8208402 -5581840
6624 -5581840 -1067812 3010288 4407682 2596942 -1170593 -6420357 -14205946 -23102009
6616 -23102009 -27302851 -23107106 -15300489 -11727715 -12760208 -12148104 -7564854 -3169371
6608 -3169371 -1067916 2154967 8057667 12562907 12955586 12418520 13776886 14540232 12440852
6599 12440852 10436856 11354715 12407413 10227348 7192790 7578111 11040752 14695483
6591 14695483 17785297 19415553 16072447 7472768 1095053 4082224 13226492 19338333
6583 19338333 18968606 15283499 10214026 3719079 -724676 1511476 7962949 10746821
6575 10746821 7612098 4721375 7246265 13436468 19287142 22898529 22619380 17039041
$$ packed form
6633g968855n172254n136093j82974M964656N179361J440744j165190j67797K626562
6624e581840M514028M078100J397394j810740l767535n249764p785589q896063
6616b3102009m200842M195745P806617L572774j032493O12104M583250M395483
6608c169371K101455L222883N902700M505240L92679n37066J358366P63346k099380
6599A2440852k003996R17859J052698k180065l034558L85321L462641L654731
6591A4695483L089814J630256l343106q599679o377715K987171R144268O111841
6583A9338333l69727l685107n069473o494947m443755K236152O451473K783872
6575A0746821l134723k890723K524890O190203N850674L611387k79149n580339
$$ plain form
6567 17039041 9104694 4730364 4965566 4681294 1198824 -1296167 1070803 5340425
6559 5340425 6067308 2425438 -2183608 -4401261 -2446433 3101275 7993739 7702818 4124752
6550 4124752 4475195 11292188 18628019 20979549 20115018 18850931 14349752 4220561
6542 4220561 -5527029 -6763042 -1202608 1628526 -2363748 -7656496 -8258301 -4570876
6534 -4570876 -421379 763967 -4043235 -14957275 -24745089 -23237855 -9742642 3935129
6526 3935129 6872641 1333972 -2405039 605006 7356681 14471993 21144729 24693196
6518 24693196 20245701 7665521 -5798910 -12968701 -13758921 -12071897 -9039902 -3428102
6510 -3428102 3389618 7757268 8831614 9246180 10368136 10840941 10633900 12285259 16180734
$$ packed form
6567A7039041p934347m374330K35202k84272l482470k494991K366970M269622
6559E340425P26883l641870m609046k217653J954828N547708M892464k90921l578066
6550D124752L50443O816993P335831K351530q64531j264087m501179j0129191
6542D220561r747590j236013N560434K831134l992274n292748o01805L687425
6534d570876M149497J185346m807202j0914040r787814J507234J3495213J3677771
6526C935129K937512n538669l739011L010045O751675P115312O672736L548467
6518B4693196m447495j2580180j3464431p169791p90220J687024L031995N611800
6510c428102O817720M367650J074346M14566J121956M72805k07041J651359L895475
$$ plain form
6501 16180734 18510014 16786547 14066793 14133141 15214272 12731261 6562368 1263590
6493 1263590 13258 2284588 6481120 10444423 10131072 3122055 -6006908 -8909841
6485 -8909841 -3382324 4557338 9743967 13580431 18044171 19536320 13748391 3566934
6477 3566934 -2872495 -850818 7562695 17192528 23387510 23374333 17790941 10853109 6621890
6468 6621890 5328998 4629343 2839976 -769612 -6466549 -12009077 -12328737 -4946337 5528813
6459 5528813 11767227 11647353 8679526 5968491 3902358 3184862 5478325 10041314 13111638
6450 13111638 11684668 5627965 -3707746 -13806496 -20161482 -19335408 -13918144 -10653460
6442 -10653460 -11991884 -12931065 -8383460 -681280 2972744 -1440346 -11627279 -22174086
$$ packed form
6501A6180734K329280j723467k719754O6348J081131k483011o168893n298778
6493A263590j250332K271330M196532L963303l13351p009017r128963k902933
6485h909841N527517P939662N186629L836464M463740J492149n787929j0181457
6477C566934o439429K021677Q413513R629833O194982j3177n583392o937832m231219
6468F621890j292892o99655j789367l609588n696937n542528l19660P382400J0475150
6459E528813O238414j19874k967827k711035k066133p17496K293463M562989L070324
6450A3111638j426970o056703r335711j0098750o354986Q26074N417264L264684
6442a0653460j338424r39181M547605P702180L654024m413090j0186933j0546807
$$ plain form
6434 -22174086 -28328136 -27775293 -21497441 -13361768 -7699985 -6757899 -9840612 -13492392
6426 -13492392 -12749212 -4951724 6340682 13521478 12992572 9206571 8310335 9462042
6418 9462042 6061634 -4451633 -15692908 -19085837 -13389664 -5075748 -166224 1428373
6410 1428373 2858207 4526642 4114190 1384913 -400289 1261802 5032372 8236361
6402 8236361 9989319 9946182 6586619 -64404 -5839973 -6478944 -3582095 -2676865 -5467825
6393 -5467825 -7996165 -7057909 -4419670 -3185494 -3409127 -3160288 -1257992 2424381 6499189
6384 6499189 6800011 -579572 -12794242 -20614196 -18520558 -11356625 -7452017 -8137596
6376 -8137596 -8465597 -5975000 -3317580 -2727742 -2928396 -2361724 -1633668 -1552703 -1608166 -1437064
$$ packed form
6434b2174086o154050N52843O277852Q135673N661783R42086l082713l651780
6426a3492392P43180P797488J1292406P180796n28906l786001q96236J151707
6418I462042l400408j0513267j1241275l392929N696173Q313916M909524J594597
6410A428373J429834J668435m12452k729277j785202J662091L770570L203989
6402H236361J752958m3137l359563o651023n775569o38971K896849R05230k790960
6393e467825k528340R38256K638239J234176k23633K48839J902296L682373M074808
6384F499189L00822p379583j2214670p819954K093638P163933L904608o85579
6376h137596l28001K490597K657420N89838k00654N66672P28056Q0965n5463J71102
$$ plain form
6366 -1437064 -1546072 -1852754 -1488194 -578843 -523593 -2177753 -4964094 -7256314 -6368466
6357 -6368466 110553 10305258 17034272 14703034 6560966 1103750 1696430 4282052
6349 4282052 5163042 5209237 4891124 1334036 -5974011 -11328375 -9293167 -1880070 4968443
6340 4968443 9145028 12048981 13183819 10909034 7705306 8893745 15055100 20026845
6332 20026845 18029853 9926414 1389448 -2688495 -1426425 1727963 1225262 -5427942
6324 -5427942 -13810102 -16207518 -10096915 -1042345 3602057 1799076 -3095599 -7019226
6316 -7019226 -8490075 -8653460 -9231591 -9811255 -7486116 -821153 6466084 8593520 4617513
6307 4617513 -649399 -2833163 -1696259 1717574 7051603 11970824 12298965 8070473
$$ packed form
6366a437064j09008l06682L64560R09351N5250j654160k786341k292220Q87848
6357f368466O479019J0194705O729014k331238q142068n457216N92680K585622
6349D282052Q80990M6195l18113l557088p308047n354364K035208P413097O848513
6340D968443M176585K903953J134838k274785l203728J188439O161355M971745
6332B0026845j996992q103439q536966m077943J262070L154388n02701o653204
6324e427942q382160k397416O110603R054570M644402j802981m894675l923627
6316g019226j470849j63385n78131n79664K325139O664963P287237K127436l976007
6307D617513n266912k183764J136904L413833N334029M919221L28141m228492
$$ plain form
6299 8070473 5284582 7594103 10154005 6849170 99477 -3273402 -3694478 -8047561
6291 -8047561 -16932439 -21331324 -15339760 -5042245 506846 1641483 4873519 10889945
6283 10889945 13406486 9362789 3126771 -1088871 -4947860 -10694114 -14746057 -11861294
6275 -11861294 -3971359 449468 -3350365 -10796133 -14590700 -13627376 -11962095 -10972662
6267 -10972662 -7404179 181222 7513146 9926580 8687122 8641509 11335843 14155931
6259 14155931 15382815 16015197 16235881 13860383 7713860 -92989 -6372443 -8999636
6251 -8999636 -6347663 2096694 13186510 21511011 25277779 27529059 29253847 25445134
6243 25445134 12477474 -3516662 -11591827 -8977156 -3959181 -4907310 -10879059 -15029658
$$ packed form
6299H070473k785891K309521K559902l304835o749693l372879m21076m353083
6291h047561q884878m398885N991564J0297515N549091J134637L232036O016426
6283A0889945K516541m043697o236018m215642l858989n746254m051943K884763
6275a1861294P889935M420827l799833p445768l794567R63324J665281R89433
6267a0972662L568483P585401P331924K413434j239458m5613K694334K820088
6259A4155931J226884O32382K20684k375498o146523p806849o279454k627193
6251h999636K651973Q444357J1089816Q324501L766768K251280J724788l808713
6243B5445134j2967660j5994136q075165K614671N017975r48129n971749m150599
$$ plain form
6235 -15029658 -13733645 -9318471 -5509486 -3096624 -329191 3734133 7166677 7094906
6227 7094906 3661122 458782 -142733 -168657 -2119563 -3615631 139944 8733183 15344062
6218 15344062 14260146 6569313 -2497961 -8642576 -9784316 -6098840 -1224630 -326664
6210 -326664 -3916765 -5973091 -1469136 6135741 8646106 3409354 -3816515 -6198044
6202 -6198044 -2850275 1835038 3087089 -733340 -7123888 -10914040 -8559390 -1981258
6194 -1981258 3130001 3332261 321383 -2461930 -3936313 -4795908 -4644714 -1977890 3252311
6185 3252311 8659358 11417150 10768828 8766304 8894436 13202125 19698866 22920196 18507422
6176 18507422 7848003 -2509105 -6639257 -4212375 366344 2914522 2783514 1771750
$$ packed form
6235a5029658J296013M415174L808985K412862K767433M063324L432544p1771
6227G094906l433784l202340o01515k5924j950906j496068L755575Q593239O610879
6218A5344062j083916p690833r067274o144615j141740L685476M874210Q97966
6210c26664l590101k056326M503955P604877K510365n236752p225869k381529
6202f198044L347769M685313J252051l820429o390548l790152K354650O578132
6194a981258N111259K02260l010878k783313j474383q59595J51194K666824N230201
6185C252311N407047K757792o48322k002524J28132M307689O496741L221330m412774
6176A8507422j0659419j0357108m130152K426882M578719K548178j31008j011764
$$ plain form
6168 1771750 1119521 175743 -2548366 -7594270 -13638485 -18079511 -18810310 -15735205 -10525937
6159 -10525937 -5087848 -736722 1476656 958318 -1389422 -3405025 -3787973 -3285902 -3243391
6150 -3243391 -4030576 -5538505 -7587874 -8429073 -4604450 5060040 16006296 21285140
6142 21285140 18764214 13106954 10377453 12466981 16901277 20041331 19889719 17309140
6134 17309140 14864776 13419604 10695042 5215999 387621 903460 5229944 6130387
6126 6130387 98731 -7780132 -10707844 -8477354 -6139187 -7274702 -11657765 -17185471
6118 -17185471 -20806695 -19373269 -13010417 -6634368 -5312392 -8932394 -13475009 -15908551
6110 -15908551 -15509812 -12493448 -8568204 -7202678 -9856045 -13081358 -12571982 -8809456
$$ packed form
6168A771750o52229r43778k724109n045904o044215m441026p30799L075105N209268
6159a0525937N438089M351126K213378n18338k347740k015603l82948N02071M2511
6150c243391p87185j507929k049369q41199L824623R664490J0946256N278844
6142B1285140k520926n657260k729501K089528M434296L140054j51612k580579
6134A7309140k444364j445172k724562n479043m828378N15839M326484R00443
6126F130387o031656p878863k927712K230490K338167j135515m383063n527706
6118a7185471l621224J433426O362852O376049J321976l620002m542615k433542
6110a5908551L98739L016364L925244J365526k653367l225313N09376L762526
$$ plain form
6102 -8809456 -5395208 -3311232 -778231 2412417 4802450 6751980 9505902 11194870
6094 11194870 8535534 2591563 -2048438 -4321232 -7733568 -13104591 -15535794 -11179894
6086 -11179894 -2905486 3436419 5055658 2448422 -2699184 -7185969 -7223510 -2762207
6078 -2762207 1471413 1576059 -1355363 -4459510 -7058230 -8779321 -7367649 -2233381
6070 -2233381 2508649 2841115 1042298 2890058 9394500 15052175 14333928 7008275 -3057541
6061 -3057541 -11844751 -17406751 -19843571 -19879390 -17579283 -13258538 -9248427 -8278214 -9440686
6052 -9440686 -8708348 -4973449 -2474400 -4808398 -9338132 -10678064 -7688578 -3806210
6044 -3806210 -1949580 -2214446 -3607401 -5285128 -6579948 -7509418 -8253521 -7257354 -2360135
$$ packed form
6102h809456L414248K083976K533001L190648K390033J949530K753922J688968
6094A1194870k659336n943971m640001k272794l412336n371023k431203M355900
6086a1179894Q274408O341905J619239k607236n147606m486785l7541M461303
6078b762207M233620J04646k931422l104147k598720j721091J411672N134268
6070b233381M742030L32466j798817J847760O504442N657675p18247p325653j0065816
6061c057541q787210n562000k436820l5819K300107M320745M010111R70213j162472
6052i440686P32338L734899K499049k333998m529734j339932K989486L882368
6044c806210J856630k64866j392955j677727j294820r29470p44103R96167M897219
$$ plain form
6035 -2360135 4780659 8816779 7622704 5352565 5472053 4966769 65873 -6216315 -8292937
6026 -8292937 -6955536 -7392197 -9847077 -9255591 -3929268 2018182 5510052 7768666 9838705
6017 9838705 10504665 9872804 9799790 9651310 6894829 3011252 3100027 7834255 11523136
6008 11523136 10614527 8636687 9644953 11929698 12010576 10483600 9747210 9362857 7731238
5999 7731238 5742574 5101762 5054266 3747135 997367 -2521736 -6628468 -10193188 -10923334
5990 -10923334 -8636198 -6246316 -5766991 -6054947 -5859045 -5657292 -5054553 -2568926 102054
5981 102054 -1571663 -7647597 -11828533 -10450468 -8251418 -10624789 -14959042 -15364314 -12118831
5972 -12118831 -10081491 -10280917 -9245813 -5273615 -223152 3642507 4494088 913461
$$ packed form
6035b360135P140794M036120j194075k270139J19488n05284m900896o282188k076622
6026h292937J337401m36661k454880N91486N326323N947450L491870K258614K070039
6017I838705O65960o31861p3014j48480k756481l883577Q8775M734228L688881
6008A1523136r08609j977840J008266K284745Q0878j526976p36390l84353j631619
5999G731238j988664o40812m7496j307131k749768l519103m106732l564720p30146
5990a0923334K287136K389882M79325k87956J95902K01753O02739K485627K670980
5981A02054j673717o075934m180936J378065K199050k373371m334253m05272L245483
5972a2118831K037340j99426J035104L972198N050463L865659Q51581l580627
$$ plain form
5964 913461 -4782695 -6437426 -2310930 331281 -4725439 -11793730 -10765910 -2881861
5956 -2881861 689336 -4363113 -10087902 -9393792 -5157274 -2599582 -856867 2545989
5948 2545989 5050927 2881128 -2227915 -5093157 -3524757 816182 5670314 9252374
5940 9252374 10047999 8029333 4672314 738421 -3716931 -6681405 -5034884 699471
5932 699471 5865654 7344863 6528372 5708248 5350561 6071000 8848407 11403956 8846639
5923 8846639 454425 -8150107 -12042637 -12305778 -12023408 -11491991 -10477988 -10756778 -12474672
5914 -12474672 -11739732 -5987472 1274365 4827223 3973821 1178416 -1917314 -3355007
5906 -3355007 257657 8682792 14939394 12627221 4332840 -1978324 -2768207 -431684
$$ packed form
5964I13461n696156j654731M126496K642211n056720p068291J027820P884049
5956b881861L571197n052449n724789O94110M236518K557692J742715L402856
5948B545989K504938k169799n109043k865242J568400M340939M854132L582060
5940I252374P95625k018666l357019l933893m455352k964474J646521N734355
5932F99471N166183J479209q16491q20124l57687P20439K777407K555549k557317
5923H846639q392214q604532l892530k63141K82370N31417J014003k78790j717894
5914a2474672P34940N752260P261837L552858q53402k795405l095730j437693
5906c355007L612664Q425135O256602k312173q294381o311164p89883K336523
$$ plain form
5898 -431684 2416247 4520027 3725821 -799800 -4912733 -3667294 1293633 3784995 2066773
5889 2066773 423297 1970038 5336598 8631876 11188873 10960092 5977361 -462051
5881 -462051 -1640783 3967789 11085513 15882751 19841066 23329128 22273661 15679521
5873 15679521 10530699 12973714 18483968 17460139 8456293 -808670 -4825397 -5707872
5865 -5707872 -5971210 -2674990 6760750 16978905 18989158 11774796 4645698 6111786
5857 6111786 13939333 19412788 18955197 16725855 16233319 15245675 11421851 7806454 8023700
5848 8023700 9506349 7358020 3068252 2811660 7220540 9695145 6622378 2759803
5840 2759803 2926868 3990784 336202 -6703226 -11136519 -12053560 -14524080 -20553928 -25182806
$$ packed form
5898d31684K847931K103780p94206m525621m112933J245439M960927K491362j718222
5889B066773j643476J546741L366560L295278K556997k28781m982731o439412
5881d62051j178732N608572P117724M797238L958315L488062j055467o594140
5873A5679521n148822K443015N510254j023829r003846r264963m016727q82475
5865e707872k63338L296220R435740J0218155K010253p214362p129098J466088
5857F111786P827547N473455m57591k229342m92536r87644l823824l615397K17246
5848H023700J482649k148329m289768k56592M408880K474605l072767l862575
5840B759803J67065J063916l654582p039428m433293r17041k470520o029848m628878
$$ plain form
5831 -25182806 -23930547 -19588517 -17904302 -19084020 -17774531 -10993048 -2335501 2848941
5823 2848941 3838275 4137030 6289706 9433426 11344139 10488238 6059920 -1465446 -9068843
5814 -9068843 -12779070 -11664116 -8226826 -3934317 2698875 11487052 17058264 13747441
5806 13747441 2773902 -8820690 -15760170 -18215915 -18770698 -18955415 -18655278 -16381175
5798 -16381175 -10629225 -3298376 -204756 -4583125 -11300896 -12037707 -5789615 597984
5790 597984 2392502 1869267 1942241 855686 -3224883 -6768123 -4779263 1806345 6633060
5781 6633060 5436862 498066 -2568093 -1215687 1337660 394282 -3180996 -2834257 4395352
5772 4395352 11609385 10065355 1479763 -4302483 -3578089 -3195240 -9141806 -18257807 -24550168
$$ packed form
5831b5182806J252259M342030J684215j179718J309489O781483Q657547N184442
5823B848941R89334K98755K152676L143720J910713q55901m428318p525366p603397
5814i068843l710227J114954L437290M292509O633192Q788177N571212l310823
5806A3747441j0973539j1594592o939480k455745n54783j84717L00137K274103
5798a6381175N751950P330849L093620m378369o717771p36811O248092O387599
5790E97984J794518n23235P2974j086555m080569l543240J988860O585608M826715
5781F633060j196198m938796l066159J352406K553347r43378l575278L46739P229609
5772D395352P214033j544030q585592n782246P24394L82849n946566r116001o292361
$$ plain form
5763 -24550168 -26863400 -26062063 -21053558 -12884073 -7175318 -6685816 -6332277 -1508555 3609756
5754 3609756 2953583 -763495 -433247 3399897 3543491 -2108583 -8130491 -10727535 -11643454
5745 -11643454 -12131089 -10085568 -5000808 -239932 1321176 -274676 -4266644 -9255914
5737 -9255914 -11375935 -7661556 -1282574 1795564 1066554 718858 1286276 -904363 -5682256
5728 -5682256 -8091863 -6882540 -6292979 -7424403 -5996709 -1688032 -979788 -5806611 -7793236
5719 -7793236 -817046 7682562 6554111 -2624974 -8037215 -4219430 2351111 3883750
5711 3883750 266185 -3494563 -3515393 281526 4109559 3006547 -3267769 -8147851 -5699180
5702 -5699180 1341001 5186431 3263495 53972 -320979 1883277 5100191 8135129
$$ packed form
5763b4550168k313232Q01337N008505Q169485N708755M89502L53539M823722N118311
5754C609756o56173l717078L30248L833144J43594n652074o021908k597044r15919
5745a1643454m87635K045521N084760M760876J561108j595852l991968m989270
5737i255914k120021L714379O378982L078138p29010l47696N67418k190639m777893
5728e682256k409607J209323N89561j131424J427694M308677P08244m826823j986625
5719g793236O976190Q499608j128451r179085n412241L817785O570541J532639
5711C883750l617565l760748k0830L796919L828033j103012o274316m880082K448671
5702e699180P040181L845430j922936l209523l74951K204256L216914L034938
$$ plain form
5694 8135129 8465638 4352636 -252658 1605862 10167108 16943923 15498195 9904147
5686 9904147 8493988 12471282 15692133 14350511 11689609 11971729 13587528 11181514
5678 11181514 3518522 -3811053 -4749566 3810 4524139 5704497 6351747 9266087
5670 9266087 11912527 10000428 3966400 -1612046 -3467039 -1058002 5616142 14964400
5662 14964400 21446948 19667177 11603369 5132907 4320766 5755920 5647503 4957717 4730388
5653 4730388 1908349 -5306941 -11800958 -10969700 -3978755 1488756 888177 -3176931 -5947113
5644 -5947113 -5133991 -693627 5694542 10260489 9952481 6492378 4469318 4865463 4037159
5635 4037159 22746 -4050693 -4691325 -2685301 -670689 883034 2576003 3678271
$$ packed form
5694H135129L30509m113002m605294J858520Q561246O776815j445728n594048
5686I904147j410159L977294L220851j341622k660902K82120J615799k406014
5678A1181514p662992p329575r38513M753376M520329J180358O47250K914340
5670I266087K646440j912099o034028n578446j854993K409037O674144R348258
5662A4964400O482548j779771q063808o470462q12141J435154j08417o89786k27329
5653D730388k822039p215290o494017Q31258O990945N467511o00579m065108k770182
5644e947113Q13122M440364O388169M565947l08008l460103k023060L96145q28304
5635D037159m014413m073439o40632K006024K014612J553723J692969J102268
$$ plain form
5627 3678271 3991186 5932829 11273818 17254423 19356809 16843020 12249373 6637912
5619 6637912 -602153 -7864942 -11875544 -12708951 -13960213 -16692804 -17380619 -13836080 -9361912
5610 -9361912 -8323849 -10653640 -13432576 -15064560 -15103656 -13030539 -10618410 -12353978 -18991131
5601 -18991131 -23369666 -18371202 -7566306 -1506577 -3465341 -5788695 -2313524 2347126
5593 2347126 203780 -8350197 -15662208 -17145328 -15231114 -13848758 -13548301 -12851426 -11491275
5584 -11491275 -11100095 -13678037 -19288900 -24593613 -24897887 -19200269 -12269145 -10104552
5576 -10104552 -13940594 -19641048 -21636601 -16473247 -4900083 7216700 12161185 7773158
5568 7773158 459455 -2088732 193627 1591685 -90276 -1148756 729400 2017652
$$ packed form
5627C678271L12915J941643N340989N980605K102386k513789m593647n611461
5619F637912p240065p262789m010602q33407j251262k732591o87815L544539M474168
5610i361912J038063k329791k778936j631984l9096K073117K412129j735568o637153
5601a8991131m378535M998464J0804896O059729j958764k323354L475171M660650
5593B347126k143346q553977p312011j483120J914214J382356L00457O96875J360151
5584a1491275L91180k577942n610863n304713l04274N697618O931124K164593
5576a0104552l836042n700454j995553N163354J1573164J2116783M944485m388027
5568G773158p313703k548187K282359J398058j681961j058480J878156J288252
$$ plain form
5560 2017652 -1371655 -8057249 -13381405 -15134576 -14262240 -11781365 -8027034 -3967010
5552 -3967010 -515199 3099032 7982023 12715050 14005521 10663001 5333617 1586153
5544 1586153 370999 193816 140810 1513362 5801070 11399935 13755980 10069910 3311635
5535 3311635 -318029 1729659 5877780 7696498 7464632 8281545 10103508 8997642 2808688
5526 2808688 -5158121 -9636821 -8840865 -4680439 1018258 7817209 14183487 16480480
5518 16480480 12367031 4247169 -2475744 -4626044 -3583385 -2380856 -1883352 -659772
5510 -659772 2166179 5113368 5608437 2699946 -1711684 -4609568 -5067804 -5244571 -7278248
5501 -7278248 -9508018 -7519932 181039 8960735 12188128 8119432 1143639 -3645183
$$ packed form
5560B017652l389307o685594n324156j753171Q72336K480875L754331M060024
5552c967010L451811L614231M882991M733027J290471l342520n329384l747464
5544A586153j215154j77183n3006J372552M287708N598865K356045l686070o758275
5535C311635l629664K047688M148121J818718k31866Q16913J821963j105866o188954
5526B808688p966809m478700P95956M160426N698697O798951O366278K296993
5518A6480480m113449q119862o722913k150300J042659J202529M97504J223580
5510f59772K825951K947189M95069k908491m411630k897884m58236j76767k033677
5501g278248k229770J988086P700971Q779696L227393m068696o975793m788822
$$ plain form
5493 -3645183 -5272541 -5647926 -5362950 -2921375 1896871 6019466 6003623 2237811 -1523951
5484 -1523951 -2827255 -2817700 -3270742 -3604533 -2664944 -1476279 -1284489 -162331 4543905
5475 4543905 10412746 10790918 2833156 -8792794 -17874947 -22722845 -24141951 -21650644
5467 -21650644 -15899011 -11749545 -13610928 -18871664 -20826502 -17699329 -14143948 -13769232
5459 -13769232 -14910381 -14651893 -12561744 -8926560 -3317803 3179186 7868334 10448812
5451 10448812 13459764 16563175 14536959 4593205 -7644942 -14018886 -13637822 -12186180
5443 -12186180 -12742281 -12513470 -9101866 -5117270 -4349703 -6508127 -8261959 -7722256 -5765728
5434 -5765728 -3978846 -3072988 -2848049 -2544275 -1671695 -1208193 -2987949 -6749210 -8944693
$$ packed form
5493c645183j627358l75385K84976K441575M818246M122595j5843l765812l761762
5484a523951j303304R555m53042l33791R39589J188665J91790J122158M706236
5475D543905N868841L78172p957762j1625950r082153m847898j419106K491307
5467b1650644N751633M149466j861383n260736j954838L127173L555381L74716
5459a3769232j141149K58488K090149L635184N608757O496989M689148K580478
5451A0448812L010952L103411k026216r943754j2238147o373944L81064J451642
5443a2186180n56101K28811L411604L984596P67567k158424j753832N39703J956528
5434e765728J786882R05858K24939L03774Q72580M63502j779756l761261k195483
$$ plain form
5425 -8944693 -6652590 -2412020 -2529587 -9482563 -18253557 -22257618 -21131083 -19554815
5417 -19554815 -19316570 -16882188 -9918118 -1993030 2055157 2193562 1057365 -1363520
5409 -1363520 -5945405 -9186707 -6121522 1069085 3677341 -1865356 -8347472 -7443866
5401 -7443866 -547811 4675875 5161339 4396132 5365957 7219636 8757459 10164626 10349075
5392 10349075 6675587 -1137867 -9717134 -15528514 -17092164 -13658350 -5580646 2887327
5384 2887327 5419885 851060 -4743175 -6152768 -6078727 -10136625 -17381955 -21183219 -18930130
5375 -18930130 -15280666 -14397551 -14012166 -10364860 -5312672 -4102516 -7855615 -12814583
5367 -12814583 -16772122 -21710568 -28598172 -33327192 -30951577 -22390805 -14087422 -11198504
$$ packed form
5425h944693K292103M240570j17567o952976q770994m004061J126535J576268
5417a9554815K38245K434382O964070P925088M048187J38405j136197k420885
5409a363520m581885l241302L065185P190607K608256n542697o482116R03606
5401g443866O896055N223686M85464p65207R69825J853679J537823J407167J84449
5392A0349075l673488p813454q579267n811380j563650L433814Q077704Q467973
5384B887327K532558m568825n594235j409593P4041m057898p245330l801264K253089
5375a8930130L649464Q83115L85385L647306N052188J210156l753099m958968
5367a2814583l957539m938446o887604m729020K375615Q560772Q303383K888918
$$ plain form
5359 -11198504 -12854657 -13975497 -10397171 -2413047 5441371 8092393 4435984 -1678660
5351 -1678660 -5267980 -4451563 -617311 4094987 8085768 10239782 10277042 8428691 3717805
5342 3717805 -5437932 -16791895 -23142160 -19976834 -12708583 -10639541 -13712991 -11922825
5334 -11922825 -275001 12280534 13949990 5336378 -2828861 -4244365 -2081618 -416118
5326 -416118 1513949 4361127 4530212 -601481 -7160434 -9092101 -6127666 -3379044 -3863622
5317 -3863622 -5394867 -5316682 -4723840 -5919469 -7804934 -6728919 -1841515 2887837 3403941
5308 3403941 912478 336789 3594186 6690373 4531961 -3081957 -11764529 -17478488
5300 -17478488 -19229377 -17746029 -13984833 -9220395 -4759422 -1066398 1472749 961839
$$ packed form
5359a1198504j656153j120840L578326P984124P854418K651022l656409o114644
5351a678660l589320Q16417L834252M712298L990781K154014L7260j848351m710886
5342C717805r155737j1353963o350265L165326P268251K069042l073450J790166
5334a1922825J1647824J2555535J669456q613612q165239j415504K162747J665500
5326d16118J930067K847178J69085n131693o558953j931667K964435K748622m84578
5317c863622j531245P8185N92842j195629j885465J076015M887404M729352N16104
5308C403941k491463n75689L257397L096187k158412p613918q682572n713959
5300a7478488j750889J483348L761196M764438M460973L693024K539147n10910
$$ plain form
5292 961839 -4577767 -13165808 -18284858 -14523613 -3345538 8184404 13967031 12777956
5284 12777956 6390253 -3314862 -13921894 -21255001 -21715826 -16353857 -10654363 -9314489
5276 -9314489 -12424546 -17151095 -20917958 -21592575 -17406586 -9995389 -5535694 -8210987
5268 -8210987 -13068552 -10750984 -464612 7386886 4485763 -4640146 -9737461 -8368688
5260 -8368688 -6068334 -5785237 -4900129 -2625395 -2621415 -5711819 -6312564 -243352 8252950
5251 8252950 11691129 8606764 3505178 -82301 -1956585 -1938933 1146931 6887052 13134759
5242 13134759 18922830 24628676 28941140 28891649 24015862 17651754 12491124 7287787
5234 7287787 90630 -7270718 -10754130 -9278655 -5644369 -2494885 22842 2160271
$$ packed form
5292I61839n539606q588041n119050L761245J1178075J1529942N782627j189075
5284A2777956o387703r705115j0607032p333107m60825N361969N699494J339874
5276i314489l110057m726549l766863o74617M185989P411197M459695k675293
5268h210987m857565K317568J0286372P851498k901123r125909n097315J368773
5260h368688K300354K83097Q85108K274734L980l090404o00745O069212Q496302
5251H252950L438179l084365n101586l587479j874284J7652L085864N740121O247707
5242A3134759N788071N705846M312464m9491m875787o364108n160630n203337
5234G287787p197157p361348l483412J475475L634286L149484K517727K137429
$$ plain form
5226 2160271 2823056 1517043 223470 1185349 3500729 3819761 467584 -4390645 -6719165
5217 -6719165 -3854618 3716826 12306694 16815786 14319287 6693169 -1002607 -4901952
5209 -4901952 -4530654 -1497844 2067103 3935649 3029779 959396 329837 923704 -19627
5200 -19627 -2767283 -3326622 1220936 8355680 13893682 17550051 20886094 21828073 16743122
5191 16743122 7991173 3706695 7800314 14653648 17019079 15539623 15915334 18917525
5183 18917525 18993451 13200220 6282482 4271980 6715630 8906490 9507650 11340345 14978728
5174 14978728 16318413 12240565 5148805 -599544 -4066447 -6817159 -9219201 -11230092
5166 -11230092 -14764770 -20649603 -24177697 -18922529 -5649347 7171283 12992480 13134951
$$ packed form
5226B160271O62785j306013j293573R61879K315380L19032l352177m858229k328520
5217f719165K864547P571444Q589868M509092k496499p626118p695776l899345
5209d901952L71298L032810L564947J868546r05870k070383o29559N93867r43331
5200a9627k747656n59339M547558P134744N538002L656369L336043R41979n084951
5191A6743122q751949m284478M093619O853334K365431j479456L75711L002191
5183A8917525P5926n793231o917738k010502K443650K190860O01160J832695L638383
5174A4978728J339685m077848p091760n748349l466903k750712k402042k010891
5166a1230092l534678n884833l528094N255168J3273182J2820630N821197J42471
$$ plain form
5158 13134951 11769088 9683413 5783028 957536 -2857437 -5068027 -5743063 -5287937
5150 -5287937 -6225594 -11292566 -17770920 -18636884 -12472198 -6952531 -8149022 -11724856 -10430903
5141 -10430903 -5195500 -1608284 106758 2905529 4028909 -1569477 -10051736 -11521071
5133 -11521071 -5158734 -1552886 -7016197 -14517941 -14339760 -6143961 3978225 11503916
5125 11503916 13651857 8108273 -2417793 -9196193 -6811043 71197 3914067 4302166
5117 4302166 5722378 9097550 11199509 10221254 7191105 3729249 1999862 4168416
5109 4168416 8370071 8761875 3783381 382840 4641244 11828809 12321885 4924072 -2596128
5100 -2596128 -4757422 -3127228 -374004 3239231 6378872 6027193 2519452 351826
$$ packed form
5158A3134951j365863k085675l900385m825492l814973k210590o75036M55126
5150e287937r37657n066972o478354q65964O164686N519667j196491l575834J293953
5141a0430903N235403L587216J715042K798771J123380n598386q482259j469335
5133a1521071O362337L605848n463311p501744J78181Q195799J0122186P525691
5125A1503916K147941n543584j0526066o778400K385150O882240L842870L88099
5117D302166J420212L375172K101959r78255l030149l461856j729387K168554
5109D168416M201655L91804m978494l400541M258404P187565M93076p397813p520200
5100b596128k161294J630194K753224L613235L139641l51679l507741k167626
$$ plain form
5092 351826 1753881 3199415 208063 -7238403 -15095410 -18373010 -13793489 -2908900
5084 -2908900 7155540 10025354 7777755 8274349 14147782 19311700 18143240 12985191
5076 12985191 9241243 7482195 5021161 2217286 1843834 3583307 4543439 5325642 10219993
5067 10219993 19356460 25185039 20737475 9021079 -273428 -2721989 -3122646 -6632325
5059 -6632325 -11007538 -11157273 -7643385 -5315997 -5118691 -3107023 2127025 6741211 8047855
5050 8047855 8482008 10444299 11727652 9608047 5627053 2256461 -1878266 -8804750
5042 -8804750 -15737282 -17699640 -13984211 -7404382 1188508 12183311 21780272 23480465
5034 23480465 16503151 7994901 4700561 5858769 6338437 3797229 244265 -1568822
$$ packed form
5092C51826J402055J445534k991352p446466p857007l277600M579521J0884589
5084b908900J0064440K869814k247599M96594N873433N163918j168460n158049
5076A2985191l743948j759048k461034k803875l73452J739473R60132P82203M894351
5067A0219993R136467N828579m447564j1716396r294507k448561m00657l509679
5059f632325m375213j49735L513888K327388J97306K011668N234048M614186J306644
5050H047855M34153J962291J283353k119605l980994l370592m134727o926484
5042h804750o932532j962358L715429O579829Q592890J0994803R596961J700193
5034B3480465o977314q508250l294340J158208M79668k541208l552964j813087
$$ plain form
5026 -1568822 -809610 1739156 4869692 7495148 8518591 6857874 2706387 -1064136
5018 -1064136 -577497 4666253 10534731 12894745 12103840 11321800 12056849 13531148 15032677
5009 15032677 16516506 17852221 19424283 22202500 25306310 25217985 19808164 11606792
5001 11606792 4782808 725207 -984457 145514 3554696 5091747 1038291 -6113986
4993 -6113986 -9995823 -8130401 -3876254 -1198832 -1120693 -2958191 -5446010 -6673335 -6061622
4984 -6061622 -6097456 -8947886 -11858216 -9469988 -809237 9119297 14875996 15183888 12212713
4975 12212713 8810410 6497091 4648251 2267689 1059327 3933705 9104037 10000817
4967 10000817 4263053 -1695745 -1677084 1170631 156415 -3958113 -5123137 -2507826
$$ packed form
5026a568822P59212K548766L130536K625456J023443j660717m151487l770523
5018a064136M86639N243750N868478K360014p90905p82040P35049J474299J501529
5009A5032677J483829J335715J572062K778217L103810q8325n409821q201372
5001A1606792o823984m057601j709664J129971L409182J537051m053456p152277
4993f113986l881837J865422M254147K677422P8139j837498k487819j227325O11713
4984f061622l5834k850430k910330K388228Q660751R928534N756699L07892k971175
4975A2212713l402303k313319j848840k380562j208362K874378N170332Q96780
4967A0000817n737764n958798J8661K847715j014216m114528j165024K615311
$$ plain form
4959 -2507826 -836538 -1389698 -498694 3017331 6069290 7385623 8887803 10481539 9518523
4950 9518523 5992195 2924856 1638975 1555853 3326219 6538939 6616853 983107 -4160109
4941 -4160109 -1541567 5027902 6046033 2131393 2789899 9245491 11183105 3518831
4933 3518831 -5381829 -6818259 -2788639 1072036 4109794 6645003 5656954 289786
4925 289786 -4750005 -5514589 -2579127 3508057 12798795 20332434 19388143 12768391 10750341
4916 10750341 15106067 16337694 10107003 3868863 2362098 -179408 -6694596 -9532034
4908 -9532034 -4461175 160653 -2140506 -4134941 1869851 9759751 9773745 3561964 -1479607
4899 -1479607 -4012522 -5155997 -2470980 3081845 4240800 422529 1894785 11642626
$$ packed form
4959b507826J671288n53160Q91004L516025L051959J316333J502180J593736r63016
4950I518523l526328l067339j285881q3122J770366L212720P7914n633746n143216
4941d160109K618542O569469J018131l914640O58506O455592J937614p664274
4933C518831q900660j436430M029620L860675L037758K535209r88049n367168
4925B89786n039791p64584K935462O087184R290738P533639r44291o619752k018050
4916A0750341M355726J231627o230691o238140j506765k541506o515188k837438
4908i532034N070859M621828k301159j994435O004792P889900J3994o211781n041571
4899a479607k532915j143475K685017N552825J158955l818271J472256R747841
$$ plain form
4891 11642626 16846461 9629906 1401873 3391115 8443902 7009618 4817598 8020613
4883 8020613 8324289 1559729 1740131 15438870 24499525 19799206 25607126 56614242
4875 56614242 82321416 84781018 122077188 257882152 432835156 492942475 374462225
4868 374462225 188337475 78820500 61610213 57579994 30893694 14520410 24262847
4861 24262847 29094180 12384715 -478784 8012486 17511422 8784935 -4505939 -3222763
4853 -3222763 6475986 9036914 4483652 610581 -2445919 -5456523 -2591719 7112277
4845 7112277 13831770 12797154 13271852 21993977 30318201 28289723 20133698 14925428
4837 14925428 11761867 5386070 -1340483 -1594989 4184766 10431311 15329609 19720976
$$ packed form
4891A1642626N203835p216555q228033J989242N052787j434284k192020L203015
4883H020613L03676o764560J80402J3698739R060655m700319N807920L1007116
4875E6614242K5707174K459602L7296170J35804964J74953004O0107319j18480250
4868C74462225j86124750j09516975j7210287m030219k6686300j6373284R742437
4861B4262847M831333j6709465j2863499Q491270R498936q726487j3290874J283176
4853c222763R698749K560928m553262l873071l056500l010604K864804R703996
4845G112277O719493j034616M74698Q722125Q324224k028478q156025n208270
4837A4925428l163561o375797o726553k54506N779755O246545M898298M391367
$$ plain form
4829 19720976 21258562 17046186 9283712 2592301 -1604002 -3933470 -4139792 -3522752
4821 -3522752 -6349565 -14251979 -22376046 -25011178 -22042026 -16603127 -9966283 -2522272
4813 -2522272 3393139 5859888 6645620 8699697 11520600 11467769 6218879 -1970450 -7034258
4804 -7034258 -4284891 3306183 6190799 -723048 -10275971 -11425062 -3679458 3293030
4796 3293030 3706721 1728376 2506783 4652204 4405251 1195177 -3861143 -9760800 -13447239
4787 -13447239 -11133407 -4442721 -200777 -1503926 -4005167 -3656971 -2663882 -4212572
4779 -4212572 -6290462 -5083816 -950173 2785069 4207395 3305089 1150299 730898 4931276
4770 4931276 11407180 13460540 8692091 2874629 2288826 5972889 8826510 9002234 8585821
$$ packed form
4829A9720976J537586m212376p762474o691411m196303k329468k06322O17040
4821c522752k826813p902414q124067k635132K969152N438899O636844P444011
4813b522272N915411K466749P85732K054077K820903n2831n248890q189329n063808
4804g034258K749367P591074K884616o913847r552923j149091P745604O972488
4796C293030M13691j978345P78407K145421k46953l210074n056320n899657l686439
4787a3447239K313832O690686M241944j303149k501241L48196R93089j548690
4779d212572k077890J206646M133643L735242J422326r02306k154790m19401M200378
4770D931276O475904K053360m768449n817462n85803L684063K853621J75724m16413
$$ plain form
4761 8585821 9206665 9894237 7914650 822874 -9791316 -16683831 -13605289 -4234282
4753 -4234282 1022280 -1422036 -4290799 -1360876 3771110 5219187 4151626 4242589 3445991
4744 3445991 -1915592 -8446142 -9107287 -3792518 718932 808134 -564649 -705821 -1251778
4735 -1251778 -3889887 -6992346 -8723041 -9990106 -11980520 -12918008 -9506198 -1202362
4727 -1202362 7834601 11463052 7069156 -1424281 -7356463 -8394552 -7885344 -8901206
4719 -8901206 -10134769 -9353134 -7741002 -7896418 -9551912 -10179495 -8583223 -5573560 -2228954
4710 -2228954 558092 1937397 2069981 2027113 1747391 -19815 -2829075 -4238967 -3830651
4701 -3830651 -4633775 -8493400 -12680684 -13503980 -11124575 -8615030 -8165033 -9867118 -12044680
$$ packed form
4761H585821O20844O87572j979587p091776j0614190o892515L078542R371007
4753d234282N256562k444316k868763K929923N131986J448077j067561R0963p96598
4744C445991n361583o530550o61145N314769M511450Q9202j372783j41172n45957
4735a251778k638109l102459j730695j267065j990414r37488L411810Q303836
4727a202362R036963L628451m393896q493437n932182j038089N09208j015862
4719h901206j233563P81635J612132j55416j655494o27583J596272L009663L344606
4710b228954K787046J379305J32584m2868k79722j767206k809260j409892M08316
4701c830651q03124l859625m187284q23296K379405K509545M49997j702085k177562
$$ plain form
4692 -12044680 -11469374 -6029941 1516792 5725863 5644209 5760183 8274561 9593929 7249283
4683 7249283 4690636 4920099 4488844 -789370 -8345379 -12755982 -13470917 -12787701 -9757056
4674 -9757056 -3008691 2977427 1857758 -5416739 -11980426 -14544742 -14999183 -13632851
4666 -13632851 -8317551 -1059803 1608075 -3366890 -12364189 -20819499 -26835979 -28468731
4658 -28468731 -23692219 -15167920 -9582980 -9613562 -10986038 -9683830 -7394468 -7041845 -7328694
4649 -7328694 -5501467 -2595084 -2185867 -5303722 -9125612 -9894776 -5891581 1224106 7144653
4640 7144653 8349157 5438633 2019965 646756 1407682 3524378 5875285 6727737 5615473
4631 5615473 4597206 4974483 4392519 713075 -3251686 -3583184 -1944333 -2457027 -3217881
$$ packed form
4692a2044680N75306N439433P546733M209071q1654J15974K514378J319368k344646
4683G249283k558647K29463m31255n278214p556009m410603p14935O83216L030645
4674i757056O748365N986118j119669p274497o563687k564316m54441J366332
4666a3632851N315300P257748K667878m974965q997299q455310o016480j632752
4658b8468731M776512Q524299N584940l0582j372476J302208K289362L52623k86849
4649g328694J827227K906383M09217l117855l821890p69164M003195P115687N920547
4640G144653J204504k910524l418668j373209P60926K116696K350907Q52452j112264
4631E615473j018267L77277n81964l679444l964761l31498J638851n12694p60854
$$ plain form
4622 -3217881 1620348 10884871 15331727 9832590 -281715 -7764001 -11564181 -13116252
4614 -13116252 -11523232 -7218252 -4409773 -4600413 -3014866 3074540 7927224 5808517
4606 5808517 1000249 1525108 6455248 8178852 5437862 4849278 8900483 11033563 5551000
4597 5551000 -4044680 -10182860 -10190906 -6775269 -2780962 1242628 5696781 10155475 12615720
4588 12615720 11044236 7222948 7275122 14514686 22700356 21623096 10222381 -1104720
4580 -1104720 -3453171 179610 847830 -4056643 -9272593 -10243610 -8126367 -6169313 -4956852
4571 -4956852 -2659038 1724383 6337784 7405802 2840043 -4484962 -8523468 -6550006
4563 -6550006 -2399567 -1349440 -3399892 -4472755 -3006481 -1295503 -87877 3586289
$$ packed form
4622c217881M838229R264523M446856n499137j0114305p482286l800180j552071
4614a3116252J593020M304980K808479j90640J585547O089406M852684k118707
4606E808517m808268N24859M930140J723604k740990n88584M051205K133080n482563
4597E551000r595680o138180q046L415637L994307M023590M454153M458694K460245
4588A2615720j571484l821288N2174P239564Q185670j077260j1400715j1327101
4580a104720k348451L632781O68220m904473n215950r71017K117243J957054J212461
4571d956852K297814M383421M613401J068018m565759p325005m038506J973462
4563f550006M150439J050127k050452j072863J466274J710978J207626L674166
$$ plain form
4555 3586289 10802914 16342628 13691707 3321106 -7142414 -10732606 -6732089 1024438
4547 1024438 8295835 12243700 12077055 9902601 9456831 12220477 15585820 16150401 13920483
4538 13920483 11797700 11605371 12280466 11755181 9066273 4559281 -434405 -3612957 -2818890
4529 -2818890 1558916 5667181 4905328 -1762905 -10443827 -15819078 -16090900 -13868804 -12130649
4520 -12130649 -10834001 -8874084 -7868872 -10822977 -16700168 -19588333 -15284548 -6720453
4512 -6720453 -701470 -649472 -4603227 -9036789 -12122648 -13842408 -15191195 -17126841 -18771577
4503 -18771577 -17575888 -13229378 -10063291 -12372783 -17769566 -18809375 -12070249 -2524362
4495 -2524362 2590866 1757603 -746566 -691643 2518053 6966348 10344212 10668730 6863287
$$ packed form
4555C586289P216625N539714k650921j0370601j0463520l590192M000517P756527
4547A024438P271397L947865j66645k174454m45770K763646L365343N64581k229918
4538A3920483k122783j92329O75095n25285k688908m506992m993686l178552P94067
4529b818890M377806M108265p61853o668233q680922n375251k71822K222096J738155
4520a2130649J296648J959917J005212k954105n877191k888165M303785Q564095
4512f720453O018983N1998l953755m433562l085859j719760j348787j935646j644736
4503a8771577J195689M346510L166087k309492n396783j039809O739126R545887
4495b524362N115228q33263k504169N4923L209696M448295L377864L24518l805443
$$ plain form
4486 6863287 193734 -5214590 -5057612 559222 5941367 5175555 -1300043 -7637039 -10200005
4477 -10200005 -11058849 -12787950 -13884006 -12429006 -10673230 -11407052 -12323397 -9291230 -3668892
4468 -3668892 -606513 -751368 225297 3547293 5154198 3043507 621741 299295 -486541
4459 -486541 -3657734 -6277982 -5920694 -5552419 -8586978 -13090838 -15592985 -16895516 -18754754
4450 -18754754 -18056053 -10740533 30105 6035059 4433009 749339 678249 3389813
4442 3389813 4432757 2049367 -1016958 -506697 4763682 10199731 8746901 -960111
4434 -960111 -11583371 -15201560 -12572232 -10475978 -11665173 -12714665 -11329617 -9802767
4426 -9802767 -9732108 -8583418 -4424136 -288557 -495942 -4946391 -9948122 -12997945 -13959965
$$ packed form
4486F863287o669553n408324J56978N616834N382145p65812o475598o336996k562966
4477a0200005q58844j729101j096056J455000J755776p33822r16345L032167N622338
4468c668892L062379j44855R76665L321996J606905k110691k421766l22446p85836
4459d86541l171193k620248L57288L68275l034559m503860k502147j302531j859238
4450a8754754O98701P315520J0770638O004954j602050l683670p1090K711564
4442C389813J042944k383390l066325N10261N270379N436049j452830r707012
4434i60111j0623260l618189K629328K096254j189195j049492J385048J526850
4426i802767P0659J148690M159282M135579k07385m450449n001731l049823r62020
$$ plain form
4417 -13959965 -12527510 -7449616 1058102 9607998 13656623 11761974 7508981 5966717
4409 5966717 7882043 9206210 7443004 5886252 8866205 14921179 18554712 17673172
4401 17673172 15088001 13134966 11527340 11036088 14324626 21181817 26919802 27769861
4393 27769861 24628438 19652825 12962016 5322825 396326 649297 3533183 5036652
4385 5036652 4666766 3577934 466300 -6165294 -13406109 -16604846 -16099540 -16484287 -18963454
4376 -18963454 -19273245 -14465015 -7243473 -1316947 3543917 8460855 10625464 6238692
4368 6238692 -2583428 -8277741 -6237874 373079 5810017 9165464 13858518 20894887
4360 20894887 26044443 24790417 17909685 10355485 5743213 3751013 2169906 -788925
$$ packed form
4417a3959965J432455N077894Q507718Q549896M048625j894649m252993j542264
4409E966717J915326J324167j763206j556752K979953O054974L633533q81540
4401A7673172k585171j953035j607626m91252L288538O857191N737985Q50059
4393B7769861l141423m975613o690809p639191m926499K52971K883886J503469
4385E036652l69886j088832l111634o631594p240815l198737N05306l84747k479167
4376a8963454l09791M808230P221542N926526M860864M916938K164609m386772
4368F238692q822120n694313K039867O610953N436938L355447M693054P036369
4360B0894887N149556j254026o880732p554200m612272j992200j581107k958831
$$ plain form
4352 -788925 -6142557 -13372726 -18853880 -17378659 -7632740 4696170 11454272 9800847
4344 9800847 4225952 1001521 1994980 4059682 3209244 -1162922 -5507282 -5288455 462512
4335 462512 7739068 11459057 10762253 9401319 10638643 13043254 12357882 6780206 -976696
4326 -976696 -6862049 -9347048 -9315830 -7267392 -2833522 2267430 3118673 -3518780 -13336935
4317 -13336935 -16881752 -9870999 1080071 5797681 2081870 -3715485 -6933287 -10333261
4309 -10333261 -17544723 -25259848 -26600082 -20509446 -13060485 -9278702 -7797435 -4958481
4301 -4958481 -714820 2131257 2587409 2600068 4019099 6343312 7623164 6810336 5354996
4292 5354996 6416480 11191792 15809554 14185927 5505198 -3270103 -4888413 -416679
$$ packed form
4352g88925n353632p230169n481154J475221R745919J2328910O758102j653425
4344I800847n574895l224431R93459K064702q50438m372166m344360K18827N750967
4335D62512P276556L719989o96804j360934J237324K404611o85372n577676p756902
4326i76696n885353k484999L1218K048438M433870N100952Q51243o637453r818155
4317a3336935l544817P010753J0951070M717610l715811n797355l217802l399974
4309a0333261p211462p715125j340234O090636P448961L781783J481267K838954
4301d958481M243661K846077M56152J2659J419031K324213J279852q12828j455340
4292E354996J061484M775312M617762j623627q680729q775301j618310M471734
$$ plain form
4284 -416679 2619832 -49519 -5075439 -7148188 -5414864 -2509625 -44171 2051139
4276 2051139 3043553 1435406 -2133171 -4416777 -3530068 -2210981 -5046654 -12220899 -18092865
4267 -18092865 -17619965 -12723283 -9581328 -10332433 -11373982 -10674713 -11987186 -18383637 -25360218
4258 -25360218 -25631418 -19217734 -13521445 -13635974 -17376405 -20089303 -19440472 -14655739 -6329172
4249 -6329172 967517 797265 -7295890 -15809444 -18148949 -15879956 -13866406 -11992909
4241 -11992909 -6542953 2403605 10035215 12869973 11918844 9790181 7704609 5759822
4233 5759822 4132345 3730712 6280040 12428243 18925961 20308590 15569257 10643964
4225 10643964 11249321 15357349 16366831 12296485 7993904 8747721 14970488 22907668
$$ packed form
4284d16679L036511k669351n025920k072749J733324K905239K465454K095310
4276B051139R92414j608147l568577k283606Q86709J319087k835673p174245n871966
4267a8092865M72900M896682L141955p51105j041549O99269j312473o396451o976581
4258b5360218k71200O413684N696289j14529l740431k712898O48831M784733Q326567
4249f329172P296689j70252q093155q513554k339505K268993K013550J873497
4241a1992909N449956Q946558P631610K834758r51129k128663k085572j944787
4233E759822j627477m01633K549328O148203O497718J382629m739333m925293
4225A0643964O05357M108028J009482m070346m302581P53817O222767P937180
$$ plain form
4217 22907668 27889125 27435480 23724228 22189004 25212061 28597458 27267018 22578978
4209 22578978 19682621 18861446 15128492 7209388 1457791 3736230 10723391 13037298
4201 13037298 6147086 -4580330 -10380546 -9267923 -7878324 -12281456 -18918936 -18302597
4193 -18302597 -7655006 4927511 10882389 10653434 8794080 4492006 -6312194 -21594903
4185 -21594903 -33180987 -36331517 -33923216 -30431357 -26644566 -21532611 -15312927 -9162532
4177 -9162532 -4501981 -3008986 -4929395 -7573774 -7820582 -5453171 -2161861 773310
4169 773310 1579265 -1892246 -7714516 -9470122 -4815845 -135808 -1056229 -3306376 -406358
4160 -406358 4540601 3952223 -1816732 -7752429 -15457183 -28343422 -39308110 -38640245
$$ packed form
4217B2907668M981457m53645l711252j535224L023057L385397j330440m688040
4209B2578978k896357q21175l732954p919104n751597K278439O987161K313907
4201A3037298o890212j0727416n800216J112623J389599m403132o637480O16339
4193a8302597J0647591J2582517N954878k28955j859354m302074j0804200j5282709
4185b1594903j1586084l150530K408301L491859L786791N111955O219684O150395
4177i162532M660551J492995j920409k644379k46808K367411L291310K935171
4169G73310Q05955l471511n822270j755606M654277M680037r20421k250147K900018
4160d06358M946959n88378n768955n935697p704754j2886239j0964688O67865
$$ plain form
4152 -38640245 -32007438 -32651255 -36648849 -28883513 -17818015 -36671133 -94092385 -146842523
4144 -146842523 -145589819 -94142325 -39232893 -11254325 -1285549 7408502 13847723 11745985
4136 11745985 5350403 1611409 -252856 -2788431 -4014259 -3491900 -5442298 -10259395
4128 -10259395 -11571390 -6834635 -2371767 -2644838 -2824270 1889069 6836024 4545221
4120 4545221 -4523691 -13824847 -19048638 -19731763 -16688629 -12451383 -10829060 -12252724
4112 -12252724 -12770403 -10378120 -8355445 -9546590 -11557354 -10545935 -5773440 1969896
4104 1969896 11753190 19772531 20580822 14522173 9041902 9145638 11700166 12808733 14590316
4095 14590316 18995505 20544981 13015937 443276 -6139545 -2225045 5894984 10108367
$$ packed form
4152c8640245O632807o43817l997594P765336J1065498j8853118n7421252n2750138
4144a46842523J252704N1447494N4909432K7978568R968776Q694051O439221k101738
4136A1745985o395582l738994j864265k535575j225828N22359j950398m817097
4128a0259395j311995M736755M462868k73071j79432M713339M946955k290803
4120D545221r068912r301156n223791o83125L043134M237246J622323j423664
4112a2252724n17679K392283K022675j191145k010764J011419M772495P743336
4104A969896R783294Q019341Q08291o058649n480271J03736K554528J108567J781583
4095A4590316M405189J549476p529044j2572661o582821L914500Q120029M213383
$$ plain form
4087 10108367 8451719 3736111 -1212940 -5419162 -9164970 -12226057 -11964444 -4851304
4079 -4851304 8213194 20185854 24472093 21941564 18493620 16798073 13804665 6387786
4071 6387786 -3427085 -9968197 -9610825 -4399264 71611 538874 -1117575 -2031709 -3247846
4062 -3247846 -7021486 -10653077 -8447886 -564384 5574423 4891492 813764 -836210
4054 -836210 701564 3165415 6099881 9183501 9499583 5444768 741605 -111296 1646011
4045 1646011 1290356 -2560925 -7431771 -11303745 -13224507 -11378913 -5029122 2648537
4037 2648537 7484227 8908130 8198681 4167224 -4751707 -15167517 -20329526 -17366389
4029 -17366389 -9661454 -2410854 1144452 146976 -3364596 -4669478 -461640 7244234
$$ packed form
4087A0108367j656648m715608m949051m206222l745808l061087K61613P113140
4079d851304J3064498J1972660M286239k530529l447944j695547k993408p416879
4071F387786r814871o541112L57372N211561M470875M67263j656449r14134j216137
4062c247846l773640l631591K205191P883502O138807o82931m077728j649974
4054h36210J537774K463851K934466L083620L16082m054815m703163q52901J757307
4045A646011l55655l851281m870846l871974j920762J845594O349791P677659
4037B648537M835690J423903p09449m031457q918931j0415810n162009K963137
4029a7366389P704935P250600L555306r97476l511572j304882M207838P705874
$$ plain form
4021 7244234 13532966 15808563 14324249 9805872 4143527 1368808 3533075 6958030
4013 6958030 6870852 4362898 4124131 6669182 8127647 6904840 4872035 2211700 -2922833
4004 -2922833 -9094426 -11975616 -11431994 -12445838 -16805159 -19154942 -14342971 -4677009
3996 -4677009 2916152 3795777 -2128857 -11349500 -18061406 -18333615 -15074912 -15041508 -18942557
3987 -18942557 -19187931 -10610108 1217292 6946296 5244768 2365858 2122599 1985703
3979 1985703 -1004887 -5262699 -6952293 -4555696 -159201 2276600 -115694 -6293291
3971 -6293291 -11548566 -11997910 -8657050 -5884895 -6257797 -8249872 -8506746 -5143665 818256
3962 818256 6168396 8074550 6965453 6430289 9343871 14516691 17870534 16344734 10205939
$$ packed form
4021G244234O288732K275597j484314m518377n662345k774719K164267L424955
4013F958030q7178k507954k38767K545051J458465j222807k032805k660335n134533
4004b922833o171593k881190N43622j013844m359321k349783M811971R665962
3996d677009P593161Q79625n924634r220643o711906k72209L258703L3404l901049
3987a8942557k45374Q577823J1827400N729004j701528k878910k43259j36896
3979A985703k990590m257812j689594K396597M396495K435801k392294o177597
3971f293291n255275m49344L340860K772155l72902j992075k56874L363081N961921
3962H18256N350140J906154j109097n35164K913582N172820L353843j525800o138795
$$ plain form
3953 10205939 2699755 -1652225 237963 7243461 14334157 17037323 15552138 13717166
3945 13717166 14463973 17329655 19965873 20685370 19319714 16669715 13828633 11716756
3937 11716756 10668127 10267656 9868294 9577875 10352449 12271759 13000339 9653552 2804050
3928 2804050 -3249765 -5603343 -6257601 -8317272 -10427505 -8429317 -2039168 3832048
3920 3832048 5177958 3231633 1537576 1456371 2279913 3639461 5725077 8238401 10600332
3911 10600332 12422082 13039242 11742793 9089557 6558541 4219528 321044 -5934373
3903 -5934373 -12729510 -17652465 -19886529 -19528529 -16447785 -11133988 -5386808 -967811
3895 -967811 1417059 1171968 -2419193 -8246182 -12724319 -12717433 -8388719 -2278919 3372282
$$ packed form
3953A0205939p506184m351980J890188P005498P090696K703166j485185j834972
3945A3717166P46807K865682K636218P19497j365656k649999k841082k111877
3937A1716756j048629m00471l99362k90419P74574J919310P28580l346787o849502
3928B804050o053815k353578o54258k059671k110233J998188O390149N871216
3920C832048J345910j946325j694057q1205Q23542J359548K085616K513324K361931
3911A0600332J821750O17160j296449k653236k531016k339013l898484o255417
3903e934373o795137m922955k234064L58000L080744N313797N747180M418997
3895i67811K384870k45091l591161n826989m478137O886M328714O109800N651201
$$ plain form
3886 3372282 7601275 10395454 12436765 14004777 13420217 8243158 -874537 -9247422
3878 -9247422 -12573738 -10953495 -7242012 -3241976 410276 2129928 185974 -4333625
3870 -4333625 -7698861 -7596702 -5905337 -6629935 -11373951 -17224097 -19245695 -15111108 -7001073
3861 -7001073 1057952 6648752 9119883 8147445 4503687 1346644 1851711 5466922 8783539
3852 8783539 9706423 8084568 3224701 -4811392 -11358932 -9958090 -904426 7794419
3844 7794419 10520968 10375352 12291365 15100289 15484321 15373540 18648517 22930352 21871541
3835 21871541 15240693 10157930 11273478 15164256 16076904 12683631 7320828 2411166
3827 2411166 -359426 -454209 102574 -1653351 -5248738 -6697146 -4033992 -79070 1763515
$$ packed form
3886C372282M228993K794179K041311J568012n84560n177059r117695q372885
3878i247422l326316J620243L711483M000036L652252J719652j943954m519599
3870d333625l365236J02159J691365p24598m744016n850146k021598M134587Q110035
3861g001073Q059025N590800K471131r72438l643758l157043N05067L615211L316617
3852H783539R22884j621855m859867q036093o547540J400842R053664Q698845
3844G794419K726549j45616J916013K808924L84032j10781L274977M281835j058811
3835B1871541o630848n082763J115548L890778R12648l393273n362803m909662
3827B411166k770592r4783N56783j755925l595387j448408K663154L954922J842585
$$ plain form
3818 1763515 1537655 705452 -1107936 -4712130 -8442400 -9158494 -5539375 689346 5611320
3809 5611320 4765963 -3409491 -14056141 -18297786 -11980352 -833115 5430862 3231138
3801 3231138 -2775617 -6577073 -6891594 -6324842 -7039675 -8521109 -8641764 -6038663 -1431823
3792 -1431823 3461786 8059868 12818940 16724276 16790862 11734663 4802984 620818 -291171
3783 -291171 -1494450 -5109792 -8825333 -9329180 -6619523 -3313117 -1039453 641140 2393396
3774 2393396 4049503 5505676 7219943 9203862 10295645 9044723 5131306 -175999
3766 -175999 -4723505 -6849907 -6647707 -5776909 -5507724 -5283514 -4037881 -2335550 -1481322
3757 -1481322 -511624 3596591 11495198 19073344 21255610 17018544 9156694 771111
$$ packed form
3818A763515k25860q32203j813388l604194l730270p16094L619119O228721M921974
3809E611320q45357q175454j0646650m241645O317434J1147237O263977k199724
3801C231138o006755l801456l14521N66752p14833j481434j20655K603101M606840
3792a431823M893609M598082M759072L905336O6586n056199o931679m182166r11989
3783b91171j203279l615342l715541n03847K709657L306406K273664J680593J752256
3774B393396J656107J456173J714267J983919J091783j250922l913417n307305
3766a75999m547506k126402K02200Q70798K69185K24210J245633J702331Q54228
3757a481322R69698M108215P898607P578146K182266m237066p861850q385583
$$ plain form
3749 771111 -5583893 -6795149 -1156423 7996501 13762848 12366893 6701646 2330591
3741 2330591 1678144 3070204 3822143 2991734 1962937 2963572 6325794 9425117 9537828
3732 9537828 7070184 4033526 315992 -5375231 -11295687 -13375973 -10731825 -6511963
3724 -6511963 -2438622 2901203 8807979 10916254 8069374 5706629 7998696 11062971
3716 11062971 9405400 5295017 5135472 9002432 11084666 9731750 9784273 13997668 18548950
3707 18548950 19087736 16165796 12472934 8894966 5496125 3033095 1705439 1099836
3699 1099836 1993836 4893422 6666398 3184660 -3834514 -7642938 -5749472 -3210013
3691 -3210013 -4203720 -5661715 -3014761 2420200 6430829 8481568 10118353 9703116 4567641
$$ packed form
3749G71111o355004j211256N638726R152924N766347j395955n665247m371055
3741B330591o52447J392060P51939q30409j028797J000635L362222L099323J12711
3732I537828k467644l036658l717534n691223n920456k080286K644148M219862
3724f511963M073341N339825N906776K108275k846880k362745K292067L064275
3716A1062971j657571m110383j59545L866960K082234j352916N2523M213395M551282
3707A8548950N38786k921940l692862l577968l398841k463030j327656o05603
3699A099836Q94000K899586J772976l481738p019174l808424J893466K539459
3691c210013r93707j457995K646954N434961M010629K050739J636785m15237n135475
$$ plain form
3682 4567641 -2775213 -5889085 -1951331 5836939 12981958 16938961 15964804 9225187
3674 9225187 -793532 -9274067 -13776860 -15624739 -16041562 -13865917 -8483464 -2476076
3666 -2476076 761598 666516 -950101 -2905063 -5362429 -8197915 -10767178 -13614861 -18340646
3657 -18340646 -24200458 -26276150 -20010036 -8057255 413381 -475637 -6315237 -8363755
3649 -8363755 -5032431 -2972715 -6354666 -9900927 -5652485 5905087 14944193 12382820
3641 12382820 -624217 -13232349 -14864929 -5508200 4338681 5318008 -629992 -4615848
3633 -4615848 -3316188 -1454272 -1960539 -1158396 3155573 5825394 2098653 -4004077 -5694122
3624 -5694122 -3888513 -4426345 -7614160 -8648575 -7299400 -8665596 -13454629 -15459426
$$ packed form
3682D567641p342854l113872L937754P788270P145019L957003r74157o739617
3674I225187j0018719q480535m502793j847879m16823K175645N382453O007388
3666b476076L237674r5082j616617j954962k457366k835486k569263k847683m725785
3657a8340646n859812k075692O266114J1952781Q470636q89018n839600k048518
3649h363755L331324K059716l381951l546261M248442J1557572R039106k561373
3641A2382820j3007037j2608132j632580R356729R846881R79327n948000l985856
3633d615848J299660J861916n06267Q02143M313969K669821l726741o102730j690045
3624e694122J805609n37832l187815j034415J349175j366196m789033k004797
$$ plain form
3616 -15459426 -11069711 -4446151 -302523 2110366 4216569 3417924 -1858809 -7228418
3608 -7228418 -7997364 -6225096 -6653854 -8608956 -8120820 -6080767 -7229156 -11048474 -10672073
3599 -10672073 -3169463 4661588 4519847 -2932994 -9745844 -10756205 -8276847 -7709408
3591 -7709408 -11981221 -20267016 -28862285 -32212163 -25981674 -11807411 1908433 6557141
3583 6557141 1498805 -5383690 -5784600 1255971 10038819 15183338 16144756 15063963 12513569
3574 12513569 7437741 825325 -3183635 -1779234 2015347 2153839 -2424341 -5344981
3566 -5344981 -647446 8876728 14707562 13393438 10309166 11647650 16509665 19446429
3558 19446429 17943266 13915513 9285581 3701623 -3325346 -10577209 -15848912 -17185827
$$ packed form
3616a5459426M389715O623560M143628K412889K106203p98645n276733n369609
3608g228418p68946J772268m28758j955102M88136K040053j148389l819318L76401
3599a0672073P502610P831051j41741p452841o812850j010361K479358N67439
3591g709408m271813q285795q595269l349878O230489J4174263J3715844M648708
3583F557141n058336o882495m00910P040571Q782848N144519R61418j080793k550394
3574A2513569n075828o612416m008960J404401L794581J38492m578180k920640
3566e344981M697535R524174N830834j314124l084272J338484M862015K936764
3558A9446429j503163m027753m629932n583958p026969p251863n271703j336915
$$ plain form
3550 -17185827 -13950754 -8265689 -4551845 -5442964 -8463281 -8698118 -4399021 1930923
3542 1930923 7297062 10487268 10817567 7529328 1389899 -4936093 -8949389 -9823498 -8168036
3533 -8168036 -5743403 -4827532 -5956336 -6814063 -5325831 -2841611 -1577765 -141113 4389179
3524 4389179 10306729 12062526 8291848 4360309 4697467 6800151 5866704 1738381 -2481446
3515 -2481446 -5772767 -8800032 -10018268 -6835548 -362919 4841184 6218716 5564305
3507 5564305 5503051 6013495 5127362 1529723 -3815244 -7607222 -6407677 -399516 5810218
3498 5810218 7917258 6623729 5636361 6125958 6171911 5236570 5530639 7994511 10061970
3489 10061970 9234971 6716200 5529069 6415987 7315958 5912919 1319578 -5630192 -12119025
$$ packed form
3550a7185827L235073N685065L713844q91119l020317k34837M299097O329944
3542A930923N366139L190206L30299l288239o139429o325992m013296q74109J655462
3533h168036K424633R15871j128804q57727J488232K484220J263846J436652M530292
3524D389179N917550J755797l770678l931539L37158K102684r33447m128323m219827
3515b481446l291321l027265j218236L182720O472629N204103J377532o54411
3507E564305o1254N10444q86133l597639n344967l791978J199545O008161O209734
3498E810218K107040j293529r87368M89597M5953r35341K94069K463872K067459
3489A0061970q26999k518771j187131Q86918Q99971j403039m593341o949770o488833
$$ plain form
3480 -12119025 -14410407 -11404819 -6910218 -6106427 -9250611 -11129346 -8197996 -4280177
3472 -4280177 -6276919 -14667745 -21768257 -20991357 -14936987 -11083133 -11103545 -9032485 -758989
3463 -758989 9090628 12837123 9729990 6370906 7862220 12205679 14386351 13203320
3455 13203320 11878885 12803328 13679219 9736452 -552909 -12849647 -20833691 -22418161
3447 -22418161 -20849283 -19657215 -18671107 -16300942 -13607992 -13282579 -15236837 -16101448 -13625024
3438 -13625024 -9354911 -5991888 -3806451 -1055280 2969426 6734625 8409271 8335462
3430 8335462 8871595 11138109 12226758 7499702 -3065669 -12463305 -13097718 -5164441
3422 -5164441 3907015 8275344 8974389 9647183 10383013 8453829 3348173 -1990248 -4663085
$$ packed form
3480a2119025k291382L005588M494601Q03791l144184j878735K931350L917819
3472d280177j996742q390826p100512P76900O054370L853854k0412K071060Q273496
3463g58989R849617L746495l107133l359084J491314M343459K180672j183031
3455A3203320j324435R24443Q75891l942767j0289361j2296738p984044j584470
3447b2418161J568878J192068R86108K370165K692950L25413j954258q64611K476424
3438a3625024M270113L363023K185437K751171M024706L765199J674646p3809
3430H335462N36133K266514J088649m727056j0565371r397636o34413P933277
3422e164441R071456M368329O99045O72794P35830j929184n105656n338421k672837
$$ plain form
3413 -4663085 -4272228 -1721121 2482369 7841457 12708029 14330701 10294479 566703
3405 566703 -11258661 -19500650 -20573749 -15782419 -9237468 -3485261 1396313 4732418
3397 4732418 3864391 -2518099 -10918992 -14973330 -11047821 -1096824 9607566 16403138
3389 16403138 17389712 13646381 8054331 2840076 -2110584 -7493104 -11477459 -10913557
3381 -10913557 -6560239 -3990805 -6491794 -9461316 -6098010 2316424 6776646 1977015
3373 1977015 -7343056 -13503375 -14917083 -14778467 -14685358 -14364128 -15240560 -18691243 -21499563
3364 -21499563 -18530178 -10471941 -3858778 -1991210 -763762 3882164 8789658 7918118
3356 7918118 1079456 -5894687 -8309619 -6247193 -2206340 918053 -25465 -5935826
$$ packed form
3413d663085L90857K551107M203490N359088M866572J622672m036222r727776
3405E66703j1825364q241989j073099M791330O544951N752207M881574L336105
3397D732418q68027o382490q400893m054338L925509R950997J0704390O795572
3389A6403138R86574l743331n592050n214255m950660n382520l984355N63902
3381a0913557M353318K569434k500989k969522L363306Q414434M460222m799631
3373A977015r320071o160319j413708J38616R3109L21230q76432l450683k808320
3364b1499563K969385Q058237O613163J867568J227448M645926M907494q71540
3356G918118o838662o974143k414932K062426M040853L124393r43518n910361
$$ plain form
3348 -5935826 -12161843 -11623172 -3239415 5734829 8180817 5364208 3622209 4861168
3340 4861168 4882232 1212737 -2079373 106940 6571235 11351371 11195324 8106831 4900931
3331 4900931 1867164 -1280876 -3403047 -3845648 -4043547 -4983597 -4826183 -1484602 3717807
3322 3717807 7475073 8587265 8067829 6181951 2580723 -999013 -1736116 39246 926868
3313 926868 -179434 30164 4364778 10743509 14690346 14177756 10269889 5028650 753880
3304 753880 -466224 1501960 4686468 7619701 10056605 10169641 4536983 -6402698
3296 -6402698 -15975826 -18020227 -13931878 -9655755 -8169855 -9015451 -12413363 -17827576
3288 -17827576 -19837668 -12413255 1919407 13339459 16660187 16182715 16716289 16148182
$$ packed form
3348e935826o226017N38671Q383757Q974244K445988k816609j741999J238959
3340D861168K1064l669495l292110K186313O464295M780136j56047l088493l205900
3331D900931l033767l148040k122171m42601j97899r40050J57414L341581N202409
3322C717807L757266J112192n19436j885878l601228l579736p37103J775362Q87622
3313I26868j106302K09598M334614O378731L946837n12590l907867n241239m274770
3304G53880j220104J968184L184508K933233K436904J13036n632658j0939681
3296f402698r573128k044401M088349M276123J485900q45596l397912n414213
3288a7827576k010092P424413J4332662J1420052L320728m77472N33574n68107
$$ plain form
3280 16148182 10852063 3268446 -871120 480796 5646422 12819647 19409513 21144071
3272 21144071 16971141 12444827 13124227 16631695 16469093 11714939 6966068 4110564
3264 4110564 1024846 -1787341 -625584 3868398 5469131 1370105 -3593084 -4950649
3256 -4950649 -5015485 -6966069 -7720508 -2474710 6964968 14068473 15679971 13065689 6928831
3247 6928831 -2522623 -11070037 -12266279 -5249568 3767151 9460097 12797795 16413252
3239 16413252 18532856 15273973 7015787 -1553296 -7775703 -13994313 -22377836 -28931118
3231 -28931118 -26324623 -13695224 -524139 2830381 -2421775 -4769242 2942427 14432421
3223 14432421 18329887 11994749 2725072 -2756129 -5056703 -8418213 -14340528 -19975887
$$ packed form
3280A6148182n296119p583617m139566J351916N165626P173225O589866J734558
3272B1144071m172930m526314O79400L507468j62602m754154m748871k855504
3264D110564l085718k812187J161757M493982J600733m099026m963189j357565
3256d950649o4836j950584p54439N245798R439678P103505J611498k614282o136858
3247F928831r451454q547414j196242P016711R016719N692946L337698L615457
3239A6413252K119604l258883q258186q569083o222407o218610q383523o553282
3231b8931118K606495J2629399J3171085L354520n252156k347467P711669J1489994
3223A4432421L897466o335138r269677n481201k300574l361510n922315n635359
$$ plain form
3215 -19975887 -20603483 -13504194 -1367208 8604868 11139018 7647325 2545156 -2914362
3207 -2914362 -9334722 -14061408 -13480367 -10063409 -10457672 -15106863 -16213062 -8892957 1510458
3198 1510458 7184272 7772172 7860208 9044063 10110592 11680008 14418173 14734622 8586982
3189 8586982 -1341220 -8213753 -10510757 -13059813 -18196896 -21920850 -20627160 -16339102
3181 -16339102 -12502890 -8872595 -3719130 2216010 7159537 11069875 13981258 14070662
3173 14070662 10814865 8219697 11026769 18318857 24289603 25397424 23844537 23524132
3165 23524132 25026906 25546522 22053453 14068673 4805836 -459150 631449 3856784
3157 3856784 2515955 -3803158 -7900174 -4793429 588603 46085 -5763112 -8059924
$$ packed form
3215a9975887o27596P099289J2136986R972076K534150l491693n102169n459518
3207b914362o420360m726686N81041L416958l94263m649191j106199P320105J0403415
3198A510458N673814N87900Q8036J183855J066529J569416K738165L16449o147640
3189H586982r928202o872533k297004k549056n137083l723954J293690M288058
3181a6339102L836212L630295N153465N935140M943527L910338K911383Q9404
3173A4070662l255797k595168K807072P292088N970746J107821j552887l20405
3165B3524132J502774N19616l493069p984780r262837n264986J090599L225335
3157C856784j340829o319113m097016L106745N382032n42518n809197k296812
$$ plain form
3149 -8059924 -3028887 2537479 1529057 -3498808 -5561878 -3881727 -2843268 -3194816
3141 -3194816 -1783902 611474 -1187333 -7976123 -13597962 -13640788 -10842324 -8903212 -6795736
3132 -6795736 -3415374 -2589776 -7785576 -15297501 -18425179 -16371416 -13938479 -13933053 -14615842
3123 -14615842 -13709804 -10795198 -6471927 -2424392 -911742 -1080287 1934961 10433174
3115 10433174 19190656 21528918 17831301 13096599 8915672 4137304 1001217 2856122
3107 2856122 6732005 6221971 1994548 1460946 6900724 11887538 11428396 7816460 3939461
3098 3939461 -1157649 -6674769 -8248006 -6274124 -8003243 -15575669 -19744278 -12851815
3090 -12851815 -1218223 4086113 3209033 4329152 8424677 8418402 2677799 -1307337 1404022
$$ packed form
3149h059924N031037N566366j008422n027865k063070J680151J038459l51548
3141c194816J410914K395376j798807o788790n621839m2826K798464J939112K107476
3132f795736L380362Q25598n195800p511925l127678K053763K432937N426o82789
3123a4615842R06038K914606M323271M047535J512650j68545L015248Q498213
3115A0433174Q757482K338262l697617m734702m180927m778368l136087J854905
3107B856122L875883n10034m227423n33602N439778M986814m59142l611936l876999
3098C939461n097110n517120j573237J973882j729119p572426m168609O892463
3090a2851815J1633592N304336q77080J120119M095525o275n740603l985136K711359
$$ plain form
3081 1404022 6499153 8208722 6759006 4832285 2626057 290771 571644 4724931
3073 4724931 8752466 7555136 1317983 -4995783 -7473104 -6471680 -4652374 -3516916
3065 -3516916 -2265505 267721 3126598 3878884 2022387 -56784 -403054 473584 2125505
3056 2125505 5587855 9857801 10451999 5414512 -123583 -132159 3966189 6554212 7254195
3047 7254195 10173742 14452091 13590181 6214749 371691 3061217 10492630 13111039
3039 13111039 7051099 -3197679 -11033768 -13102404 -10039385 -4990898 -1023319 1366856
3031 1366856 3494360 5234072 4676543 1399508 -2531982 -5564905 -8056691 -10021178
3023 -10021178 -10333856 -8961059 -7094235 -4541125 -372035 3379107 3009036 -570845
$$ packed form
3081A404022N095131J709569j449716j926721k206228k335286K80873M153287
3073D724931M027535j197330o237153o313766k477321J001424J819306J135458
3065c516916J251411K533226K858877P52286j856497k079171l46270Q76638J651921
3056B125505L462350M269946N94198n037487n538095q576M098348K588023O99983
3047G254195K919547M278349q61910p375432n843058K689526P431413K618409
3039A3111039o059940j0248778p836089k068636L063019N048487L967579K390175
3031A366856K127504J739712n57529l277035l931490l032923k491786j964487
3023a0021178l12678J372797J866824K553110M169090L751142l70071l579881
$$ plain form
3015 -570845 -1502927 2871323 8008057 9017452 7089583 5721890 4875115 3153885 2088283
3006 2088283 3335274 4392109 2026604 -2211442 -4757583 -6358849 -10463822 -16626063
2998 -16626063 -20828461 -21830888 -22107419 -22520882 -21002400 -17002527 -12564408 -8026912
2990 -8026912 -1131512 7966479 14595302 14547466 8604651 822008 -5219208 -7708362 -7259984
2981 -7259984 -7537546 -12301151 -20322194 -25856719 -25555423 -22091009 -19379292 -17556387 -15460917
2972 -15460917 -15146491 -19617130 -26797097 -29620300 -23270736 -10534118 898463 5631959
2964 5631959 4802268 3644456 5051018 6083322 2099075 -5969023 -11117859 -8444945
2956 -8444945 -1384470 2724873 1417740 -1928056 -4639763 -7608348 -10957470 -11691319
$$ packed form
3015e70845r32082M374250N136734J009395j927869j367693q46775j721230j065602
3006B088283J246991J056835k365505m238046k546141j601266m104973o162241
2998a6626063m202398j002427k76531m13463J518482L999873M438119M537496
2990h026912O895400R097991O628823m7836n942815p782643o041216k489154M48378
2981g259984k77562m763605q021043n534525L01296L464414K711717J822905K095470
2972a5460917L14426m470639p179967k823203O349564J2736618J1432581M733496
2964E631959q29691j157812J406562J032304l984247q068098n148836K672914
2956h444945P060475M109343j307133l345796k711707k968585l349122p33849
$$ plain form
2948 -11691319 -8503023 -5308758 -5967090 -7779287 -4982131 2278959 7745257 8433223
2940 8433223 8902367 13697401 20081860 22182923 19156276 14686316 10343860 4348181
2932 4348181 -3565535 -10446846 -13741500 -13395746 -10485866 -7045422 -6784566 -11871368 -18814741
2923 -18814741 -21748113 -20270836 -19530045 -21724193 -22678152 -18763929 -12213647 -6817817
2915 -6817817 -2922930 209949 1582595 1600377 3632197 8241813 10085522 5397877 -1414034
2906 -1414034 -4144750 -3890453 -5106255 -5751114 396543 12434443 21295150 20970255 14370578
2897 14370578 7185584 2271396 1297358 5203946 10384794 10223846 3800991 -1455485
2889 -1455485 1051649 9090895 15516983 16441293 12731308 7060731 2832088 3253935 8124440
$$ packed form
2948a1691319L188296L194265o58332j812197K797156P261090N466298O87966
2940H433223M69144M795034O384459K101063l026647m469960m342456n995679
2932D348181p913716o881311l294654L45754K909880L440444K60856n086802o943373
2923a8814741k933372J477277P40791k194148r53959L914223O550282N395830
2915f817817L894887L132879J372646J7782K031820M609616J843709m687645o811911
2906a414034k730716K54297j215802o44859O147657J2037900Q860707l24895o599677
2897A4370578p184994m914188r74038L906588N180848j60948o422855n256476
2889a455485K507134Q039246O426088R24310l709985n670577m228643M21847M870505
$$ plain form
2880 8124440 13037834 13854513 10547729 5859679 2558976 2509085 5236617 6931075 4694414
2871 4694414 2059675 5171520 12674484 15914542 11571489 6969474 8576514 12242963
2863 12242963 11096212 7007167 6203354 7861556 6046600 700441 -2319358 -1655865
2855 -1655865 -2424119 -6888089 -10781056 -10762196 -8948751 -7856292 -6819396 -5890231 -7593553
2846 -7593553 -11685864 -13185843 -9248255 -3954887 -2638453 -4768929 -5986612 -4405601
2838 -4405601 -1529186 757153 991364 -1904774 -6461106 -8454093 -5867003 -2230897
2830 -2230897 -2040027 -4734646 -6678265 -7404961 -9521703 -12821948 -13057531 -7889048 -690244
2821 -690244 3563957 4005181 3450005 3826756 4404985 4128951 3417628 2970792 2457122 1732016
$$ packed form
2880H124440M913394Q16679l306784m688050l300703m9891K727532J694458k236661
2871D694414k634739L111845P502964L240058m343053m602015J607040L666449
2863A2242963j146751m089045q03813J658202j814956n346159l019799O63493
2855a655865p68254m463970l892967J8860J813445J092459J036896R29165j703322
2846g593553m092311j499979L937588N293368J316434k130476j217683J581011
2838d405601K876415K286339K34211k896138m556332j992987K587090L636106
2830b230897J90870k694619j943619p26696k116742l300245k35583N168483P198804
2821f90244M254201M41224n55176L76751N78229k76034p11323m46836n13670p25106
$$ plain form
2811 1732016 2295671 5600405 10118660 12270043 10890365 8719441 8354210 8876887 8162303
2802 8162303 6242760 3931653 407994 -4290082 -6191424 -1409833 7458608 13840526
2794 13840526 16153728 19013219 24606828 28745608 27982489 25040238 23304562 20909359
2786 20909359 15336435 9845478 9284067 12131336 13009018 11515930 11933896 14546410 14193483
2777 14193483 8896090 3733476 3398203 5885447 6948226 6791282 8274036 11030820
2769 11030820 11562768 8422399 4364003 3388421 7095690 13394781 17980171 18194989 15997137
2760 15997137 15465873 17119442 17510502 15336996 14145130 16448296 18756535 16395102
2752 16395102 10678796 6674943 5493494 3941973 1200833 193146 1373687 529741
$$ packed form
2811A732016N63655L304734M518255K151383j379678k170924l65231N22677p14584
2802H162303j919543k311107l523659m698076j901342M781591Q868441O381918
2794A3840526K313202K859491N593609M138780p63119k942251j735676k395203
2786B0909359n572924n490957n61411K847269Q77682j493088M17966K612514l52927
2777A4193483n297393n162614l35273K487244J062779j56944J482754K756784
2769A1030820N31948l140369m058396r75582L707269O299091M585390K14818k197852
2760A5997137n31264J653569L91060k173506j191866K303166K308239k361433
2752A6395102n716306m003853j181449j551521k741140j007687J180541q43946
$$ plain form
2744 529741 -4757206 -10682140 -12338713 -10102995 -7730327 -6694600 -5885038 -4998298 -4591385
2735 -4591385 -3935972 -2264664 -1302270 -3024544 -5355941 -3927640 1463570 5804654 5524297
2726 5524297 3171146 3718559 8444931 14188371 17026064 15402860 11270258 9279511
2718 9279511 13069618 21111753 27885930 30018979 28942013 26535142 21727414 14133996
2710 14133996 7844363 7387699 11561263 15189486 15693116 13853752 9494235 1773512
2702 1773512 -6252051 -9011693 -5850388 -2216234 -1585436 -1037188 2627805 7317923 9905177
2693 9905177 11647019 14692855 16785379 14874004 11317581 10395284 10191792 4578905 -6606387
2684 -6606387 -15603443 -16352588 -10862013 -4356647 777230 3772470 3018998 -1550423 -6796082
$$ packed form
2744E29741n286947n924934j656573K235718K372668J035727Q09562Q86740M06913
2735d591385O55413J671308R62394j722274k331397J428301N391210M341084k80357
2726E524297k353151N47413M726372N743440K837693j623204m132602j990747
2718I279511L790107Q042135O774177K133049j076966k406871m807728p593418
2710A4133996o289633m56664M173564L628223N03630j839364m359517p720723
2702A773512q025563k759642L161305L634154O30798N48248L664993M690118K587254
2693I905177J741842L045836K092524j911375l556423r22297k03492n612887j1185292
2684f606387q997056p49145N490575O505366N133877K995240p53472m569421n245659
$$ plain form
2675 -6796082 -10218636 -12782326 -15374648 -15798261 -12629261 -8936667 -8054994 -8151502 -5557336
2666 -5557336 -1624809 -1216808 -5311284 -10234817 -13955257 -17615313 -20049121 -16708528
2658 -16708528 -6882283 2781182 5978515 4790537 5744288 9982437 12232926 9263330
2650 9263330 4760504 4083752 6982273 7837778 2212502 -8331097 -17616850 -20233808
2642 -20233808 -15861203 -9063156 -5014854 -5206925 -7080819 -7401141 -5438259 -2909782
2634 -2909782 -1638349 -2074691 -4018207 -7752470 -13414957 -19239110 -21539295 -17577228
2626 -17577228 -8649803 143637 3715758 1112243 -3633343 -4839233 -92427 7812441
2618 7812441 13991554 15989664 14286455 9400891 1489622 -6504813 -8923305 -3723836
$$ packed form
2675f796082l422554k563690k592322m23613L169000L692594Q81673r6508K594166
2666e557336L932527M08001m094476m923533l720440l660056k433808L340593
2658a6708528R826245R663465L197333j187978R53751M238149K250489k969596
2650I263330m502826o76752K898521Q55505n625276j0543599r285753k616958
2642b0233808M372605O798047M048302j92071j873894l20322J962882K528477
2634b909782J271433m36342j943516l734263n662487n824153k300185L962067
2626a7577228Q927425Q793440L572121k603515m745586j205890M746806P904868
2618G812441O179113J998110j703209m885564p911269p994435k418492N199469
$$ plain form
2610 -3723836 3224780 3822755 -2963089 -10758297 -14261364 -14344292 -14378759 -15408286 -16512582
2601 -16512582 -16841980 -15402340 -11269517 -5741713 -1981750 -827908 730750 5093289
2593 5093289 10386733 13280012 13166762 11287468 7951280 3302607 -1101194 -4330680
2585 -4330680 -8026333 -13379732 -17660348 -16858507 -10867167 -3495166 1544651 2579683
2577 2579683 68667 -2539137 -729621 4670033 5971000 -1682716 -11952711 -14833132
2569 -14833132 -10287292 -6768482 -7374690 -6816953 -3284112 -3131232 -9379054 -14649744 -12339175
2560 -12339175 -7667661 -9476291 -16162640 -18621985 -14054278 -7845217 -3013514 3247963
2552 3247963 11644790 17285102 16606761 11929393 6719448 1474631 -3170992 -4235182
$$ packed form
2610c723836O948616N97975o785844p795208l503067q2928l4467j029527j104296
2601a6512582l29398J439640M132823N527804L759963J153842J558658M362539
2593E093289N293444K893279j13250j879294l336188m648673m403801l229486
2585d330680l695653n353399m280616Q01841N991340P372001N039817J035032
2577B579683k511016k607804J809516N399654J300967p653716j0269995k880421
2569a4833132M545840L518810o06208N57737L532841J52880o247822n270690K310569
2560a2339175M671514j808630o686349k459345M567707O209061M831703O261477
2552C247963Q396827N640312o78341m677368n209945n244817m645623j064190
$$ plain form
2544 -4235182 -930861 2150138 350491 -4509025 -6242566 -2001672 4733640 8607201
2536 8607201 8047228 6115120 6221422 7470378 5429892 -1726878 -9714216 -13061070 -12118171
2527 -12118171 -11912614 -14705095 -17401552 -16533105 -12155527 -6151058 -273863 2996970
2519 2996970 1147515 -5125885 -11989558 -16841303 -19790758 -20321418 -16644635 -9928627
2511 -9928627 -4796525 -3145692 -1683287 1396993 1898745 -3691611 -10941142 -12767622
2503 -12767622 -9559293 -7621675 -8573715 -7120489 -433809 6397657 7256006 3212362
2495 3212362 526697 2787586 7840543 11203820 10376460 6446064 2883433 2455354 4769376
2486 4769376 7262711 8331321 8303217 7692808 6441711 5188694 5385641 7335602 9423911
$$ packed form
2544d235182L304321L080999j799647m859516j733541M240894O735312L873561
2536H607201n59973j932108J06302J248956k040486p156770p987338l346854R42899
2527a2118171K05557k792481k696457Q68447M377578O004469N877195L270833
2519B996970j849455o273400o863673m851745k949455n30660L676783O716008
2511i928627N132102J650833J462405L080280N01752n590356p249531j826480
2503a2767622L208329J937618r52040J453226O686680O831466Q58349m043644
2495C212362k685665K260889N052957L363277q27360l930396l562631m28079K314022
2486D769376K493335J068610k8104o10409j251097j253017J96947J949961K088309
$$ plain form
2477 9423911 9910479 8520480 6263083 4954499 6477197 10320202 11919307 6418310
2469 6418310 -4761545 -13793646 -14925096 -11194653 -10309893 -14927278 -19540474 -17033104
2461 -17033104 -6614889 5058291 9781558 4973067 -4148208 -9649822 -8717640 -5979384
2453 -5979384 -7481129 -13358256 -17948263 -16709322 -11100349 -6021105 -4024005 -3599546
2445 -3599546 -2606827 -1438800 -1844649 -3789633 -5215595 -4851756 -3551053 -2250118 -323360
2436 -323360 2725409 5392853 5880641 4657722 3190918 999895 -3248091 -8071494 -10069737
2427 -10069737 -9294446 -10257228 -15543428 -21227895 -21517549 -16227979 -10686857 -9139631 -11026087
2418 -11026087 -13347960 -14064137 -13080550 -12231135 -14614202 -21810549 -31075460 -36961285 -36469479
$$ packed form
2477I423911M86568j389999k257397j308584J522698L843005J599105n500997
2469F418310j1179855r032101j131450L730443Q84760m617385m613196K507370
2461a7033104J0418215J1673180M723267m808491r121275n501614R32182K738256
2453e979384j501745n877127m590007J238941N608973N079244J997100M24459
2445c599546R92719J168027m05849j944984j425962L63839J300703J300935J926758
2436c23360L048769K667444M87788j222919j466804k191023m247986m823403j998243
2427a0069737P75291r62782n286200n684467k89654N289570N541122J547226j886456
2418a1026087k321873p16177R83587Q49415k383067p196347r264911n885825M91806
$$ plain form
2409 -36469479 -31467136 -25848470 -21855168 -19485974 -17595028 -14443623 -8488199 12282
2401 12282 8564525 14205368 15420193 12662774 8243457 5487323 5911057 6645241 2926422
2392 2926422 -5466919 -12337639 -11684262 -4632270 2584896 6192619 7368505 7922735 7415761
2383 7415761 5595282 4280618 4490997 3888883 -166587 -6096858 -9415781 -8622873 -7559901
2374 -7559901 -11015486 -19111206 -26754999 -28129879 -21549426 -10648810 -1297415 2949252
2366 2949252 2812521 1305759 631173 1173365 2199133 2246141 -389504 -5746991 -10844933
2357 -10844933 -12077390 -9550318 -7402747 -8679196 -11096380 -9523295 -2251546 6834159
2349 6834159 12674914 14240130 14190578 14166636 12547907 7835195 2371588 75855 1039753
$$ packed form
2409c6469479N002343N618666L993302K369194J890946L151405N955424Q500481
2401A2282Q552243N640843J214825k757419m419317k756134M23734P34184l718819
2392B926422q393341o870720O53377P051992P217166L607723J175886N54230n06974
2383G415761j820479j314664K10379o02114m055470n930271l318923P92908J062972
2374g559901l455585q095720p643793j374880O580453J0900616R351395M246667
2366B949252j36731j506762o74586N42192J025768M7008k635645n357487n097942
2357a0844933j232457K527072K147571j276449k417184J573085P271749R085705
2349F834159N840755J565216m9552k3942j618729m712712n463607k295733R63898
$$ [...]
##END NTUPLES=NMR SPECTRUM
##END=
