##TITLE=31Pdec_DE-123_1
D2O, 24 sc
 23.1.2026
##JCAMPDX= 6.0         $$ Bruker NMR JCAMP-DX V2.0
##DATA TYPE= NMR SPECTRUM
##DATA CLASS= NTUPLES
##ORIGIN= UXNMR, Bruker Analytische Messtechnik GmbH
##OWNER= root
$$ XWIN-NMR		Version 3.5
$$ Fri Jan 23 16:24:33 2026 Russian Standard Time (UT+4h)  she@DPX200
##.OBSERVE FREQUENCY= 81.013821
##.OBSERVE NUCLEUS= ^31P
##.ACQUISITION MODE= SIMULTANEOUS
##.ACQUISITION SCHEME= undefined
##.AVERAGES= 24
##.DIGITISER RES= 17
##SPECTROMETER/DATA SYSTEM= spect
##.PULSE SEQUENCE= zgpg30
##.SOLVENT NAME= DMSO
##.SHIFT REFERENCE= (INTERNAL, DMSO, 0, 198.062)
##AUDIT TRAIL= $$ (NUMBER, WHEN, WHO, WHERE, WHAT)
$$ ##TITLE= Audit trail, XWIN-NMR		Version 3.5
$$ ##JCAMPDX= 5.01
$$ ##ORIGIN= Bruker BioSpin GmbH
$$ ##OWNER= she
$$ F:/spectra/data/she/nmr/P31/2/pdata/1/auditp.txt
$$ ##AUDIT TRAIL=  $$ (NUMBER, WHEN, WHO, WHERE, WHAT)
(   1,<2026-01-23 16:23:29.28 +0400>,<she>,<DPX200>,
      <created by zg, POWCHK disabled, PULCHK disabled
       configuration hash MD5:
       00 E9 B6 7A A2 85 ED C7 34 08 36 98 17 FE 4E 26
       data hash MD5: 32K
       69 D7 75 52 7B 3C C8 AF 8F B0 7A E6 CB 64 DC 89>)
(   2,<2026-01-23 16:23:32.68 +0400>,<she>,<DPX200>,
      <Start of raw data processing
       efp BC_mod = 2 LB = 1.5 FT_mod = 6 PKNL = 1 PHC0 = 1380.419 PHC1 = 77.30029 SI = 64K 
       data hash MD5: 64K
       BE D5 5A 86 2C E7 DF 6E 77 8D F5 3A 7F D9 F6 BD>)
(   3,<2026-01-23 16:24:05.65 +0400>,<she>,<DPX200>,
      <pk PHC0 = 130.703 PHC1 = -326.4 
       data hash MD5: 64K
       80 BB 2D B5 A8 5F 9D A9 29 6F 20 C8 25 6A AD 81>)
$$ ##END=
$$ 
$$ hash MD5
$$ F3 CA 48 BB D4 79 85 17 ED D5 AF C1 38 CE DA E7
##$RELAX= 
##$RELAX= 
##$RELAX= 
##$RELAX= 
##$RELAX= 
##$RELAX= 
##$RELAX= 
##$RELAX= 
$$ Bruker specific parameters
$$ --------------------------
##$DU= <F:/spectra>
##$EXPNO= 2
##$NAME= <P31>
##$PROCNO= 1
##$TYPE= <nmr>
##$USER= <she>
##$AMP= (0..31)
100 100 100 100 100 100 100 100 100 100 100 100 100 100 100 100 100 100 
100 100 100 100 100 100 100 100 100 100 100 100 100 100 
##$AQSEQ= 0
##$AQ_mod= 1
##$AUNM= <au_zg>
##$AUTOPOS= <>
##$BF1= 81.014009
##$BF2= 200.13
##$BF3= 200.13
##$BF4= 200.13
##$BF5= 200.13
##$BF6= 200.13
##$BF7= 200.13
##$BF8= 200.13
##$BYTORDA= 1
##$CFDGTYP= 0
##$CFRGTYP= 5
##$CHEMSTR= <none>
##$CNST= (0..31)
1 1 145 1 1 1 1 1 1 1 1 1 1 1 1 1 1 1 1 1 1 1 1 1 1 1 1 1 1 1 1 1 
##$CPDPRG= <waltz16>
##$CPDPRG1= <>
##$CPDPRG2= <waltz16>
##$CPDPRG3= <>
##$CPDPRG4= <mlev>
##$CPDPRG5= <mlev>
##$CPDPRG6= <mlev>
##$CPDPRG7= <mlev>
##$CPDPRG8= <mlev>
##$CPDPRGB= <>
##$CPDPRGT= <>
##$D= (0..31)
0 1 0 0 0 0 0 0 0 0.06 0 0.03 2e-05 3e-06 0 0 0.0002 0 0 0 0 0 0 0 0 0 
0 0 0 0 0 0 
##$DATE= 1769171008
##$DBL= (0..7)
120 120 120 11 120 120 24 19 
##$DBP= (0..7)
150 150 150 150 150 150 150 150 
##$DBP07= 0
##$DBPNAM0= <>
##$DBPNAM1= <>
##$DBPNAM2= <>
##$DBPNAM3= <>
##$DBPNAM4= <>
##$DBPNAM5= <>
##$DBPNAM6= <>
##$DBPNAM7= <>
##$DBPOAL= (0..7)
0.5 0.5 0.5 0.5 0.5 0.5 0.5 0.5 
##$DBPOFFS= (0..7)
$$ [...]
##$SUBNAM2= <"">
##$SUBNAM3= <"">
##$SUBNAM4= <"">
##$SUBNAM5= <"">
##$SUBNAM6= <"">
##$SUBNAM7= <"">
##$SUBNAM8= <"">
##$SUBNAM9= <"">
##$SW= 400.765351723535
##$SWIBOX= (0..15)
0 1 3 0 0 0 0 0 0 0 0 0 0 0 0 0 
##$SW_h= 32467.5324675325
##$TD= 32768
##$TD0= 1
##$TE= 0
##$TE2= 300
##$TE3= 300
##$TEG= 300
##$TL= (0..7)
0 120 53 12 22 120 120 120 
##$TP= (0..7)
150 150 150 150 150 150 150 150 
##$TP07= 0
##$TPNAME0= <>
##$TPNAME1= <>
##$TPNAME2= <>
##$TPNAME3= <>
##$TPNAME4= <>
##$TPNAME5= <>
##$TPNAME6= <>
##$TPNAME7= <>
##$TPOAL= (0..7)
0.5 0.5 0.5 0.5 0.5 0.5 0.5 0.5 
##$TPOFFS= (0..7)
0 0 0 0 0 0 0 0 
##$TUNHIN= 0
##$TUNHOUT= 0
##$TUNXOUT= 0
##$USERA1= <user>
##$USERA2= <user>
##$USERA3= <user>
##$USERA4= <user>
##$USERA5= <user>
##$V9= 5
##$VALIST= <valist>
##$VCLIST= <CCCCCCCCCCCCCCC>
##$VD= 0
##$VDLIST= <DDDDDDDDDDDDDDD>
##$VPLIST= <PPPPPPPPPPPPPPP>
##$VTLIST= <TTTTTTTTTTTTTTT>
##$WBST= 1024
##$WBSW= 4
##$XGAIN= (0..3)
0 0 0 0 
##$XL= 0
##$YL= 0
##$YMAX_a= 6356
##$YMIN_a= -6887
##$ZGOPTNS= <>
##$ZL1= 120
##$ZL2= 120
##$ZL3= 120
##$ZL4= 120
##$ABSF1= 0
##$ABSF2= 0
##$ABSG= 0
##$ABSL= 0
##$ALPHA= 0
##$AQORDER= 0
##$ASSFAC= 0
##$ASSFACI= 0
##$ASSFACX= 0
##$ASSWID= 0
##$AUNMP= <proc_1d>
##$AZFE= 0.1
##$AZFW= 0.5
##$BCFW= 0
##$BC_mod= 2
##$BYTORDP= 0
##$COROFFS= 0
##$CY= -3
##$DATMOD= 1
##$DC= 0
##$DFILT= <>
##$DTYPP= 0
##$F1P= 0
##$F2P= 0
##$FCOR= 1
##$FTSIZE= 65536
##$FT_mod= 6
##$GAMMA= 0
##$GB= 0
##$INTBC= 1
##$INTSCL= 9.790993e-09
##$ISEN= 30
##$LB= 1.5
##$LEV0= 0
##$LPBIN= 0
##$MAXI= 10000
##$MC2= 0
##$MEAN= 0
##$ME_mod= 0
##$MI= 50
##$NCOEF= 0
##$NC_proc= -7
##$NLEV= 6
##$NOISF1= 182.463
##$NOISF2= 159.3651
##$NSP= 0
##$NTH_PI= 0
##$NZP= 0
##$OFFSET= 198.0616
##$PC= 4
##$PHC0= 1511.122
##$PHC1= -249.0997
##$PH_mod= 1
##$PKNL= yes
##$PPARMOD= 0
##$PSCAL= 0
##$PSIGN= 0
##$REVERSE= no
##$SF= 81.0140089999434
##$SI= 65536
##$SIGF1= 159.3651
##$SIGF2= -187.1042
##$SINO= 113.3802
##$SIOLD= 16384
##$SREGLST= <1H.CDCl3>
##$SSB= 0
##$STSI= 65536
##$STSR= 0
##$SW_p= 32467.5324675325
##$SYMM= 0
##$S_DEV= 0
##$TDeff= 32768
##$TDoff= 0
##$TI= <>
##$TILT= no
##$TM1= 0
##$TM2= 0
##$TOPLEV= 0
##$USERP1= <user>
##$USERP2= <user>
##$USERP3= <user>
##$USERP4= <user>
##$USERP5= <user>
##$WDW= 1
##$XDIM= 65536
##$YMAX_p= 321017974
##$YMIN_p= -31288950
$$ End of Bruker specific parameters
$$ ---------------------------------
##NTUPLES= NMR SPECTRUM
##VAR_NAME=  FREQUENCY,     SPECTRUM/REAL,   SPECTRUM/IMAG
##SYMBOL=    X,             R,               I
##VAR_TYPE=  INDEPENDENT,   DEPENDENT,       DEPENDENT
##VAR_FORM=  AFFN,          ASDF,            ASDF
##VAR_DIM=   65536,         65536,           65536
##UNITS=     HZ,            ARBITRARY UNITS, ARBITRARY UNITS
##FACTOR=    0.49542278885378, 1,            1
##FIRST=     16045.7642231865, 0,            0
##LAST=      -16421.768244346, 0,            0
##MIN=       -16421.768244346, -31288950,    0
##MAX=       16045.7642231865, 321017974,    0
$$ Real data points
##PAGE= N=1
##DATA TABLE= (X++(R..R)), XYDATA
$$ [...]
41558a739723J22127m0594o08454j056611p48292L53380J375941J243654o8727
41549a167299j163160n85627J321157K531633J736177l674p86040m61250m23079
41540I98838j080863j198602r1372J161430J495461J385704J512675J258994l4928
41531E407337j391117j418767m90123l4106k09730l1834N29532M39889m10853
41522B390228q80138m78191j7196m2000j11316j1342k19126p18103p84215m16508
41512a287907m96586r93474o50223P43654J458244L86001j009932q08495M95190
41503b163528R11872l6069r36991p37903J50382Q80921J060425O40296r5480n07220
41493h33295l37310j83638m77600n31432L60876J413947J279903J91219k90568
$$ plain form
41558 -1739723 -1617596 -1658190 -2266644 -3323255 -4071547 -3718167 -2342226 -1098572 -1167299
41549 -1167299 -2330459 -2916086 -1594929 936704 2672881 2669207 1883167 1421917 998838
41540 998838 -82025 -1280627 -1371999 -210569 1284892 2670596 4183271 5442265 5407337
41531 5407337 4016220 2597453 2107330 2073224 1863494 1831660 2361192 2801081 2390228
41522 2390228 1510090 1031899 1014703 972703 861387 850045 630919 -87184 -871399 -1287907
41512 -1287907 -1784493 -2777967 -3428190 -2684536 -1226292 -840291 -1850223 -2658718 -2163528
41503 -2163528 -1251656 -1287725 -2224716 -2962619 -2812237 -1931316 -870891 -230595 -326075 -833295
41493 -833295 -1170605 -1354243 -1831843 -2363275 -2002399 -588452 691451 882670 592102
41484E92102L32112Q18928K16985p76914j054037o37991l12890m50962q09995
41475b082662r73746n88347L48465J181267J156382M95936K29496O97568J009398
41466A473757M16158n42456q62290m28533J07547L25059K55007j6489l37352l80082
41456A0326j08076l2805m25971o51518l5359Q81420Q88443j16613q47119l75096
41446h12368O78496J134259P24261o969o85176j235006j381038q64584r0345K05518
41436b332952O302K8889N39706R07023O57929K33143J53583J17807l17965p09582
41426g16117l33132M91267P40693K71701l6740J51011P1009o96923j294366q21012
41416b172609K88788R33860Q11025M33179J69798O8373K48297O67624P84120K24131
$$ plain form
41484 592102 924214 1743142 1960127 1183213 129176 -508815 -821705 -1272667 -2082662
41475 -2082662 -3056408 -3644755 -3296290 -2115023 -958641 -462705 -233209 464359 1473757
41466 1473757 1889915 1347459 485169 56636 164183 489242 744249 727760 390408 10326
41456 10326 -97750 -130555 -556526 -1208044 -1243403 -361983 526460 409847 -437272 -812368
41446 -812368 -133872 1000387 1724648 1717679 1032503 -202503 -1583541 -2448125 -2538470 -2332952
41436 -2332952 -2326650 -2297761 -1758055 -851032 -193103 40040 193623 311430 -6535 -716117
41426 -716117 -1049249 -557982 182711 454412 417672 568683 639692 -57231 -1351597 -2172609
41416 -2172609 -1883821 -949961 -138936 294243 464041 532414 780711 1448335 2232455 2456586
41406B456586m55010m44070R0642K63070k00571p07479p97500n84789k36227J70077
41396d45271K57417l24987j102805j154621m39426J12479M0232l3972M12021R12390
41386a766543Q62461M97645L80113M98444N20538M61534M65501L07810k70656
41377A956847j011008j432876j420112j089264m39090L78222Q18295N77875J82980
41368a478131L26469Q32479R13228L18491m07581p61521p53103n20627q0725L80883
41358a230138M65300M6954n06302p61217o20027k07810L52005Q90243J123241
41349d47751Q33346J13723o09058q47065m80305O0959K34461M2703l8507J47501
41339i89993J78646j62365l70385J4159N36645L90668l80957r28191p37585r7926
$$ plain form
41406 2456586 2001576 1557506 1648148 1911218 1710647 1003168 205668 -379121 -615348 -445271
41396 -445271 -187854 -512841 -1615646 -2770267 -3209693 -3097214 -3056982 -3090954 -2678933 -1766543
41386 -1766543 -904082 -406437 -26324 472120 992658 1454192 1919693 2227503 1956847
41377 1956847 945839 -487037 -1907149 -2996413 -3435503 -3057281 -2238986 -1661111 -1478131
41368 -1478131 -1151662 -319183 594045 912536 504955 -256566 -1009669 -1530296 -1611021 -1230138
41358 -1230138 -764838 -717884 -1224186 -1985403 -2605430 -2813240 -2461235 -1570992 -447751
41349 -447751 385595 499318 -109740 -956805 -1437110 -1376151 -1141690 -1098987 -1137494 -989993
41339 -989993 -811347 -973712 -1344097 -1329938 -793293 -402625 -783582 -1711773 -2449358 -2547284
41329b547284N08059Q19652O33394o5357p21672o40187P7500O67908Q40030R78393
41319E50436J081265N13756p15994j432458q27428K65261N46113P5056j21123
41310f5116J87140K41210k88125q35392r67773q69328o50798j38243M32909M71926
41300b481590Q5811J10294O88323Q59178J87411k57454M87480J548628J329534
41291B557615j44429j270246j062990j13904O19033Q14104M37880m67058j286910
41282H3095j131319j05076N74472K35064l16914j29903M51453N05857M9331j44599
41272G1461J29547L13909P0074l60226p00341q16445m43557M95826J330067J217654
41262A307969L79210q9759J43805J01039r20614k015444j763009k29094J039393
$$ plain form
41329 -2547284 -2039225 -1219573 -586179 -651536 -1373208 -2013395 -1935895 -1267987 -427957 550436
41319 550436 1631701 2145457 1429463 -2995 -830423 -565162 -19049 56007 -65116
41310 -65116 122024 363234 75109 -760283 -1728056 -2597384 -3248182 -3386425 -2953516 -2481590
41300 -2481590 -2395779 -2285485 -1597162 -737984 -550573 -808027 -320547 1228081 2557615
41291 2557615 2413186 1142940 79950 -33954 585079 1399183 1837063 1370005 83095
41282 83095 -1048224 -1153300 -578828 -343764 -660678 -790581 -339128 166729 216060 71461
41272 71461 201008 514917 584991 224765 -475576 -1292021 -1735578 -1239752 90315 1307969
41262 1307969 1687179 1597420 1741225 1842264 921650 -1093794 -2856803 -3085897 -2046504
41253b046504R81388J86428j45813K21541N35074K86199j39228j27987L10424
41244F1522O63367O19503K90489j16042m21472l45053K37010Q32954O96885j29890
41234B389273o89412l59019L01082M01291q9924n71725p40315o19806j12505O72700
41224E81640J013745M25816l60664l05481K74033J67958o46334q44010J8145O29218
41214I54066J1177r04319q59667k82176l64483r59106r11172p9800M70259K28906
41204b696315j47747j12192Q7771K45139O05507J057403R20862P5093n60434k91815
41194h16728L08766K99175k78878o81253o59931n70209n08439j67718M17317O95232
41184a962666L93050l2964m7356K23006K56384m6614j97298K02949Q95344J239779
$$ plain form
41253 -2046504 -1065116 -878688 -1024501 -802960 -267886 18313 -120915 -248902 61522
41244 61522 724889 1344392 1634881 1518839 1097367 752314 989324 1822278 2519163 2389273
41234 2389273 1699861 1340842 1641924 2043215 1953291 1381566 641251 21445 -91060 581640
41224 581640 1595385 2021201 1660537 1355056 1629089 1797047 1150713 306703 324848 954066
41214 954066 965243 60924 -798743 -1080919 -1445402 -2404508 -3315680 -3395480 -2925221 -2696315
41204 -2696315 -2844062 -2956254 -2868483 -2623344 -2017837 -960434 -39572 35521 -524913 -816728
41194 -816728 -507962 -208787 -487665 -1168918 -1828849 -2399058 -2907497 -3075215 -2657898 -1962666
41184 -1962666 -1569616 -1602580 -1649936 -1426930 -1170546 -1217160 -1414458 -1211509 -316165 923614
41174I23614R52832L85883L1807r5351m09949j076887j588548j247215o7470J053667
41164a137617J250152O09222q5227l90854n17963n73113j73638P23349J191415
41155H95726L78133j046659j439630k93890J092319J374190P42926K27918J79037
41146B110070K05710J17067R2063J61290K11331L05596M06346P1565q78791j678259
41136A123988j414648l48803M10870M29454K12632J9188m71689j104772j029809
41127b173589p4429O65585L33878l94224l41875M88781J139175J107913O41447
41118A392662k0590p42574j050492n58276K08572L27803j45311k51733K78995
41109e60944N34456o2941p24495n16165J58923K61503j82641j92503M80549R09459
$$ plain form
41174 923614 1876446 2262329 2294136 2198785 1788836 711949 -876599 -2123814 -2191284 -1137617
41164 -1137617 112535 721757 636530 245676 -272287 -845400 -1019038 -295689 895726
41155 895726 1273859 227200 -1212430 -1506320 -414001 960189 1703115 1931033 2110070
41146 2110070 2315780 2432847 2524910 2686200 2897531 3203127 3609473 3681038 2802247 1123988
41136 1123988 -290660 -639463 -228593 200861 413493 432681 -39008 -1143780 -2173589
41127 -2173589 -2248018 -1582433 -1248555 -1642779 -1984654 -1495873 -356698 751215 1392662
41118 1392662 1372072 629498 -420994 -979270 -770698 -442895 -588206 -839939 -560944
41109 -560944 -26488 -89429 -813924 -1330089 -1171166 -909663 -1092304 -1284807 -804258 105201
41099A05201N00264n5578P5352N30831L79343l48087o77246j76667M29535L62332
41089A125280j68382m19975j67597J61895J76028p1001k80637k49631k4234J54668
41079B36414J13705l7961j27815k85028o92177r65929m12646Q02492J396558M86514
41069E14127j094703j730280r87412J07117N84226M87884L04942K69618M39804
41060a104677P81266R34282M84762l32227p90817o97915n66029n51406p7806J005722
41050i14845J733482J249135J04278n20149m40510m02232o82458p76295m62781
41041a112375k28584l92561n63165l02437K33495O40746Q05388Q03186O42697
41032E26390L71917J19790j47318n36845p62709l16642N86447Q58441p2299j223026
$$ plain form
41099 105201 605465 549887 625239 1156070 1535413 1187326 510080 333413 762948 1125280
41089 1125280 956898 536923 369326 531221 707249 636248 355611 105980 81746 236414
41079 236414 350119 312158 184343 -100685 -792862 -1758791 -2171437 -1368945 27613 514127
41069 514127 -580576 -2310856 -3298268 -3191151 -2606925 -2119041 -1814099 -1544481 -1104677
41060 -1104677 -323411 610871 1095633 763406 -27411 -725326 -1291355 -1842761 -1920567 -914845
41050 -914845 818637 2067772 2172050 1651901 1211391 809159 126701 -649594 -1112375
41041 -1112375 -1340959 -1733520 -2296685 -2599122 -2365627 -1724881 -919493 -116307 526390
41032 526390 898307 1018097 870779 333934 -428775 -745417 -158970 699471 627172 -595854
41022e95854j231105k79177J55187n08078j124056o36709L12507M75736m4988
41013c476537j35864L70842M62249j73529m15695M57980J358789R03142l98995
41004a047618p82258K19095J167269Q24756k81026q59412n60850o2723J5508k92726
40994a659985n16119j92204O60101J328282J045387M1396n18696L8588R88143
40985A214893J130579K43417q28347j227336p93347L6005N99826M45702k50873
40976E70519q03984p75373m17709j85617j37219r7860q0556j87817l41040l98414
40966b855070l10829L300N70334J023862R20383N86858Q78832J707167J756561
40957D281398M04802j035550j097097l70327m87435j405368j448455p9739J120659
$$ plain form
41022 -595854 -1826959 -2106136 -1950949 -2459027 -3583083 -4219792 -3907285 -3431549 -3476537
41013 -3476537 -3612401 -3241559 -2779310 -2952839 -3368534 -2910554 -1551765 -648623 -1047618
41004 -1047618 -1829876 -1610781 -443512 381244 100218 -759194 -1320044 -1382767 -1367259 -1659985
40994 -1659985 -2176104 -2368308 -1708207 -379925 665462 706858 188162 226750 1214893
40985 1214893 2345472 2588889 1760542 533206 -260141 -224136 375690 821392 570519
40976 570519 -233465 -1008838 -1426547 -1612164 -1749383 -1847243 -1927799 -2115616 -2456656 -2855070
40966 -2855070 -3165899 -3162599 -2592265 -1568403 -648020 -61162 817670 2524837 4281398
40957 4281398 4686200 3650650 2553553 2183226 1695791 290423 -1158032 -1237771 -117112
40948a17112P86330l93415r94441q62670p71234q70341o05379J34602P13447O08759
40938b371454M1374l08119P348P24949J050104N16677m14566r74120j094701j187093
40928d009601j117541l54348Q44216J473627J270116J049286J173514R04825o3312
40919A170782o78658j07897Q45592J030572O55693M15984j07249j512100k747732
40910a035013k171185k05497J005247P12000L99048J050658J499584M92540j137559
40901F09823j648451p26246N43027J296540J405840R59184K62016o7000J46611
40892B781344K22756k68029o03734n7298O79308M29132n32470q59294l16439j04797
40882A370479p82020j308743q07081m9224k19312j017933j126269j89118P24751
$$ plain form
40948 -117112 669218 275803 -718638 -1581308 -2352542 -3222883 -3828262 -3693660 -2980213 -2371454
40938 -2371454 -2330080 -2638199 -2630851 -1905902 -855798 -339121 -753687 -1727807 -2822508 -4009601
40928 -4009601 -5127142 -5481490 -4637274 -3163647 -1893531 -844245 329269 1234094 1170782
40919 1170782 492124 384227 1229819 2260391 2916084 3332068 3224819 1712719 -1035013
40910 -1035013 -3206198 -3411695 -2406448 -1694448 -1295400 -244742 1254842 1747382 609823
40901 609823 -1038628 -1764874 -1221847 74693 1480533 2439717 2701733 2634733 2781344
40892 2781344 3004100 2736071 2132337 2075039 2754347 3183479 2651009 1791715 1475276 1370479
40882 1370479 588459 -720284 -1527365 -1576589 -1795901 -2813834 -3940103 -4129221 -3404470
40873c404470O61303m3264l78256P7359Q36928J195984R42155M19311P9520O9855
40863D56425K08651K20217n9737n38443p98460m02286M83314J006993N83999k47471
40853I13202m44093J57317O94322N38734j1198m75451q63681j218150j195382
40844a904380o46462k8198L19605O92871J174632R84712l46464j714201j587124
40835c055009j73057Q51922P40079M09552N59424N41910j90868q29733m57367
40826a603147L90292N72143Q7250k05519j30585k20515m66615l14914J18210O2756
40816a710644m95267o06990O0082N70349K70082k9437O64274J788734J889195
40807B400378P05215m99717p48310n32911q21611j587330j938407j412360n25469
$$ plain form
40873 -3404470 -2743167 -2786431 -3164687 -3087328 -2250400 -1054416 -112261 307050 386570 456425
40863 456425 665076 885293 825556 287113 -511347 -913633 -430319 576674 1160673 913202
40853 913202 469109 626426 1320748 1859482 1848284 1372833 509152 -708998 -1904380
40844 -1904380 -2550842 -2579040 -2259435 -1566564 -391932 592780 246316 -1467885 -3055009
40835 -3055009 -3228066 -2376144 -1636065 -1226513 -667089 -125179 -316047 -1145780 -1603147
40826 -1603147 -1212855 -640712 -553462 -758981 -889566 -1110081 -1576696 -1891610 -1773400 -1710644
40816 -1710644 -2205911 -2812901 -2752819 -2182470 -1912388 -1941825 -1277551 511183 2400378
40807 2400378 3105593 2605876 1857566 1324655 503044 -1084286 -3022693 -4435053 -4960522
40798d960522J3208J70316L89588P81991R54757O84824L35237L26739N09070M65318
40788c29474K30395J84294L14148K03304j52100j88610K46615M03723l09140j225734
40778f22579j127924J02825J262130J322047N33505j84051m20784m48206n34452
40769a17489n76062m12160j74688j52404l81659n07633j43692O27214J214550
40760f24023J076768K70595o21578j032987q03762j79281L87583N18952K31042
40751g76691m0513P4799M10280M94054J94402j79906m19644o47659q77543p79233
40741b547654k13703L37682L28498o6216k12177L2648J96077Q5248J83596Q21718
40731a054283J441911J230756K60959n57080o54625m38357n79320j038227j107526
$$ plain form
40798 -4960522 -4947314 -4776998 -4387410 -3605419 -2650662 -1965838 -1630601 -1303862 -794792 -329474
40788 -329474 -99079 85215 399363 602667 450567 261957 508572 912295 603155 -622579
40778 -622579 -1750503 -1647678 -385548 936499 1470004 1285953 865169 416963 -117489
40769 -117489 -693551 -1105711 -1280399 -1432803 -1814462 -2322095 -2465787 -1838573 -624023
40760 -624023 452745 723340 101762 -931225 -1734987 -1914268 -1526685 -1007733 -776691
40751 -776691 -817204 -742405 -332125 161929 356331 176425 -243219 -890878 -1768421 -2547654
40741 -2547654 -2761357 -2423675 -2095177 -2161393 -2373570 -2340922 -2144845 -2059597 -1876001 -1054283
40731 -1054283 387628 1618384 1879343 1322263 667638 229281 -350039 -1388266 -2495792
40722b495792l15319R42592J727578J477581N70867q6808k5885L95210N88437
40713B778461M11657L5094m99467j127035j422441j027081l13389M3220J26856
40704i94125N99628J326098J183705k22190j572999j426628j31367Q28658Q97682
40695D88462P17596O23067J84501o27006j046460p12585k62592k16062j51067
40686a002146L82471R14184P87634K48958j2017K8134r0578l21915j80870L06206
40676A060061N41440K95849j2848j12811k70802o41434q23371m62617J20903L53629
40666D7999K05028J29558L26435M87132L38164P1783J2013P6380q2737m28685
40656A183070m37336J26883O48451L26208o74173j221299n27254Q91770J765797
$$ plain form
40722 -2495792 -2811111 -1868519 -140941 1336640 1907507 1820699 1794814 2190024 2778461
40713 2778461 3190118 3225212 2725745 1598710 176269 -850812 -1164201 -1120981 -994125
40704 -994125 -394497 931601 2115306 1893116 320117 -1106511 -1237878 -409220 488462
40695 488462 1206058 1829125 2013626 1386620 340160 -372425 -635017 -851079 -1002146
40686 -1002146 -619675 294509 1082143 1331101 1319084 1347218 1256640 934725 753855 1060061
40676 1060061 1601501 1897350 1884502 1771691 1500889 859455 36084 -426533 -305630 47999
40666 47999 253027 382585 709020 1196152 1534316 1606099 1618112 1694492 1611755 1183070
40656 1183070 745734 872617 1521068 1847276 1173103 -48196 -575450 316320 2082117
40647B082117J335467q0661j487858j958222j230989J08069J101558J224037O70050
40638A763568p7896o39970o91647n1232R01382J325548Q30519l2047n43274p13728
40628B071223r43060j156438r36656l34193J46731L50479N94788R02597P74347
40619A469818J2428p61299q19462k28216L48934N08524L77855J72491q0705l27355
40609F73013l54465q9212J71645R7594j85568k34086O7496L47732L84504M89793
40599A368446Q88746J081273M34466p50936j458713j256056o90098l02554j2909
40590f98335K85694L26578R0883Q3709M55982N48839o0052p24980o82601k19290
40580e93573o0649j67714r3742m0853m58578r28906o35135K15997O28476M38619
$$ plain form
40647 2082117 3417584 3336923 1849065 -109157 -1340146 -1232077 -130519 1093518 1763568
40638 1763568 1685672 1045702 354055 302823 1204205 2529753 3360272 3328225 2784951 2071223
40628 2071223 1128163 -28275 -964931 -1299124 -1152393 -801914 -207126 695471 1469818
40619 1469818 1482246 720947 -98515 -326731 22203 530727 908582 1081073 1000368 673013
40609 673013 318548 229336 400981 498575 313007 78921 146417 494149 878653 1368446
40599 1368446 2257192 3338465 3772931 3021995 1563282 307226 -382872 -685426 -698335
40590 -698335 -412641 -86063 4820 88529 544511 1093350 1033298 308318 -374283 -593573
40580 -593573 -654222 -821936 -915678 -956531 -1415109 -2344015 -2979150 -2763153 -2134677 -1696058
40570a696058M81377J000321J121637L03609p46603j109862p64233k02520K90311
40561a322021N34456L34067r9647j95362J84914N82264P43476Q45478P59019L1196
40551B397840j073224j521731r99598m56778n66750o56936J3397Q52071Q35669
40542a176040J02619m13431m09167k41850J7605M95658P81157L44036m20947n18852
40532a439212K59377J041042R87013J02503r91318j549786j135614j06289N44007
40523b288277L41362k7349J88139N93898M03656q3570J03235R34828J337653Q62947
40513B366522K38797L5826j15834n69138q95542o50155j55182P7236J35518L38151
40503H06199N00812J74659n68644j057062p35230K23419J023385R87825K68565
$$ plain form
40570 -1696058 -1214681 -214360 907277 1210886 464283 -645579 -1409812 -1612332 -1322021
40561 -1322021 -787565 -453498 -553145 -748507 -563593 18671 762147 1607625 2366644 2397840
40551 2397840 1324616 -197115 -1196713 -1653491 -2220241 -2877177 -2863780 -2011709 -1176040
40542 -1176040 -1073421 -1486852 -1896019 -2137869 -2120264 -1624606 -843449 -499413 -920360 -1439212
40532 -1439212 -1179835 -138793 848220 950723 -40595 -1590381 -2725995 -2832284 -2288277
40523 -2288277 -1946915 -1974264 -1786125 -1192227 -788571 -872141 -768906 165922 1503575 2366522
40513 2366522 2605319 2641145 2525311 1956173 1060631 410476 255294 332530 468048 806199
40503 806199 1307011 1481670 913026 -144036 -879266 -655847 367538 1355363 1623928
40494A623928l37167m02709l50456o15584q43033n45819j12902k57357p03601
40485b544700m62945N86616J431510J391987Q67754L68409j79980p43501p77257
40476f2107j28400M43378K90463k16987l86631j79226R0962L97876O96636N57991
40466A503955j75600q42440p59759j49729L55200O26507P51592L91970o32459
40457A069237j508435j228638p8384O57708M29099r6819l03582l50360m06895
40448a817069j76003L45730M80062j18994o98461l74201N51504R73128M67336
40439c66968k94203n62960l15631N0404K82804L30554K51220K96324P26509J272891
40429A670944J167725J41022r28310r66220j66195K38984k55540p32267l28271
$$ plain form
40494 1623928 1286761 884052 533596 -81988 -925021 -1470840 -1583742 -1841099 -2544700
40485 -2544700 -3007645 -2421029 -989519 402468 1270222 1638631 1458651 715150 -62107
40476 -62107 -190507 252871 543334 326347 -60284 -239510 -148548 249328 945964 1503955
40466 1503955 1328355 485915 -273844 -423573 -68373 558134 1309726 1701696 1069237
40457 1069237 -439198 -1667836 -1746220 -1088512 -659413 -756232 -1059814 -1410174 -1817069
40448 -1817069 -1993072 -1647342 -1167280 -1286274 -1984735 -2358936 -1807432 -834304 -366968
40439 -366968 -661171 -1224131 -1539762 -1489358 -1206554 -876000 -624780 -328456 398053 1670944
40429 1670944 2838669 2979691 2051381 1085161 918966 1157950 902410 170143 -158128
40420a58128M19589M96898Q2113K10331R73782J240595M00476o56534q51701m03711
40410A753710k66847n97076o13198J44209J113840J420152Q80514J04405k69149
40401C670560k69563m40385j001626j431846j152237l93974Q7527N5027k2074
40392h98591J64764L25052J60559j61257l48941l48151k06866j2566J3530j12758
40382a425225J97112J247994J989347J029465j069877j961563o40450J019878
40374C86681R08068m49487j074419n42097n7399j54629j77929J08170J08918k72924
40364a217047l91483j58580k32296o49631n82010K07913R06552J013629R47330
40355a55623Q96771L68882n57490q15699K7742Q65614O40216j46373m28213j75737
$$ plain form
40420 -158128 261461 758359 840472 1050803 2024585 3265180 3665656 3009122 2157421 1753710
40410 1753710 1486863 889787 276589 420798 1534638 2954790 3835304 3939709 3670560
40401 3670560 3400997 2960612 1958986 527140 -625097 -1019071 -931544 -876517 -898591
40392 -898591 -733827 -408775 -248216 -409473 -758414 -1106565 -1313431 -1325997 -1312467 -1425225
40382 -1425225 -1228113 19881 2009228 3038693 1968816 7253 -633197 386681
40374 386681 1294749 845262 -229157 -771254 -828653 -983282 -1161211 -1053041 -944123 -1217047
40364 -1217047 -1608530 -1767110 -1999406 -2649037 -3231047 -3023134 -2116582 -1102953 -155623
40355 -155623 741148 1110030 552540 -263159 -235417 630197 1270413 1124040 695827 520090
40345E20090J113O9647L21028M97910K25692j39917o6118J70269p307l72203k86623
40334I33581J10208J04466l94160q01078q59551p81407n13556J76999R11367R50674
40324a62457L41225o8153J01346L13343J46128p2761J856J14091l3606j91135
40314D89877j6552K91202K65389j67127o11396o15342n880R34497J512036J152804
40304C229508O2578q77754r95103m08605K68093N18316K09738l68714o98436n49727
40294C89894l08766m77182r24497j078411q18248o28223p71527q71590n34163
40285f022713R0681O29393R69058J162190J192294J082288R57712Q25295N63948
40276A450146K33491M6996m3087l08900o92438p64695l91600N8993L42130O03335
$$ plain form
40345 520090 521203 590850 911878 1409788 1635480 1495563 1429445 1599714 1592407 1220204 933581
40334 933581 1043789 1148255 754095 -46983 -906534 -1687941 -2201497 -2024498 -1113131 -162457
40324 -162457 178768 110615 211961 525304 671432 598671 600527 714618 681012 489877
40314 489877 473325 764527 1029916 862789 251393 -363949 -369829 564668 2076704 3229508
40304 3229508 3292086 2414332 1419229 1010624 1278717 1797033 2006771 1638057 939621 389894
40294 389894 81128 -396054 -1320551 -2398962 -3217210 -3845433 -4616960 -5488550 -6022713
40285 -6022713 -5932032 -5302639 -4333581 -3171391 -1979097 -896809 60903 886198 1450146
40276 1450146 1683637 1730633 1687546 1378646 686208 -78487 -470087 -411094 -68964 534371
40266E34371Q10171N72596j16605o09769n21497k95343l64341m34886k37009k42099
40256i04411p42242q86217J77194J600651J652850J98154r96067p18109J83155
40247d35042L22147k93215p00951n63595l24735k15249m4053J51134M2417l32049
40237b393191m63540j03000L29664K91991j73059n00351k94282K19359M98744
40228b587665L38736K670l12755p48054j219543j033928K47522J766570K082805
40219a463642J033881k9647j67383j6535m33903r56415o44865K23241N55621K10121
40209a689526O6932L94024M58780Q075j58163L39845N60891l17923j521693j661644
40199c520402o49967M00089Q36912R52946R28880M36467m47522q90598l93866
$$ plain form
40266 534371 1344542 1917138 1800533 1190764 669267 373924 9583 -425303 -662312 -904411
40256 -904411 -1646653 -2532870 -2355676 -755025 897825 1095979 99912 -618197 -435042
40247 -435042 -112895 -406110 -1107061 -1670656 -1995391 -2210640 -2254693 -2103559 -2061142 -2393191
40237 -2393191 -2856731 -2959731 -2630067 -2338076 -2511135 -3011486 -3305768 -3086409 -2587665
40228 -2587665 -2248929 -2246259 -2559014 -3307068 -4526611 -5560539 -5313017 -3546447 -1463642
40219 -1463642 -429761 -459408 -626791 -643326 -1077229 -2033644 -2678509 -2455268 -1899647 -1689526
40209 -1689526 -1622594 -1228570 -769790 -761715 -919878 -580033 -19142 -337065 -1858758 -3520402
40199 -3520402 -4170369 -3770280 -2933368 -1980422 -1051542 -615075 -1062597 -1953195 -2347061
40190b347061M05899N80287J28689j84973P2421O09964R78244J023848P66720
40181B034038K35982m46285j060735j459823j582446j313800n82304L44981R20746
40172b909646Q28632K89032k46709n26300m95396j07065N78622J214383J408297
40163C3850J169958Q62106O70289L83792j94186q57803j182300r36900j98888
40154b50082P41677J429453J423165P11725j45706n36670l87939o2734J71612
40145C094501K81512K20017k8959j67879J70341P27254O30380n11443j810059
40136B605665j920438o62836O57817P96228O9699j70909N28583J017926J70458
40127C092193j341897j770492o65917N12301N09881l7040J38717Q18775P04870
$$ plain form
40190 -2347061 -1941162 -1360875 -1232186 -1417159 -1344738 -734774 243470 1267318 2034038
40181 2034038 2270020 1823735 763000 -696823 -2279269 -3593069 -4175373 -3830392 -2909646
40172 -2909646 -2081014 -1791982 -2038691 -2564991 -3060387 -3167452 -2588830 -1374447 33850
40163 33850 1203808 2065914 2736203 3119995 2925809 2068006 885706 -51194 -250082
40154 -250082 491595 1921048 3344213 4055938 3910232 3373562 2985623 2922889 3094501
40145 3094501 3376013 3596030 3567071 3399192 3569533 4296787 4927167 4415724 2605665
40136 2605665 685227 22391 680208 1476436 1546135 1375226 1903809 2921735 3092193
40127 3092193 1750296 -20196 -686113 -173812 336069 299029 437746 1256521 1961391
40118A961391m06162j239094r63539k55791k5909j52414p2155K43642N42188P86426
40108D18583Q11556K39844o32323p00673L69209J235815N93828q67936j401713
40099F6190o01340L93555P34817N45436l6126j008520j652973j036058L22407
40090b272612P36341j86167p92529J48532J558142J664604M38901p69494j217670
40081f91952j142928p31253r036N03821K13824n13244o81486m107Q75877J387713
40071g92771J440037R59188n4374r86294j021548k52916L89751M42724L53279
40062D77076M57094L76722j72516p08355o19141M2066Q24553J444817J651588
40053C773904J047518l33126j578873j695498p95666K2602L2673l27557k02351
$$ plain form
40118 1961391 1555229 316135 -647404 -903195 -929104 -1081518 -1153673 -910031 -367843 418583
40108 418583 1230139 1469983 837660 136987 506196 1742011 2335839 1467903 66190
40099 66190 -535150 -141595 593222 1138658 1102532 94012 -1558961 -2595019 -2272612
40090 -2272612 -1536271 -1722438 -2514967 -2366435 -808293 856311 1295212 525718 -691952
40081 -691952 -1834880 -2566133 -2575169 -2071348 -1857524 -2370768 -3052254 -3056361 -2180484 -792771
40071 -792771 647266 1606454 1552080 565786 -455762 -708678 -318927 123797 477076
40062 477076 934170 1310892 1138376 430021 -189120 -147054 677499 2122316 3773904
40053 3773904 4821422 4488296 2909423 1213925 418259 440861 473534 145977 -56374
40044e6374M65927Q43071L34929n31599p02937K0047O95795N39727j3541n6404
40034A538641L83091M59973p1648m42783r3787M69434N03530J08974j07930m3079
40024B704416r0361l07017k65198J55641L57632k61225j400418k020425j490248
40015b617203l53673L04233J88186O9252N47343J056703O99908k40528m91196
40006h36975M35118J487514J455942M16119o75505j231327j267630q63587j41374
39997a221705M17781L43383j49946l98747j91623O7869J00276J07197K49094K54360
39987d22061j51606p13351q55124l42481M51114R20379P75040K11493l82004p73246
39977a281847q82833o18476q171N48677N62582J10517j58133J26212N42858M83041
$$ plain form
40044 -56374 409553 1252624 1587553 1055954 353017 373064 1068859 1608586 1595045 1538641
40034 1538641 1921732 2381705 2310057 1867274 1773487 2242921 2746451 2855425 2747495 2704416
40024 2704416 2614055 2307038 2041840 2197481 2555113 2293888 893470 -1126955 -2617203
40015 -2617203 -2970876 -2666643 -2478457 -2409205 -1861862 -805159 -105251 -345779 -836975
40006 -836975 -401857 1085657 2541599 2957718 2282213 1050886 -216744 -1080331 -1221705
39997 -1221705 -803924 -460541 -610487 -1009234 -1200857 -1132988 -1032712 -925515 -676421 -422061
39987 -422061 -573667 -1287018 -2142142 -2484623 -2033509 -1113130 -338090 -126597 -508601 -1281847
39977 -1281847 -2164680 -2783156 -2791327 -2242650 -1680068 -1569551 -1727684 -1601472 -1058614 -575573
39967e75573n0704n38485n67384j05425N52154Q76059N13704j51506l38526m6556
39957d32242j89435j037830j396777l12932J129529J103842k27711q69641M0745
39948b192452J065399Q13483m7938j23762N12293O97468R0464n17802n22878j26411
39938c52136K66117M75151M18631J67453M9437K02829K16886k68986q49678q23202
39928d97498j87948M02300N21857K82508m6639k03956L5515M48607L05747o32808
39918D27685j440011j140491j39728M25377M16096N51446P39985R1524j166510
39909a234627j392045J00652J718817J671979L40896n64932m01467R1829K97374
39900F28476K53098l7585o11049r23028l16314Q14977J280199O47246k92996p37156
$$ plain form
39967 -575573 -626277 -1164762 -1732146 -1837571 -1285417 -409358 104346 -47160 -385686 -432242
39957 -432242 -621677 -1659507 -3056284 -3369216 -2239687 -1135845 -1363556 -2233197 -2192452
39948 -2192452 -1127053 -313570 -361508 -485270 27023 724491 814955 297153 -225725 -352136
39938 -352136 -86019 389132 807763 975216 1024653 1227482 1444368 1175382 325704 -497498
39928 -497498 -685446 -283146 238711 521219 474580 270624 306139 754746 1060493 427685
39918 427685 -1012326 -2152817 -2292545 -1867168 -1451072 -899626 -159641 -68117 -1234627
39909 -1234627 -2626672 -2526020 -807203 864776 1205672 640740 239273 331102 628476
39900 628476 881574 843989 232940 -690088 -1006402 -191425 1088774 1736020 1443024 705868
39890G05868p04708m80513q1974L51769L54962k15561q16300q76636m30059J63973
39880b029179O88486J005024R66553O79050M64883L43545k1852o42344r73459
39871D80707o85357j80646L7674O6026K28172M05025K49090k03018n98060p29136
39861i29523n41656M3260Q58223J295524R00119K0270n75147n88688l00296N129
39851A87215K14677J58823k24734n52589l55871K25915O02912N68112M51742M40335
39841A716537L20396N594k39319k80375l19338m35015m25687l10965m29004p28344
39831a125520n52968L76477J262939J157902K80162k86615r5513J73670j73210
39822A017324q75640j183150q66014l41803K2203L15687P36581J116508J020049
$$ plain form
39890 705868 1160 -479353 -561327 -209558 145404 -70157 -886457 -1763093 -2193152 -2029179
39880 -2029179 -1340693 -335669 630884 1309934 1774817 2118362 2096510 1454166 480707
39871 480707 -204650 -385296 -347622 -281596 -53424 351601 600691 397673 -200387 -929523
39861 -929523 -1471179 -1427919 -569696 725828 1625947 1646217 1071070 482382 182086 187215
39851 187215 401892 560715 335981 -216608 -572479 -346564 256348 824460 1276202 1716537
39841 1716537 2036933 2042527 1803208 1522833 1203495 768480 342793 31828 -397176 -1125520
39831 -1125520 -1678488 -1302011 -39072 1118830 1398992 1112377 1016864 1190534 1017324
39822 1017324 141684 -1041466 -1907480 -2249283 -2227080 -1911393 -1174812 -58304 961745
39813I61745K98042o16343j066653p88421r8406M66752N92416L40818N0211O3455
39803B03616L68882N32018K15494k70494k93151J78957M37834M4429n07391n59071
39793C51123l00010l78567p44181o67891L2584N74880L47564j84260k29517J32406
39783a065869J54984l85875q62289o83606J7470P26005J141020J217401R39214
39774A198455L32817m21955j042352j226179p40682K70497J063223Q42972k38492
39765C8304j070019q92755j85634K15485L84440Q98811J470128J074406l59487
39756A573679j420364r64502L30208Q80580J90956q05768j079431m35665O70662
39747a059645J478822J164595m19830k095622k213545n25604J352040J731200
$$ plain form
39813 961745 1259787 643444 -423209 -1211630 -1310036 -843284 -250868 89950 140161 203616
39803 203616 572498 1104516 1320010 1049516 756365 935322 1373156 1417585 910194 351123
39793 351123 51113 -327454 -1071635 -1739526 -1706942 -1132062 -784498 -968758 -1198275 -1065869
39783 -1065869 -910885 -1296760 -2159049 -2842655 -2825185 -2099180 -958160 259241 1198455
39774 1198455 1531272 1109317 66965 -1159214 -1899896 -1629399 -566176 276796 38304
39765 38304 -1031715 -1924470 -2110104 -1894619 -1510179 -611368 858760 1933166 1573679
39756 1573679 153315 -811187 -480979 399601 590557 -215211 -1294642 -1730307 -1059645
39747 -1059645 419177 1583772 1163942 -931680 -3145225 -3670829 -2318789 -587589
39739e87589O58058m70077o66634j72901K57024K37562j80392q04575j310187
39730c039711j191430j60377J302340K134905J737499O57974j18112l98235p38348
39721A86505j212234j084550r1391Q09615P28782K07225L01587Q18075O87150
39712A350764j53371o44205m35948l83606q44763r50970k85690J02884n73991
39703b818896j290858p12331O34782J189945P72449N68561R70755J068524M09761
39694G92692k47340l41883l41446n87256m85156L61996J152070R49213J26772
39685A379662j95071K09466M97170J21606m25107m06344J66788O47377O14260
39676B609807L02953J29118P255n21777j431884j927712j399290l18191L74471
$$ plain form
39739 -587589 70469 -399608 -1066242 -1239143 -982119 -744557 -924949 -1729524 -3039711
39730 -3039711 -4231141 -4391518 -3089178 -954273 783226 1441200 1323088 924853 186505
39721 186505 -1025729 -2110279 -2201670 -1392055 -663273 -456048 -154461 663614 1350764
39712 1350764 1197393 553188 117240 -266366 -1111129 -2062099 -2347789 -2244905 -2818896
39703 -2818896 -4109754 -4822085 -4187303 -2997358 -2224909 -1656348 -685593 382931 792692
39694 792692 545352 203469 -137977 -725233 -1210389 -848393 303677 1252890 1379662
39685 1379662 1184591 1394057 1891227 2012833 1587726 1181382 1348170 1995547 2609807
39676 2609807 2912760 3041878 3049133 2527356 1095472 -832240 -2231530 -2549721 -2175250
39667b175250N29797P39390J157351J251288Q43183M87740M56687J94990o57020
39658B828156j434489j353682o85316k39308j03377K29809P17586P01055M6371
39649G06805m83743k88375K61990M50860K09587M0525J69601K28866j62829p86310
39639C46977j002842n23799J82108L93484l1250n24005n02401J3066N02417M59202
39629f87043k10954j054640j326932p00860K50678O60366M77989M43339Q23047
39620a325010R00496J80942n81458l45455O45689J159240O85909o0231m08074
39611H52048n49692p48268n92685K53544J087841Q20105n03089j577676j433081
39602b390953n60507p9689k13012j90685M48863J150587J177680O09196M8298
$$ plain form
39667 -2175250 -1645453 -906063 251288 1502576 2345759 2833499 3290186 3485176 2828156
39658 2828156 1393667 39985 -645331 -884639 -988016 -758207 -40621 660434 706805
39649 706805 223062 -65313 196677 647537 857124 897649 1067250 1296116 1133287 346977
39639 346977 -655865 -1179664 -997556 -604072 -635322 -1159327 -1661728 -1648662 -1146245 -687043
39629 -687043 -897997 -1952637 -3279569 -3980429 -3729751 -3069385 -2591396 -2148057 -1325010
39620 -1325010 -424514 -243572 -825030 -1170485 -524796 634444 1320353 1260122 852048
39611 852048 302356 -445912 -1038597 -785053 302788 1122893 619804 -957872 -2390953
39602 -2390953 -2951460 -3031149 -3244161 -3434846 -2985983 -1835396 -657716 -48520 -222
39593b22k74687n10566n55735j61209L40236K13726n47410r98056n21915L12970
39583b702868O55060N27699M81594N86259M87796J59837r7532j98469j93370R9079
39573a94915P03736R78184L01136q28638j216808n28121L72314O94472N05036
39564G86396R4221n06345j007347p61647K11556Q18151K42008p99920r30457Q2319
39554a771065J158084J370433Q32614J48885k84684k76561K08261P54354O41409
39545B781730k75798j147588j075681k95590J51829r0241k23030L82471J057946
39536A266048P46381l52738r84337o29940r0921n6759j60325j2401j11773p78835
39526a165600j080280j12176J221517J209078j04660r13190l23312N26095M66807
$$ plain form
39593 -222 -274909 -785475 -1341210 -1502419 -1162183 -948457 -1495867 -2493923 -3015838 -2702868
39583 -2702868 -2047808 -1520109 -1038515 -452256 35540 195377 97845 -100624 -293994 -194915
39573 -194915 508821 1487005 1788141 959503 -257305 -785426 -413112 281360 786396
39564 786396 880617 374272 -633075 -1394722 -1183166 -365015 -123007 -922927 -1853384 -1771065
39554 -1771065 -612981 757452 1590066 1738951 1454267 1177706 1385967 2140321 2781730
39545 2781730 2505932 1358344 282663 -12927 138902 48661 -174369 208102 1266048
39536 1266048 2012429 1659691 675354 45414 -45507 -102266 -262591 -274992 -386765 -1165600
39526 -1165600 -2245880 -2358056 -1136539 72539 -32121 -945311 -1268623 -742528 -275721
39517b75721o1857j54625O0917P3673J23139N68839Q87347M35177l38107n32286
39507G86496k23728j77678m64929m65641q8226P4986j90159m22301l11494m6702
39497a529376J91431L90693M14972K38656L11541R00870J295203O66667m20808
39488B459849n88289J97368M13564o40030j626816j175079N3861M48673j77446
39479f34345n86369j38808M33508L44899j50956l02435J27096O89844P45224j783
39469E25875j133933j669380r77269L64747J040718N22813k42916k0825J095668
39460d94502J772080J184013J02848k28205R4904j97001j512692k532492j978767
39451c789814m22912O50036R58296J289300J578252Q05216r11977j824665r94059
$$ plain form
39517 -275721 -337578 -492203 -431286 -357613 -234474 334365 1221712 1656889 1318782 786496
39507 786496 562768 385090 -79839 -545480 -633706 -558720 -748879 -1171180 -1482674 -1529376
39497 -1529376 -1337945 -947252 -532280 -293624 17917 918787 2213990 2880657 2459849
39488 2459849 1871560 2068928 2482492 1842462 215646 -959433 -905572 -456899 -634345
39479 -634345 -1220714 -1359522 -926014 -581115 -732071 -1034506 -907410 -217566 527658 525875
39469 525875 -608058 -2277438 -3254707 -2889960 -1849242 -1326429 -1569345 -1590170 -494502
39460 -494502 1277578 2461591 2564439 2336234 2431138 2234137 721445 -1811047 -3789814
39451 -3789814 -4212726 -3562690 -2604394 -1315094 263158 1068374 156397 -1668268 -2662327
39442b662327K33603L54739P653N74771J501268J031970p57873j792638j096446
39433b605280j04673j76158n40921J01472J267780J460113N06611l21648k48818
39424f61522K13130L99996L53781L31418K49306p6665o08657j152255j393479
39415b344947r43069J63540J087688R32810p4603p73147n72225j13987j52587
39406b790527m33154k22959M85234R59555P86534L80287L48621P12750R40652
39397A166993O34445M4201j93781J34263M68686K04711m06793n97154k72813j51451
39387A031307n08896o50311j79857P8791n95562j278123n61859J034329J462161
39378a68020J70752r62538m90191M28798O0339r84579p55773P56971J476094M52059
$$ plain form
39442 -2662327 -2428724 -2073985 -2066332 -1491561 9707 1041677 283804 -1508834 -2605280
39433 -2605280 -2709953 -2886111 -3427032 -3325560 -2057780 -597667 -91056 -412704 -661522
39424 -661522 -448392 -48396 305385 636803 886109 809444 200787 -951468 -2344947
39415 -2344947 -3288016 -3124476 -2036788 -1103978 -1178581 -1951728 -2523953 -2637940 -2790527
39406 -2790527 -3223681 -3446640 -2961406 -2001851 -1215317 -835030 -486409 226341 1166993
39397 1166993 1801438 1845639 1651858 1786121 2254807 2459518 2052725 1455571 1182758 1031307
39387 1031307 522411 -127900 -307757 -228966 -824528 -2102651 -2664510 -1630181 -168020
39378 -168020 2732 -959806 -1449997 -1021199 -960860 -1945439 -2701212 -1944241 -468147 -16088
39368a6088p75403o88783O7006J62366j64732J88526J053370J156479J99809o29826
39358E52724l98020M10241P84722M45222j68337n83908o22014l92892j90921j67690
39348c30873j26488P4133J22654k30471m90176j943Q70781J060006L86479j47685
39338A186417L0199K04654k81668q19838n81704J0732j3645n12217n07324O7916
39328a216478J71484o32095j364331r74693L01738J367322J455442N81950o03991
39319i13652j101666l05622J127531J710335Q39906m54193r07242n44564k00372
39310g49539j16383R3191M24488M30568J56076K07195P04867R61942N21101j65890
39300B467616n11957o52593r68247j190554p07412L58733J054875P52589n5334
$$ plain form
39368 -16088 -791491 -1480274 -1413268 -1250902 -1415634 -1227108 -173738 982741 1182550 552724
39358 552724 154704 564945 1349667 1794889 1626552 1042644 420630 27738 -163183 -330873
39348 -330873 -457361 -383228 -260574 -491045 -981221 -983164 -112383 947623 1334102 1186417
39338 1186417 1216616 1421270 1139602 319764 -261940 -251208 -264853 -777070 -1284394 -1216478
39328 -1216478 -1044994 -1677089 -3041420 -4016113 -3714375 -2347053 -891611 -309661 -913652
39319 -913652 -2015318 -2320940 -1193409 516926 1356832 902639 -4603 -549167 -749539
39310 -749539 -865922 -772731 -348243 82325 238401 445596 1150463 2112405 2633506 2467616
39300 2467616 1955659 1303066 334819 -855735 -1563147 -1204414 -149539 603050 547716
39291E47716l91678L3154N98324O26356J34131l72603n98080o47463n87266k38346
39281h95755L59445O21497M7127r17856j201362m38289N06767O51474J06085k72220
39271a433087j04351K28990L81612M37280M37476J80795k38637k96361J37495
39262b68788L75309j05559p09580n26123K00000L58073k81179o58986r1991O71169
39252a037655O95227K81917K41580M21192J00933n30062n75556m9292J7596o55466
39242a089586r74570j73442R56024J302571R79290P04712M13732l87352j358392
39233C72987j604761j051240m69075j62902L39852J148090J514324Q57423l71743
39224E72955j175172r38178J95763J381202J540521M28953p76021o83564N01642
$$ plain form
39291 547716 156038 189192 787516 1413872 1548003 1175400 577320 -70143 -657409 -895755
39281 -895755 -536310 85187 132314 -785542 -1986904 -2425193 -1918426 -1266952 -1160867 -1433087
39271 -1433087 -1537438 -1308448 -926836 -489556 -52080 128715 -109922 -406283 -268788
39262 -268788 106521 962 -708618 -1234741 -1034741 -676668 -957847 -1616833 -1708824 -1037655
39252 -1037655 -342428 -60511 181069 602261 703194 173132 -402424 -451716 -434120 -1089586
39242 -1089586 -2064156 -2237598 -1281574 20997 1000287 1704999 2118731 1731379 372987
39233 372987 -1231774 -2283014 -2752089 -2914991 -2575139 -1427049 87275 944698 572955
39224 572955 -602217 -1540395 -1344632 36570 1577091 2006044 1230023 546459 1048101
39215A048101J236124P71895o380j61249J5506j04932l57095l76239m68219r28414
39205F69098j176196o01915K40894L57157j49188l36673K2108K62532J14018O2234
39195e35931L27179M76207K69701L4345k7213j10008j90715O4887N48851O71817
39185A529120L45268J59481K44360r8036j040109j427404k59984J600457K230327
39176C283480R69735q92725j743088j262746l47574L3108l00057p05173m26427
39167a391467N32012J314459J174013L63540k03459m5943M53365O52283L71458
39158C220261m4224k10820j74145l58503r42116j396459j028427k4295N66318
39149c92410J61015n42937n36204J51032O66993O13828L89478L34904K55571o0366
$$ plain form
39215 1048101 2284225 3056120 3049740 2888491 2903997 2799065 2441970 2065731 1597512 669098
39205 669098 -507098 -1109013 -868119 -510962 -660150 -996823 -974715 -712183 -598165 -535931
39195 -535931 -208752 267455 537156 571501 544288 434280 243565 308452 857303 1529120
39185 1529120 1874388 2033869 2278229 2180193 1140084 -287320 -547304 1053153 3283480
39176 3283480 4253215 3360490 1617402 354656 7082 40190 -259867 -965040 -1391467
39167 -1391467 -859455 455004 1629017 1992557 1789098 1743155 2196520 2848803 3220261
39158 3220261 3176037 2965217 2791072 2432569 1490453 93994 -934433 -958728 -392410
39149 -392410 -231395 -774332 -1310536 -1159504 -492511 121317 510795 845699 1101270 1040904
39139A040904m09257m92646k85138R6586N55280Q89675Q32463L93628p7410l03768
39129B240317l37195l34651l36004l31837k92959j00855K48059L80902o2909p06471
39119C66397o53664K96146J169442R75552o8895r50196j130800q41604l88569
39110a226191J30440N01106M77880K65990L15908N43220L78687k44574o38622
39101E03844m10107r8297l01123p61001q92037o73670l50412K15987J025624J242810
39091d98382J65643j301041j423017j0174J259918J223703O01567L70741J75046
39082E64004n37435r94981k59865Q61092P82215l29156p52542L7383O29972J49375
39072A50062k55571O17653J885971J732626j3365j681591j867643p95103L15969
$$ plain form
39139 1040904 631647 139001 -146137 -49551 505729 1395404 2227867 2621495 2544085 2240317
39129 2240317 1903122 1568471 1232467 900630 607671 506816 754875 1135777 1072868 366397
39119 366397 -287267 8879 1178321 2153873 2084978 1134782 3982 -837622 -1226191
39110 -1226191 -1095751 -594645 -116765 149225 465133 1008353 1387040 1142466 503844
39101 503844 93737 -4560 -305683 -1066684 -1958721 -2632391 -2982803 -2766816 -1741192 -498382
39091 -498382 -332739 -1633780 -3056797 -3066971 -1807053 -583350 18217 388958 564004
39082 564004 26569 -968412 -1228277 -367185 415030 85874 -666668 -629285 687 150062
39072 150062 -105509 512144 2398115 4130741 4117376 2435785 568142 -226961 89008
39063H9008N33573j10568p80909p13178p4960L50074L55568M87199Q19792N54545
39053A510144n29842j201110l80293J080147J431759M29116n37302n12571L8816
39044A328864L47187L14475J76775R6886K56198N59176K54075j188206k793424
39035f47994k848313j212219L20926M49933j7328K91126J222612J594074J039815
39026A92632K54217k00680l19635j25450L58655P07056M71820p0753k68747j35331
39016H63784k75905p37020p55798N8134J001241J205754P81872M65237M33761
39007C041060J46020o24766j206132q27255L10808J199778J164167M11390n42803
38998C072267j420767j900981j419804P3834J501080J612275N45076l17720j28174
$$ plain form
39063 89008 622581 512013 -268896 -982074 -1057034 -706960 -351392 135807 955599 1510144
39053 1510144 980302 -220808 -601101 479046 1910805 2339921 1802619 1290048 1328864
39044 1328864 1676051 1990526 2167301 2264187 2520385 3079561 3333636 2145430 -647994
39035 -647994 -3496307 -4708526 -4387600 -3937667 -3954995 -3663869 -2441257 -847183 192632
39026 192632 446849 246169 -73466 -198916 159739 866795 1338615 1267862 999115 863784
39016 863784 587879 -149141 -904939 -846805 154436 1360190 2142062 2607299 3041060
39007 3041060 3187080 2562314 1356182 528927 839735 2039513 3203680 3615070 3072267
38998 3072267 1651500 -249481 -1669285 -1595451 -94371 1517904 2062980 1745260 1617086
38989A617086N51121Q40998O66951L36288k16286j032064j517135j068791o6205
38980A11963N19691L93127J20189R4582M4592k63119m67067j47710M41348O07986
38970A455582J11559m87293m76295J31550N82119L41157j46836n326Q37467J437178
38960C780862J001797j82422j245842j704043j546050p81980M80330J643344J889894
38951C335890R88487m31557j457254j618439j149424o98248o67778p49854l23115
38942b771292O18405J312252J193094N82816J20052m9205j04383j6516K79936
38933A165159N13334M25881K30968K05622J42691k09454m93694k34582K73607
38924B019532L44430J924j13218J23255J33716l28949p60231p01546k73221K66663
$$ plain form
38989 1617086 2168207 3009205 3676156 4012444 3796158 2764094 1246959 178168 111963
38980 111963 631654 1024781 1144970 1239552 1284144 1021025 553958 406248 847596 1455582
38970 1455582 1567141 1079848 603553 735103 1317222 1658379 1511543 1506217 2343684 3780862
38960 3780862 4782659 4600237 3354395 1650352 104302 -677678 -197348 1445996 3335890
38951 3335890 4324377 3892820 2435566 817127 -332297 -1030545 -1698323 -2448177 -2771292
38942 -2771292 -2152887 -840635 352459 935275 1055327 1006122 901739 885223 1165159
38933 1165159 1678493 2104374 2335342 2540964 2683655 2474201 1980507 1745925 2019532
38924 2019532 2363962 2365886 2252668 2375923 2509639 2180690 1420459 718913 445692 712355
38914G12355Q34996J200151R97531L25613k42181m68006p06461j118508j225515
38905C09975o17855L23420P82489L83792m16461o50793K80749J718226K091263
38896D204805P76712q22101r78547n44M37818N9951K71464J405798J730075K38541
38886G323972j359912j029973N44875J136170K84373n28735n32532m56660o77562
38877D704016m97368L01407P97399M71527Q5842K93634N04824M104o77781m75659
38867E511945O32066J588516J554484O63177l18441o69126k51813L47516M37502
38858I495826R0814L648L95972O56798L56352m6820J4964L09941K89970L2303
38848A1599768l632J29602m1694n29528p84810n24776o1977L09107O98150J167617
$$ plain form
38914 712355 1547351 2747502 3745033 4070646 3828465 3360459 2653998 1535490 309975
38905 309975 -307880 15540 798029 1181821 765360 114567 395316 2113542 4204805
38896 4204805 4981517 4159416 3180869 3180325 3618143 3678094 3949558 5355356 7085431 7323972
38886 7323972 5964060 4934087 5478962 6615132 6899505 6370770 5838238 5381578 4704016
38877 4704016 4206648 4508055 5305454 5776981 5862823 6156457 6661281 6665385 5987604 5511945
38867 5511945 6144011 7732527 9287011 9950188 9631747 8962621 8710808 9058324 9495826
38858 9495826 9586640 9590288 9986260 10643058 10999410 10952590 10967554 11277495 11567465 11599768
38848 11599768 11596136 11725738 11684044 11154516 10369706 9844930 9782953 10092060 10790210 11957827
38838A1957827J394448J173029R35395J281129K061257K397831J780547Q02145
38830B3783608M70074R60142J499979J510190J323187J459102J690093J474607
38822C4170982J094494J529537L019474M470127M750470M108522L755180M325324
38814F1224110N349220O184438O873359P834691R064559J0047900J0481074J0804459
38806A27863810J1740381J3307966J4656733J5179939J5517395J6856108J9182355
38799B34304687K0843237K0187224J7215065J3220824R200031N174865Q72041
38792C21017974l597700p838862j1506738j4402367j6518532j8052239j9109520
38785B29992016j9419878j8715526j7413147j6403410j5904031j4989768j2768543
$$ plain form
38838 11957827 13352275 14525304 15460699 16741828 18803085 21200916 22981463 23783608
38830 23783608 24253682 25213824 26713803 28223993 29547180 31006282 32696375 34170982
38822 34170982 35265476 36795013 39814487 44284614 49035084 53143606 56898786 61224110
38814 61224110 66573330 72757768 79631127 87465818 96530377 106578277 117059351 127863810
38806 127863810 139604191 152912157 167568890 182748829 198266224 215122332 234304687
38799 234304687 255147924 275335148 292550213 305771037 314971068 320145933 321017974
38792 321017974 317420274 309581412 298074674 283672307 267153775 249101536 229992016
38785 229992016 210572138 191856612 174443465 158040055 142136024 127146256 114377713
38778A14377713r792179p687977p315182p807456p715032o684989n551005m997768
38770E6826125m783542m394230l853886l468786l183256k755104k340251k255537
38762B9791533k237101j682463p67226n05862j263734j964595j528723n46106
38754A9295723n16519j644274k497926k025513q59335j32872P9484L35854M97184
38745A2531806r7250j287125j940887j376175j94172O12806P60939M85338j43402
38736I351878j035459j539563r02120O24734J740662J453000J26577j046168j297386
38727G476155p49115K2913M46661J60663p01515j382417j119833q8913O34923
38718D699522L12912n56868r02510l86940L88464Q36468R62326R13147N51203
$$ plain form
38778 114377713 104585534 96897557 89582375 81774919 74059887 67374898 61823893 56826125
38770 56826125 52042583 47648353 43794467 40325681 37142425 34387321 32047070 29791533
38762 29791533 27554432 25871969 25104743 24598881 23335147 21370552 19841829 19295723
38754 19295723 18779204 17134930 14637004 12611491 11752156 11619284 11698768 12034622 12531806
38745 12531806 12434556 11147431 9206544 7830369 7636197 8249003 9009942 9495280 9351878
38736 9351878 8316419 6776856 5874736 6499470 8240132 9693132 9819709 8773541 7476155
38727 7476155 6727040 6749953 7196614 7357277 6655762 5273345 4153512 4064599 4699522
38718 4699522 5012434 4455566 3553056 3166116 3554580 4391048 5353374 6266521 6817724
38709F817724j61799p84595q90569o88106o35624o28290k04838M74371O15952
38700C914226k341n51112l68119k2912m13877j226086j248882j69590R01813R55381
38690A768501L31576L37J99856L70335Q8652m73738q62691p30910p1165O52861
38680A273614Q15202L31724j93597k68889r9039m6918K2829L15387M23891j76618
38670B397586j137759j518299j056243m43999k46725k51494j02897P9264Q5392
38661b195174J15659M67470J018019J345022J166961M84928m62468j228380j410602
38652f98565j045952n52749k23094k6278R8515J35087K06942M70836P20478N50004
38642c64776J5772l30137j74618K73538P97653J349343J581638R61365l22772
$$ plain form
38709 6817724 6655925 5871330 4980761 4292655 3657031 3028741 2823903 3298274 3914226
38700 3914226 3911885 3360773 2992654 2969742 2555865 1329779 80897 -88693 813120 1768501
38690 1768501 2100077 2100414 2300270 2670605 2759257 2285519 1422828 691918 620753 1273614
38680 1273614 2088816 2420540 2226943 1958054 1859015 1812097 1834926 2150313 2574204 2397586
38670 2397586 1259827 -258472 -1314715 -1758714 -2005439 -2256933 -2359830 -2280566 -2195174
38661 -2195174 -2079515 -1612045 -594026 750996 1917957 2402885 1940417 712037 -698565
38652 -698565 -1744517 -2297266 -2520360 -2546638 -2448123 -2313036 -2106094 -1635258 -914780 -364776
38642 -364776 -349004 -679141 -853759 -580221 217432 1566775 3148413 4109778 3787006
38633C787006j283332j393304j223864j324299j219064k60265J116025J840969
38625C9872J562803Q01887Q7051l43193l02642J17757L32994k0499m14262j67534
38615A694234M67960P33181N22506K49311q4229o46416r14768k95114N30395K57270
38605B514330r31452j370127m16760N16510J69597o83023o29834J63196M43652
38596b23911p0735m51184j10831N57536J053853J300344J210859N73662l98040
38587C441553j017352r05401m28164j46156j16386N6633N95996J121587R52152
38578C554462l7590j014038j046151l36509P600m32951p95771l62623K43893J08586
38568a11092l63943l2005J005843J266615J7645j461566j418647J43259J512760
$$ plain form
38633 3787006 2503674 1110370 -113494 -1437793 -2656857 -2917122 -1801097 39872
38625 39872 1602675 2404562 2491613 2148420 1845778 1963535 2296529 2276030 1861768 1694234
38615 1694234 2162194 2895375 3417881 3667192 3582963 2936547 2021779 1726665 2257060 2514330
38605 2514330 1582878 212751 -204009 312501 482098 -200925 -830759 -667563 -223911
38596 -223911 -294646 -745830 -856661 -299125 754728 2055072 3265931 3839593 3441553
38587 3441553 2424201 1518800 1090636 944480 828094 884727 1480723 2602310 3554462
38578 3554462 3516872 2502834 1456683 1120174 1127774 694823 -100948 -463571 -219678 -111092
38568 -111092 -475035 -507040 498803 1765418 1783063 321497 -1097150 -953891 558869
38559E58869J382580K77477l24057J02981O10941K54519m63927k90679P96324
38550B905028J262657R5245j628670k066998r84929J72781L41173q4780l04546
38541b93039k38196j83357q8094K56312O78580P64050L81913j76061m74356k82044
38531C45708J80660L68324K8531m05328l79852j7738J45673N8924J01508J95890
38521F22300j62973q29197q89174m6221P40053O05899P029j59831K9578p0212
38511a52749l79877k95706Q5733P6727l05404k63255L97959Q70699O52709K50354
38501I37190J02093k23421j059160j727603j485534p20335k35387R4018Q10728
38492c507411J436268R33105m26898j093844m72741K34530L1020l43499J39004
$$ plain form
38559 558869 1941449 2218926 1894869 1997850 2608791 2863310 2399383 2108704 2905028
38550 2905028 4167685 4262930 2634260 567262 -417667 -244886 96287 11507 -293039
38541 -293039 -531235 -714592 -802686 -546374 132206 896256 1278169 1102108 627752 345708
38531 345708 526368 894692 923223 517895 138043 120305 265978 324902 426410 622300
38521 622300 459327 -369870 -1259044 -1305265 -565212 40687 47716 -112115 -82537 -152749
38511 -152749 -532626 -828332 -742599 -665872 -971276 -1234531 -836572 34127 686836 937190
38501 937190 1039283 815862 -243298 -1970901 -3456435 -4176770 -4412157 -4318139 -3507411
38492 -3507411 -2071143 -1138038 -1564936 -2658780 -3131521 -2896991 -2865971 -3209470 -3070466
38483c070466R34271Q43350N3456k12326K82947O05675M12875M19521Q83884J014230
38473B167417L69805l53746n40422n69486q37099r04704m52380j30383m80628
38464a731626q28317l46880M52071N06339k1962n9608N60592Q97521M75598j32694
38454b28966l79200l13269K2077O98655J241202R27471J8864l38446K22655P42308
38444B613351M63750j16255k86949k29847l54642l86526Q571L42164j9332p28280
38434A306005r13458n22096l55894p98086j212994p98820L52642J266421J119120
38425e57160K19006k67622K02419P34284K84458o34556o30294L27888P77071J49261
38415F04755l02294K87551Q53444K97702m82842j24528P26611M21167q54907j328156
$$ plain form
38483 -3070466 -2136195 -1292845 -1239389 -1451715 -1168768 -563093 -150218 269303 1153187 2167417
38473 2167417 2537222 2183476 1643054 1073568 236469 -668235 -1120615 -1250998 -1731626
38464 -1731626 -2559943 -2906823 -2454752 -1948413 -1970375 -2029983 -1469391 -571870 -96272 -228966
38454 -228966 -608166 -921435 -899358 -200703 1040499 1967970 1986834 1648388 1871043 2613351
38444 2613351 3077101 2960846 2673897 2444050 2089408 1702882 1711453 2053617 2034285 1306005
38434 1306005 392547 -129549 -485443 -1283529 -2496523 -3295343 -2942701 -1676280 -557160
38425 -557160 -338154 -605776 -403357 330927 615385 -19171 -649465 -321577 455494 604755
38415 604755 302461 590012 1443456 1741158 1258316 1133788 1860399 2281566 1426659 98503
38405I8503n12921K20159R2336o1529L14383M68282j3610k25407L70268P50927
38395A501391N0999p93404n33501K60071J66228o22333n43501P68499J814834
38386B069283J451106L93024j42355k28154p11509j501170j473706j62093J279461
38377I73887J302696j58037j578120j623220n46091M16674N67416J83436k32545
38368f93904m50303l42314P9842L59627k5383p93878r95270k79808N54932O16932
38358a969527k0164o55206q21067m29140L90885J130940J111677L86743l5022
38349i09881N50494J504176J693334R58593J7432p20555j375954j823882j616495
38340a722738p78285M9191M31059N50836O76853P43263O20100L58636J0381m49627
$$ plain form
38405 98503 -414418 -194259 -101923 -163452 150931 619213 605603 380196 750464 1501391
38395 1501391 1552390 758986 225485 485556 651784 29451 -514050 254449 2069283
38386 2069283 3520389 3913413 3771058 3542904 2831395 1330225 -143481 -305574 973887
38377 973887 2276583 2118546 540426 -1082794 -1628885 -1212211 -644795 -461359 -693904
38368 -693904 -1144207 -1486521 -1406679 -1047052 -1072435 -1866313 -2861583 -3141391 -2586459 -1969527
38358 -1969527 -1989691 -2644897 -3465964 -3895104 -3504219 -2373279 -1261602 -874859 -909881
38349 -909881 -359387 1144789 2838123 3796716 3814148 3093593 1717639 -106243 -1722738
38340 -1722738 -2501023 -2451832 -2020773 -1469937 -793084 -49821 570279 928915 939296 489669
38330D89669r14139j149553j052056o63354k4998O89283J068862Q92554N04591
38321a59141L47029L20684R7544j90942k09488j24953k87206l81625J72952J012807
38311E97661J059281J44702o35134n47339j72706k20097m08594k62815j18008
38302e63049m19731p34341m39181J54548L62102L29162O05994Q96142M30529n51225
38292G0950q99794k31970N67132P02308L35395j27107o07942q74898m43550N57021
38282i52455J233350J085977N33806p1579r41331j810577j587660l6424J207873
38273a339020O34507q28726r96715M44440J580068J057679k88573r68014o72784
38264a377138k0204M67469M81096j14512q29947q06740l4164M80173K50546P6460
$$ plain form
38330 489669 -424470 -1574023 -2626079 -3289433 -3314431 -2625148 -1556286 -663732 -159141
38321 -159141 187888 508572 606116 415174 205686 80733 -206473 -588098 -415146 597661
38311 597661 1656942 1801644 1166510 619171 446465 226368 -182226 -445041 -563049
38302 -563049 -982780 -1717121 -2156302 -2001754 -1639652 -1310490 -704496 191646 622175 70950
38292 70950 -828844 -1060814 -493682 208626 544021 416914 -191028 -1065926 -1509476 -952455
38282 -952455 280895 1366872 1900678 1829099 887768 -922809 -2510469 -2546893 -1339020
38273 -1339020 -704513 -1533239 -2529954 -2085514 -505446 552233 263660 -704354 -1377138
38264 -1377138 -1397342 -929873 -448777 -563289 -1393236 -2199976 -2234140 -1753967 -1503421 -1426961
38254a426961N76501R66983L29809p14850q35962K4856P32617O94967L13259q3376
38244E77843n23120o86286j42278O39938O84277L7342k50963J66873M93291L16852
38234A313769K32133M35578J00586j037925j759737j090170J02896M31665K1256
38225a249949p7929K23206K14609k6126K56656R32397R82878J96464m15246j72860
38215H64100L97910N71631L15769j68393q66494j494056j455806p30299q0370
38206b646008M9021J43618O78750J259495J254204P10307Q0961m54232q36017
38197B40099p69470j56604M47281M20028q9898m12825k50960J29848M05616M38056
38187D01171J65262l14592o37243n21950j74984n5974k97340n69651m54514J61497
$$ plain form
38254 -1426961 -850460 116523 446332 -268518 -1104480 -1079624 -347007 347960 661219 577843
38244 577843 54723 -631563 -773841 -133903 550374 587716 336753 503626 996917 1313769
38234 1313769 1545902 1981480 2082066 1044141 -715596 -1805766 -1702870 -1271205 -1249949
38225 -1249949 -1327878 -1104672 -890063 -916189 -659533 272864 1255742 1452206 1036960 864100
38215 864100 1262010 1833641 2149410 1981017 1114523 -379533 -1835339 -2565638 -2646008
38206 -2646008 -2596987 -2453369 -1774619 -515124 739080 1449387 1530348 1076116 240099
38197 240099 -529371 -685975 -238694 181334 91436 -321389 -572349 -442501 -36885 401171
38187 401171 566433 251841 -385402 -907352 -1082336 -1138310 -1435650 -2005301 -2459815 -2298318
38177b298318R17455J173377O67169j0868n9867L63262K91870n02649r58567k92409
38167g09545O88730P23843q3299o54890o91659p56548q02054q2707J209877J650235
38157D91983N99818o42580o38823J54211K74706m41804p56975n8122P59734O96647
38147D38795k9415n12719l56529J22628M42187L03496k80534q91290j022761p18391
38137b504533n33384o45548m97318L03669J249737J644868J560118J366459P91657
38128B735725n33438j837863j786945m51767N46880K91587k74617j31979J62553
38119a279864k53124p24968j16649J001074R88646k20483r23207l13665L92156
38110a450084J05100m36212p9759Q48758J183434N85233m45616j480932k099587
$$ plain form
38177 -2298318 -1380863 -207486 459683 448815 388948 752210 1044080 541431 -417136 -709545
38167 -709545 -20815 703028 619729 -35161 -726820 -1483368 -2285422 -2368129 -1158252 491983
38157 491983 1091801 449221 -189602 -35391 239315 -202489 -959464 -1017586 -257852 438795
38147 438795 409380 -103339 -459868 -337240 104947 408443 127909 -763381 -1786142 -2504533
38137 -2504533 -3037917 -3683465 -4180783 -3877114 -2627377 -982509 577609 1944068 2735725
38128 2735725 2202287 364424 -1422521 -1874288 -1327408 -1035821 -1310438 -1442417 -1279864
38119 -1279864 -1532988 -2257956 -2374605 -1373531 -384885 -605368 -1528575 -1842240 -1450084
38110 -1450084 -1344984 -1781196 -1860955 -1012197 171237 756470 310854 -1170078 -3269665
38101c269665j622602j8610J452401J585120P99127L31638L28465l6457q26712
38092a277295j085374l82625N46851R34708Q04235M97016K49137L60255R04861
38083A551769J181836M03539r41810j463868q29022k09802l96688o95349l93458
38074a792853j26767o95444j402334r05476O63854J702077J250899R0376m89953
38065a705621k23839J82155J37820j90726j97201M00427J149996J297589O42241
38056A492841k33540o46872m83391j12105O7254r4024l29029l5249J008426J949265
38046B583576J559357j17897j535720j478008m20764M53357P96613Q60230M73123
38037C173867n99900j681966j760831r31276k01512N9674L57502P37697N04320
$$ plain form
38101 -3269665 -4892267 -4910877 -3458476 -1873356 -1074229 -742591 -414126 -450583 -1277295
38092 -1277295 -2362669 -2745294 -2198443 -1263735 -459500 37516 286653 646908 1551769
38083 1551769 2733605 3137144 2195334 731466 -97556 -307358 -704046 -1399395 -1792853
38074 -1792853 -1919620 -2615064 -4017398 -4922874 -4259020 -2556943 -1306044 -1215668 -1705621
38065 -1705621 -1929460 -1747305 -1609485 -1800211 -1997412 -1596985 -446989 850600 1492841
38056 1492841 1259301 612429 129038 16933 84187 -9837 -338866 -374115 634311 2583576
38046 2583576 4142933 4025036 2489316 1011308 590544 1043901 1840514 2700744 3173867
38037 3173867 2573967 892001 -868830 -1800106 -2001618 -1941944 -1584442 -846745 -342425
38028c42425l77619q20022k05665N63836M21080k79107m43199R8549O06002P17244
38018f1326P06525O18817J41731n80058q74979n39140k01549l83265p81974q69281
38008b824499o89586n72089m06541J94397J092377J515829R26582k80047j129878
37999b173455j040768l51256Q6221j95551p94455q91722j76702Q03418J267463
37990c466807J010434M61097J05364R2931L05818N02306M08122l662k84702N3848
37980h15251P53239R09071J71395o01363m26410L74075N67186k01947q30264k87568
37970c87837R36103J489569Q90417m4633l91780j55733J0057k95996q45436j118280
37960H6451q28114j60341M10717N26242J76665m06058r42945j157124q47995j40939
$$ plain form
38028 -342425 -720044 -1540066 -1745731 -1181895 -760815 -1039922 -1483121 -1384572 -778570 -61326
38018 -61326 645199 1264016 1405747 825689 -49290 -588430 -789979 -1173244 -1955218 -2824499
38008 -2824499 -3514085 -4086174 -4492715 -4298318 -3205941 -1690112 -763530 -1043577 -2173455
37999 -2173455 -3214223 -3565479 -3479258 -3674809 -4469264 -5360986 -5537688 -4734270 -3466807
37990 -3466807 -2456373 -1995276 -1889912 -1796981 -1491163 -988857 -580735 -584397 -869099 -815251
37980 -815251 -62012 847059 1018454 417091 -9319 364756 931942 729995 -100269 -387837
37970 -387837 548266 2037835 2928252 2883619 2491839 2336106 2346163 2050167 1204731 86451
37960 86451 -741663 -902004 -491287 34955 211620 -194438 -1137383 -2294507 -3142502 -3283441
37950c283441M26969L41417k91601p40644l66278O93023J637248J815623J334038
37941A566354P69752L88371o5493p25413j151653r02297k97588p3021l40191m76236
37931a307415j18329L33850M11977J95798o0662l51459n76171l39701L84334Q96844
37921e30934O91771K62506K71995L77816j53888r38634p57515N28372J483295
37912A234784R95312k30810p39859k27806L87417M01276K7586k52654l69807n02303
37902G23136o20738m70097M1652N61315N38313j15786p46810o54381l7967J92374
37892e88989l22737q18659m58758M32767P50887R4180p12136p26281p7193L19438
37882b107481M2502k93364O2890Q80180J147334L81892o93163j005337l58827
$$ plain form
37950 -3283441 -2856472 -2515055 -2806656 -3547300 -3913578 -3220555 -1583307 232316 1566354
37941 1566354 2336106 2724477 2658984 1933571 781918 -120379 -417967 -490988 -831179 -1307415
37931 -1307415 -1425744 -1091894 -679917 -484119 -544781 -896240 -1472411 -1812112 -1427778 -530934
37921 -530934 160837 423343 695338 1073154 919266 -19368 -776883 -248511 1234784
37912 1234784 2230096 1999286 1259427 1031621 1419038 1820314 1847900 1595246 1225439 723136
37902 723136 102398 -367699 -326047 235268 773581 657795 -89015 -743396 -781363 -588989
37892 -588989 -911726 -1730385 -2189143 -1756376 -1005489 -911309 -1623445 -2349726 -2426919 -2107481
37882 -2107481 -2064979 -2358343 -2295453 -1415273 -267939 113953 -579210 -1584547 -1943374
37873a943374M92983P73950L61279k76193m82932N9666Q86849J069578L55639
37864A297445l59682k50844J67859j48405r72247r66476K54568J415222J354903
37855A792343M48661l42732q31647j196759j103807k84700N91372O87004K52748
37846A2483J33125L75432L83513J82017L42286P08867M29386n38819j094630n87944
37836C45716K18424L10518k54649p50511q13889m90322J41293P60343P49506J8366
37826B34795n62146k53311M11738L85355k73289m81502J64452P34636L52228n41463
37816A71493q78518m25875J00666J58254m9653j61047k25933l85233l66383K18257
37806a843972J135775J545984R53255j03839o00964k02967L75328K59178n30092
$$ plain form
37873 -1943374 -1450391 -676441 -315162 -591355 -1074287 -1014621 -127772 941806 1297445
37864 1297445 937763 686919 854778 706373 -265874 -1232350 -977782 437440 1792343
37855 1792343 2241004 1898272 1066625 -130134 -1233941 -1518641 -927269 -240265 12483
37846 12483 145608 521040 904553 1086570 1428856 2137723 2567109 2028290 933660 345716
37836 345716 564140 874658 620009 -130502 -944391 -1434713 -1293420 -533077 216429 234795
37826 234795 -327351 -580662 -168924 216431 -56858 -538360 -373908 360728 712956 171493
37816 171493 -707025 -1132900 -1032234 -873980 -923633 -1084680 -1310613 -1695846 -2062229 -1843972
37806 -1843972 -708197 837787 1791042 1687203 1086239 883272 1258600 1517778 987686
37797I87686j105210p71012J50516P05942M36111j41397k66800J16968M40404
37788E53208L53571P3029j05065j82272k27204k10953k67282o34198j022359n81631
37778b251156R30693K355199K264935P53469o56925r06323m59385l13545o65834
37769A051128r66651q02494k77294K15929L06758l0000k98762J9133O36805O38412
37759D92964k01666q45308l07064R00708J399228P94065L0991j43006j78223p64049
37749A178640j567172j626394p06837M25907J045226J164686J067236P25020J01657
37740A807969l59040j49689M66049O08486p0977q62248r00793k39161L50169L71004
37730A021769l9894n92344j164967j597959j584621r71018O14Q17344R94566M05041
$$ plain form
37797 987686 -117524 -888536 -738020 -32078 404033 262636 -4164 112804 553208
37788 553208 906779 979808 874743 692471 465267 254314 -12968 -647166 -1669525 -2251156
37778 -2251156 -1320463 1034736 3299671 4053140 3396215 2489892 2030507 1716962 1051128
37769 1051128 84477 -718017 -995311 -779382 -472624 -502624 -801386 -782253 -145448 492964
37759 492964 291298 -554010 -861074 39634 1438862 2232927 2263918 2120912 1942689 1178640
37749 1178640 -388532 -2014926 -2721763 -2295856 -1250630 -85944 981292 1706312 1807969
37740 1807969 1448929 1299240 1765289 2373775 2302798 1440550 539757 300596 650765 1021769
37730 1021769 981875 389531 -775436 -2373395 -3958016 -4929034 -4928420 -4111076 -3116510 -2711469
37720b711469m67953p89305k15220O76890J152504J255640J434984J500373Q24820
37711B661264l70021q95101j62611R14747J131968M53077l19663p30490q09954
37702A873216n29848M2771L44739r7041q31262j007291o20605m28939o60623o82795
37692b597678j12730N75099Q70638R17563R44359O55745j98583j061439j036447
37683a043473j5308J123758J433315P43325l32030r90799q98592m22887j80855
37674e83546l27040m76097l63055k33420l72239n70716l99010J85854Q27747J213803
37664a097719J212202P24988j92038j097738j440712j129171n41714K7704N64076
37655b970122R15799O77067j92478r91846r95147l79199O0035O1770J75494P16013
$$ plain form
37720 -2711469 -3179422 -3968727 -4183947 -3507057 -2354553 -1098913 336071 1836444 2661264
37711 2661264 2291243 1396142 1233531 2148278 3280246 3733323 3413660 2683170 1873216
37702 1873216 1343368 1386139 1730878 1633837 802575 -204716 -825321 -1254260 -1914883 -2597678
37692 -2597678 -2710408 -2135309 -1264671 -347108 597251 1252996 1054413 -7026 -1043473
37683 -1043473 -1058781 64977 1498292 2241617 1909587 918788 20196 -402691 -583546
37674 -583546 -910586 -1386683 -1749738 -1983158 -2355397 -2926113 -3325123 -3139269 -2311522 -1097719
37664 -1097719 114483 839471 647433 -450305 -1891017 -3020188 -3561902 -3534198 -2970122
37655 -2970122 -2054323 -1377256 -1569734 -2561580 -3556727 -3935926 -3875891 -3814121 -3638627 -2922614
37645b922614J081566O30178j99201l74222K61498P88424N85333J09514n4188
37636i3712j62025o61395j140857q34136P5950O19282N28923O03207J261553J636019
37626A832809P75326q25460j717593j309538m34737p0178j45361N5774P04401
37617a134557J117001O54716l81429j024818p92649k54971k21530n92612m85125
37608c115974M88372J570490J724940P88003n10471j349658j337376n58772M56835
37599a843611R97188Q07280L77374K90476M75368M77705K28877J4720j55938n02567
37589A166872q24758o24442j2833K50193o5341j94056L73840Q76230L53275p17311
37579E81669r06544J21434J099687R46949J23897l16767k44746k49375m58239
$$ plain form
37645 -2922614 -1841048 -1210870 -1410071 -1784293 -1522795 -734371 -149038 -39524 -93712
37636 -93712 -255737 -917132 -2057989 -2892125 -2816175 -2196893 -1667970 -1064763 196790 1832809
37626 1832809 2608135 1782675 65082 -1244456 -1679193 -1749371 -1894732 -1838958 -1134557
37617 -1134557 -17556 637160 255731 -769087 -1561736 -1816707 -2038237 -2630849 -3115974
37608 -3115974 -2627602 -1057112 667828 1455831 945360 -404298 -1741674 -2300446 -1843611
37599 -1843611 -846423 -39143 338231 628707 1104075 1581780 1810657 1825377 1669439 1166872
37589 1166872 342114 -282328 -295161 -44968 -110309 -304365 69475 945705 1298980 581669
37579 581669 -324875 -203441 896246 1843195 1967092 1650325 1405579 1156204 697965
37570F97965m72287k50731j51908j13120L08896R25517Q76468P640n94337j13731
37560A120372O95588O15578j99729n98198l32755l23286r55831j384580r36129
37551b298970r3433N11230J050662J669130J666875N85710o34725q19628l56421
37542A280430m82235j122984j012899J5994N41860j63689r05899m80063M96809
37533a832676P90782N29889O28581R63833O18884l67178r13885n45360J16359
37524a0771N64345Q92930Q96720j7857j530088k185384j227667K52196P94180
37515a571396M18260J21081K12867K31966J04069K41645N85184N90578K67300
37506A201554K78245P47924Q37338k0560j103879j204471j16743J145123J448389
$$ plain form
37570 697965 225678 -25053 -176961 -290081 18815 944332 1820800 1828440 1234103 1120372
37560 1120372 1815960 2431538 2231809 1633611 1300856 977570 21739 -1362841 -2298970
37551 -2298970 -2392403 -1881173 -830511 838619 2505494 3091204 2456479 1636851 1280430
37542 1280430 798195 -324789 -1337688 -1321694 -779834 -943523 -1849422 -2329485 -1832676
37533 -1832676 -1041894 -512005 116576 1080409 1699293 1332115 418230 -127130 -10771
37524 -10771 553574 1446504 2343224 2325367 795279 -1390105 -2617772 -2365576 -1571396
37515 -1571396 -1153136 -1032055 -819188 -587222 -483153 -241508 343676 934254 1201554
37506 1201554 1479799 2227723 3065061 3044501 1940622 736151 619408 1764531 3212920
37497C212920N59557p68891j490650j184535m24936q2229k62739l12767Q2452
37488f71818L93846J57352k02489n3596L52516K37363m19320p69134l70954J77995
37478a168239K04551q0704q6783J41356N0166m33273o58758j34234P61115J198568
37468b06235Q55014K09511j10703j00015k90355q59338j122238l31692J080548
37459h75503J675225P32404p21143j170161n01532J31102J10708L098K28674J76936
37449b10192o72634j557155j331360j46794P65091Q27785O42922P28060P47105
37440b07172L59361l2409L4385K71778J52672k04930l12578j73977k18578n05557
37430h37005n83652j42988O35319J357833J658121J229027Q0037j185648j744986
$$ plain form
37497 3212920 3772477 3003586 1512936 328401 -96535 -178764 -441503 -754270 -671818
37488 -671818 -277972 -120620 -323109 -376705 -24189 213174 -206146 -975280 -1346234 -1168239
37478 -1168239 -963688 -1044392 -1131175 -989819 -939653 -1372926 -2031684 -2165918 -1404803 -206235
37468 -206235 648779 858290 747587 647572 357217 -502121 -1624359 -1956051 -875503
37459 -875503 799722 1532126 810983 -359178 -860710 -729608 -618900 -615802 -387128 -210192
37449 -210192 -882826 -2439981 -3771341 -3918135 -3153044 -2325259 -1682337 -954277 -207172
37440 -207172 152189 119780 154165 425943 578615 373685 61107 -112870 -331448 -837005
37430 -837005 -1420657 -1563645 -928326 429507 2087628 3316655 3396692 2211044 466058
37421D66058j343084m99751Q0426J05593k20534m48160k46447K72078O58837O90063
37411d84921N92745N36675L04546j62523l48271J13395O78189O01161J06253l6079
37401A901170J09874k44400j108787j483266r18577k11621p8922j68204N979J35276
37391b061478r3758j70772L52701Q81093O72666R7956o1285k3038m95462j118618
37381b019995p78981N28658J432459J043632L2085n11659l85379k3301K96151
37372c86330M84600M18733J17796j95636m23271n98216m95285J98499J147969
37363B68859J413657N75614o37329j175421p84799l9279M25116M48554L19875
37354H14847L62497M66690J81262n03490q22868k36092N62771M43115m91313r66412
$$ plain form
37421 466058 -877026 -1376777 -1296351 -1190758 -1411292 -1859452 -2105899 -1833821 -1174984 -484921
37411 -484921 107824 644499 949045 786522 438251 551646 1229835 1830996 1937249 1901170
37401 1901170 2011044 1766644 657857 -825409 -1743986 -1955607 -2034529 -2202733 -2196754 -2061478
37391 -2061478 -2155236 -2326008 -1973307 -1092214 -419548 -321592 -382877 -405915 -901377 -2019995
37381 -2019995 -2798976 -2270318 -837859 205773 237858 -273801 -659180 -682481 -386330
37372 -386330 98270 517003 634799 439163 15892 -582324 -1077609 -879110 268859
37363 268859 1682516 2258130 1620801 445380 -339419 -378698 46418 494972 814847
37354 814847 1177344 1644034 1825296 1321806 498938 262846 825617 1268732 777419 -188993
37344a88993l45008N67226P55324J76995n58545q67693l07677J055834K081283
37335B368746J396375o83306k119442j672773m02426J42780P9076L56432P60089
37326B25551L17947p73225j226391o36212J2605m42j76159J20164N95440N85376
37316i55346N2996m32025l71880K29627Q57953Q97928L54915K3990N09669J262781
37306B430608J163843l8028j453660k146809j905420r97676J54214R78388J051238
37297g63302N83274K03034J86677K46332K8168n34558j207882j432521o56417
37288c347195P72204J483779O56292o71379q64542j1508K68851o44736j431821
37279c790055q78925L60543Q62642M12597l3267J34508N43861N48457j8260p58460
$$ plain form
37344 -188993 -534001 33225 788549 965544 406999 -460694 -768371 287463 2368746
37335 2368746 3765121 3081815 962373 -710400 -1112826 -970046 -890970 -534538 225551
37326 225551 543498 -229727 -1456118 -2092330 -2079725 -2080167 -2256326 -2136162 -1540722 -955346
37316 -955346 -902350 -1334375 -1706255 -1476628 -618675 279253 634168 658158 1167827 2430608
37306 2430608 3594451 3556423 2102763 -44046 -1949466 -2947142 -2792928 -1814540 -763302
37297 -763302 -180028 23006 209683 456015 484183 -50375 -1258257 -2690778 -3347195
37288 -3347195 -2574991 -1091212 -434920 -1106299 -1970841 -1982349 -1713498 -2358234 -3790055
37279 -3790055 -4668980 -4308437 -3445795 -3033198 -3066465 -2931957 -2388096 -1839639 -1857899 -2616359
37269b616359j077703p02485O5008P18291J057743J079887O75965j540k05952
37260a007145N11683J273425Q00471o26154j309098m68734P68146J129947P43823
37251A816364L00433j58312p62792j092059q52804n13064m34873j73463N17521
37242a353049Q65946K90955l94562j84187M16826K17004o39529r00382k11780
37233a892758M76290M91978K02819R9563J77208L42257N16525L03327n46814j369498
37223a199103j249626m22217K9009j16733K7000Q04280J343238R94171L72895
37214E82914L18782O26358N15386j73184q53624r57163m61530R6725O4119n21817
37204g63034p11499J54126J229733J102569j09375p84734j68025N62347J88137
$$ plain form
37269 -2616359 -3694062 -4396547 -4331539 -3613248 -2555505 -1475618 -799653 -801193 -1007145
37260 -1007145 -495462 777963 1578434 952280 -356818 -825552 -57406 1072541 1816364
37251 1816364 2116797 1958485 1195693 103634 -749170 -1262234 -1697107 -1870570 -1353049
37242 -1353049 -487103 -196148 -590710 -774897 -358071 -141067 -780596 -1680978 -1892758
37233 -1892758 -1416468 -924490 -721671 -622108 -444900 -102643 413882 717209 170395 -1199103
37223 -1199103 -2448729 -2870946 -2841937 -2958670 -2931670 -2127390 -784152 210019 582914
37214 582914 901696 1528054 2043440 1870256 1016632 59469 -402061 -305336 -241217 -763034
37204 -763034 -1474533 -1320407 -90674 1011895 902520 117786 -50239 512108 700245
37195G00245p62556j011522l93958K81870N74744O10671M28280P7975Q256M52269
37185I66274P41249J39583q72133j094485k94303N24057N56300L0423n20403r27753
37175g51191j001934k95084J125955K165380J687834o2663j587222j784248j069998
37166a573171n99083o84356n34987L74810J299524J134174J8139p26177l03112
37157a594239O19584R42677M63660k53164p93424j089933j035188n25934J90494
37148c075467O78062P85826O37087K67699l47625r58499j090530n25859M08682
37139c220624J053956R44673L08236O708O19672J549706J559929L83998q14505
37130B391749r61465m04996j33386k61025j71709J84581J73471l42446o54947
$$ plain form
37195 700245 -62311 -1073833 -1467791 -1185921 -611177 -506 427774 505749 514005 966274
37185 966274 1707523 1847106 974973 -119512 -413815 110242 666542 696965 176562 -751191
37175 -751191 -1753125 -2048209 -922254 1243126 2930960 2868297 1281075 -503173 -1573171
37166 -1573171 -2172254 -2856610 -3391597 -3016787 -1717263 -583089 -564950 -1291127 -1594239
37157 -1594239 -974655 -31978 431682 178518 -614906 -1704839 -2740027 -3265961 -3075467
37148 -3075467 -2397405 -1611579 -974492 -706793 -1054418 -2012917 -3103447 -3629306 -3220624
37139 -3220624 -2166668 -1221995 -913759 -907051 -287379 1262327 2822256 3206254 2391749
37130 2391749 1430284 1025288 891902 630877 459168 643749 817220 474774 -180173
37121a80173l08574K07046K50738n2896j34924J63279N02333O02661N04486L39482
37111A893458J30568j41608m14955n56814m96894l34224k58392l50844n39531
37102a069236p34359q50581p15239k21743L68304O11405M92737M65368O86573
37093i66771O78596J10327n14022m58049K30761Q04960P33537J36846m56397m24215
37083a24427N05466J665398J755483L65297j257438j716681j258043j048051j129959
37074b242955n30409O66261J012269j5071r22193l51827Q68228J059875K29144
37065b26678j71559L74767P77656J72400q13749j118894p11635l55901l87308
37056b460901l78339O0019O00280N02365m87078j655909j890143q09678P67262
$$ plain form
37121 -180173 -488747 -281701 -30963 -83859 -218783 -55504 446829 1049490 1553976 1893458
37111 1893458 2024026 1882418 1467463 910649 413755 79531 -178861 -529705 -1069236
37102 -1069236 -1803595 -2654176 -3369415 -3591158 -3222854 -2611449 -2118712 -1653344 -966771
37093 -966771 -288175 -177848 -691870 -1149919 -919158 -114198 619339 756185 299788 -124427
37083 -124427 381039 2046437 3801920 4167217 2909779 1193098 -64945 -1112996 -2242955
37074 -2242955 -2773364 -2107103 -1094834 -1109905 -2032098 -2383925 -1515697 -455822 -226678
37065 -226678 -398237 -23470 754186 926586 112837 -1006057 -1717692 -2073593 -2460901
37056 -2460901 -2839240 -2779221 -2178941 -1676576 -2163654 -3819563 -5709706 -6519384 -5752122
37047e752122J638342J391742N89098p0854l95729m69428k21216M00097R99321
37038a890749R67606K83441k93512j40565L81283M38668q0040m71561l24215k3760
37028a153404N5129J11645K46687R405o90999r53878j42465Q23436O58766j95068
37018a230746j48922R35450J384649L33732r27629j038289n31129n55625q44382
37009b622891m21073M66790P05753K13039l7569K35857L02586k2041J03534R95494
36999h0521J584236Q55491o21982j401922r73075j69782O5547k47549m07473p4972
36989a472002K53895m9956p39863q44570J7949J007831J163783O37643K07096
36980A81806J1475l42635o73548l00335O76087J187243O63615j36918k47461K15952
$$ plain form
37047 -5752122 -4113780 -2722038 -2132940 -2203794 -2599523 -3068951 -3290167 -2890070 -1890749
37038 -1890749 -923143 -639702 -933214 -1073779 -692496 -253828 -333868 -805429 -1129644 -1153404
37028 -1153404 -1098275 -986630 -739943 -730538 -1421537 -2375415 -2517880 -1694444 -1035678 -1230746
37018 -1230746 -1379668 -444218 940431 1274163 346534 -691755 -1222884 -1778509 -2622891
37009 -2622891 -3043964 -2577174 -1871421 -1658382 -1695951 -1460094 -1157508 -1179549 -1076015 -80521
36999 -80521 1503715 2359206 1737224 335302 -637773 -807555 -742008 -989557 -1397030 -1472002
36989 -1472002 -1218107 -1268063 -2007926 -2852496 -2834547 -1826716 -662933 -25290 181806
36980 181806 193281 -149354 -822902 -1123237 -447150 740093 1403708 1266790 1019329 1235281
36970A235281M17810j4782o89128j024903p55754j02787L22115J02286l51667
36961h61529k25533M61722O85721j14992j048899r25965N1801N83213Q8831n86532
36951a892162m32451M17586R79926O55018k04180q31220q42195m24505P1809M86166
36941b016208P60090P70042M99089K27902K47554M56971N45445M62854L24961
36932B278700j3354p29231j392013j227408k18539O82133P57729L88165L25942
36923H52124O21081P43911M11504j50145m97129k27058O74683J466513J140777
36914E036261k96190j533648j452004m51024K45502J29115l64314o94504n75288
36905D3906J00602R46230J065552J38430q59688q70309k58077r4051l68739k29516
$$ plain form
36970 1235281 1653091 1638309 949181 -75722 -831476 -934263 -612148 -509862 -861529
36961 -861529 -1087062 -625340 60381 -54611 -1103510 -2029475 -1977674 -1394461 -1305630 -1892162
36951 -1892162 -2324613 -1907027 -927101 -272083 -476263 -1307483 -2149678 -2574183 -2502374 -2016208
36941 -2016208 -1256118 -486076 13013 240915 488469 945440 1490885 1953739 2278700
36932 2278700 2265346 1536115 144102 -1083306 -1301845 -619712 138017 526182 852124
36923 852124 1473205 2217116 2628620 2478475 1981346 1754288 2428971 3895484 5036261
36914 5036261 4740071 3206423 1754419 1303395 1548897 1678012 1313698 619194 43906
36905 43906 144508 1090738 2156290 2294720 1435032 564723 306646 212595 -156144 -385660
36895c85660K32415q688r57619j231039j92107R53776R77495L28362R8759L35871
36885A51565M34976L64081L76672J63781n72601j200504r33037j44937J83919
36876a176085L6661K24063Q48091J089199N98641L1505l3749J75782K14443j2347
36866A996204m33151q62018p84329J26223J184318J263274L78405k20520J54009
36857B802415O89456M11447m37527r97792j005199o89529j24502N30407O80774
36848A859950L2703p16708p38554k87358k18770n75232o02057q0467L28047K04124
36838g94322l3289N1375K23027J13329j27859j81009j41950k69810m03712j24484
36828a688704N50165J030812Q37247K03641j63079J28190P65688J166985J085289
$$ plain form
36895 -385660 -153245 -161933 -1119552 -2350591 -2542698 -1588922 -611427 -283065 -184306 151565
36885 151565 586541 950622 1327294 1491075 918474 -282030 -1215067 -1360004 -1176085
36876 -1176085 -1139424 -915361 -67270 1021929 1620570 1652075 1618326 1794108 2008551 1996204
36866 1996204 1563053 701035 -83294 42929 1227247 2490521 2868926 2648406 2802415
36857 2802415 3491871 3903318 3465791 2467999 1462800 773271 648769 1179176 1859950
36848 1859950 1892653 1175945 437391 150033 -68737 -643969 -1246026 -1326493 -998446 -794322
36838 -794322 -827611 -776236 -553209 -439880 -567739 -748748 -890698 -1160508 -1564220 -1688704
36828 -1688704 -1138539 -107727 729520 933161 770082 898272 1663960 2830945 3916234
36819C916234O01820k19983j196508j667419j010149K86346Q24703M5126r45673
36810F34497r50406l59542k80607o10446l49005L96136L21779q31547j470972
36801c500113m00832J307183J786966R15159J74828M18094R56984Q31806k84r07471
36791A582320j306654r76916k01732K70545r0120q01429p32946M88381J810070
36782D1519J845855M78911r78795j302269p46693n68996j195639j485988l35131
36773d247226J469123J982610O99511o86184n59278N70708J084251N23374j91443
36764F45446l53312j49950J29728N19373Q36399N64948l63394j193938j105629
36755d70329j42748P47216N83721n71451j405842p13502R13222J546163M82040
$$ plain form
36819 3916234 4518054 4298071 3101563 1434144 423995 710341 1535044 1580170 634497
36810 634497 -315909 -675451 -956058 -1566504 -1915509 -1519373 -1197594 -2029141 -3500113
36801 -3500113 -3900945 -2593762 -806796 108363 283191 701285 1658269 2490075 2489791 1582320
36791 1582320 275666 -701250 -902982 -632437 -722557 -1523986 -2256932 -1768551 41519
36782 41519 1887374 2366285 1387490 85221 -661472 -1230468 -2426107 -3912095 -4247226
36773 -4247226 -2778103 -795493 -95982 -782166 -1341444 -770736 313515 836889 645446
36764 645446 292134 142184 271912 791285 1627684 2192632 1829238 635300 -470329
36755 -470329 -613077 134139 717860 146409 -1259433 -1972935 -1059713 486450 968490
36746I68490o84366l81821O39055O97354m4601p5161O61598O25787n22538j148968
36736G34829l06907P79026Q41006M15691L76968K35455o13333j285576p56972
36727D20187J80831R2370o66435n16748P01197J455965Q83793j97437q39522j091038
36717D23163j182851q22245J06952R83402J129972N62449j90959n84380l37392
36708H8111K80881N04223q6511r26259j198302q88360m49364J41383J058399J734331
36698B58532J426633M94039n5793j67640o18602j336095j289536l14454L94769
36689a208147J19112l64260k22135J83062K20964P3261O3370j05673n63851o23463
36679b427760J25017Q35418N43347l13759n28534J37256P79320O62652n4123p17147
$$ plain form
36746 968490 284124 -97697 541358 1238712 1194111 1118950 1780548 2406335 1883797 734829
36736 734829 427922 1206948 2047954 2463645 2840613 3076068 2462735 1177159 420187
36727 420187 601018 693388 26953 -489795 211402 1667367 2551160 2353723 1514201 423163
36717 423163 -759688 -1581933 -1474981 -491579 638393 1200842 1009883 425503 88111
36708 88111 368992 873215 786704 -139555 -1337857 -2226217 -2675581 -2534198 -1475799 258532
36698 258532 1685165 2179204 2123411 1955771 1337169 1074 -1288462 -1602916 -1208147
36689 -1208147 -1089035 -1453295 -1675430 -1492368 -1271404 -1198143 -1134773 -1240446 -1804297 -2427760
36679 -2427760 -2302743 -1467325 -923978 -1237737 -1766271 -1629015 -849695 -187043 -241166 -958313
36669i58313p58611j44670L94641N2081q30554r54538Q6077J079309R86303M25745
36659f22530M03564N86066J73160l22540J98628J333775J504550L58263p02094
36650B910842o19175M8572L32520J31932k10284o19099j026864j145429r38002
36641a134987p10943m84524N0859P54554R94713O55050L74026M40393K95129l82765
36631H51505r18720o61502j07729j77858p61227q57381q8875P11911O57757J1077
36621a341042k10244L52173Q85620N16848m60934r89248o89177j85140M4047K25522
36611a851575L91107k6891r85510j238491m4771J353252J281287M5727o67240
36602a743105l31082J23676K58689N31868P53680R5540j019812r82950M13251
$$ plain form
36669 -958313 -1716924 -1861594 -1466953 -1414872 -2245426 -3199964 -3113887 -2034578 -1048275 -622530
36659 -622530 -218966 367100 540260 217720 416348 1750123 3254673 3612936 2910842
36650 2910842 2291667 2340239 2672759 2804691 2594407 1975308 948444 -196985 -1134987
36641 -1134987 -1845930 -2330454 -2279595 -1525041 -530328 124722 498748 939141 1234270 851505
36631 851505 -67215 -728717 -836446 -1014304 -1775531 -2632912 -2721787 -2009876 -1352119 -1341042
36621 -1341042 -1551286 -1199113 -313493 203355 -257579 -1246827 -1936004 -2121144 -2077097 -1851575
36611 -1851575 -1460468 -1487359 -2472869 -3711360 -3756131 -2402879 -1121592 -1075865 -1743105
36602 -1743105 -2074187 -1950511 -1691822 -1159954 -406274 -310734 -1330546 -2313496 -1900245
36593a900245J323113O45199l57019l23583J15683m4691j48892P15161J558826
36584A583552Q02932j018485j843468r77570L46272J031889J097304P45180L9907
36575A807513m65828j73207M41817L69499l34850p23631n97305o17285q41378
36566a134655o07565Q827Q9688m84927o75265K8090Q22400R61958P27735N53504
36556B89790L30493J05032L55012R78743J052557K27587o06807o85864m30992
36547A615551m71292n59052k54899J53197K64146L69252P89562J034022M77151
36538C417638o07652j448044j759665j670194j157973k81030M50085O02881M02949
36529b051005K89560L14322L97654O11046P67293M27156k08711k79428K67726
$$ plain form
36593 -1900245 -577132 68067 -288952 -612535 -496852 -541543 -690435 24726 1583552
36584 1583552 2386484 1367999 -475469 -1453039 -1106767 -74878 1022426 1767606 1807513
36575 1807513 1341685 1168478 1610295 1979794 1644944 921313 324008 -293277 -1134655
36566 -1134655 -1742220 -1733393 -1643705 -2128632 -2803897 -2775807 -1953407 -991449 -263714 289790
36556 289790 620283 725315 1080327 2059070 3111627 3339214 2732407 2046543 1615551
36547 1615551 1144259 585207 330308 483505 747651 1116903 1906465 2940487 3417638
36538 3417638 2809986 1361942 -397723 -2067917 -3225890 -3506920 -3056835 -2453954 -2051005
36529 -2051005 -1761445 -1447123 -1049469 -438423 328870 756026 547315 267887 535613
36520E35613K55927p74503j362108k34728J354360J186537n61084j481064m42952
36511a524002R67049R45967k39888j196352j293988p52232J37434R65950J125067
36502h64995N82792J73469M51682Q37578N73266n4453k42422K6414Q5113k46254
36492A322190m53042k67575m7532o6977q0136J21747K34278n1287l75835p6454
36482B59377Q04864J366302R31555n1667n93019m60629l79013q85679j552156
36473e60065j638750j080592m02872K9623K17453K06340M9563k0184J87160M85680
36463b526644N47163L61358J41204n8606k67724l49684k31065j59273k86251k53060
36453c082582K78242R29676J057199O80534L08591N7171l12698o73751p01113
$$ plain form
36520 535613 791540 17037 -1345071 -1579799 -225439 961098 400014 -1081050 -1524002
36511 -1524002 -556953 389014 149126 -1047226 -2341214 -3093446 -2956012 -1990062 -864995
36502 -864995 -282203 -108734 342948 1180526 1753792 1699339 1456917 1483331 1568444 1322190
36492 1322190 869148 601573 554041 487064 406928 528675 762953 711666 335831 259377
36482 259377 1064241 2430543 3362098 3310431 2717412 2256783 1877770 992091 -560065
36473 -560065 -2198815 -3279407 -3682279 -3652656 -3435203 -3228863 -3179300 -3199484 -3012324 -2526644
36463 -2526644 -1979481 -1618123 -1476919 -1535525 -1803249 -2152933 -2383998 -2543271 -2829522 -3082582
36453 -3082582 -2804340 -1874664 -817465 -136931 171660 228831 -83867 -757618 -1458731
36444a458731o13349p93088p78966K12038J679023K049098Q79491m07137n94802
36435A73577k62113m32760p67883l28472O25082R67852N16658K33400O29816J035816
36425B390973O86416k23511q64868p18127l4190L95524k7323r91752j504674j075385
36415a966917l14144M41j1012K51056P75738R82683O56757J82582o8508n2668
36405D36008J28262K49231j4977o22423r70413o60522j29580L8886J2310K06344
36395a326874L41614m7086m95031j30498Q08360J171575O92783L80563Q22367
36386B217773J252453Q23841j64939q95777j064760p51017n4848N64738L92464
36377B319928m55660q18077r0735P01111K96312r88484j810997j642679r99593
$$ plain form
36444 -1458731 -2072080 -2865168 -3644134 -3432096 -1753073 296025 1175516 768379 173577
36435 173577 -88536 -521296 -1289179 -1617651 -992569 -24717 491941 725341 1355157 2390973
36425 2390973 3077389 2853878 1989010 1270883 1236693 1632217 1604894 613142 -891532 -1966917
36415 -1966917 -2281061 -2280620 -2291632 -2040576 -1264838 -282155 374602 557184 488676 436008
36405 436008 564270 813501 798524 176101 -794312 -1454834 -1584414 -1545528 -1533218 -1326874
36395 -1326874 -985260 -1032346 -1527377 -1657875 -849515 322060 1014843 1395406 2217773
36386 2217773 3470226 4294067 4129128 3233351 2168591 1417574 1362726 1927464 2319928
36377 2319928 1864268 1046191 955456 1656567 1952879 964395 -846602 -2489281 -3488874
36368c488874k40576O71371J354113J171658L82555Q7557P16698J424387J343210
36359C422099O73040J09303j23624j66768k4235K58804L02829j71285q49239j205415
36349B225509j168610j020654q63949o16315l42466j32490K05328Q31447J336020
36340D53820J088444K08043l83252j39044L60445K38090m45359q10159l89488
36331A81540K76752L78705k06133q78951j027840o03043q6847L1373j93199j98927
36321b326570L39478R54429R28219L27395j9116K97876O68572L89975l02816o46046
36311F11396m42657j63016j54069l25500n04249n56183k81874K19341K37274p25007
36301b084544j835941j568635K79201K061932K252017J172276J75453j82859l12081
$$ plain form
36368 -3488874 -3729450 -3058079 -1703966 -532308 -149753 -62196 654502 2078889 3422099
36359 3422099 4095139 4204442 4080818 3914050 3889815 4148619 4451448 4280163 3430924 2225509
36349 2225509 1056899 36245 -827704 -1444019 -1786485 -1918975 -1713647 -882200 453820
36340 453820 1542264 1750307 1367055 1228011 1588456 1826546 1381187 571028 181540
36331 181540 458292 836997 630864 -248087 -1275927 -1878970 -1965817 -1934444 -2127643 -2326570
36321 -2326570 -1987092 -1032663 -104444 222951 203835 501711 1170283 1560258 1257442 611396
36311 611396 168739 5723 -148346 -473846 -978095 -1534278 -1816152 -1596811 -1359537 -2084544
36301 -2084544 -3920485 -5489120 -5209919 -3147987 -895970 276306 451759 268900 -43181
36292d3181m37038l07707M5565J66769q1606l08245k90016k84589m28942l67915
36282b336905J70227Q02254Q84376L08662l94907o85095n22290k54501j36101
36273b164280o7099J47911L79328K65576j81529l78327J10443Q64358J049083
36264B5464M85883j96827n17983p09335j073739j274405p86793J64239P13672
36255c169824M64488k0605p0549J90270K24667N6837K01783O51189O99860J03123
36245f68761l18348J27760P79358N11959m53200p57116L6144P62963M52138k97383
36235A75514m43159q6444K0619j09932J23323O73141Q48318M40491p8210m19466
36225A144195o71242o94982k71425J26274k83708j231521j419105l01863J046017
$$ plain form
36292 -43181 -480219 -787926 -742361 -575592 -657198 -965443 -1255459 -1540048 -1968990 -2336905
36282 -2336905 -2166678 -1364424 -480048 -171386 -566293 -1251388 -1773678 -2028179 -2164280
36273 -2164280 -2231379 -2083468 -1704140 -1438564 -1620093 -1998420 -1887977 -1023619 25464
36264 25464 511347 314520 -203463 -912798 -1986537 -3260942 -4047735 -3883496 -3169824
36255 -3169824 -2705336 -2725941 -2796490 -2606220 -2381553 -2324716 -2122933 -1471744 -771884 -668761
36245 -668761 -987109 -859349 -79991 431968 -21232 -778348 -742204 20759 472897 175514
36235 175514 -267645 -354089 -333470 -443402 -320079 353062 1201380 1641871 1563661 1144195
36225 1144195 472953 -222029 -493454 -367180 -650888 -1882409 -3301514 -3603377 -2557360
36216b557360J370265P68846J84248L2615M5872L548q7137k51084m05286k24580
36206a120053L39299P08885M14766r6746l0633N46767P46118J12140p79048j136550
36196b95055q74874m68584k26262j5214M02805R73532J322833J096758L23171
36187B239110n78841j123847j058278m62606K51252N43675K46376j70274j41395
36178b54828K36508M06127K49701J98615L62408K49987l43654q46353p48247l32616
36168h22352o7441J29584M14306M17821r3726m84764r4737N83489N84989L6043
36158F03212j15855J94749K3914q19866j200656l82651P89532J179933R04839
36149A177151P11653N74450k1565q24417r56734k65743L81165L03072j80342l64098
$$ plain form
36216 -2557360 -1187095 -418249 -234001 -201386 -155514 -151966 -239103 -490187 -895473 -1120053
36206 -1120053 -780754 -71869 342897 246151 215518 762285 1508403 1620543 841495 -295055
36196 -295055 -1169929 -1638513 -1864775 -1879989 -1477184 -503652 819181 1915939 2239110
36187 2239110 1660269 536422 -521856 -984462 -733210 -189535 56841 -113433 -254828
36178 -254828 -18320 387807 637508 836123 1198531 1448518 1104864 258511 -489736 -822352
36168 -822352 -889793 -760209 -345903 71918 -21808 -506572 -601309 -17820 567169 603212
36158 603212 487357 682106 706020 -113846 -1314502 -1697153 -907621 272312 1177151
36149 1177151 1888804 2463254 2441689 1617272 660538 394795 775960 1079032 898690 534592
36139E34592p0030L28170M62713K96837L1833j59164l04976n03489o29178m14386
36129d27078O1513K91735K5820k81482j01599L63411N19883L18779K12694K52030
36119A235706j2141n52482n83059K52438J029582O33909n89207j114016k41982
36110E8748R04290P80408o55540j931357j782316l99489J021350J515104R80716
36101D91914j0145o70928m57885M98474J357140J264848K48540p60003r33018
36092A028937m39737j45533m99360r86960q16589K3406O83669N03371j44709l76987
36082a170492j5483K51828N7486O2712R05746J868600J510231l02352j869485
36073A298791j624635k3375J132499Q76917r6541o40628m64377o2155J37750J65209
$$ plain form
36139 534592 464562 792732 1255445 1552282 1584115 1424951 1119975 616486 -12692 -427078
36129 -427078 -365565 -73830 -48010 -329492 -431091 -67680 452203 770982 983676 1235706
36119 1235706 1223565 671083 88024 340462 1370044 2003953 1414746 300730 58748
36110 58748 963038 1743446 1087906 -843451 -2625767 -3025256 -2003906 -488802 491914
36101 491914 481769 -189159 -647044 -148570 1208570 2473418 2721958 1961955 1028937
36092 1028937 589200 443667 -55693 -1042653 -1859242 -1835836 -1152167 -648796 -793505 -1170492
36082 -1170492 -1185975 -934147 -876661 -813949 91797 1960397 3470628 3168276 1298791
36073 1298791 -325844 -349219 783280 1660197 1563656 923028 458651 396496 534246 699455
36063F99455K18553K96211K15188n5206k14803K4978M34286M03896k65479j024253
36053G32826j268799j056042p81598m94351o4604K34024K6419l54336j50967N90800
36043b586628Q85785K51093m76489l42839L27368N04924K4394k98896j91M34009
36033a277470M27154P4220k25738l66742m52844m99534m95529m67612k88780K45335
36023c327540R46979J229658Q67361L95307L70923N63608L73728j79128m91932
$$ plain form
36063 699455 918008 1214219 1429407 1374201 1159398 1184376 1618662 2022558 1757079 732826
36053 732826 -535973 -1592015 -2373613 -2867964 -2932568 -2698544 -2672125 -3026461 -3177428 -2586628
36043 -2586628 -1700843 -1449750 -1926239 -2269078 -1941710 -1436786 -1412392 -1711288 -1711479 -1277470
36033 -1277470 -850316 -776096 -1001834 -1368576 -1821420 -2320954 -2816483 -3284095 -3572875 -3327540
36023 -3327540 -2380561 -1150903 -283542 111765 482688 1046296 1420024 1240896 748964
$$ [...]
##END NTUPLES=NMR SPECTRUM
##END=
