##TITLE=1H_DE-123_oil
 200.13MHz,D2O.
 8 sc
 
 26.1.2026
##JCAMPDX= 6.0         $$ Bruker NMR JCAMP-DX V2.0
##DATA TYPE= NMR FID
##DATA CLASS= NTUPLES
##ORIGIN= UXNMR, Bruker Analytische Messtechnik GmbH
##OWNER= pz
$$ XWIN-NMR		Version 3.5
$$ Mon Jan 26 13:49:13 2026 Russian Standard Time (UT+4h)  she@DPX200
##.OBSERVE FREQUENCY= 200.1313
##.OBSERVE NUCLEUS= ^1H
##.DELAY= (6, 6)
##.ACQUISITION MODE= SIMULTANEOUS
##.ACQUISITION SCHEME= undefined
##.AVERAGES= 8
##.DIGITISER RES= 18
##SPECTROMETER/DATA SYSTEM= spect
##.PULSE SEQUENCE= zg30
##.SOLVENT NAME= D2O
##.SHIFT REFERENCE= (INTERNAL, D2O, 0, 14.3821)
##AUDIT TRAIL= $$ (NUMBER, WHEN, WHO, WHERE, WHAT)
$$ ##TITLE= Audit trail, XWIN-NMR		Version 3.5
$$ ##JCAMPDX= 5.01
$$ ##ORIGIN= Bruker BioSpin GmbH
$$ ##OWNER= she
$$ F:/spectra/data/she/nmr/H-C/1/audita.txt
$$ ##AUDIT TRAIL=  $$ (NUMBER, WHEN, WHO, WHERE, WHAT)
(   1,<2026-01-26 13:47:24.01 +0400>,<she>,<DPX200>,
      <created by zg, POWCHK disabled, PULCHK disabled
       configuration hash MD5:
       00 E9 B6 7A A2 85 ED C7 34 08 36 98 17 FE 4E 26
       data hash MD5: 16K
       31 33 C1 BA 0D 28 CC 38 12 5F 64 6E 4B A5 12 FB>)
$$ ##END=
$$ 
$$ hash MD5
$$ 20 58 A0 EF 99 BF 32 43 10 2D 26 9A 99 2C AB FF
##$RELAX= 
##$RELAX= 
##$RELAX= 
##$RELAX= 
##$RELAX= 
##$RELAX= 
$$ Bruker specific parameters
$$ --------------------------
##$DU= <F:/spectra>
##$EXPNO= 1
##$NAME= <H-C>
##$PROCNO= 1
##$TYPE= <nmr>
##$USER= <she>
##$AMP= (0..31)
100 100 100 100 100 100 100 100 100 100 100 100 100 100 100 100 100 100 
100 100 100 100 100 100 100 100 100 100 100 100 100 100 
##$AQSEQ= 0
##$AQ_mod= 1
##$AUNM= <au_zg>
##$AUTOPOS= <>
##$BF1= 200.13
##$BF2= 200.13
##$BF3= 200.13
##$BF4= 200.13
##$BF5= 200.13
##$BF6= 200.13
##$BF7= 200.13
##$BF8= 200.13
##$BYTORDA= 1
##$CFDGTYP= 0
##$CFRGTYP= 5
##$CHEMSTR= <none>
##$CNST= (0..31)
1 1 145 1 1 1 1 1 1 1 1 1 1 1 1 1 1 1 1 1 1 1 1 1 1 1 1 1 1 1 1 1 
##$CPDPRG= <>
##$CPDPRG1= <>
##$CPDPRG2= <>
##$CPDPRG3= <>
##$CPDPRG4= <mlev>
##$CPDPRG5= <mlev>
##$CPDPRG6= <mlev>
##$CPDPRG7= <mlev>
##$CPDPRG8= <mlev>
##$CPDPRGB= <>
##$CPDPRGT= <>
##$D= (0..31)
0 0.7 0 0 0 0 0 0 0 0 0 0.03 0 0 0 0 0 0 0 0 0 0 0 0 0 0 0 0 0 0 0 0 
##$DATE= 1769420843
##$DBL= (0..7)
120 120 120 120 120 120 120 120 
##$DBP= (0..7)
150 150 150 150 150 150 150 150 
##$DBP07= 0
##$DBPNAM0= <>
##$DBPNAM1= <>
##$DBPNAM2= <>
##$DBPNAM3= <>
##$DBPNAM4= <>
##$DBPNAM5= <>
##$DBPNAM6= <>
##$DBPNAM7= <>
##$DBPOAL= (0..7)
0.5 0.5 0.5 0.5 0.5 0.5 0.5 0.5 
##$DBPOFFS= (0..7)
0 0 0 0 0 0 0 0 
##$DE= 6
##$DECBNUC= <off>
##$DECIM= 32
##$DECNUC= <off>
##$DECSTAT= 4
##$DIGMOD= 1
##$DIGTYP= 9
##$DL= (0..7)
0 120 120 120 120 120 120 120 
##$DP= (0..7)
150 150 150 150 150 150 150 150 
##$DP07= 0
##$DPNAME0= <>
##$DPNAME1= <>
##$DPNAME2= <>
##$DPNAME3= <>
##$DPNAME4= <>
##$DPNAME5= <>
##$DPNAME6= <>
##$DPNAME7= <>
##$DPOAL= (0..7)
0.5 0.5 0.5 0.5 0.5 0.5 0.5 0.5 
##$DPOFFS= (0..7)
0 0 0 0 0 0 0 0 
##$DQDMODE= 0
##$DR= 18
##$DS= 0
##$DSLIST= <SSSSSSSSSSSSSSS>
##$DSPFIRM= 0
$$ [...]
##$SUBNAM0= <"">
##$SUBNAM1= <"">
##$SUBNAM2= <"">
##$SUBNAM3= <"">
##$SUBNAM4= <"">
##$SUBNAM5= <"">
##$SUBNAM6= <"">
##$SUBNAM7= <"">
##$SUBNAM8= <"">
##$SUBNAM9= <"">
##$SW= 18.0517328524113
##$SWIBOX= (0..15)
0 0 2 0 0 0 0 0 0 0 0 0 0 0 0 0 
##$SW_h= 3612.71676300578
##$TD= 16384
##$TD0= 1
##$TE= 0
##$TE2= 300
##$TE3= 300
##$TEG= 300
##$TL= (0..7)
0 120 120 120 120 120 120 120 
##$TP= (0..7)
150 150 150 150 150 150 150 150 
##$TP07= 0
##$TPNAME0= <>
##$TPNAME1= <>
##$TPNAME2= <>
##$TPNAME3= <>
##$TPNAME4= <>
##$TPNAME5= <>
##$TPNAME6= <>
##$TPNAME7= <>
##$TPOAL= (0..7)
0.5 0.5 0.5 0.5 0.5 0.5 0.5 0.5 
##$TPOFFS= (0..7)
0 0 0 0 0 0 0 0 
##$TUNHIN= 0
##$TUNHOUT= 0
##$TUNXOUT= 0
##$USERA1= <user>
##$USERA2= <user>
##$USERA3= <user>
##$USERA4= <user>
##$USERA5= <user>
##$V9= 5
##$VALIST= <valist>
##$VCLIST= <CCCCCCCCCCCCCCC>
##$VD= 0
##$VDLIST= <DDDDDDDDDDDDDDD>
##$VPLIST= <PPPPPPPPPPPPPPP>
##$VTLIST= <TTTTTTTTTTTTTTT>
##$WBST= 1024
##$WBSW= 4
##$XGAIN= (0..3)
0 0 0 0 
##$XL= 0
##$YL= 0
##$YMAX_a= 205221
##$YMIN_a= -186324
##$ZGOPTNS= <>
##$ZL1= 120
##$ZL2= 120
##$ZL3= 120
##$ZL4= 120
##$ABSF1= 10
##$ABSF2= 0
##$ABSG= 5
##$ABSL= 3
##$ALPHA= 0
##$AQORDER= 0
##$ASSFAC= 0
##$ASSFACI= 0
##$ASSFACX= 0
##$ASSWID= 0
##$AUNMP= <proc_1d>
##$AZFE= 0.1
##$AZFW= 0.1
##$BCFW= 1
##$BC_mod= 2
##$BYTORDP= 1
##$COROFFS= 0
##$CY= -3
##$DATMOD= 1
##$DC= 2
##$DFILT= <>
##$DTYPP= 0
##$F1P= 0
##$F2P= 0
##$FCOR= 0.5
##$FTSIZE= 0
##$FT_mod= 4
##$GAMMA= 1
##$GB= 0.15
##$INTBC= 1
##$INTSCL= 1
##$ISEN= 128
##$LB= 0.25
##$LEV0= 0
##$LPBIN= 0
##$MAXI= 10000
##$MC2= 0
##$MEAN= 0
##$ME_mod= 0
##$MI= 1.114404
##$NCOEF= 0
##$NC_proc= 0
##$NLEV= 6
##$NOISF1= 3.799351
##$NOISF2= 2.8
##$NSP= 1
##$NTH_PI= 0
##$NZP= 0
##$OFFSET= 14.38212
##$PC= 1
##$PHC0= -3700.997
##$PHC1= 7.592309
##$PH_mod= 1
##$PKNL= yes
##$PPARMOD= 0
##$PSCAL= 0
##$PSIGN= 0
##$REVERSE= no
##$SF= 200.129724274929
##$SI= 16384
##$SIGF1= 3
##$SIGF2= 2
##$SINO= 400
##$SIOLD= 16384
##$SREGLST= <1H.CDCl3>
##$SSB= 0
##$STSI= 0
##$STSR= 0
##$SW_p= 3205.1282051282
##$SYMM= 0
##$S_DEV= 0
##$TDeff= 0
##$TDoff= 0
##$TI= <>
##$TILT= no
##$TM1= 0
##$TM2= 0
##$TOPLEV= 0
##$USERP1= <user>
##$USERP2= <user>
##$USERP3= <user>
##$USERP4= <user>
##$USERP5= <user>
##$WDW= 1
##$XDIM= 8192
##$YMAX_p= 0
##$YMIN_p= 0
$$ End of Bruker specific parameters
$$ ---------------------------------
##NTUPLES= NMR FID
##VAR_NAME=  TIME,          FID/REAL,        FID/IMAG
##SYMBOL=    X,             R,               I
##VAR_TYPE=  INDEPENDENT,   DEPENDENT,       DEPENDENT
##VAR_FORM=  AFFN,          ASDF,            ASDF
##VAR_DIM=   8192,          8192,            8192
##UNITS=     SECONDS,       ARBITRARY UNITS, ARBITRARY UNITS
##FACTOR=    0.0002768,     1,               1
##FIRST=     0,             0,               0
##LAST=      2.2672688,     0,               0
##MIN=       0,             -186324,         0
##MAX=       2.2672688,     205221,          0
$$ Real data points
##PAGE= N=1
##DATA TABLE= (X++(R..R)), XYDATA
0 0 0 0 0 0 0 0 0 0 0 0 0 0 0 0 0 0 0 0 0 0 0 0 3 -5 5 -8 8 -8 8 -8 11 -12 12 -14 17 -19 20 -22 25 -27 29 -33 37 -41
44 -41 45 -48 54 -60 65 -72 80 -87 95 -106 117 -133 147 -168 192 -221 259 -310 377 -474 622
65 622 -869 1326 -2348 5547 -34543 -186324 -77844 14474 -64760 -33048 84964 73118 24710
78 24710 17707 -34606 -47377 22326 -1492 -71879 -13652 44812 12943 51578 100499 6262
90 6262 -49082 -203 -77355 -173051 -23975 131805 52207 -3407 76263 48999 -64182 -71437
102 -71437 -33414 -11311 36734 29686 -25145 27406 92494 9835 -48084 7781 -26750 -113927
114 -113927 -54801 21169 2898 59665 139040 41276 -70688 -27044 -14522 -81937 -40585 54546
126 54546 56018 37410 33210 -13942 -20613 18231 -36745 -97138 -22615 27358 -26641 7891 105821
139 105821 74009 1521 4330 -36086 -101635 -48169 25443 12348 32950 85480 36213 -35942
151 -35942 -30103 -36677 -60630 -19990 6744 -15762 24721 81516 39137 2988 36728 1078
163 1078 -82640 -66029 -15056 -16262 21347 82119 52647 890 -817 -36459 -85724 -45457 7362
176 7362 2006 27051 71565 43001 9612 23669 -4753 -59755 -46289 -22795 -36217 -1789
188 -1789 59626 50584 24579 27549 -14415 -73749 -57175 -19460 -15603 22208 74303 58419 23576
201 23576 21348 -10320 -58094 -47904 -25498 -32761 -8277 40884 44715 31745 32802 1212 -43966
214 -43966 -45124 -37421 -37877 6713 63260 58422 36049 35499 2921 -52164 -59824 -41894 -35198 -7187
228 -7187 34562 41856 36000 38220 11885 -30722 -41608 -37540 -36478 -7534 33962 46809 48987
241 48987 48033 9976 -39925 -51019 -47145 -50175 -23240 25879 47749 46076 41324 19346 -15688
254 -15688 -34846 -42921 -42370 -15459 21127 38877 45676 46689 21271 -18669 -42767 -53609 -54123
267 -54123 -28618 10995 36489 48903 52992 32616 -4095 -30978 -43685 -45162 -27198 4473
279 4473 30631 46218 48214 27377 -5412 -32834 -49960 -55000 -36701 -2408 28410 48575 54947
292 54947 40943 10823 -20136 -42567 -49721 -36613 -9471 18865 40820 48910 36051 7224
304 7224 -22312 -44467 -53009 -42326 -14753 18170 44232 54868 46558 22172 -9091 -36733 -50540
317 -50540 -44359 -21641 7327 33389 46622 41742 19926 -10274 -36555 -50325 -45881 -23729 6859
330 6859 36154 53109 50880 30777 847 -28784 -48726 -49652 -32280 -4550 24067 44108 45515
343 45515 28475 3096 -24763 -46208 -48886 -30854 -3055 25107 46955 52418 39540 11960
355 11960 -21518 -46119 -49712 -37809 -18145 11492 41484 49703 33724 12116 -11981 -37468
367 -37468 -47846 -36806 -14774 13734 41979 50777 40145 21430 -6452 -38409 -52254 -44707
379 -44707 -26683 3111 35058 45511 38533 27960 1185 -36126 -48033 -34069 -20842 -1252
391 -1252 31290 48548 41478 27712 3174 -30392 -45456 -41871 -37309 -14177 26652 46163 41392
404 41392 36314 14003 -26108 -43006 -37675 -34237 -11748 30193 45129 34981 32434 15424 -24390
417 -24390 -41953 -36728 -38480 -24054 16523 36562 35336 43517 30779 -13081 -36165 -36782 -43835
430 -43835 -27480 19150 40295 35853 41847 25288 -21763 -40052 -33062 -40966 -27682 15761 28596
443 28596 22661 43632 41426 -6156 -27490 -21924 -40834 -44763 -2905 27201 35432 51620 37738
456 37738 -12058 -30658 -30189 -52441 -41708 14698 33586 23212 41250 36508 -7438 -15400 -7114
469 -7114 -42011 -50452 618 18840 5044 34535 57284 19222 -16896 -33166 -56375 -44153
481 -44153 1435 12148 19155 63450 56275 -13075 -28616 -7084 -33159 -44216 -1319 9488
493 9488 -1257 34279 48621 4354 -5533 9401 -32047 -66116 -31356 3950 22420 54191
505 54191 50364 11246 7760 -6619 -69946 -64720 15780 24868 -10466 23908 52076 8541 -9703
518 -9703 4518 -24095 -40269 -10251 -13660 -22983 31944 68020 32857 10459 570 -44388 -56259
531 -56259 -21825 -20072 -4914 65225 65609 -12985 -17281 21614 -19631 -56992 -13027 9635 -7810
544 -7810 12197 30124 16488 31283 34633 -28401 -60826 -27123 -23626 -26027 31155 61427 29915
557 29915 23617 12457 -52991 -60652 3874 4992 -26677 19583 55758 12522 -4596 16643 -1746
570 -1746 -23462 -17550 -38766 -42507 19423 46895 18300 32202 46215 -18159 -61039 -31927 -25189
583 -25189 -21484 35411 54009 8232 9265 28728 -18663 -47205 -8230 -3537 -28583 -5082 19085
596 19085 13372 35970 46714 -5275 -32429 -13856 -36786 -54983 7054 52292 30151 28264
608 28264 31868 -18311 -45172 -16820 -19502 -31130 12299 34369 4509 10918 35988 8545 -15044
621 -15044 -6208 -28553 -48232 -7712 20568 11198 36988 56216 4041 -36557 -23511 -32414 -42158
634 -42158 3201 33851 16219 23263 35014 -2267 -22514 -1893 -15257 -38101 -10923 9595
646 9595 -251 23041 48469 17719 -10069 -8513 -33053 -53435 -15381 18157 16075 33608 46526
659 46526 7959 -19915 -10130 -22570 -37595 -8233 12115 1054 15842 36459 15092 -1986
671 -1986 3543 -19804 -45532 -23686 424 1713 26570 48799 24066 -1754 -6380 -29045 -44530
684 -44530 -16349 5818 2286 20096 38263 15656 -2915 1703 -14180 -34517 -20363 -6708
696 -6708 -6298 16550 40648 26541 9899 5873 -18798 -41994 -28181 -9147 -2294 20433 38450
709 38450 22514 6593 3455 -15850 -34583 -21587 -7531 -6386 11190 31298 25035 14652 10959
722 10959 -11206 -32546 -27610 -17875 -12047 10683 33327 28163 17042 10084 -10962 -30896 -26060
735 -26060 -15963 -9685 9403 27963 24953 17950 12969 -6248 -25927 -25993 -20526 -16366 3110 24380
749 24380 27257 22738 16331 -3117 -23394 -26491 -22564 -16282 3137 22692 25963 22440 16002 -1354
763 -1354 -19495 -25565 -24664 -18461 -812 17469 23711 24524 20706 4183 -16025 -24796 -24619 -19287 -4279
778 -4279 13475 23441 26363 21046 4160 -13920 -23075 -25440 -21938 -7572 10524 22640 26426 22618
792 22618 8534 -7941 -19752 -25797 -23438 -10421 7500 19950 24850 22384 11330 -5316 -19442
805 -19442 -26495 -23849 -11845 4003 17501 25671 25178 14598 -2144 -16451 -24475 -24410 -15081 -128
819 -128 14875 24679 24586 15415 853 -13636 -23461 -25422 -17089 -2362 13079 23066 25652 18539 4494
834 4494 -10685 -22285 -25602 -19180 -5372 8807 20312 25460 19998 6554 -8390 -19849 -24924
847 -24924 -20226 -7970 6758 19677 25736 21374 8600 -4489 -17352 -25393 -23002 -11149 3125
860 3125 16186 24488 22078 11635 -873 -15235 -25150 -23059 -11571 1044 14087 24400 23702
873 23702 13419 988 -12897 -24437 -23179 -14112 -3408 9914 23620 23808 15159 4897 -8728
886 -8728 -22331 -24072 -15679 -5942 8422 22986 24652 15873 6623 -7616 -22399 -23824 -15806 -9017
900 -9017 4868 21031 22834 15801 9959 -2044 -18390 -22547 -17364 -13038 1031 19758 23441 17287
914 17287 13680 1132 -20170 -25378 -18457 -12958 457 18489 21706 16951 15818 2350 -18462
927 -18462 -20672 -14081 -15093 -7298 12794 20106 18211 19046 6627 -15119 -19166 -17236 -22319 -10942
941 -10942 16716 25002 17607 16900 7183 -12879 -18339 -16699 -19982 -7542 14958 15029 9061 18827 16221
956 16221 -7129 -16852 -15916 -22343 -13969 7349 13158 16299 29790 18952 -13188 -21133 -14277 -20742
970 -20742 -14932 7899 15433 15537 22217 10790 -11667 -8539 -3887 -21938 -22490 3169 11801 10078
984 10078 22589 21290 1180 -6329 -13866 -34063 -24194 8887 14827 9381 23825 22178 -4542
997 -4542 -13814 -12407 -20799 -12974 6596 2138 -86 23294 24768 -1073 -4951 -1439 -20931 -27161
1011 -27161 -8445 -454 9672 33157 27156 -3002 -6598 -4713 -26803 -27649 2048 11530 7579
1024 7579 18823 15623 -2067 2240 3151 -21574 -23800 -1252 -3177 -7388 18803 30426 12611
1037 12611 5680 -2488 -29046 -29031 -3719 -1504 641 27516 29669 443 -6597 -1861 -16910 -17758
1051 -17758 -1506 -5143 -6472 17270 20873 3193 10037 14650 -14905 -29518 -13775 -10609 -6052
1064 -6052 22310 29407 9796 7237 3087 -25002 -28941 -2955 152 -3680 15126 19396 2771
1077 2771 6868 10458 -11544 -17484 -4461 -13856 -18878 10471 25669 12890 15201 13649 -15864
1090 -15864 -27602 -13343 -12450 -8033 19617 26008 6171 6141 8505 -12530 -18161 -3026 -8512 -14351
1104 -14351 6339 14363 4855 15018 20519 -4903 -18965 -11372 -18267 -19010 9027 23227 13475
1117 13475 15481 13684 -12118 -21908 -8686 -10328 -11704 8624 15035 3129 9859 16484 -1998
1130 -1998 -11027 -4234 -14572 -21606 -847 12825 10157 19399 21829 -3099 -16979 -11288 -17420 -17981
1144 -17981 5241 16663 8385 12748 14558 -3483 -10723 -3188 -10953 -17352 -1366 7088 2943 13857
1158 13857 21844 4891 -7100 -6954 -18120 -22671 -3293 9529 8232 17245 20286 1206 -10135
1171 -10135 -6695 -12653 -16453 -1683 6102 3092 11231 17494 5029 -2592 -1488 -12431 -20617 -8697
1185 -8697 1374 3322 15027 21850 8226 -2943 -4615 -14808 -19806 -5961 3290 3891 12034 17032
1199 17032 5736 -1482 -1040 -10493 -16887 -8573 -1791 -615 10527 18921 10653 3382 85 -11223
1213 -11223 -19221 -10906 -2659 962 11056 17536 9949 2190 -999 -10442 -16115 -9078 -3510 -1344
1227 -1344 7840 15753 11117 5591 2658 -6857 -15161 -11871 -7029 -2932 7796 15783 12130 6811 2554
1242 2554 -7148 -14854 -11892 -6924 -2656 6578 13802 11164 7595 4527 -4857 -12752 -12114 -8252 -4990
1257 -4990 3577 11623 12515 10047 5249 -4144 -11661 -11772 -9731 -5846 3256 11366 12094 9735 5954 -2330
1273 -2330 -9869 -11330 -10452 -6851 1244 9242 11342 10374 7051 -375 -8414 -11671 -11453 -7207 494 7484
1289 7484 11289 11506 8276 717 -7314 -11009 -11248 -8564 -1843 6184 10479 11625 8603 2085 -5171
1304 -5171 -9602 -11311 -9036 -2558 4951 9544 11227 9659 3854 -4089 -9392 -11576 -10115 -4163 2974
1319 2974 8357 11117 10175 4643 -2039 -7993 -10987 -9984 -5184 1672 7337 11088 10514 5816 -1078
1334 -1078 -6376 -10541 -11125 -6781 164 6567 10013 10530 7009 556 -5615 -9849 -10820 -7424 -830 5076
1350 5076 9541 10661 7928 1610 -4440 -9389 -11048 -8359 -2397 3579 8497 11212 8672 3259 -2689
1365 -2689 -7917 -10773 -8659 -3348 2259 7268 10945 9359 4112 -1752 -7371 -11120 -9110 -4808 626
1380 626 6701 11421 9556 4666 -71 -5649 -10049 -9570 -5506 -685 5221 10484 9432 5148 1474
1395 1474 -3955 -10315 -10861 -6098 -1154 4478 9776 9955 6931 3273 -4290 -10676 -9244 -5169 -3313
1410 -3313 2113 9102 9849 6036 3070 -1894 -8991 -9500 -6462 -5362 268 8779 11278 7543 4690
1425 4690 -734 -7681 -9526 -8551 -6554 1799 9583 7848 4866 6157 1304 -8221 -9652 -6058 -5337
1440 -5337 -1530 6068 7747 7567 8768 2911 -7069 -9307 -7368 -7571 -3164 5419 8632 8853 8359 824
1456 824 -8322 -6837 -4372 -8790 -4806 6952 8541 4562 6172 5148 -2727 -6267 -7202 -10291 -5715
1471 -5715 4070 6315 6166 10361 6812 -3977 -7340 -7573 -10036 -3695 5907 5520 4080 10279 6930
1486 6930 -5151 -6569 -2703 -7345 -7974 -566 3664 5545 10499 7752 -1010 -2655 -4577 -12576 -9624
1501 -9624 2571 5982 5729 10713 6931 -3516 -4586 -3604 -10114 -7949 2897 3763 775 7100 9154
1516 9154 1857 -872 -3223 -9938 -8881 -1252 -419 2930 12768 11514 -601 -3505 -3544 -11070 -10050
1531 -10050 1008 2971 2194 9105 8105 -1107 -730 1064 -6558 -8994 -2158 -1572 -625 8740 10320
1546 10320 3001 2520 -185 -12047 -12379 -1812 482 891 10183 10964 955 -641 -173 -7848 -8009
1561 -8009 -255 -850 -2556 5826 8368 2397 3262 3098 -6814 -10085 -4542 -4438 -2089 9456 12088 4257
1577 4257 2693 1142 -8580 -10768 -1858 -1009 -1348 6444 7525 813 1870 3613 -4519 -7404 -2584
1592 -2584 -4648 -5517 4829 9175 5306 6207 5311 -6030 -10346 -5121 -4782 -3407 6540 8789 2752
1607 2752 2929 2974 -5607 -7360 -1389 -3269 -4673 2846 6396 2877 5561 6967 -2098 -6969 -4702 -6913
1623 -6913 -6677 2994 7906 4891 5852 4757 -4110 -7331 -3359 -4147 -4225 3264 6221 2084 3877 5888
1639 5888 -534 -4455 -2404 -5706 -7573 -321 4451 3348 6744 7589 -739 -5459 -3977 -5841 -5988
1654 -5988 1522 5780 3264 4837 5529 -1291 -4435 -1965 -4481 -6323 -863 2413 1536 5257 7581
1669 7581 2012 -2143 -2356 -6101 -7874 -1273 3135 3281 6141 6689 724 -3301 -2704 -5040 -6412 -946
1685 -946 2070 1588 4252 6364 2107 -629 -534 -4337 -6726 -2810 795 1172 4755 6925 3130 -855
1701 -855 -1631 -5185 -6685 -2791 644 1436 4501 6115 2593 239 -463 -2891 -5729 -2973 -809 -284
1717 -284 3060 5916 3530 704 14 -3627 -6296 -3977 -1248 633 4103 6068 3805 1249 390 -2928
1733 -2928 -5290 -3157 -1359 -912 2234 4485 3667 1773 692 -2455 -5003 -4080 -2510 -850 2386 5068
1749 5068 4560 3002 1133 -1779 -4329 -3884 -2966 -1588 1448 3978 3571 2245 1508 -1149 -3832 -3703
1765 -3703 -2827 -1314 874 3630 4005 3204 2000 -807 -3608 -3987 -3438 -2019 318 2995 3731 2945 2160
1782 2160 -75 -2643 -3431 -3168 -1995 64 2417 3699 3446 2670 365 -2216 -3369 -3558 -2859 -650
1798 -650 1890 2886 3223 2861 931 -1893 -2915 -3167 -2654 -905 1629 2838 3447 2683 1116 -1150 -2888
1815 -2888 -3456 -3392 -1588 631 2561 3127 2912 1865 -469 -2108 -2773 -3017 -1984 467 2098 3145 3033
1832 3033 1903 -158 -2218 -3161 -3323 -2281 -133 1601 2819 3057 2608 615 -1564 -2723 -3119 -2190
1848 -2190 -517 1033 2388 3249 2595 811 -1106 -2337 -3226 -2598 -983 982 2418 3372 2970 1593
1864 1593 -698 -1867 -2682 -2750 -1556 338 1819 2834 2293 1384 154 -1462 -3247 -3210 -1556 -253 1417
1881 1417 2863 3096 2030 367 -1005 -2760 -3098 -1548 -435 792 2257 3089 2059 551 -1223 -2550
1897 -2550 -2559 -1685 -1395 546 2886 3004 1712 1104 -42 -2178 -2986 -2464 -1278 110 2206 2930 1762
1914 1762 1285 138 -1847 -2900 -1967 -1349 215 2071 2104 2016 2404 939 -2189 -2760 -1702 -1965 -1330 1195
1932 1195 2816 2536 1850 805 -1526 -2423 -2134 -2117 -887 1613 2394 1905 2019 800 -1328 -1697 -1699 -2438
1950 -2438 -1744 1157 1760 1129 2078 2445 -275 -2076 -2198 -2342 -1518 515 1662 2110 2531 1681 -1016 -2116
1968 -2116 -1404 -2137 -2138 483 1186 1073 2056 2343 -248 -1262 -537 -2463 -3080 -520 1411 1661 2719 2528
1986 2528 177 -997 -1350 -2897 -2539 8 1080 669 2240 2753 402 -957 -400 -1534 -2463 -561
2002 -561 166 -11 2065 3276 904 -547 -437 -2262 -3177 -943 266 575 2371 2796 514 -735 65
2019 65 -1663 -2654 -473 349 -271 1176 2573 1186 31 536 -1460 -2909 -1403 -532 -143 1619 3356
2036 3356 1602 515 66 -1829 -3260 -807 59 -248 833 2484 702 15 789 -904 -2294 -1125
2052 -1125 -536 -1347 656 2826 2058 1068 1459 -711 -2930 -1660 -499 -1108 1010 2988 1411 320
2068 320 780 -469 -1900 -931 -179 -1318 208 1998 1193 800 1956 282 -2013 -1515 -1026 -1936 135
2085 135 2386 1552 1046 1311 -145 -2180 -1245 -550 -1448 -94 1759 869 446 1510 388 -1344 -571
2102 -571 -987 -2045 -1118 1062 1272 1151 2435 804 -1774 -1483 -1127 -2104 -254 1835 1075 785 1769 412
2120 412 -1312 -765 -492 -1732 -1023 534 257 317 2119 1573 -351 -410 -1118 -2656 -1355 770 616 1191
2138 1191 2433 1086 -919 -562 -557 -1807 -1120 670 300 157 1811 1147 143 80 -393 -2032 -1949 -493
2156 -493 -80 778 2239 1497 68 -163 -665 -1853 -1609 -245 139 496 1419 1605 -56 108 -325 -1528
2174 -1528 -1274 -70 -581 -193 1637 1796 597 297 190 -1475 -1980 -846 -130 211 1509 1552 717 416
2192 416 -108 -1543 -1452 -600 -342 -411 1095 1003 858 948 545 -994 -1780 -977 -716 -159 1031 1536 1119 965
2212 965 473 -1071 -1560 -962 -759 -620 586 1263 843 842 428 -705 -1131 -967 -1018 -1089 245 1414 1287 1228
2232 1228 812 -124 -1248 -1132 -1370 -1002 388 1320 1111 1271 991 -140 -994 -1076 -1079 -1095 -54 679 908 1230
2252 1230 1343 353 -710 -1090 -1226 -1174 -538 754 1031 1330 1426 156 -529 -869 -1319 -1414 -485 336 1093 1662
2272 1662 1209 744 -313 -882 -1363 -1196 -862 228 880 1320 1226 808 -354 -697 -1250 -1556 -991 50 415
2291 415 1080 1383 841 44 -513 -1111 -1574 -1017 -504 543 874 1407 948 341 -465 -1115 -1211 -872 -523 -63
2311 -63 908 1542 1141 487 84 -945 -1274 -1133 -416 288 691 1279 1190 567 71 -834 -1014 -1352 -812 -415
2331 -415 411 1186 1330 867 128 -706 -1131 -1161 -1304 -193 559 1160 1367 1144 475 -141 -971 -1484 -1065 -525
2351 -525 107 900 1473 1265 449 -119 -1244 -1397 -1355 -824 135 1044 1330 1156 1127 73 -776 -1586 -1375 -768
2371 -768 -183 637 1244 1266 1058 277 -888 -1280 -1125 -864 -374 588 990 1663 1215 649 -184 -1154 -1267 -1404
2391 -1404 -568 578 1083 1409 1283 613 -501 -995 -1203 -1605 -944 298 991 1539 1512 828 78 -730 -1265
2410 -1265 -1438 -865 53 683 960 1420 1322 -232 -654 -1028 -1703 -1220 -113 624 823 1461 1180 129 -340
2429 -340 -1122 -1365 -1420 -196 340 799 1515 1424 637 -286 -1002 -1657 -1436 -575 184 830 1765 1744 861 -224
2449 -224 -770 -1767 -1409 -355 68 436 1475 1636 403 238 -233 -1707 -1719 -618 -131 243 1354 1620
2467 1620 798 284 -271 -1545 -1816 -1087 -433 85 1492 1967 791 357 174 -1376 -1597 -593 -845 -248
2485 -248 1295 1800 735 1015 649 -966 -1929 -991 -869 -495 1306 1962 1079 877 268 -1129 -2148 -1124
2503 -1124 -523 -442 1272 1639 634 1037 865 -568 -1471 -950 -1370 -1514 672 1599 1094 1510 1269 -784
2521 -784 -1786 -1164 -1177 -1583 1114 1735 840 1230 1256 -693 -1245 -814 -1088 -1578 217 1005 987 1755 1706 215
2541 215 -1492 -968 -1739 -2106 61 1280 1305 1451 2052 -233 -1768 -987 -1168 -1454 -11 1261 470 1242
2559 1242 1998 263 -615 -320 -1512 -2634 -511 984 447 1706 2470 418 -1171 -627 -1675 -2402 -407
2576 -407 965 690 1477 1772 446 -619 -59 -914 -1999 -667 251 -176 1114 2413 1363 -120 129
2593 129 -1699 -2798 -1297 179 457 1493 2530 814 -471 28 -1061 -2426 -992 187 -118 526
2609 526 2329 1324 184 619 -573 -2658 -1530 -632 -656 945 2917 1661 189 339 -1053 -2598
2625 -2598 -1317 -41 -255 1022 2186 1114 415 752 -317 -1809 -1200 -779 -1199 192 2086 1690 826
2642 826 1180 -635 -2473 -1954 -751 -758 482 2392 1285 634 733 -372 -1986 -1691 -727 -1016 -149 1624
2660 1624 1305 1009 1579 82 -1709 -1717 -1375 -1652 -109 1926 1568 1262 1529 -25 -1744 -1416 -1091 -1351
2678 -1351 -160 1364 1072 998 1621 300 -1596 -1119 -1186 -1892 -733 1269 1557 1652 2433 785 -1073 -1615
2696 -1615 -1351 -1767 -509 1442 1389 1155 1643 817 -995 -1091 -965 -2039 -1080 742 1242 1022 2105 1358
2714 1358 -576 -1093 -1399 -2196 -1116 362 1222 1586 2193 1203 -388 -899 -1043 -1991 -1557 185 982 1209
2732 1209 2134 1621 137 -730 -1272 -2171 -1503 -3 369 1360 2026 1805 104 -336 -1169 -1948 -1552 -440
2750 -440 412 1341 2297 1592 442 -293 -1436 -2003 -1887 -564 -34 1064 1976 2020 987 202 -1075 -1920
2768 -1920 -1691 -915 -39 822 2139 1881 987 -6 -719 -1886 -2012 -1220 -540 539 1827 1797 1274 119
2786 119 -669 -1713 -2037 -1251 -650 413 1696 1867 1382 714 -175 -1472 -1933 -1689 -760 280 1471 1834
2804 1834 1279 1138 -55 -1112 -1830 -1534 -941 -73 1146 1626 1885 1119 149 -850 -1697 -1646 -1430 -415 1164
2823 1164 2062 2217 1475 550 -835 -1593 -2104 -1356 -475 637 1822 1863 1503 729 -470 -1676 -2028 -1752
2841 -1752 -905 489 1555 2019 1693 589 -321 -1459 -1763 -1646 -828 174 1621 1777 1575 812 -238
2858 -238 -1330 -1842 -2061 -1216 392 1313 2115 1823 1307 18 -1311 -1625 -1939 -1345 -222 963 1498 1852
2876 1852 1594 406 -1098 -1694 -1720 -1950 -305 556 1553 1973 1625 592 -1091 -1607 -1835 -1762 -774 563
2894 563 1522 2022 1798 830 -196 -1115 -2063 -2269 -857 275 1040 2045 1963 808 -438 -964 -2027 -2016
2912 -2016 -1052 164 742 1916 2194 1330 137 -779 -1691 -2189 -1330 -116 467 1834 2142 1314 228 -435
2930 -435 -1609 -2425 -1537 -543 609 1453 2385 1263 652 -491 -1236 -2120 -1546 -467 -180 1326 2280 1538
2948 1538 535 99 -1128 -2537 -1824 -938 -526 1172 2294 1808 1158 -14 -1195 -1983 -1563 -807 -407
2965 -407 1128 2238 1669 948 821 -750 -2085 -1712 -1430 -998 777 2016 1875 1484 1211 -522 -2116
2982 -2116 -2021 -1244 -1010 397 2221 1496 1428 1210 -543 -1752 -1680 -1570 -1481 231 1974 1576 1468 1746 268
3001 268 -1716 -1723 -1545 -1976 -22 2017 1912 1596 1842 -94 -2121 -1660 -1494 -1779 -247 1446 1330 1290 1922
3020 1922 509 -1441 -1391 -1641 -2301 -1175 1344 1584 1804 2531 568 -1465 -1456 -1839 -2332 -780 1503 1316
3038 1316 1511 2355 639 -1171 -707 -1533 -2313 -955 381 793 1480 2708 1429 -727 -953 -1819 -3112
3055 -3112 -1763 995 1106 1679 3010 1275 -908 -965 -1231 -2435 -1082 583 284 1117 2464 1330 49
3072 49 -86 -1083 -3117 -2186 -131 -107 1328 3143 2115 -26 -322 -1277 -3016 -1725 221 47 1006 2690
3090 2690 1486 -222 -45 -446 -2410 -1587 -238 -736 332 2583 2164 612 515 -452 -2603 -2217 -503
3107 -503 -360 726 2996 1889 248 331 -500 -2327 -1846 -224 -673 106 2101 1898 626 1514 178
3124 178 -2406 -2217 -1187 -1238 -271 2652 2589 1164 818 -231 -2555 -2188 -738 -928 -110 2284 1892 837
3142 837 1434 377 -1672 -1952 -1213 -1957 -832 1620 2057 1351 1903 646 -1781 -2057 -1324 -1580 -373 2094
3160 2094 2203 1251 1720 477 -1670 -1798 -1083 -1545 -1121 1243 1548 1304 2065 1169 -1012 -1612 -1296 -2300
3178 -2300 -1357 1109 1737 1493 1992 1023 -1293 -1900 -1205 -1924 -1381 1180 1397 1099 1904 1662 -596 -1056
3196 -1056 -1249 -2114 -1889 359 1380 1057 2280 1849 -579 -1366 -1764 -2440 -1451 358 1395 1383 2146 1758
3214 1758 -121 -1048 -1340 -2023 -1911 147 825 831 2112 1930 258 -690 -1405 -2222 -1896 -442 750 1345
3232 1345 2251 2082 359 -689 -1017 -2163 -1958 -494 276 1022 2011 2326 825 -28 -774 -2010 -2227 -912
3250 -912 -131 716 1891 2409 1224 356 -611 -1807 -2202 -1350 -368 584 1630 2329 1463 263 -583 -1935
3268 -1935 -2127 -1271 -554 478 1672 2210 1733 708 -405 -2028 -2259 -1689 -543 178 1258 2169 1790
3285 1790 678 -204 -1353 -2000 -1630 -1031 88 1026 2297 1607 1003 197 -1659 -2146 -1675 -1282 -133 1020
3303 1020 2103 2035 1276 85 -840 -1728 -1937 -1457 -157 1308 1702 1896 1288 464 -827 -1667 -2117 -1587
3321 -1587 -753 797 1611 1782 1579 801 -644 -1607 -1738 -1615 -924 366 1699 1978 1820 1089 -447 -1575
3339 -1575 -1819 -1779 -1022 291 1434 2173 1787 1372 3 -1064 -2038 -1620 -1041 -323 1290 1698 1990 1527
3357 1527 146 -1039 -1877 -2244 -1547 -343 1083 1828 2049 1802 466 -1149 -1781 -1993 -1731 -434 369
3374 369 1570 1830 1833 811 -499 -1328 -1655 -1520 -763 572 1357 1885 1914 779 -196 -1039 -2039 -2283 -1103
3393 -1103 366 1145 1811 1801 1206 -70 -1213 -1739 -1980 -1286 139 912 1795 2180 1394 441 -640 -1529
3411 -1529 -2130 -1381 -540 578 1545 2278 1396 348 -877 -1562 -1872 -1508 -407 663 1668 2036 1580 491
3429 491 -208 -1599 -2189 -1498 -769 285 1061 2410 1852 423 -86 -1125 -1994 -1867 -680 -39 1044 2017
3447 2017 1901 776 149 -1153 -2093 -1315 -906 -357 749 2054 1790 1271 676 -783 -2151 -1762 -1266 -725
3465 -725 792 2206 1717 1260 556 -420 -2032 -1727 -1126 -762 559 1826 1897 1175 1059 -172 -1556 -1650
3483 -1650 -1460 -1485 -18 1845 1868 1270 1378 65 -1915 -1846 -1613 -1610 164 1475 1314 1283 1404 325 -1663
3502 -1663 -1061 -1144 -1704 -588 1397 1446 1251 1963 676 -1251 -1227 -1467 -1834 -628 1192 1573 1468 1790 342
3521 342 -1333 -1625 -1411 -1879 -597 991 1308 1117 2122 1026 -810 -1218 -1111 -2301 -1434 651 890
3538 890 1582 2461 1412 -746 -1123 -1322 -2201 -1063 770 1005 1062 2329 957 -545 -567 -281 -1957 -1407
3556 -1407 321 709 1130 2533 1939 102 -609 -1155 -2944 -1950 226 795 945 2808 1768 -482 -587
3573 -587 -1083 -2012 -1682 60 172 718 2504 1598 49 107 -591 -2313 -1945 -487 -253 559 2699 2127
3591 2127 175 202 -590 -2470 -1952 -5 93 600 2190 1884 324 171 -485 -1614 -1905 -642 -997 -195
3609 -195 2263 2366 776 979 -37 -2239 -2186 -833 -503 275 2103 2039 662 487 -178 -1896 -1942 -865
3627 -865 -1036 -109 1782 2066 916 1219 467 -1653 -1858 -1190 -1307 -617 1658 2064 1007 1043 564 -1887
3645 -1887 -1874 -899 -874 -633 1223 1576 1076 1381 564 -1314 -1716 -1210 -1660 -1016 1103 1578 1403 1568 825
3664 825 -1326 -2141 -1134 -1603 -957 1043 1736 1326 1566 993 -1002 -1479 -1223 -1348 -1119 582 1435 1069
3682 1069 2020 1372 -375 -1511 -1333 -1934 -1602 539 1635 1421 2107 1178 -580 -1172 -1289 -1632 -1601 250
3700 250 789 920 1793 1487 117 -778 -1117 -1881 -1925 -88 712 1148 2121 1957 438 -752 -998 -1844 -1750
3719 -1750 43 626 1075 1724 1591 414 -635 -723 -1955 -1701 -802 339 818 1678 1886 670 -151 -897
3737 -897 -1831 -2019 -676 105 1164 1749 2154 866 -210 -493 -1608 -1916 -1098 12 198 1626 1898 1373
3755 1373 390 -480 -1596 -2017 -1120 -372 432 1540 1964 1033 578 -421 -1417 -1752 -1093 -381 333 1001 1871
3774 1871 1698 615 -214 -1151 -1658 -1415 -916 317 1168 1556 1451 820 -399 -922 -1698 -1400 -745 -201 1241
3793 1241 1750 1424 757 239 -650 -1620 -1677 -928 -351 774 1541 1530 1187 373 -572 -1617 -1602 -1140 -534 455
3813 455 1380 1577 1209 442 -625 -1450 -1813 -1302 -502 122 1057 1770 1333 751 -86 -1036 -1427 -1257 -1035 341
3833 341 1037 1464 1372 945 -20 -1236 -1580 -1112 -817 -63 1235 1493 1530 981 279 -698 -1566 -1449 -1087 -85
3853 -85 854 1571 1591 1564 383 -772 -1224 -1419 -1165 -231 888 1344 1524 1276 563 -506 -1496 -1540 -1242 -798
3873 -798 424 938 1379 1331 585 -209 -1029 -1264 -1470 -981 345 841 1420 1606 734 -99 -1126 -1388 -1451 -741
3893 -741 295 649 1221 1294 920 -39 -746 -1148 -1444 -1147 58 885 1063 1604 1180 123 -740 -1390 -1551
3912 -1551 -1075 46 714 1387 1537 1169 227 -235 -1113 -1773 -1414 -249 458 1088 1876 1185 478 3 -1155
3931 -1155 -1738 -1283 -829 23 955 1472 1377 619 167 -730 -1430 -1303 -701 -457 711 1497 1507 862 143 -576
3951 -576 -1449 -1566 -786 -294 536 1293 1514 1042 483 -225 -1376 -1123 -934 -584 127 1057 1191 901 1043 -176
3971 -176 -1458 -1536 -1008 -750 488 1301 1500 1177 736 -245 -1067 -1264 -984 -1020 189 1202 1298 993 876 87
3991 87 -1111 -1207 -1063 -994 -334 1130 1321 1193 1454 291 -841 -1193 -1044 -1116 -261 1181 1634 1067 1087 218
4011 218 -1042 -1091 -966 -1217 -512 590 994 866 1577 927 -719 -877 -495 -1601 -1065 501 1109 1055 1468
4030 1468 849 -443 -923 -684 -1475 -732 558 893 540 1386 968 -393 -533 -669 -1414 -1053 83 429
4048 429 967 1625 1063 -328 -647 -927 -1628 -1107 166 360 646 1578 1200 -18 -294 -454 -1329 -1247 65
4067 65 254 371 1487 1252 113 -126 -351 -1454 -1212 -114 346 659 1856 1336 -266 -51 -686 -1568
4085 -1568 -1256 -212 60 266 1662 1267 330 206 -371 -1345 -1298 -787 -403 407 1884 1489 409 92 -179
4104 -179 -1302 -1529 -417 -208 28 1531 1348 345 408 351 -1321 -1295 -319 -504 220 1453 1433 445 548
4123 548 23 -1119 -1533 -818 -422 -132 1212 1416 589 699 289 -1164 -1118 -476 -555 -595 710 1299 668 994
4143 994 523 -1079 -1532 -763 -930 -557 798 1407 721 1063 327 -874 -1126 -689 -769 -510 694 1062 658
4162 658 764 571 -445 -1086 -620 -968 -948 544 989 565 1007 932 -483 -1139 -991 -1486 -593 473 1000
4181 1000 733 1019 867 -215 -871 -743 -1163 -1030 16 642 614 1084 1051 -289 -425 -928 -1299 -1073 -128
4200 -128 787 759 1184 972 62 -768 -554 -1241 -1193 -504 435 508 1220 1046 96 -361 -829 -923 -1256 -411 289
4221 289 819 1279 1279 620 -253 -725 -1241 -1372 -129 366 683 1095 1014 564 -412 -433 -832 -1082 -535 -2 222
4242 222 1068 1220 492 -290 -174 -1086 -1433 -526 121 375 724 1030 725 51 -339 -827 -1345 -670 -79 232
4262 232 846 1008 817 326 -269 -639 -1333 -925 -201 193 518 1064 846 589 -84 -747 -1299 -844 -420 -12
4282 -12 795 1172 854 654 167 -522 -1096 -737 -526 -5 768 1093 997 618 266 -579 -1133 -797 -770 -327 358
4303 358 934 1122 699 278 -336 -780 -931 -869 -261 206 705 1011 1016 308 -309 -973 -905 -590 -461 171 858
4324 858 868 900 250 -246 -738 -1097 -822 -939 128 747 764 808 402 -34 -747 -671 -826 -495 -72 790 1034
4345 1034 805 596 444 -455 -960 -889 -910 -154 246 866 608 703 104 -588 -679 -1016 -660 -483 228 831 1182
4366 1182 737 281 -142 -625 -952 -882 -758 225 644 791 821 707 158 -290 -732 -988 -513 64 328 1009
4386 1009 1005 681 29 -561 -915 -1004 -389 -129 280 648 833 377 426 -536 -645 -993 -778 -77 211 766 857
4407 857 808 65 -655 -627 -1055 -1049 -299 322 652 967 643 246 -146 -334 -874 -558 -239 209 491 845 947
4428 947 95 -23 -192 -848 -701 -462 -181 471 933 906 369 112 -322 -754 -644 -415 -39 68 782 889
4448 889 257 125 41 -956 -664 -692 -502 -137 815 869 536 248 -89 -774 -908 -632 -455 -193 833 524 488
4469 488 406 -149 -592 -646 -497 -334 89 981 724 324 606 185 -557 -680 -465 -753 47 636 784 741 472
4490 472 84 -533 -497 -490 -563 -412 356 777 380 441 195 -670 -756 -723 -539 -343 319 835 715 550 788 -224
4512 -224 -715 -466 -921 -392 402 607 348 723 677 -298 -451 -287 -562 -486 372 251 373 885 774 71 -253
4533 -253 -354 -912 -584 91 413 616 856 637 -204 -295 -338 -812 -756 -159 282 556 805 671 305 -192 -401
4554 -401 -700 -717 -276 142 500 1030 524 339 -290 -89 -616 -819 -186 131 103 753 959 192 134 -122 -704
4575 -704 -809 -109 -19 135 713 885 266 177 74 -648 -751 -459 -271 20 656 997 232 210 184 -648 -658 -492
4597 -492 -205 68 623 590 306 122 -168 -457 -788 -621 -225 -43 229 592 668 566 41 -832 -440 -546 -353
4618 -353 -263 489 714 411 310 313 -320 -719 -342 -242 -387 229 497 377 471 450 -318 -674 -340 -259 104 447
4640 447 725 357 560 469 -205 -706 -500 -772 -472 -28 576 346 539 539 46 -427 -477 -681 -306 281 482
4661 482 519 321 427 -102 -725 -615 -400 -505 176 478 395 467 556 -18 -567 -409 -745 -477 -68 487 286
4682 286 598 442 161 -372 -416 -828 -634 -209 273 371 455 486 137 -445 -320 -294 -658 -153 71 523 407 384
4704 384 262 -142 -303 -550 -575 -389 358 0 575 433 347 232 -311 -396 -753 -487 -179 25 44 639 503
4725 503 -47 30 -244 -580 -434 -164 29 168 633 543 -263 -61 -637 -486 -230 -208 102 488 792 336 169
4746 169 65 -216 -624 -562 19 196 354 536 594 530 143 78 -619 -606 -384 73 253 407 480 346 23 -208
4768 -208 -600 -393 -409 -168 387 456 692 301 477 -184 -500 -222 -311 -152 154 466 259 309 337 44 -204 -250
4790 -250 -395 -240 229 354 276 268 15 75 -385 -302 -557 -204 -95 256 22 497 394 21 -259 -475 -376 -338
4812 -338 -129 62 525 262 345 97 -210 -420 -430 -606 -477 118 491 254 441 79 98 -221 -356 -412 -169
4833 -169 162 378 395 432 223 -200 -384 -545 -408 -402 -191 193 417 88 312 -183 -248 -515 -669 -471 -152 400
4855 400 472 436 376 433 -166 -111 -516 -331 -250 202 444 344 336 395 -198 -210 -407 -649 -29 55 155 475 344 250
4879 250 -34 -393 -515 -500 -323 23 270 296 656 132 -39 -167 -379 -309 -159 -43 5 495 167 402 60
4900 60 -358 -307 -462 -355 -245 148 301 463 230 66 30 -311 -431 -298 100 -258 187 550 337 -172 37
4921 37 -87 -393 -173 -192 -57 282 342 481 -12 -193 -523 -429 -175 -326 -98 204 616 357 186 23 -253
4942 -253 -289 -262 -404 44 320 452 199 241 278 -442 -606 -450 -264 -309 432 445 223 444 356 -58 -235 -488
4964 -488 -416 -743 214 414 250 589 136 -263 -76 -469 -287 -173 112 -132 347 354 211 -2 -65 -142 -503 -231
4986 -231 -190 421 73 510 444 -121 -123 -400 -305 -536 -320 229 130 470 288 58 -37 -339 -256 -458 -94 167 58
5009 58 285 601 136 -98 -245 -368 -411 -82 62 410 450 581 186 -95 -11 -415 -532 -190 -110 120 434 482
5031 482 95 -229 -49 -298 -765 -235 -239 19 147 688 412 0 -1 -249 -596 -460 -78 207 282 603 373 155
5053 155 5 -121 -216 -344 -110 147 314 526 468 224 35 -340 -572 -255 -71 -69 352 649 397 131 162 -137
5075 -137 -252 -296 -230 7 369 414 282 393 314 -53 -479 -346 -472 -309 228 386 529 280 448 -186 -175 -346
5097 -346 -461 -189 12 750 431 335 412 -319 -39 -335 -178 -313 -38 401 331 74 321 -45 -477 -584 -424
5118 -424 -420 -12 122 403 23 421 13 -290 -781 -309 -507 25 345 370 296 300 17 -343 -79 -186 -130 -228 137
5141 137 103 144 507 135 -24 -131 -308 -501 -280 125 329 210 390 220 -3 -197 -214 -435 -330 20 47
5162 47 412 393 125 49 -98 -257 -733 -259 31 -97 299 554 174 -42 -144 -116 -495 -583 -79 300 287 537
5184 537 336 77 -69 -98 -452 -363 100 103 80 462 343 316 -3 -231 -32 -353 -82 26 -29 397 295 267 71
5207 71 -232 -588 -532 -114 167 189 240 553 -28 121 -287 -475 -413 -231 -375 22 399 462 228 -39 -88 -367
5229 -367 -710 -156 -325 -151 217 503 189 -2 -194 -441 -402 -211 -168 36 24 370 376 355 -117 -335 -550 -151
5251 -151 -176 -214 213 276 287 -101 89 -243 -254 -262 -362 -112 213 319 163 554 136 -70 -406 -343 -395 -227 116
5274 116 161 381 -111 343 -284 -361 -288 -379 -82 57 205 155 359 398 182 -339 -215 -496 -275 -33 277 483
5296 483 294 460 146 -285 -99 -819 -354 -37 -12 331 540 350 93 -419 -267 -313 -203 -56 -87 191 369
5317 369 80 -79 7 -299 -224 -532 -175 371 50 486 368 99 32 67 -493 -369 -343 -118 22 285 285 138
5339 138 -80 -169 -353 -504 -116 9 75 507 179 531 66 75 -528 -578 -309 -54 248 299 440 447 319 22 -597
5362 -597 -546 -312 -416 331 339 405 226 175 1 -185 -351 -359 -64 297 243 398 346 300 -31 -347 -219 -540 -375
5385 -375 369 186 264 501 77 -186 -162 -373 -374 -322 -85 282 193 319 74 28 -105 -540 -434 -345 -27 368 337
5408 337 236 239 388 -105 -356 -469 -349 -139 66 304 504 168 -149 -186 -132 -234 -330 -194 61 261 344 434
5430 434 382 59 -376 -289 -383 -71 130 263 521 90 277 -54 -231 -267 -320 -246 -208 458 373 449 483 203 -52
5453 -52 -372 -394 -482 46 172 20 92 591 239 -212 -137 -372 -308 -130 53 282 267 381 270 -30 -349 -289 -408
5476 -408 -142 26 388 523 467 162 13 -230 -529 -257 -497 3 -36 363 342 443 86 -37 -330 -373 -429 -102
5498 -102 182 260 538 109 -113 -123 -337 -698 -152 255 124 202 670 424 142 159 115 -286 -196 -27 -12 -155
5520 -155 586 253 113 -70 -225 -556 -408 -43 -193 529 726 261 101 296 -81 -545 -512 -218 25 135
5540 135 413 257 108 365 66 -409 -203 -306 -69 -115 373 393 167 -26 -100 -181 -269 -291 -519 105 216 438
5562 438 157 386 -177 -437 -218 -502 -339 66 138 470 223 258 69 -405 -398 -461 -497 -51 342 577 295 80
5584 80 38 -399 -238 -523 -317 -168 365 413 418 244 -68 -464 -499 -232 -403 -188 222 285 442 766 -33 5 -327
5607 -327 -394 -135 -368 133 450 201 320 52 -18 -636 -201 -375 -298 198 308 200 583 483 4 -37 -308
5628 -308 -435 -537 223 303 56 322 381 -103 -370 -241 -540 -362 -144 171 357 444 279 180 -122 -309 -555
5649 -555 -437 178 -16 148 697 232 168 -198 -161 -387 -666 -80 293 284 553 393 168 -165 160 -395 -670
5670 -670 -23 328 83 336 784 30 63 -387 -546 -610 -324 317 271 468 351 -83 86 -84 -243 -386 -222
5691 -222 -124 -64 571 500 335 29 -103 -534 -282 -352 130 104 305 583 -27 114 -137 -288 -466 -271 -116 -270
5713 -270 538 359 391 215 32 -113 -516 -249 -214 -129 480 437 467 251 10 -342 -280 -304 -172 -321 133 335
5735 335 587 457 136 -90 -257 -622 -433 -1 143 341 432 302 482 60 -347 -593 -500 -276 102 637 216
5756 216 418 218 -324 -349 -42 -267 -352 -82 460 410 592 354 88 -201 -377 -323 -552 -183 386 300 441 241
5778 241 -181 -475 -234 -102 -397 49 317 406 220 173 161 -406 -230 -402 -610 53 26 396 379 473 -105 -219
5800 -219 -326 -432 -247 -245 56 239 592 499 326 68 -428 -576 -211 -97 253 330 221 237 67 115 -156 -308
5822 -308 -430 -86 9 76 196 275 -41 9 -123 -520 -399 -382 41 206 388 453 388 24 56 -253 -381 -108 33
5845 33 159 166 570 356 -71 -102 -237 -279 -102 -186 259 543 479 342 -71 -29 -241 -300 -644 -98 241 157 561
5868 561 251 249 173 -17 -502 -239 -172 -225 179 464 253 278 -35 -281 -305 -406 -109 -113 191 453 297 211 -201
5891 -201 -346 -464 -255 -158 -26 172 358 411 442 198 -134 -225 -512 -495 -257 248 507 536 256 215 -30 -230
5913 -230 -365 -281 -279 168 388 417 455 348 -186 -272 -352 -274 -80 -135 286 338 216 391 34 -316 -599 -370 -376 46
5937 46 137 337 364 248 257 -191 -400 -514 -427 -131 166 331 496 322 128 -276 -397 -271 -8 42 83 144 407
5960 407 329 -149 -80 -227 8 -310 -388 -7 82 405 6 326 -63 -423 -307 -191 -300 236 400 113 285
5981 285 160 -118 -345 -227 -458 -11 -21 -65 254 232 526 26 -343 -237 -470 -590 16 241 199 108 187 -14
6003 -14 -228 -199 -192 -554 21 240 234 143 289 -41 204 -246 -213 -307 -76 123 16 517 85 126 199 -25 -251 -200
6027 -200 -193 -28 139 458 411 283 -179 -117 -337 -587 -161 20 88 492 471 70 -62 -165 -176 -723 -430 -206
6049 -206 241 293 278 109 72 92 -451 -402 -171 -10 -9 118 327 143 220 -93 -117 -356 78 -84 -279 458 426
6072 426 142 446 -300 -359 -435 -208 -94 196 441 221 121 166 160 -270 -364 -290 -342 -271 250 61 271 486 26
6095 26 -68 -463 -77 -207 -61 172 15 639 391 25 -31 -192 -167 -193 -259 92 65 211 219 10 -151 -203 -476
6118 -476 -271 -37 -22 422 222 118 214 -104 -56 -243 -554 -307 -164 505 13 241 161 -43 -42 -223 -318 -409 14
6141 14 111 366 354 211 -131 -187 -73 -503 -390 -39 119 206 137 303 -170 41 -53 -181 -345 -119 168 312
6163 312 461 444 -117 -219 -244 -368 -530 57 106 125 393 203 36 -47 -151 -232 -411 -266 -19 236 568 381
6185 381 314 34 -193 -320 -693 -218 51 -105 375 665 456 -69 -93 -162 -299 -299 -308 19 367 180 291 90
6207 90 -25 -257 -270 -485 -257 -113 351 290 -34 -11 241 -61 -331 -473 -140 -42 -10 246 201 118 21 -285 -462
6230 -462 -177 -103 -67 416 436 -44 -210 196 -152 -166 -92 -128 -38 2 336 186 103 36 -103 -129 -192 -333 -133 -65
6254 -65 256 123 87 300 -249 -374 -250 -210 -184 -9 97 125 435 -59 -19 -348 -341 -187 152 113 394 226 503
6277 503 425 56 -497 -247 -52 -170 200 130 195 327 87 -271 -306 -152 -370 -354 36 171 52 200 -37 -36
6299 -36 -117 247 -526 -326 -131 63 139 235 489 -46 -430 -361 -268 -67 -104 404 520 358 340 422 -236 -10 -322
6322 -322 -137 -95 32 172 178 252 28 37 -113 -229 -217 -283 179 196 95 626 458 -178 -62 -10 -216 -404 -46
6345 -46 364 185 224 278 352 -57 -312 -352 -373 -78 -48 498 482 -39 133 -228 -338 -143 -80 171 -6 314 293
6368 293 89 42 8 -355 -415 -279 -200 -71 142 91 77 165 73 -180 -253 -250 19 281 20 73 -82 314 75 -233
6392 -233 -420 -352 -210 40 13 383 143 92 -17 -223 66 91 -232 -76 173 197 253 200 290 -78 -67 -502 31
6415 31 -48 217 199 276 156 -115 6 -385 -238 -212 -163 -57 56 300 9 35 186 71 -77 -219 -213 164 182
6438 182 144 99 321 -132 -57 -230 -101 -81 -101 -18 57 241 138 87 -283 -250 -249 -200 108 334 74 26 376 148
6462 148 -347 -169 -247 -305 -106 93 302 113 175 297 -232 -278 -129 -175 -39 100 45 158 195 20 -303 -182
6484 -182 -131 -339 -43 9 168 102 378 -48 294 79 5 -38 -42 -70 9 91 268 -20 -46 -205 -459 -228 123 55
6508 55 208 142 231 2 -101 -93 -241 -121 -443 233 55 -138 392 245 -141 -151 -239 -276 -168 -106 120 19 449
6531 449 90 -28 -17 24 -289 -251 -138 296 142 126 345 -21 50 34 -182 -267 -430 71 33 209 66 146 266
6554 266 16 -193 -436 -56 104 209 228 -258 -215 82 125 -259 -205 -18 62 -30 167 194 152 191 90 -116 -251
6577 -251 141 259 127 211 169 -42 33 -231 23 -77 -27 136 35 11 173 141 23 -11 -156 -319 -154 -33
6599 -33 -126 117 236 35 265 33 18 -200 3 13 128 150 202 338 82 8 -319 -154 -124 -314 49 -83 319
6622 319 84 137 111 -266 -310 205 -212 13 81 167 -91 -124 153 -73 -182 -19 53 -2 104 120 -57 338 269
6645 269 -184 -71 -87 -299 -148 -66 30 241 -124 -114 64 -232 109 -228 -186 -70 195 63 130 396 -122 -103
6667 -103 -200 -107 -212 71 -165 93 26 -96 250 -148 195 -254 -390 98 -37 27 173 -91 0 -262 -367 -33
6689 -33 -77 -160 41 31 200 222 -208 162 -123 -206 -410 217 -71 -2 363 199 -90 95 -64 3 -20 64 83 -289
6713 -289 -47 11 274 8 -185 -324 107 -207 84 148 122 -276 -126 39 129 -282 -93 136 33 398 57
6734 57 -125 147 88 12 41 -99 -204 -225 218 153 408 43 -41 -176 -96 -231 -108 5 -159 54 274 107 64
6757 64 123 -136 -138 -100 102 120 151 -75 256 161 195 -342 -83 -127 -56 78 271 44 70 -92 36 -162 70 -3
6781 -3 -88 -122 172 -182 -86 126 288 -156 -148 -242 -55 324 97 213 149 77 -122 -78 -335 -397 156 92 25 -30 147
6806 147 277 -277 -303 -183 -130 -243 44 -349 -171 282 142 100 -231 -33 -178 -132 54 52 336 107 125 -4
6828 -4 -114 -87 -134 -199 106 -139 116 191 170 140 -131 -131 -90 9 -299 81 -49 74 -51 -95 -269 -270 70 -288 -94
6853 -94 -348 -243 180 -75 217 -15 -87 -192 -164 104 -112 52 119 81 199 81 43 -82 54 -25 -2 149 -15
6876 -15 180 38 -12 -173 -44 -115 -302 -24 93 316 55 -107 212 -8 223 105 -94 -341 -34 381 3
6897 3 124 170 -58 -209 -141 -60 -91 151 29 344 334 18 75 -193 109 -245 -233 -91 168 -85 254 47 246
6920 246 -3 -116 229 11 131 267 106 -142 150 17 -107 300 -151 -83 61 -40 -171 254 -49 -331
6940 -331 -230 -287 -149 -194 -29 9 -35 263 -95 251 158 -236 43 -24 -123 301 129 112 85 217 -16 -178 -182 57
6964 57 -69 -71 223 108 116 -113 22 122 -300 -9 -44 68 112 63 178 42 72 -106 -153 -301 -39 -58 48 352
6988 352 165 251 7 9 36 125 -241 -28 -335 24 106 240 -67 -42 119 -68 234 -68 56 108 -112 27 25
7011 25 33 110 52 -243 -59 -29 -109 18 368 169 -37 -269 -9 -147 280 -116 13 -49 -134 110 -96 -18 -213
7034 -213 -2 -33 -102 8 67 -31 -10 168 -22 -68 -101 -188 63 -23 273 213 167 37 -18 62 24 -382 67 75 45 25
7060 25 203 -20 -50 -211 -216 -134 -45 59 1 -43 322 251 -218 -150 154 -86 -173 -112 79 350 109 81 -42 26 -85
7085 -85 -28 116 170 227 8 126 148 -140 -283 -306 -368 122 7 -118 80 196 48 -208 330 -306 -18 -72 -20
7108 -20 410 -219 -85 -75 -20 -5 -105 -201 125 199 129 -86 -81 3 254 -285 -30 -126 -118 -18 68 -45 454 93 240
7133 240 170 -226 -32 -36 22 137 57 239 76 25 -226 -184 147 -207 138 50 164 -50 -24 -100 -178 140 84 -117
7157 -117 -22 -165 184 61 281 -5 -135 -5 -166 -212 -127 29 131 191 -23 246 155 203 153 84 -119 54 186
7180 186 43 104 106 224 96 88 -156 -62 -177 -258 -161 97 -20 148 226 -123 162 -92 35 119 -79 -38 -66 95
7204 95 -106 87 53 29 14 86 56 -107 251 -58 -37 -103 39 -167 -301 -102 -146 174 177 -163 -133 -234 -80 106
7228 106 471 -200 35 116 133 58 23 -157 -83 64 -162 -151 93 -198 44 -67 -138 -435 -22 -179 -320 134
7250 134 -25 128 10 68 -53 -148 45 -88 -287 -22 3 75 87 -142 33 75 -218 -16 -50 -105 168 -140 -72
7273 -72 55 11 -203 -47 -111 -46 -167 2 206 -52 -16 203 -73 -99 -150 -74 -18 5 235 -60 240 -7 -64 -146
7297 -146 -128 -68 -71 92 122 132 248 -298 174 61 63 -89 -97 -139 -79 162 284 127 -184 -113 45 264 -103 -189 36
7322 36 -172 -113 -122 264 -74 -44 -1 2 29 45 52 124 -86 14 -189 -193 -216 -225 85 -41 149 85 121 14 -256 -273 -43
7349 -43 -36 -188 -233 8 -138 95 -2 81 -9 -125 -324 188 -18 -211 -170 -64 -3 131 -224 49 -90 -125 13
7372 13 -158 413 284 -6 341 -24 -497 -146 -77 39 58 527 54 -180 8 -205 -130 -142 -141 -72 265 -164 42
7395 42 132 -42 -143 66 -169 126 -24 86 -70 158 -83 -116 -138 -67 90 -25 -66 -80 368 4 110 -11
7417 -11 -21 -84 -115 -236 -143 -215 -34 205 181 -104 -56 -75 -186 101 104 -114 -173 -55 122 209 -222 -86 101 78 165
7442 165 -77 125 7 224 79 142 21 -4 -44 214 -41 169 391 8 100 -25 5 -275 -130 -140 87 84 380
7465 380 -9 -28 27 -35 -4 -239 -57 -296 125 151 63 252 90 -45 21 -114 -291 -54 3 -39 154 98 -114
7488 -114 97 -120 -87 -189 53 -178 48 -10 150 227 -186 123 -35 -222 -335 69 -49 3 113 118 -76 5
7510 5 69 -50 -89 -123 -43 -7 312 -362 -126 219 -40 -183 -27 38 102 111 -66 175 98 24 -162 92 -210 -2
7534 -2 -157 270 202 167 384 4 36 -86 58 -78 -128 43 326 54 -215 -46 -35 -101 -220 -264 185 88 -61
7557 -61 422 62 -182 182 -143 -59 -298 -203 -30 189 196 133 18 -202 248 -48 -424 -149 -27 103 211 236
7579 236 -68 151 -264 56 -252 -194 91 251 13 -29 96 -78 -188 -273 85 -52 254 242 -110 433 156
7600 156 95 -210 22 28 -60 275 -69 -94 221 -52 -1 104 -196 -205 -92 -98 51 87 -97 -152 217 -38 83 28
7624 28 -120 -77 -117 113 66 169 73 -242 150 85 8 -222 73 125 218 21 -19 -92 56 -76 -61 31 37 67 143 148
7650 148 131 -154 -103 -126 -202 -61 50 29 -191 22 40 -192 194 -199 -189 -94 -58 -83 76 14 258 207 67 103
7674 103 -180 -143 108 9 -49 127 -19 -163 -128 -212 -69 -138 160 160 34 231 292 61 -124 -242 -218 -21 -122
7697 -122 101 54 364 57 -32 406 -183 -304 84 29 4 110 244 140 -25 -11 141 -31 -44 -66 -201 -140 173
7720 173 3 137 27 144 -121 -71 -41 20 93 87 266 82 -214 -37 -40 -23 2 -134 29 97 -44 121 150 149 19
7745 19 -44 -64 282 -49 78 23 297 31 246 -50 -286 26 -73 133 303 38 8 63 51 -273 15 -233 -163
7768 -163 20 89 -194 105 150 84 145 -163 80 -197 -159 -113 218 34 66 25 248 -235 -53 -94 -279 -51 212
7791 212 200 117 -113 -113 -44 -135 -114 13 72 313 1 16 242 -161 -16 -301 138 -56 -127 135 44 375 50 -128
7815 -128 123 -189 -233 -204 178 -71 298 67 -62 -33 -336 29 -230 33 -89 161 126 -51 212 146 118 -277
7837 -277 -25 124 -16 -136 138 266 164 161 -119 -29 -235 -159 -293 -23 56 22 60 111 58 -98 -79 -137 -195 5
7861 5 299 70 290 160 -32 65 -92 -196 -99 -270 16 150 90 -220 97 -118 -190 -204 73 75 -132 -83 -21 108
7885 108 -7 -308 189 -15 -64 -3 29 27 154 136 -336 -79 168 125 -357 218 -11 94 145 335 104 27 -319
7908 -319 -163 -81 -54 -108 195 -20 324 -9 68 -2 -243 -43 -52 -129 182 50 210 -117 258 -21 -142 -193 50
7931 50 -295 -50 124 -66 363 -11 -235 -99 116 248 -316 -74 276 -143 246 -16 258 1 -218 275
7951 275 139 71 -53 268 -81 -16 133 66 103 83 38 262 -59 118 32 -3 157 -34 -233 -210 -10 -39 -16 224
7975 224 298 125 -5 -97 -181 -27 139 -411 -118 13 -157 98 -120 -176 -140 -131 -602 114 302 29 78 32 -90
7998 -90 64 -190 -105 83 -75 -135 307 80 70 -56 -177 321 -164 -52 167 -139 -46 -55 146 147 128 -97 -189 -302
8022 -302 -193 -260 239 151 224 -76 -108 133 -120 -90 -87 33 114 385 -143 -24 9 -166 -122 -47 -233 3 9 117
8046 117 -25 284 128 72 -173 -390 54 -266 273 -86 125 -217 124 -173 -409 -48 -91 -199 27 221 46
8067 46 -89 45 78 -77 -358 -233 160 -189 -41 181 11 90 -318 -6 -257 167 99 -112 248 47 -11 104
8089 104 -26 -186 -103 -178 -15 148 131 -12 316 51 -47 33 -36 -270 -265 -327 254 -16 35 361 84 -97 8
8112 8 -242 81 -217 202 228 61 -165 85 -1 -19 -321 158 -150 -124 73 -63 117 91 -65 -35 23 25 -195 63
8136 63 50 -249 -75 -181 -28 -334 -78 -263 -21 -85 161 -317 16 -157 89 -2 -47 -179 -171 40 -10 78 196
8159 196 215 158 -207 24 -45 -45 163 69 -260 230 209 174 111 -205 -204 -96 28 -23 25 -44 -2 329 36 -32 -39 -345
8185 -345 -123 -130 -12 133 111 -29
8191b9
$$ Imaginary data points
##PAGE= N=2
##DATA TABLE= (X++(I..I)), XYDATA
0 0 0 0 0 0 0 0 0 0 0 0 0 -1 8 -8 8 -8 12 -16 16 -24 24 -32 40 -43 49 -57 72 -80 94 -105 121 -138 159 -177
34 -177 201 -227 255 -285 320 -356 397 -440 490 -542 599 -661 730 -805 888 -977 1076 -1186
52 -1186 1308 -1443 1596 -1765 1961 -2184 2443 -2749 3117 -3569 4139 -4881 5900 -7380 9739
67 9739 -14120 24995 -113328 -106394 100586 10641 23563 118578 93210 -22800 -33016 -59597
79 -59597 -63860 2054 16910 -43059 19586 94238 48099 19775 41595 -54402 -124705 -53034
91 -53034 -43203 -89570 59082 205221 86350 -42580 12433 -415 -110541 -93251 2074
102 2074 35115 59302 53954 -4276 11537 57351 -30524 -107889 -38892 -17075 -70681 2982
114 2982 108492 75810 55993 83520 -24119 -143708 -74989 1361 -34186 5165 103482 80473
126 80473 8615 -12278 -47160 -60735 -15753 -29748 -65958 19467 93777 35003 23467 87369
138 87369 30943 -78802 -71940 -52986 -73579 -998 90848 63502 29989 46611 -12092 -92936
150 -92936 -67040 -24434 -23323 20963 63556 36019 38154 67313 6667 -58634 -30224 -32248 -84069
163 -84069 -39442 48771 51779 46450 68795 14767 -62629 -57404 -47150 -58289 1545 72507 57908
176 57908 41037 53984 8270 -48792 -37332 -36079 -65262 -28957 26993 25201 35204 69223
188 69223 33593 -27433 -33769 -45347 -70812 -24755 43599 48909 51688 68566 23935 -39720 -44855
201 -44855 -47496 -64805 -29425 22287 25387 31516 57657 36606 -8553 -20895 -35923 -57474 -31675
214 -31675 10407 23329 48012 74410 36425 -20873 -33013 -45465 -71339 -46521 6833 27556
226 27556 40531 58165 38512 1425 -12246 -29998 -53468 -37207 -1477 15440 35585 55884
238 55884 39588 6069 -14168 -43443 -69710 -48167 -7447 11100 32877 61858 53518 16285
250 16285 -8905 -28503 -46711 -40507 -17101 3804 29349 50081 40017 14275 -5501 -30606
262 -30606 -55266 -50038 -24556 138 29108 55038 52357 29593 7435 -19609 -45646 -47427 -27685
275 -27685 -5173 19191 40446 42106 26857 4213 -22964 -45405 -47030 -31400 -9439 19034
287 19034 45691 52208 38938 16761 -11214 -37062 -47227 -38613 -18302 8608 32018 41072 34331
300 34331 15931 -10770 -35218 -44688 -36870 -17145 9295 35376 48649 44540 25072 -2717 -28358
313 -28358 -44061 -43910 -28362 -2598 23024 38282 38515 24713 945 -23595 -39089 -39685 -25240
326 -25240 -703 25158 42511 45245 32075 7099 -20448 -39709 -45401 -35831 -13861 13171 33297
339 33297 40274 32902 12575 -12850 -31844 -38122 -32232 -12426 15349 35844 42294 35545 17089
352 17089 -9446 -33016 -45554 -42430 -21269 5704 24720 36794 41021 25303 -4978 -26192
364 -26192 -33252 -34337 -22330 3483 25984 37686 39727 24446 -2743 -24341 -37222 -44409 -32781
377 -32781 -5169 19341 35559 44301 31033 4920 -13211 -28193 -42996 -32692 -60 19511
389 19511 26614 37948 33449 6384 -16220 -30562 -43526 -36194 -10724 6698 23678 46230 43208
402 43208 14561 -5435 -21223 -43075 -39622 -11022 6221 21055 43869 39172 6434 -9344
414 -9344 -18479 -41443 -41342 -13420 1378 13116 40616 44391 19644 7198 -6305 -39398 -47198
427 -47198 -21994 -6779 9041 43159 47000 16744 2054 -11688 -44641 -46489 -14676 -2249
439 -2249 8048 40346 42128 14761 13485 9005 -33371 -47955 -19995 -14331 -12328 26938 49423
452 49423 31322 19064 -349 -43233 -49806 -21373 -17308 -3235 45653 53390 16940 10794 6859
465 6859 -32017 -38160 -11514 -22455 -25866 25565 45466 14331 18511 30509 -13328 -50910 -41070
478 -41070 -31430 -8751 37896 44881 25047 37479 21499 -46206 -56602 -10667 -12552 -23187 19398
491 19398 36314 10885 23260 32094 -16383 -35752 -9748 -27284 -47165 2262 47609 44098
503 44098 41641 23463 -25541 -35139 -26324 -54386 -37409 46438 56323 -254 10992 38694 -8615
516 -8615 -38127 -11775 -18854 -32154 4678 19506 5512 38896 60180 3845 -37142 -32202 -46897
529 -46897 -43555 8607 27502 24251 60071 46983 -38965 -50119 5651 -13951 -49235 1945
541 1945 38848 11514 13736 31848 8262 -1298 -777 -47057 -66291 -8681 20981 12526 46728
554 46728 62376 7007 -23215 -22089 -55839 -50972 24831 38466 -4627 21237 53566 1438
566 1438 -32594 -4955 -11086 -34878 -18004 -10580 -7409 43838 64264 13254 -4091 7021 -42278
579 -42278 -73523 -18289 17844 15372 47331 54576 -5943 -24085 1914 -27667 -52572 -3535
591 -3535 19644 -6477 9866 38940 21864 15689 16312 -31851 -57365 -20063 -9705 -18079 36160
604 36160 73363 26249 -7816 -4510 -38789 -56684 -11179 9269 -2863 27658 47730 7542
616 7542 -5817 16380 -8829 -39304 -21107 -16685 -24207 17743 50180 25747 18666 24031 -26617
629 -26617 -64644 -30138 -7211 -8762 29384 55236 20943 3033 9724 -21070 -42378 -12214
641 -12214 -5286 -22016 6499 35385 18360 18151 30106 -6869 -42788 -29086 -24553 -28380 15080
654 15080 51421 32648 20734 20026 -19180 -47377 -24216 -13008 -18726 11169 35818 17091 13013
667 13013 24176 -1953 -28814 -18619 -21450 -33181 -1063 33070 27658 27857 33146 -1964 -36054
680 -36054 -30861 -28360 -27913 7252 34993 22801 19966 26141 -2259 -28386 -18888 -17831 -26762 -4474
694 -4474 20586 18908 25407 34514 7923 -21728 -22876 -29348 -36281 -8433 22839 25320 29282 31937
708 31937 4242 -21406 -20520 -24261 -29649 -6068 18341 17810 22115 30093 11701 -11507 -16695 -26220
722 -26220 -34389 -15010 9337 16876 27631 35980 15828 -9384 -17638 -26765 -32816 -14281 8978
735 8978 16704 24973 30826 14635 -5971 -13681 -24179 -31868 -17997 1812 11236 23619 33467 21101
749 21101 1340 -10656 -23795 -32717 -20716 -1895 10236 23845 32101 20587 2112 -9968
761 -9968 -22251 -30253 -22010 -5828 7476 21916 30670 22815 7541 -4006 -19045 -30411 -25044
774 -25044 -9286 4919 18764 28039 24498 11611 -3179 -19413 -28982 -24580 -11874 1597 16670
787 16670 28008 26345 14523 -13 -15571 -26069 -25524 -16246 -2653 13559 26247 25876 15983
800 15983 2298 -12548 -24188 -26521 -18491 -4117 12416 24306 25797 19326 6447 -9890 -23137
813 -23137 -26632 -20151 -7466 7583 20905 25627 20851 8482 -7202 -20476 -25006 -20775 -9866
826 -9866 5836 19844 25850 22160 11263 -3904 -18021 -25231 -23419 -12914 2294 16701 23977
839 23977 22701 14230 -193 -15759 -23847 -22777 -13913 235 14385 23420 24086 16277 1401 -13968
853 -13968 -22634 -23326 -17659 -4652 11941 21806 23734 18080 5395 -10211 -19899 -23033 -19475 -6457
867 -6457 10494 20102 22851 19756 7638 -8612 -19200 -23175 -21010 -8880 7398 16943 21395 22294
881 22294 11197 -5548 -16017 -21006 -22107 -12239 4608 15247 21187 23544 12951 -4438 -15041
894 -15041 -20701 -23681 -13699 3781 13191 19545 23990 14804 -2470 -10850 -16807 -23104 -16683 -723
908 -723 9165 17168 25574 17811 6 -8516 -16172 -26615 -20418 -759 10464 17435 25451 17543
922 17543 1258 -5907 -14016 -25945 -18944 -167 4758 9275 22523 21284 6422 -1531 -11929
935 -11929 -26153 -21506 -5146 -198 9483 28942 26756 4736 -5316 -11262 -24070 -21285 -5875
948 -5875 -638 9415 25635 18834 1427 2306 -229 -20368 -24586 -10029 -4148 4412 22826 22859
962 22859 10731 9822 -2288 -29963 -29607 -6895 -1128 3473 22084 23960 9344 4385 -5257 -23767
976 -23767 -17363 -1369 -9197 -8054 18616 25111 10111 9180 4722 -16954 -23124 -15754 -18257 -4025
990 -4025 28209 28937 8072 8495 4968 -20796 -26361 -10313 -6512 467 19451 14445 2519 14591
1004 14591 13430 -15985 -22237 -7812 -13586 -14599 10055 21715 17658 23469 10667 -23018 -25296
1017 -25296 -9015 -15745 -12257 19762 27329 9535 8289 5041 -13981 -12350 -3332 -17517 -16457
1030 -16457 11850 15861 3852 18416 23438 -4189 -18242 -15705 -25671 -17539 15067 20987 10500
1043 10500 21472 17557 -16663 -24825 -8154 -10900 -10905 9200 10945 3177 17279 18380 -6406 -8549
1057 -8549 4 -20125 -28601 -1072 12883 11068 25274 24232 -5916 -15747 -10680 -24119 -21417
1070 -21417 11681 19052 6188 14204 16156 -5752 -8904 -807 -15536 -19799 795 2641 -3088
1083 -3088 19496 29566 4873 -6159 -4998 -24050 -28527 -1398 10249 8649 24456 23935 -4879
1096 -4879 -12791 -3905 -16064 -19084 2566 5540 -2236 12920 20525 3271 1118 5471 -15914 -27715
1110 -27715 -8647 -421 -376 21240 29683 6971 -3841 -4024 -21804 -25483 -2048 5868 1735 15426
1124 15426 20087 981 -1603 5431 -10674 -20369 -5967 -4290 -8337 12072 24926 11333 6729
1137 6729 4753 -17335 -27958 -10446 -2778 -1740 17595 25242 6831 618 2157 -12824 -19080
1150 -19080 -4844 -2812 -7421 8555 18223 7931 7465 10563 -7800 -21068 -13148 -10813 -9247 11277
1164 11277 23382 12615 8345 7095 -11688 -21725 -10228 -5474 -5701 8626 16774 7941 6519
1177 6519 9128 -5510 -15182 -9205 -10148 -12383 3494 16720 12610 12965 12408 -5204 -17785 -13204
1191 -13204 -11965 -10310 5947 16932 11201 9503 9558 -4149 -13818 -9323 -10003 -11252 1323 11784
1205 11784 9889 12305 13852 422 -11387 -11228 -13765 -14353 -234 11711 11929 13362 12544 -155
1219 -155 -10827 -10854 -12414 -12279 -530 9164 9162 11511 13109 3237 -7067 -9669 -12698 -14082 -4524 5801
1235 5801 9056 13834 14937 4256 -6187 -9209 -13046 -13905 -4554 5465 9181 12680 13652 5185 -3615
1250 -3615 -7408 -12221 -14439 -6910 2578 7056 11731 14203 7923 -916 -6776 -12661 -14600 -7703 734
1265 734 6565 11999 14431 8229 -218 -5868 -11192 -13649 -8821 -1350 4799 10794 13942 9481 2140
1280 2140 -4024 -10217 -13652 -10219 -2976 3627 10329 13405 9996 3876 -3067 -10144 -13579 -10685 -4351
1295 -4351 2190 8720 12974 11318 5444 -1559 -8242 -12492 -11091 -5815 763 8116 12371 10967 6379
1310 6379 -493 -7177 -12053 -11719 -7272 -385 6807 11274 11586 7615 1412 -5928 -11080 -11742 -7956 -1886
1326 -1886 5282 10354 11756 8468 2605 -4725 -10539 -11495 -8623 -3236 3751 9836 11830 9102 3858
1341 3858 -2760 -9024 -11125 -9369 -4661 2444 8857 11406 9602 5238 -1417 -8500 -11171 -10088 -5651
1356 -5651 1275 7788 11105 10122 6431 -205 -6783 -10404 -10067 -6693 -351 6952 9710 9821 6950 1030
1372 1030 -6092 -10015 -10349 -7609 -1413 5604 9136 10424 8630 2195 -5218 -8688 -9395 -8564 -2891 4076
1388 4076 8064 9582 9189 3167 -4143 -7615 -8815 -9605 -4944 3455 8525 10108 9275 4312 -2159 -6717
1404 -6717 -9871 -10701 -4314 3664 6025 7480 9827 5927 -2187 -6239 -8264 -9955 -5733 1091 4569
1419 4569 7254 11327 8071 -573 -5823 -8145 -10413 -7328 -1147 3526 8883 12128 6009 -1915 -2796
1434 -2796 -4775 -10806 -8251 576 3874 5289 9563 7990 1853 -948 -5161 -11813 -9513 -1557 1770
1449 1770 5101 10806 9345 2868 -844 -6778 -12066 -6648 781 -135 2481 11426 10128 -5 -1801
1464 -1801 -1803 -7867 -9112 -4555 -2421 2486 10812 9720 3477 2622 -1731 -10774 -10657 -3990 -1252 4211
1480 4211 11334 7929 722 2250 -220 -10718 -10044 -933 -823 -1728 5425 8922 5461 5121 356 -8184
1496 -8184 -8132 -4303 -5968 -1761 10525 10955 4155 3430 -368 -10024 -9002 -2366 -3902 -1753 8686
1511 8686 8479 1097 3338 4544 -4282 -7505 -4919 -6434 -3619 5707 6891 5095 8454 4576 -9224
1526 -9224 -10776 -4563 -5643 -3213 8116 9372 3376 4544 3480 -6370 -6544 -781 -4827 -6193 2784
1541 2784 5588 2946 7242 6424 -3065 -5809 -4791 -9771 -7264 6090 9134 4382 7673 6170 -5554
1556 -5554 -7936 -3160 -5329 -4785 3977 4640 674 5130 6916 -1506 -3525 -1290 -7448 -8878 634
1571 634 4489 3714 10171 9787 -2266 -6301 -3841 -8658 -7646 3163 5781 2115 6106 6213 -2686
1586 -2686 -3724 452 -5255 -7017 438 1593 205 7192 9647 1370 -1566 -1429 -8915 -10620 -796
1601 -796 3376 2533 8351 8367 -1170 -3854 -1199 -5890 -6656 1290 2061 -852 4817 7462 1493 151
1617 151 1377 -5936 -9843 -3436 -801 -489 7319 10284 2772 -735 -713 -6825 -8434 -824 1555 383
1633 383 5241 7012 571 -516 1659 -4071 -7268 -2816 -1845 -2638 4085 8129 4209 2677 2338 -5099
1649 -5099 -9168 -3752 -1560 -825 5586 8141 2486 442 770 -4763 -6993 -2180 -1580 -2581 2801 5938
1665 5938 3473 3514 3836 -2344 -6856 -4181 -3679 -3414 3104 7187 4446 2932 2393 -3763 -6838 -3710
1681 -3710 -2637 -2482 2504 5843 3300 3149 3527 -1428 -4652 -3208 -3796 -4505 650 5117 3950 4063
1697 4063 4179 -1243 -5569 -4780 -4301 -3640 1457 4892 4157 3954 3690 -723 -4234 -3347 -3763 -4058 -85
1714 -85 3039 2899 4149 4625 539 -3442 -3496 -4096 -4600 -525 3942 4498 4823 4498 665 -2812 -3520 -4888
1732 -4888 -4570 -990 2420 2822 3620 4365 1414 -1876 -2821 -3847 -4694 -1979 1837 2880 4317 5208 2031
1749 2031 -1446 -3133 -4464 -5227 -2103 844 2579 4246 4742 2310 -628 -2012 -3582 -4438 -2514 360
1765 360 2245 3954 4698 2880 222 -2099 -4068 -4812 -3245 -523 1431 3507 4880 3181 620 -1288
1781 -1288 -3185 -4062 -3273 -315 1219 3189 4045 3392 1164 -958 -3188 -4320 -3637 -1552 740 2749
1797 2749 4170 3544 1786 15 -2428 -4089 -3618 -1733 278 2321 3792 3700 2200 -148 -2407 -3640
1813 -3640 -4085 -2078 -590 1760 3765 3659 2701 878 -1898 -3284 -3716 -2603 -884 1150 3271 3480
1829 3480 2621 673 -1317 -3296 -3863 -2816 -989 1123 2921 3751 2989 1334 -470 -2911 -3418 -2839
1845 -2839 -1749 286 2201 3186 2885 1653 -308 -2522 -3484 -2978 -1994 539 2450 3510 2996 2153 149
1862 149 -1723 -3068 -3075 -1970 -595 1307 2668 3119 2417 615 -1741 -2322 -2804 -2439 -985 1698 2940
1879 2940 2760 2542 885 -1004 -2371 -3007 -2737 -1584 982 2161 2675 2592 1631 -595 -2282 -2953 -2573
1896 -2573 -1099 835 1687 2409 3410 1654 -886 -1784 -2284 -3088 -2224 -300 1655 2351 3274 2042 -85
1913 -85 -1377 -1652 -2720 -2355 46 1417 2213 2849 2068 67 -407 -1513 -3461 -2682 -29 817 962 2543
1931 2543 2870 1132 -699 -1536 -2536 -2252 -671 407 1239 2960 2342 424 -689 -1182 -2301 -2301 -838
1948 -838 1 493 2785 2726 581 240 302 -1996 -2872 -1658 135 927 2130 2399 1468 447 -762 -2780
1966 -2780 -2973 -863 -402 -160 1892 2534 1048 685 531 -1868 -2615 -944 -749 -1034 1394 3073 1836
1983 1836 964 422 -1629 -2903 -1554 -1386 -398 2283 2674 975 1046 843 -1119 -2025 -667 -1147 -1195 874
2001 874 1892 845 1293 1609 -639 -2303 -1851 -1717 -1399 1081 2563 1596 1913 1448 -1250 -2249 -902
2018 -902 -1104 -1515 784 1983 664 894 1832 -174 -1406 -899 -1484 -2481 -214 1586 1607 2268 2547 43
2036 43 -1886 -1326 -1828 -2255 310 2068 1026 966 1662 -291 -1231 -320 -985 -2130 -272 899 227 1302
2054 1302 2883 872 -684 -670 -1675 -3022 -848 1164 924 1404 2333 319 -1449 -595 -1139 -2249 -242
2071 -242 1138 -40 365 2284 731 -509 238 -1160 -2603 -1603 -89 -105 1079 3020 1744 -233
2087 -233 -118 -1253 -2600 -1026 612 234 725 2331 944 -425 297 -399 -2263 -1345 -370 -1048 320
2104 320 2341 1980 671 856 -575 -2765 -1772 -180 -379 662 2337 1534 212 399 -336 -1974 -1308
2121 -1308 -140 -668 -391 1926 1307 688 1271 467 -1757 -1921 -954 -1583 -280 2083 1968 543 1195 145
2139 145 -1777 -1427 -595 -917 -169 1310 1277 443 888 600 -1235 -1261 -540 -1740 -986 951 1504 1139 1884
2158 1884 655 -1387 -1488 -1085 -1322 -764 1380 1470 963 924 841 -950 -959 -704 -1635 -714 541 734 849 1610
2178 1610 1502 -360 -915 -1245 -1445 -1215 578 1151 1117 1630 1403 -429 -930 -661 -1375 -1168 28 771 818
2197 818 1457 1229 -43 -422 -394 -1577 -1544 -218 620 707 1725 1822 329 -345 -714 -1762 -1703 -24 542
2216 542 770 1487 1483 446 -282 -127 -1269 -1375 -427 -140 434 1442 1620 601 101 -101 -1534 -1831 -1197
2235 -1197 90 56 1389 1667 1007 84 -272 -1011 -1583 -889 -247 19 914 1683 1100 702 -205 -1025 -1703
2254 -1703 -785 -549 -234 1137 1444 1176 641 104 -836 -1358 -1112 -592 -167 609 1488 1012 450 508 -724
2273 -724 -1318 -1112 -881 -305 775 1371 1089 1008 409 -613 -1346 -794 -1215 -661 393 884 1579 933 497
2292 497 -473 -1051 -1488 -1291 -796 249 795 1210 1261 791 -26 -947 -1324 -1174 -819 -226 686 1283 1246 1206 305
2313 305 -716 -1246 -1313 -886 -296 597 1315 1386 1016 659 -497 -1081 -1302 -1016 -442 319 932 1432 965 603
2333 603 -466 -1164 -1430 -1276 -448 197 996 1538 1333 890 -39 -652 -1343 -1084 -951 134 787 1171 1413
2352 1413 898 14 -703 -1147 -1708 -1032 -145 589 734 1168 1035 528 -585 -1131 -1438 -1139 -334 509 1041
2371 1041 1444 1318 697 -30 -984 -1744 -1489 -482 104 790 1341 1366 761 -20 -689 -1262 -1169 -982 -226 889
2391 889 1457 1302 960 355 -443 -1238 -1748 -659 76 489 1177 1525 852 582 -408 -1300 -1234 -801 -511 225
2411 225 1161 1091 1074 863 230 -1383 -1546 -1068 -996 -129 1106 1626 1084 778 350 -866 -1523 -1255 -1047 -292
2431 -292 1073 1311 996 1170 359 -1118 -1404 -1075 -952 -464 948 1248 1147 1723 538 -613 -1421 -997
2449 -997 -1004 -812 437 1428 1242 1543 982 -761 -1019 -832 -1469 -1185 228 1246 1116 1536 1333 -113 -888
2468 -888 -1170 -1974 -1330 285 991 939 1437 1308 -333 -1244 -1047 -1649 -1250 191 745 625 1577 1382 65
2487 65 -421 -891 -1539 -2120 -252 564 755 2120 1973 318 -721 -931 -1598 -2026 -216 761 663 1731 1803
2506 1803 303 -149 -315 -1535 -1892 -517 95 121 1547 2328 689 -117 -81 -1460 -2154 -867 338 576
2524 576 1432 1995 502 -372 -220 -1334 -1723 -646 -39 -20 976 2010 917 419 618 -905 -2160 -897
2542 -897 -353 -414 1418 2800 1206 190 -137 -1370 -2349 -917 29 -356 1508 2096 684 190 778 -540
2560 -540 -2222 -1077 -1088 -1055 1038 2444 1460 952 946 -1011 -2480 -1442 -1082 -875 1039 2365 1027 536
2578 536 1026 -665 -1943 -863 -466 -1308 345 1725 1236 1027 1707 -172 -1885 -1435 -1536 -1795 385
2595 385 2302 1704 978 1583 -497 -1800 -838 -1168 -1372 205 1758 725 821 1834 557 -1072 -823
2612 -823 -1201 -2078 -398 1334 1097 1577 2434 312 -1804 -1880 -1348 -1949 -294 1777 1065 1112 1944 568
2630 568 -1237 -626 -901 -2062 -554 802 493 1251 2436 870 -604 -595 -1545 -2687 -863 994 944 1502
2648 1502 2417 1072 -1071 -837 -1068 -2121 -535 661 224 927 2075 1310 -151 -196 -974 -2237 -1553
2665 -1553 -126 433 1384 2797 2042 -83 -503 -1248 -2449 -1137 368 232 1159 2051 1387 -32 74
2682 74 -557 -2299 -1497 -80 -79 369 2440 2020 602 253 -975 -2327 -1862 -399 37 757 2365 1739
2700 1739 379 103 -575 -2074 -1618 -525 -764 540 2310 1562 794 845 -131 -1858 -1862 -1243 -782 155 1974
2719 1974 1980 1117 1007 -225 -2079 -2343 -1276 -332 363 1882 1884 1174 721 -57 -1436 -1738 -1181 -1258 -408 1463
2739 1463 1564 1456 1506 -182 -1500 -2107 -1588 -945 -193 1487 1700 1419 1302 178 -1056 -1659 -1616 -1457 -472
2758 -472 1190 1589 1423 1656 739 -685 -1523 -1560 -1360 -595 900 1608 1675 1592 901 -699 -1622 -1540 -1689 -854
2778 -854 460 1365 1475 1907 1070 -236 -1158 -1642 -1601 -1282 242 1303 1593 1980 1327 -162 -1166 -1599
2796 -1599 -1976 -1646 -28 1136 1778 1842 1497 71 -727 -1713 -1947 -1216 -347 975 1391 1593 1553 702 -837
2815 -837 -1718 -1737 -1696 -347 641 1441 1915 1948 910 -607 -1241 -2058 -1591 -992 153 1031 2175 1954 764
2834 764 -239 -1082 -1829 -1683 -951 240 1282 1826 2122 1394 361 -1066 -1794 -2353 -964 -20 806 1676
2852 1676 2036 1534 465 -696 -1962 -1871 -1527 -377 713 1611 2088 1445 416 -641 -1466 -1797 -1503 -1213
2870 -1213 73 1384 2201 1742 749 -440 -1455 -2038 -1866 -860 221 1325 1924 1788 1014 330 -1118
2887 -1118 -2043 -1836 -1107 -257 1123 1877 1897 1379 458 -820 -1771 -1605 -1695 -751 725 2018 1900 1410 587
2906 587 -842 -1788 -2168 -1753 -796 526 1835 2024 1382 1069 -612 -1644 -2027 -1752 -1018 338 1605 1762
2924 1762 1841 911 -187 -1429 -1642 -1676 -1397 -49 1446 1687 1981 1709 185 -1314 -1698 -1841 -1966 -195
2942 -195 1352 1491 1601 1850 184 -1157 -1585 -2056 -2119 -529 1022 1244 1779 2205 607 -834 -1824 -2211
2960 -2211 -2112 -544 907 1199 1749 1941 480 -805 -1090 -1681 -2191 -886 489 789 1806 2637 947
2977 947 -413 -1030 -1923 -2677 -969 634 811 1683 2438 1139 -419 -669 -1540 -2793 -767 559 255
2994 255 1479 2320 1302 -14 -90 -1497 -2882 -1469 -105 464 1360 2918 1864 194 -302 -1466 -2612
3011 -2612 -1552 132 190 1215 2533 1303 215 224 -922 -2532 -1528 -364 -670 666 2873 1958 952
3028 952 756 -1153 -2844 -1891 -424 -459 1029 2965 1999 518 874 -473 -2479 -1816 -629 -1190 506
3045 506 2085 1845 818 1191 -64 -2587 -2272 -1181 -1487 433 2716 2306 1131 1305 -453 -2810 -1893
3062 -1893 -816 -961 97 2212 1474 1037 1538 491 -2127 -1620 -1231 -2258 -426 2257 2045 1560 2245
3079 2245 407 -2020 -2298 -1547 -1709 -105 1969 1979 1241 2089 319 -2047 -1264 -1142 -1795 -744 1300
3096 1300 1380 935 2308 999 -1540 -1838 -1521 -2771 -1209 1551 1922 1525 2643 805 -1714 -1511 -1126
3113 -1126 -2125 -977 1227 1255 1082 2239 1407 -1058 -956 -1137 -2614 -2045 925 1007 1418 2715 1983 -769
3131 -769 -1348 -1302 -2846 -1602 727 963 914 2396 1588 -537 -699 -706 -2270 -1744 136 422 943 2674 2155
3150 2155 -7 -299 -713 -2945 -2264 141 512 1080 2784 1823 -117 -857 -993 -2061 -2007 -149 124 209
3168 209 2361 2056 568 278 -683 -2173 -2356 -741 -494 528 2413 2565 779 45 -525 -2475 -2183
3185 -2183 -762 -152 517 2438 1948 317 463 123 -2058 -2315 -1018 -912 -62 1906 2370 1266 651
3202 651 -160 -2105 -2462 -1290 -867 170 2210 2489 1070 789 -73 -1687 -1990 -1403 -1036 -335 1532 2042
3220 2042 1205 1244 437 -1356 -2207 -1615 -1047 -341 1492 2192 1871 1292 542 -1180 -1858 -1687 -1422 -410 1003
3239 1003 1837 1423 1278 658 -1131 -1794 -1666 -1599 -876 987 1956 1815 1779 1125 -624 -1708 -1693 -1848 -1246
3258 -1246 723 1613 1830 1769 1084 -489 -1536 -1813 -1767 -1201 384 1344 1523 1954 1346 -69 -1401 -1776
3276 -1776 -1825 -1467 -85 1332 1538 1823 1384 1 -967 -1611 -1980 -1461 -201 1070 1387 1882 1670 184
3294 184 -858 -1491 -1808 -1883 -562 677 1304 2143 1699 828 -447 -1233 -2064 -1632 -903 459 1253 2185 2013
3313 2013 617 -138 -1136 -2074 -2285 -731 129 1297 1862 2095 1216 -177 -1009 -1723 -2087 -1502 -210 1073
3331 1073 1940 1780 1551 224 -708 -1912 -2054 -1355 -376 701 1600 2602 1741 423 -484 -1425 -1929 -1816
3349 -1816 -430 562 1678 2076 1659 569 -259 -1578 -2071 -1566 -878 227 1177 2096 1837 1126 -48 -1214
3367 -1214 -2239 -1871 -740 -371 1241 1861 1924 1076 69 -1184 -1784 -1665 -1060 -129 825 1900 1791 1236
3385 1236 337 -782 -1933 -2032 -1180 -535 704 1958 1609 1458 564 -495 -1404 -1590 -1478 -956 752 1486
3403 1486 1857 1639 928 -701 -1428 -1825 -1777 -1263 121 1492 1899 1797 1239 -64 -1813 -1596 -1413 -1280
3421 -1280 188 1272 1863 1786 1316 -233 -1019 -1536 -1990 -1571 -225 1381 1559 1819 1731 775 -1306 -1403 -1820
3440 -1820 -1797 -336 995 1659 1877 1570 653 -954 -1454 -1690 -1869 -593 503 1235 1568 2049 829 -510
3458 -510 -1159 -1790 -2215 -1052 399 988 1654 2197 918 -506 -917 -1688 -2060 -919 449 729 1573 2168
3476 2168 1087 -119 -697 -1552 -2096 -1393 -92 527 1193 2419 1564 12 -566 -1523 -2467 -1785 13 513
3494 513 1318 2496 1563 -128 -331 -1277 -2202 -1434 -244 215 1034 2363 1781 399 221 -858 -2510 -1848
3512 -1848 -708 -199 1010 2463 2087 411 122 -771 -2732 -1812 -402 -465 776 1949 1741 584 576 -428
3530 -428 -2043 -1769 -660 -784 272 2465 2029 992 962 -270 -2360 -2054 -1018 -631 432 2218 2100
3547 2100 829 669 -142 -2064 -1651 -830 -1041 -164 2076 1754 1084 1631 138 -2052 -1741 -1356 -1657 -379
3565 -379 2078 1934 1232 1204 201 -2199 -1799 -1087 -1182 -264 1726 1685 908 1679 774 -1253 -1412 -1186 -1713
3584 -1713 -946 1387 1685 1313 2091 780 -1507 -1558 -1314 -1828 -933 1632 1554 1231 1703 707 -1194 -1304 -1097
3603 -1097 -1919 -1165 688 1099 1074 2278 1464 -407 -1309 -1065 -2359 -1292 892 1512 1100 2256 1410 -746
3621 -746 -1480 -949 -1969 -1196 579 947 1026 1834 1581 -118 -704 -851 -1983 -1832 -48 398 1075 2252
3639 2252 1970 -63 -729 -1187 -2091 -1912 288 842 1125 2157 1620 13 -583 -581 -1977 -1729 -115 -121 439
3658 439 2077 1901 505 -171 -639 -2082 -2251 -338 340 542 2032 2055 166 -542 -484 -2110 -2173 -469
3676 -469 -150 294 1854 2173 858 73 -20 -1687 -2163 -983 -348 320 1705 2438 828 202 -260 -1613
3694 -1613 -1972 -936 -334 -82 1626 1650 813 442 -142 -1451 -2021 -1085 -927 -330 1192 1885 1238 1030 164
3713 164 -1488 -1851 -1325 -905 -300 1072 1904 1312 541 226 -1052 -1727 -1393 -1000 -269 917 1910 1269 1305
3732 1305 645 -986 -1754 -1452 -1219 -635 837 1671 1486 1294 665 -689 -1865 -1419 -1383 -824 321 1401
3750 1401 1233 1368 816 -577 -1239 -1544 -1465 -1113 276 1096 1656 1444 1362 -376 -1125 -1395 -1641 -1220 234
3769 234 1293 1583 1359 1127 54 -913 -1574 -1569 -1233 -150 765 1141 1755 1462 -23 -782 -1239 -1506 -1484 -432
3789 -432 627 1082 1885 1385 522 -891 -1192 -1624 -1677 -557 525 1486 1604 1596 921 -437 -843 -1464 -1622
3808 -1622 -536 217 929 1424 1428 898 -282 -777 -1640 -1447 -826 -162 767 1294 1508 1008 317 -948 -1380
3827 -1380 -1510 -851 -478 617 1494 1656 936 210 -377 -1086 -1440 -1168 -78 385 1267 1679 1260 713 -294
3846 -294 -1087 -1576 -1387 -463 179 1067 1504 1370 774 -215 -1175 -1535 -1398 -676 -143 896 1338 1665 596
3865 596 153 -905 -1484 -1451 -693 -82 819 1488 1219 857 49 -771 -1336 -1312 -1081 -273 913 1694 1101 1150
3885 1150 539 -401 -1416 -1625 -1297 -595 373 1421 1491 1160 631 -182 -1061 -1398 -911 -465 265 1194 1505
3904 1505 1344 687 25 -1174 -1500 -1364 -1157 12 1039 1375 1353 1173 179 -811 -1039 -1481 -1041 27 899
3923 899 1399 1360 922 202 -1071 -1368 -1587 -1169 -151 717 1448 1407 1179 364 -664 -896 -1268 -1371 -377 311
3943 311 781 1341 1434 617 -738 -1055 -1425 -1243 -614 225 920 1211 1546 669 -652 -1070 -905 -1435 -1115 586
3963 586 953 927 1529 882 -232 -524 -1070 -1516 -906 9 959 1313 1553 1251 -245 -549 -1244 -1429 -766 69
3983 69 697 1042 1477 941 -95 -46 -530 -1554 -1375 -246 222 1022 1830 1367 287 -148 -980 -2108 -1212
4002 -1212 -392 73 733 1917 1418 194 27 -431 -1462 -1118 -390 -103 505 1499 1255 509 164 -455 -1697
4021 -1697 -1378 -558 -401 617 1499 1481 789 379 -549 -1396 -1224 -521 -316 235 1534 1422 550 547 -55 -1397
4041 -1397 -1340 -652 -1054 30 1406 1481 744 680 119 -1429 -1541 -690 -792 29 1387 1425 659 832 317 -1076
4061 -1076 -1177 -312 -541 -270 851 1235 902 1231 676 -867 -896 -653 -1202 -507 1316 1355 1297 1268 452 -855
4081 -855 -1151 -972 -959 -390 756 1110 516 1111 788 -702 -654 -739 -956 -883 444 817 706 1148 1021 -895
4101 -895 -1027 -918 -1373 -1033 874 1041 760 1241 917 -421 -801 -844 -1285 -819 238 761 796 1212 1191 -234
4121 -234 -560 -845 -1603 -1412 313 616 723 1436 1095 -285 -397 -455 -1446 -889 -117 803 315 1399 1148
4140 1148 -130 -248 -433 -1594 -1343 -287 413 777 1384 1522 84 -372 -549 -1381 -1184 -511 84 518
4158 518 1252 1309 -20 -300 -523 -853 -1284 -411 177 105 994 1502 543 -126 -174 -1402 -1663 -425 -200 236
4178 236 1368 1366 638 131 -91 -967 -1425 -674 89 441 1214 1216 579 305 409 -1052 -1507 -938 -295 -234 994
4199 994 1229 1024 329 44 -749 -1298 -565 -402 -239 730 1316 756 309 75 -717 -1280 -887 -672 22 509
4219 509 1106 977 354 401 -691 -1110 -1120 -646 -393 573 1158 739 640 638 -413 -805 -656 -727 -383 466 1027
4240 1027 980 720 688 -189 -896 -888 -998 -849 148 791 998 920 723 -192 -808 -866 -850 -557 29 1152 797 911
4262 911 698 203 -807 -706 -845 -768 -177 793 1181 780 777 101 -617 -848 -1053 -723 -280 418 1022 1052 899
4283 899 191 -399 -756 -930 -616 -604 254 827 1124 713 489 -216 -708 -823 -711 -449 278 765 812 1217 450
4304 450 156 -682 -688 -874 -619 119 362 916 1148 529 101 -481 -1073 -1033 -713 -110 462 737 946 829 170
4325 170 -453 -777 -900 -766 352 318 752 865 675 201 -317 -660 -1058 -599 -508 248 1006 990 604 342 -180
4346 -180 -625 -1079 -1156 -306 128 719 789 615 149 -194 -711 -889 -482 -273 179 452 1036 1172 381 -17 -519
4367 -519 -920 -1047 -766 -114 328 909 807 449 441 -257 -799 -897 -738 -42 357 735 874 680 457 -199 -653
4388 -653 -907 -475 -264 267 831 859 618 452 -52 -736 -905 -412 -365 -4 526 857 727 335 122 -363 -891
4409 -891 -838 -462 -95 597 477 977 505 54 -520 -594 -731 -496 -383 261 668 694 719 343 -369 -620 -654 -702
4431 -702 -202 163 761 915 1025 269 -397 -724 -742 -675 -299 400 505 674 604 594 -146 -489 -814 -574 -254
4452 -254 76 636 677 1041 722 110 -359 -725 -1141 -442 0 521 503 741 606 94 -245 -645 -703 -431 -15
4473 -15 103 436 1109 664 -6 -282 -276 -967 -628 99 114 413 782 959 -81 45 -283 -761 -713 -214 126
4494 126 540 954 525 185 30 -81 -700 -740 -388 -155 179 1106 773 370 156 -179 -1079 -708 -376 -231
4514 -231 481 713 717 182 28 -215 -848 -723 -172 -123 114 452 591 308 311 -151 -693 -798 -434 -401 97 694
4536 694 814 391 394 206 -776 -603 -487 -322 -123 692 833 529 486 105 -624 -716 -500 -651 -16 393 721
4557 721 675 614 385 -494 -770 -483 -666 -181 394 469 302 578 617 -526 -741 -296 -642 -412 124 549 725
4578 725 589 356 -372 -873 -682 -816 -740 164 398 428 864 489 -147 -639 -389 -665 -339 66 582 322 529
4599 529 485 -120 -380 -199 -551 -676 134 410 651 735 630 -84 -48 -405 -647 -851 178 632 304 805 530
4620 530 7 -384 -163 -572 -737 -219 246 214 875 920 154 208 -377 -750 -802 -157 201 466 608 717 141
4641 141 -312 -468 -583 -867 -256 -53 80 766 699 20 10 177 -648 -806 -431 -35 -72 788 845 444 -59
4662 -59 50 -600 -839 -277 27 265 458 672 570 227 178 -584 -780 -497 -1 -353 361 860 465 23 58
4683 58 -307 -972 -597 -273 -337 471 596 316 218 -47 -344 -593 -372 -270 -123 272 485 209 471 130 -167
4704 -167 -530 -477 -298 -348 -70 500 529 268 143 -195 -712 -305 -313 -275 -51 626 715 438 156 163 -729 -422 -311
4727 -311 -349 87 156 306 469 493 -19 -371 -513 -244 -258 106 228 308 656 543 -106 -463 -221 -424 -354 26
4749 26 390 528 417 473 -39 -386 -245 -301 -639 156 154 349 566 287 368 -280 -553 -428 -406 -230 100 296
4771 296 171 290 90 -240 -163 -569 -226 -492 -34 244 485 383 282 -184 -252 -309 -404 -364 -116 373 232 407
4793 407 586 197 -265 -530 -576 -440 -148 419 524 600 539 -60 -153 -289 -365 -380 -270 412 230 389 516 -128
4815 -128 -261 -203 -660 -203 -154 12 188 600 218 282 1 -331 -469 -565 -330 104 -25 499 592 279 320 -93
4837 -93 -206 -389 -417 3 -41 178 613 329 84 -214 -434 -546 -815 -271 -48 381 340 272 220 -21 -220 -583
4859 -583 -515 -173 -236 452 148 481 254 149 -175 -518 -456 -289 105 -26 267 261 148 -156 -154 -466 -363 -17
4881 -17 -228 277 145 362 276 510 -222 -165 -610 -144 -151 280 504 354 301 154 4 -414 -353 -450 -275 294 456
4904 456 482 341 469 -9 -463 -322 -255 -253 -169 427 425 624 456 -113 -426 -401 -352 -346 106 113 448 409 619 34 -266
4929 -266 -360 -282 -211 -64 148 242 360 443 179 -45 -467 -461 -259 -244 -27 376 533 413 210 -149 -37 -315 -10
4952 -10 -316 117 323 493 677 245 -119 -242 -349 -460 -257 62 -22 410 667 298 84 206 -390 -514 -322
4973 -322 18 -56 482 334 81 75 203 -73 -478 -176 -59 -181 330 524 67 99 311 -311 -299 -376 -335 -74
4995 -74 144 289 398 101 -57 -418 -554 -313 -302 -132 338 622 295 -94 218 -256 -199 -307 -291 -199 17 428
5017 428 431 105 19 -218 -357 -271 -471 142 45 570 122 417 326 116 -223 -327 -177 -113 100 56 445 193 665
5040 665 178 -338 -69 -529 -173 59 277 436 318 442 168 -330 -376 -303 -315 112 89 414 522 445 139 -171
5062 -171 -666 -177 -412 -255 124 192 640 652 387 -28 -431 -439 -521 123 151 65 261 479 404 -53 4 -113 -605
5085 -605 -7 23 309 360 304 486 -76 -143 -123 -511 -450 -32 143 238 526 205 133 -57 -223 -341 -635 56 244
5108 244 407 526 205 -227 -5 -245 -567 -201 -103 -6 40 671 213 -200 -196 6 -586 -543 -226 -12 322 485
5130 485 201 107 122 -249 -346 -429 -110 -247 72 636 267 122 -88 -184 -463 -429 -149 -162 -3 492 479 55 2
5153 2 11 -568 -467 -331 -122 -84 342 420 348 246 13 -262 -50 -120 -307 -130 208 235 365 480 -82 -330 -542
5176 -542 -101 -318 -147 271 396 -66 288 -91 -164 -498 -176 -512 -26 307 59 -6 260 335 -233 -171 -283
5197 -283 -501 0 242 335 226 563 237 -183 -200 -277 -561 31 56 275 88 399 497 57 76 -394 -393 -469 215
5220 215 10 445 449 122 -48 -82 -429 -365 -281 37 59 366 202 369 150 -221 -313 -565 -179 116 241 378
5242 378 311 469 7 -108 -129 -193 -541 -21 123 394 452 262 324 -118 -105 -299 -469 -115 -79 129 501 552 170
5265 170 -140 -11 -311 -495 -180 151 334 311 349 89 7 -175 -173 -380 -192 311 75 291 331 114 244 29
5287 29 -250 -221 -389 -128 138 280 424 -24 8 109 -331 -277 -266 -383 259 257 274 403 48 222 -279 -429 -210
5310 -210 -188 -89 166 507 259 287 82 -345 -416 -273 -435 -77 208 344 578 258 -195 75 -479 -508 -253 -147
5332 -147 143 248 179 378 16 -199 -503 -209 29 -406 367 410 303 222 463 80 -322 -533 -323 -227 92
5353 92 170 387 329 12 142 -79 -208 -209 -22 202 99 313 157 80 -93 -454 -568 -196 -265 39 190 194 445
5376 445 484 -105 -192 -358 -381 -332 -229 23 411 398 358 294 -78 -265 -543 -332 -124 259 231 523 155 34 -160
5399 -160 -110 -355 -536 -452 22 138 423 372 87 78 -273 -282 -599 -344 -113 435 262 268 466 169 -287 -427 -204
5422 -204 -245 -98 57 436 407 344 23 -374 -343 -216 -417 -154 23 359 225 392 84 233 -158 -718 -477
5443 -477 -280 289 370 255 274 323 97 -19 -551 -484 -286 114 241 532 61 353 38 -180 -436 -333 -452
5464 -452 -103 299 596 80 95 -21 -250 -253 -507 -218 -76 -94 156 345 221 -29 -139 52 -323 -312 -116 134
5486 134 352 276 205 241 41 -377 -472 -180 -446 -244 121 490 310 259 118 -457 -719 -325 -351 121 357 401
5508 401 423 440 -73 -336 -417 -532 -374 49 6 284 274 656 453 -201 -307 -458 -184 -89 84 139 360 480
5530 480 237 -204 -137 -355 -332 -33 30 520 408 527 186 -98 -175 -264 -535 -367 30 323 259 608 530 -131
5552 -131 -84 -264 -362 -276 273 237 208 437 235 -80 -324 -270 -452 -219 137 -47 284 423 251 208 -301 -210 -496
5575 -496 -538 101 76 293 498 511 146 -145 -456 -524 -135 49 -116 106 474 332 85 189 -132 -472 -240
5596 -240 -99 148 155 221 625 73 -44 -247 -414 -598 -112 -54 200 421 271 74 123 -182 -451 -443 -233 -212 -106
5619 -106 426 309 387 141 -117 -170 -629 -375 -214 -42 276 573 392 105 -189 -432 -607 -409 -213 123 300
5640 300 196 190 173 118 -424 -510 -451 -465 -133 206 286 363 162 300 -61 -927 -503 -299 -87 330 747 252 245 381
5664 381 -276 -189 -307 -489 -57 304 376 473 -7 243 -148 -208 -414 -273 -328 23 99 216 272 106 -347 -522
5686 -522 -48 -469 -288 45 593 257 316 453 -1 -439 -241 -510 -535 100 394 480 81 414 -87 -264 -393
5707 -393 -487 -465 130 311 334 460 194 -417 -397 -57 -132 -243 211 -23 40 408 422 271 -127 -198 -88 -318 -103
5730 -103 82 273 465 262 118 -54 -221 -703 -543 -309 122 429 236 437 66 -95 -252 -306 -467 -281
5750 -281 16 -180 281 669 135 71 2 -349 -581 -282 250 93 349 546 308 -137 2 37 -358 -324 -154
5771 -154 225 344 250 418 -114 32 -276 -335 -134 -54 258 258 429 405 -16 -78 -28 -387 -205 -37 157 146 205
5794 205 307 154 -20 -263 -468 -230 -280 -166 451 292 331 166 160 -198 -274 -741 -79 -82 360 288 313 105 81
5817 81 -142 -304 -464 -207 -74 219 282 86 377 177 -64 -612 -471 -412 -152 323 127 324 255 275 -366 -247
5839 -247 -253 -333 -104 128 506 464 423 139 -39 -379 -354 -230 -16 -150 185 489 348 466 56 -384 -385 -515 -389
5862 -389 -215 214 385 547 402 104 -534 -363 -112 -270 -226 71 157 532 468 87 -60 -195 -357 -352 -195 58
5884 58 322 412 543 -46 -276 -335 -402 -724 -223 -43 173 360 110 150 -182 -194 -400 -298 -371 44 312 186
5906 186 514 337 299 -124 -455 -253 -313 -115 187 198 92 442 -86 -260 -270 -570 -401 -129 98 158 217 222 96
5929 96 -51 -332 -498 -320 138 149 138 577 372 229 -86 -246 -487 -183 -264 289 53 396 374 137 -39 -170
5951 -170 -601 -372 -155 -71 178 451 194 46 -162 -178 -459 -71 -394 10 362 235 401 136 1 -123 -413
5972 -413 -466 -328 -184 174 23 474 342 362 -117 -429 -288 -379 -254 261 333 264 445 309 315 -190 -137 -238 -192
5995 -192 93 467 424 533 234 -166 -70 -286 -269 -407 -107 119 390 421 235 69 -220 -493 -293 -370 -36 247
6017 247 168 283 253 564 -134 -247 -419 -87 -378 149 190 237 192 237 -218 -271 -106 -345 -83 212 419 59
6039 59 99 234 -207 -249 -226 -383 -118 137 68 580 231 292 -267 -6 -90 -288 -126 -36 406 364 436 43 -149
6062 -149 -153 -442 -235 -144 152 81 -11 706 379 199 -135 -139 -365 -248 5 -64 240 215 94 432 -94 -77 -222
6085 -222 -360 -28 101 113 443 340 10 -43 -481 -380 -291 30 -89 341 113 313 30 -184 -64 -89 -322
6106 -322 -255 128 258 544 352 198 287 -128 -147 -570 -146 22 214 465 320 129 240 -50 -248 -272 -192 -44
6128 -44 -102 164 352 -22 -11 17 -236 -476 -187 62 171 369 425 69 210 -68 -55 -69 -103 5 132 316 491
6151 491 481 242 -207 -194 -710 -217 134 -45 247 400 309 363 -17 -205 -436 -134 -6 -103 5 177 122 423
6173 423 300 -613 -529 -307 -238 -390 175 470 160 -3 4 15 -362 -249 -148 -205 121 454 146 339 548 -377
6195 -377 -266 -171 -427 -22 -358 -97 254 444 407 -73 -32 -340 -674 -133 93 245 -34 366 380 65 115 -71
6217 -71 -456 -522 51 248 165 278 230 190 -163 189 -82 -607 22 162 178 89 348 130 -46 -315 -497 -250
6239 -250 -39 266 -16 371 190 -47 -109 -297 -279 -406 212 245 355 203 574 100 -136 -326 -367 -490 -365
6260 -365 46 266 423 340 207 -202 -228 -263 -232 -79 -142 371 82 -66 94 21 3 -133 -548 -139 4 114
6282 114 379 358 218 185 135 -217 -218 -432 22 -258 231 458 116 -44 82 -329 -529 -59 -130 -138 324 210 121
6305 121 12 -101 -230 -495 37 -181 5 166 266 -89 138 181 -218 -284 -425 27 -53 102 287 376 -8
6326 -8 218 -203 -257 -108 -181 56 347 213 293 272 -391 -106 -411 -277 -270 -292 59 213 423 365 461 -31 -557 -164
6350 -164 -17 -84 234 187 173 231 250 -133 -291 -235 157 11 429 -38 89 535 434 267 -227 -521 -153 -71
6372 -71 -190 202 86 401 438 -24 -161 -4 -289 -145 205 269 196 256 362 -61 -137 -66 -308 -324 -179 223 364
6395 364 215 289 66 -146 -127 -207 -269 -278 -110 188 52 155 302 -188 -197 -125 -117 109 65 182 383 233 149 -76
6419 -76 -171 -121 -88 -111 239 127 82 330 199 13 -215 -34 2 -421 169 27 76 273 38 -106 -67 28 -55 94
6443 94 -19 88 315 177 164 -102 -110 -217 -112 27 -66 44 169 62 300 92 -168 -412 -393 -298 49 191
6465 191 52 370 292 -117 184 -156 -173 -278 -290 -294 205 13 0 327 26 73 -344 -189 -264 71 -7 15 126
6488 126 94 299 108 19 -211 -352 -21 232 376 293 13 137 55 -69 -65 -314 27 128 265 -75 185 74
6510 74 -151 -170 -321 -355 -102 -72 280 49 135 23 -47 -267 -351 -136 -108 108 165 -2 370 -93 221 0 -495
6533 -495 -129 -131 -254 242 625 92 212 96 -50 47 -167 -54 -35 265 248 -82 147 437 -2 -55 -521 -169
6555 -169 61 89 25 -65 47 212 -185 -5 -347 -101 -124 197 -19 -74 355 163 -146 -172 199 -137 -132 89 47
6578 47 89 111 239 -3 26 48 74 195 -139 -197 134 74 58 32 -2 91 -530 -257 53 153 48 58 245 0
6602 0 -374 -115 -362 -4 1 174 367 -201 -37 0 -91 -134 -151 -273 67 79 -45 267 169 177 14 -3 -106 -304
6626 -304 -27 -189 237 258 460 145 231 -10 -75 -450 -202 -141 93 527 -39 334 -119 -168 -194 2 377 188
6648 188 -193 159 94 135 48 -78 -254 -218 35 -44 -40 -50 211 13 30 27 -104 -114 -115 238 -108 370 66 31 -5
6673 -5 34 -76 60 -301 -226 249 304 99 1 67 -83 32 -97 -121 -188 -181 72 149 49 177 -65 -112 112 -255
6697 -255 -81 -178 200 226 326 -1 -119 -93 -212 -171 -150 50 271 136 -31 -8 -86 -15 -229 -74 -78 -382 -89
6720 -89 3 82 139 91 151 -177 -304 -131 -74 4 231 -47 -58 151 -20 -432 -45 -128 -188 1 -26 -51 -39 -111 -61
6745 -61 43 -38 -208 159 -71 327 121 58 -39 -118 -364 -107 -217 79 55 -45 191 -30 232 -377 246 -221
6767 -221 -19 -163 -246 18 -63 149 -8 82 -181 145 43 -102 -138 202 -164 -32 103 160 -285 -148 -142 -393
6789 -393 9 113 72 226 49 293 -214 103 -121 -102 -13 27 -35 383 294 185 -275 -188 33 -211 -227 -103 114
6812 114 -6 91 126 -5 -291 -279 -214 -150 82 30 -37 156 89 74 -155 180 163 165 -142 -473 82 107 -27 28 -129
6837 -129 -282 -89 -194 -88 16 91 71 285 185 -117 -180 -253 -120 -70 -163 -8 270 111 -10 101 12 -200
6859 -200 61 17 -117 -219 60 314 180 -59 -199 93 -60 151 9 -146 166 218 89 313 -181 -134 -24
6880 -24 -256 -268 -18 103 -96 -2 53 -149 -46 -69 149 -208 135 -128 221 197 132 -155 -310 -286 81 116 -57
6903 -57 97 281 -40 -17 -302 21 -34 -157 -55 -109 -73 395 79 60 148 -14 -213 -87 270 -198 125 -24
6925 -24 154 -29 -226 38 93 -184 28 1 -122 134 -34 37 -17 -274 18 -65 -295 -2 -8 -108 -95 174 -151
6948 -151 -316 -157 -52 -208 240 205 -44 -53 238 134 -121 123 -298 -168 -285 24 -35 -49 361 -151 -198 -139
6970 -139 36 -284 -130 143 272 106 34 -121 69 13 -27 -119 -25 151 94 -8 191 297 -66 -22 -162 -34
6992 -34 11 -83 23 168 244 80 -106 5 -102 67 61 -90 260 117 103 99 -71 -416 -134 -104 -16 -11 86 241 17
7017 17 44 115 -71 36 -75 -177 -117 29 -4 125 85 58 120 -49 140 286 -137 -176 -81 129 23 35 26 -3 141
7042 141 -19 87 -32 -77 -18 41 118 105 8 -267 -179 122 4 31 403 61 31 86 75 -27 70 -143 142 106
7066 106 -19 205 129 120 202 8 -108 -69 -173 120 -54 -43 158 2 4 -59 87 -183 -106 24 107 108 42 110 -116
7091 -116 -523 -125 -175 -86 97 89 -146 -144 67 90 -47 -20 -134 -147 -113 54 77 -5 174 -116 -190 -221 -170 -88 -195
7116 -195 -33 200 -40 -100 -45 29 104 90 -167 36 96 149 -61 47 260 -10 -67 -23 -202 -3 220 1 -12
7139 -12 -109 -73 -35 -104 -189 -9 -59 -92 130 156 124 -146 215 -249 12 -165 -103 -77 45 -10 164 266 -180 164
7163 164 -29 -271 -107 -119 277 210 381 63 -23 -15 -70 -12 -29 -113 109 -87 214 -56 -270 -213 -128 -22 112 257
7187 257 -108 89 97 31 -110 108 -71 82 214 199 -162 172 158 223 15 133 49 -275 28 118 25 121 72 180
7211 180 61 -153 -426 129 -331 -155 230 69 222 -100 38 -230 -125 -26 -110 -17 -129 -167 112 22 -107 -73
7233 -73 41 -96 -44 -24 175 -4 24 -8 -122 -90 -143 -135 -75 224 -62 54 91 41 199 24 -22 -323 -221 -122 36
7258 36 21 -57 265 102 -196 -27 -72 87 75 92 157 305 142 32 -50 164 -137 -22 -76 -17 -51 -69 159 -4
7282 -4 80 -11 10 -124 -376 112 83 -101 134 262 -91 146 -64 -123 -33 -21 168 27 38 235 38 -109 -278
7305 -278 -261 -274 121 177 234 -8 84 -4 -93 -30 -193 -81 -238 26 -97 290 203 -208 87 -120 -155 -17 -71 43
7329 43 156 137 -120 218 37 -181 -62 -207 201 -172 14 116 231 -103 -5 -128 -139 -240 -88 -63 -8 222
7351 222 7 55 -92 80 -122 72 -1 326 60 190 336 -133 100 -32 -54 251 -43 129 0 -28 24 -52
7373 -52 244 -65 -50 83 -53 169 17 20 -57 74 211 179 -29 -270 27 239 104 -178 200 345 -18 306
7395 306 0 97 -23 63 216 21 147 168 -19 125 -8 79 54 178 -218 -152 126 318 59 327 -180 -235
7417 -235 -58 83 -189 165 -58 17 266 61 -98 -28 14 -131 -15 63 198 47 -45 -2 -51 144 -152 -382
7439 -382 32 67 -40 54 -63 119 -123 -150 -303 84 8 123 181 -126 64 39 -60 -185 -102 -62 -47 14 144 48
7463 48 318 53 -168 43 -204 75 8 143 -136 246 47 217 68 -109 -30 -236 -91 -192 -113 -239 -160 -16
7485 -16 214 -180 -190 -278 -50 85 25 -87 17 89 280 -93 -2 -276 -284 -294 310 120 -129 -435 124 156 91 171
7509 171 -23 -86 12 66 136 164 60 -137 255 -16 -52 24 160 -35 93 204 127 213 123 -63 31 51 85 105 291
7534 291 334 -33 -232 -58 50 -214 -42 -129 126 -175 97 -179 140 -145 -140 -251 -23 -65 139 115 54 360
7556 360 144 282 -21 -246 227 44 -86 47 286 144 106 -17 -173 -15 -79 -162 69 108 242 253 43 9
7578 9 -160 -17 1 153 -38 84 152 344 -26 -1 62 -108 -96 -123 -128 74 121 63 -134 38 -54 -318 -56 100
7602 100 -153 -133 -59 213 -7 -20 246 54 -257 -302 159 68 -129 -49 -22 253 -123 -32 -68 -88 83 -91 120
7625 120 89 342 161 85 63 -9 13 -71 95 100 155 227 29 176 38 -64 113 101 -179 189 -58 -4 -69 -5 6
7650 6 -252 -243 -179 0 -94 281 111 53 118 -93 -56 -88 18 57 127 -22 52 329 45 -149 -138 -28 -124 10 3 -138
7676 -138 82 -88 183 136 -154 -18 -253 -343 68 8 159 -14 136 9 -91 -317 -50 -78 -112 117 369 159
7698 159 63 -91 -82 -35 94 -95 24 -53 -35 408 -43 6 -149 -256 17 44 73 107 -95 154 408 -22 234
7721 234 -131 1 -131 70 -118 -49 314 131 372 281 332 -279 -140 -36 -155 345 295 185 -104 -200 -94 -336
7743 -336 -49 -244 13 -102 151 13 121 57 -158 -271 -17 -70 -119 41 -46 26 120 176 -153 -290 -217 -160 69
7766 69 16 160 114 236 27 -128 -128 -133 146 -117 103 337 111 11 -124 12 -101 -82 89 83 23 51 114 124 144
7791 144 -176 120 -175 30 23 -181 -322 -66 -96 -176 21 -48 -108 -112 15 38 -265 63 -7 78 72 226 -20 -201
7815 -201 174 -87 -62 -180 329 191 234 151 -60 -486 -24 -198 -119 416 125 250 28 -113 -94 -130 -297 -222
7837 -222 28 192 100 141 80 25 154 -397 -131 248 300 56 -91 317 359 58 -196 -98 -250 -73 -275 -212 100
7860 100 259 274 245 173 -22 12 -21 -187 -4 -118 52 4 187 -178 -40 74 64 -87 -151 -12 328 191 103
7883 103 -30 47 -321 -95 36 -37 211 62 55 11 182 -58 169 -125 -37 17 134 273 421 172 -139 -8
7905 -8 25 -22 18 -13 -16 -227 -35 -98 150 -93 200 -28 -86 259 151 352 277 88 16 -299 -32 -196 -355 99
7929 99 34 298 34 122 272 -105 -40 -118 -239 -25 -275 23 505 214 96 -31 158 -77 36 -238 35 9
7951 9 301 230 15 406 159 -129 -306 -149 -205 -262 71 103 257 -59 172 -16 60 -352 175 -134 52 -26 148
7974 148 -55 45 -64 -560 -341 -132 58 67 -289 110 11 -197 50 -40 -13 -77 144 223 279 237 -127 -155 9
7997 9 -105 106 193 -78 67 125 -47 74 116 119 -232 -126 -173 8 -143 48 77 383 -129 -24 29 28 -234 -142
8021 -142 5 339 139 319 81 -51 -53 227 -40 -27 226 137 -13 133 -79 -269 4 40 -76 -177 -104 -144
8043 -144 200 109 153 -179 -77 -210 -16 -396 370 199 17 63 -122 184 138 175 -236 -55 -32 213 115 48 -135
8066 -135 31 131 -71 -117 -10 -83 2 -13 -31 -62 168 -1 -354 -123 19 -46 -61 -9 228 -145 22 89 -329
8089 -329 -193 -354 5 -30 -166 293 75 -171 -85 138 -158 -135 156 -52 32 48 44 154 123 31 -269 -191 -53
8112 -53 178 -143 -88 218 268 -177 134 -189 0 65 -79 33 170 166 256 -43 216 -86 -44 38 99 130 40 65
8136 65 -74 -235 2 -163 -488 -71 49 33 -25 242 -170 -132 -87 -137 -166 -86 -219 -76 258 52 121 30 78 -243
8160 -243 -81 -122 68 -104 40 22 112 176 8 71 -30 181 -29 -287 220 99 71 37 -209 41 -7 -86 -300
8183 -300 -12 210 79 109 10 404 -55 -63
8191f3
##END NTUPLES=NMR FID
##END=
