##TITLE=1H_DE-123_EXT_3
 200.13MHz,D2O.
 8 sc
 
 26.1.2026
##JCAMPDX= 6.0         $$ Bruker NMR JCAMP-DX V2.0
##DATA TYPE= NMR FID
##DATA CLASS= NTUPLES
##ORIGIN= UXNMR, Bruker Analytische Messtechnik GmbH
##OWNER= pz
$$ XWIN-NMR		Version 3.5
$$ Mon Jan 26 13:39:22 2026 Russian Standard Time (UT+4h)  she@DPX200
##.OBSERVE FREQUENCY= 200.1313
##.OBSERVE NUCLEUS= ^1H
##.DELAY= (6, 6)
##.ACQUISITION MODE= SIMULTANEOUS
##.ACQUISITION SCHEME= undefined
##.AVERAGES= 8
##.DIGITISER RES= 18
##SPECTROMETER/DATA SYSTEM= spect
##.PULSE SEQUENCE= zg30
##.SOLVENT NAME= D2O
##.SHIFT REFERENCE= (INTERNAL, D2O, 0, 14.3821)
##AUDIT TRAIL= $$ (NUMBER, WHEN, WHO, WHERE, WHAT)
$$ ##TITLE= Audit trail, XWIN-NMR		Version 3.5
$$ ##JCAMPDX= 5.01
$$ ##ORIGIN= Bruker BioSpin GmbH
$$ ##OWNER= she
$$ F:/spectra/data/she/nmr/H-C/1/audita.txt
$$ ##AUDIT TRAIL=  $$ (NUMBER, WHEN, WHO, WHERE, WHAT)
(   1,<2026-01-26 13:37:22.78 +0400>,<she>,<DPX200>,
      <created by zg, POWCHK disabled, PULCHK disabled
       configuration hash MD5:
       00 E9 B6 7A A2 85 ED C7 34 08 36 98 17 FE 4E 26
       data hash MD5: 16K
       E3 0A 4F 51 EF 98 B6 1A 2B E7 28 F1 AB 65 6A D4>)
$$ ##END=
$$ 
$$ hash MD5
$$ CB A1 69 C5 C6 D9 5F 6B CC 83 6E DD 04 04 0A CC
##$RELAX= 
##$RELAX= 
##$RELAX= 
##$RELAX= 
##$RELAX= 
##$RELAX= 
$$ Bruker specific parameters
$$ --------------------------
##$DU= <F:/spectra>
##$EXPNO= 1
##$NAME= <H-C>
##$PROCNO= 1
##$TYPE= <nmr>
##$USER= <she>
##$AMP= (0..31)
100 100 100 100 100 100 100 100 100 100 100 100 100 100 100 100 100 100 
100 100 100 100 100 100 100 100 100 100 100 100 100 100 
##$AQSEQ= 0
##$AQ_mod= 1
##$AUNM= <au_zg>
##$AUTOPOS= <>
##$BF1= 200.13
##$BF2= 200.13
##$BF3= 200.13
##$BF4= 200.13
##$BF5= 200.13
##$BF6= 200.13
##$BF7= 200.13
##$BF8= 200.13
##$BYTORDA= 1
##$CFDGTYP= 0
##$CFRGTYP= 5
##$CHEMSTR= <none>
##$CNST= (0..31)
1 1 145 1 1 1 1 1 1 1 1 1 1 1 1 1 1 1 1 1 1 1 1 1 1 1 1 1 1 1 1 1 
##$CPDPRG= <>
##$CPDPRG1= <>
##$CPDPRG2= <>
##$CPDPRG3= <>
##$CPDPRG4= <mlev>
##$CPDPRG5= <mlev>
##$CPDPRG6= <mlev>
##$CPDPRG7= <mlev>
##$CPDPRG8= <mlev>
##$CPDPRGB= <>
##$CPDPRGT= <>
##$D= (0..31)
0 0.7 0 0 0 0 0 0 0 0 0 0.03 0 0 0 0 0 0 0 0 0 0 0 0 0 0 0 0 0 0 0 0 
##$DATE= 1769420242
##$DBL= (0..7)
120 120 120 120 120 120 120 120 
##$DBP= (0..7)
150 150 150 150 150 150 150 150 
##$DBP07= 0
##$DBPNAM0= <>
##$DBPNAM1= <>
##$DBPNAM2= <>
##$DBPNAM3= <>
##$DBPNAM4= <>
##$DBPNAM5= <>
##$DBPNAM6= <>
##$DBPNAM7= <>
##$DBPOAL= (0..7)
0.5 0.5 0.5 0.5 0.5 0.5 0.5 0.5 
##$DBPOFFS= (0..7)
0 0 0 0 0 0 0 0 
##$DE= 6
##$DECBNUC= <off>
##$DECIM= 32
##$DECNUC= <off>
##$DECSTAT= 4
##$DIGMOD= 1
##$DIGTYP= 9
##$DL= (0..7)
0 120 120 120 120 120 120 120 
##$DP= (0..7)
150 150 150 150 150 150 150 150 
##$DP07= 0
##$DPNAME0= <>
##$DPNAME1= <>
##$DPNAME2= <>
##$DPNAME3= <>
##$DPNAME4= <>
##$DPNAME5= <>
##$DPNAME6= <>
##$DPNAME7= <>
##$DPOAL= (0..7)
0.5 0.5 0.5 0.5 0.5 0.5 0.5 0.5 
##$DPOFFS= (0..7)
0 0 0 0 0 0 0 0 
##$DQDMODE= 0
##$DR= 18
##$DS= 0
##$DSLIST= <SSSSSSSSSSSSSSS>
$$ [...]
##$SUBNAM0= <"">
##$SUBNAM1= <"">
##$SUBNAM2= <"">
##$SUBNAM3= <"">
##$SUBNAM4= <"">
##$SUBNAM5= <"">
##$SUBNAM6= <"">
##$SUBNAM7= <"">
##$SUBNAM8= <"">
##$SUBNAM9= <"">
##$SW= 18.0517328524113
##$SWIBOX= (0..15)
0 0 2 0 0 0 0 0 0 0 0 0 0 0 0 0 
##$SW_h= 3612.71676300578
##$TD= 16384
##$TD0= 1
##$TE= 0
##$TE2= 300
##$TE3= 300
##$TEG= 300
##$TL= (0..7)
0 120 120 120 120 120 120 120 
##$TP= (0..7)
150 150 150 150 150 150 150 150 
##$TP07= 0
##$TPNAME0= <>
##$TPNAME1= <>
##$TPNAME2= <>
##$TPNAME3= <>
##$TPNAME4= <>
##$TPNAME5= <>
##$TPNAME6= <>
##$TPNAME7= <>
##$TPOAL= (0..7)
0.5 0.5 0.5 0.5 0.5 0.5 0.5 0.5 
##$TPOFFS= (0..7)
0 0 0 0 0 0 0 0 
##$TUNHIN= 0
##$TUNHOUT= 0
##$TUNXOUT= 0
##$USERA1= <user>
##$USERA2= <user>
##$USERA3= <user>
##$USERA4= <user>
##$USERA5= <user>
##$V9= 5
##$VALIST= <valist>
##$VCLIST= <CCCCCCCCCCCCCCC>
##$VD= 0
##$VDLIST= <DDDDDDDDDDDDDDD>
##$VPLIST= <PPPPPPPPPPPPPPP>
##$VTLIST= <TTTTTTTTTTTTTTT>
##$WBST= 1024
##$WBSW= 4
##$XGAIN= (0..3)
0 0 0 0 
##$XL= 0
##$YL= 0
##$YMAX_a= 191148
##$YMIN_a= -192838
##$ZGOPTNS= <>
##$ZL1= 120
##$ZL2= 120
##$ZL3= 120
##$ZL4= 120
##$ABSF1= 10
##$ABSF2= 0
##$ABSG= 5
##$ABSL= 3
##$ALPHA= 0
##$AQORDER= 0
##$ASSFAC= 0
##$ASSFACI= 0
##$ASSFACX= 0
##$ASSWID= 0
##$AUNMP= <proc_1d>
##$AZFE= 0.1
##$AZFW= 0.1
##$BCFW= 1
##$BC_mod= 2
##$BYTORDP= 1
##$COROFFS= 0
##$CY= -3
##$DATMOD= 1
##$DC= 2
##$DFILT= <>
##$DTYPP= 0
##$F1P= 0
##$F2P= 0
##$FCOR= 0.5
##$FTSIZE= 0
##$FT_mod= 4
##$GAMMA= 1
##$GB= 0.15
##$INTBC= 1
##$INTSCL= 1
##$ISEN= 128
##$LB= 0.25
##$LEV0= 0
##$LPBIN= 0
##$MAXI= 10000
##$MC2= 0
##$MEAN= 0
##$ME_mod= 0
##$MI= 1.114404
##$NCOEF= 0
##$NC_proc= 0
##$NLEV= 6
##$NOISF1= 3.799351
##$NOISF2= 2.8
##$NSP= 1
##$NTH_PI= 0
##$NZP= 0
##$OFFSET= 14.38212
##$PC= 1
##$PHC0= -3704.589
##$PHC1= 14.19231
##$PH_mod= 1
##$PKNL= yes
##$PPARMOD= 0
##$PSCAL= 0
##$PSIGN= 0
##$REVERSE= no
##$SF= 200.129724274929
##$SI= 16384
##$SIGF1= 3
##$SIGF2= 2
##$SINO= 400
##$SIOLD= 16384
##$SREGLST= <1H.CDCl3>
##$SSB= 0
##$STSI= 0
##$STSR= 0
##$SW_p= 3205.1282051282
##$SYMM= 0
##$S_DEV= 0
##$TDeff= 0
##$TDoff= 0
##$TI= <>
##$TILT= no
##$TM1= 0
##$TM2= 0
##$TOPLEV= 0
##$USERP1= <user>
##$USERP2= <user>
##$USERP3= <user>
##$USERP4= <user>
##$USERP5= <user>
##$WDW= 1
##$XDIM= 8192
##$YMAX_p= 0
##$YMIN_p= 0
$$ End of Bruker specific parameters
$$ ---------------------------------
##NTUPLES= NMR FID
##VAR_NAME=  TIME,          FID/REAL,        FID/IMAG
##SYMBOL=    X,             R,               I
##VAR_TYPE=  INDEPENDENT,   DEPENDENT,       DEPENDENT
##VAR_FORM=  AFFN,          ASDF,            ASDF
##VAR_DIM=   8192,          8192,            8192
##UNITS=     SECONDS,       ARBITRARY UNITS, ARBITRARY UNITS
##FACTOR=    0.0002768,     1,               1
##FIRST=     0,             0,               0
##LAST=      2.2672688,     0,               0
##MIN=       0,             -192838,         0
##MAX=       2.2672688,     191148,          0
$$ Real data points
##PAGE= N=1
##DATA TABLE= (X++(R..R)), XYDATA
$$ [...]
2498a488j108l195R67M427N75J678M147j154m661o0j478m377P58L859L0K125N509
2515F554q42l967m02k949n571J402M598Q11K338M040j779l497Q48k054m904Q11
2531d563K996o88K191N914n73k913K72k896n095N88K353o31K914O073o40k338
2547B964j00l857n024J400K840n74K593M109r52j418J833k506m998m74J20n90
2563d634L722N814l83q90K74l491m657N35K57o34L057N076L40r61M47l422l943
2580c493r8J092j020J781L623O97J127J380k597m724j870q50l77L846M607J048
2596D172m56L5k512l098q61n33j033J590M034J919L60J53j488k911j912p68q37
2613d146O48K952L117J641J051j261m411l373j057N39J785L429K016l0K25J08
$$ plain form
2498 -1488 -2596 -5791 -4824 -397 178 1856 6003 4849 188 128 -1350 -5727 -4969 -1110 -1080 1045 6554
2515 6554 5712 1745 1343 -1606 -7177 -5775 -1177 -366 1972 6012 4233 736 1584 -470 -5374 -4563
2531 -4563 -1567 -2255 -64 5850 5277 2364 2636 -260 -5355 -4767 -2414 -3045 -131 5942 5302 2964
2547 2964 2864 -993 -6017 -4617 -1777 -2351 242 4351 3399 1981 3814 1308 -3690 -4164 -4044 -4634
2563 -4634 -912 4902 4519 3629 3903 412 -4245 -3710 -3453 -4087 -1030 4046 4386 3425 3872 450 -3493
2580 -3493 -3591 -2499 -3519 -1738 1885 2582 3709 5089 2492 -2232 -4102 -4952 -5329 -1483 3124 4172
2596 4172 3716 3751 1239 -1859 -2720 -3253 -4286 -2696 1338 3257 3617 3770 2282 -629 -2541 -3309 -4146
2613 -4146 -3498 -546 2571 4212 5263 4002 -409 -3782 -4839 -4300 -2515 914 2930 2900 3125 3233
2629C233k404k474r47j421m15L108L421J501N04J2l242k872p83j273r93L543L688
2646B186O74J641M28l740m055J77n71m44K593K437k04J716K283k480l165j266
2662a790k440j763L421M029O62K029J066l427k756m26k103j971L300L134J08K314
2678C387J925l147k785j60k069j903K434J672L70L312L153k983k788o60l352k279
2694e873L409K557L52K875J709k606j776J68l530k463K224J570Q30L593J927k335
2710B631j250p0l839k306J885P90Q57L878K540j642j220j116m137j533K041N57
2726a934N37L471J958j228k53n89l855k312Q83K91J368L811J763q22k44o58l755
2743a568j974M22NJ264L367J918k56L83j687l401j452Q6n52R45L297K016K93M60
$$ plain form
2629 3233 829 -1645 -2592 -4013 -4428 -1320 2101 3602 4106 4118 876 -1996 -2779 -4052 -5045 -1502 2186
2646 2186 2860 4501 4929 1189 -2866 -2689 -3260 -3704 -1111 1326 1122 2838 5121 2641 -524 -1790
2662 -1790 -4230 -5993 -2572 1457 2119 4148 5214 1787 -969 -1395 -3498 -5469 -2169 965 1073 3387
2678 3387 5312 2165 -620 -780 -2849 -4752 -2318 -646 -276 3036 6189 3206 418 -242 -3594 -5873
2694 -5873 -2464 93 445 3320 5029 2423 647 815 -2715 -5178 -2954 -1384 -554 3039 4966 2631
2710 2631 1381 1311 -2528 -4834 -2949 -2159 -1302 2576 5116 3474 2254 1138 -2999 -4532 -2491 -1934
2726 -1934 -1397 2074 4032 2804 2551 1962 -1893 -4205 -3322 -3031 -1663 2148 3911 3089 2845 2187 -1568
2743 -1568 -3542 -3120 -3115 -1851 1516 3434 3178 3561 1874 -1527 -2979 -2893 -3445 -2500 797 2813 3106 3566
2761C566p68l371j849r29n16J110L359J896N70M08p02k937k004p88o86P53K787
2778a01K260J004O53q35k503k278j185o36Q26K007J989J790Q94j012j783k324
2794a234j630o18L03J874K391J460J026o55j564k167j764j180N01J867K063J951
2810B624J079m71j323k000k060j606O18P65K262K248J111J30j312k129j932j288
2826c284j13J255J588K301J402K87p95k303j447j900p29J237J919J995J374N61
2842C348o43j629k103j710o70N81J438K290J822O31k61j445k369j784q62N01J257
2859a608K090J684J552o59j590j590k039j200L9J255J835K188J131K44j225j505
2875F02k259j459J31J094J668J674J742J06j164j420k422j322KP72J532J658K005
$$ plain form
2761 3566 2798 -573 -2422 -3351 -3867 -2757 602 2498 3068 3476 2774 -163 -2167 -2955 -3641 -2888 -101
2778 -101 2159 3163 3816 2981 478 -1800 -2985 -3621 -2795 -788 1201 2991 3885 2873 1090 -1234
2794 -1234 -2864 -3482 -3179 -1305 1086 2546 3572 2917 1353 -814 -2578 -3758 -3257 -1390 673 2624
2810 2624 3703 3232 1909 -91 -2151 -3757 -3139 -2374 -112 2136 3247 3377 2065 -64 -1996 -3284
2826 -3284 -3397 -2142 -554 1747 3149 3436 2641 338 -1109 -3009 -3738 -2501 -582 1413 2787 3348
2842 3348 2705 1076 -1027 -2737 -3407 -2826 -1388 902 2724 3355 3094 1649 -720 -2504 -3366 -2865 -1608
2859 -1608 482 2166 3718 3059 1469 -121 -2160 -3360 -3321 -2066 -231 1957 3088 3332 2107 602
2875 602 -1657 -3116 -2985 -1891 -223 1451 3193 3299 2135 715 -1707 -3029 -3027 -2255 -723 935 2940
2892B940P29r97j681k113j735m78P10J603J869K092K96j144l34k187k221n41K76
2909b916J513J879K174J34j90o12k124k076n66K9O42J776K375R67j77n68k105
2926A55k325n67K59j33J915K525R55q2j73j932k400n82R4m08J738K724N23K50
2944B536M70j966k279j089k04o97J759K936O28O41O64j938k944m47o38o60J892
2961a336K197Q56P58O82j517k158q26j104j245J594K730N82J360R54j732k411
2977f16p33r21j438J793K537N14J345J080j926j785o48j561r72J539J364L46J864
2994A782J506r31j894o18j954j624J217J924Q72J931J811j838j807p09j379j526
3010c237R92J424N26J718J892r79j388l15k290j312Q04J072K01K118J841L2j355
$$ plain form
2892 2940 3669 2672 991 -1122 -2857 -3335 -2625 -1022 847 2939 3235 2091 1757 -430 -2651 -3192 -2916
2909 -2916 -1403 476 2650 2784 2594 1982 -142 -2218 -2784 -2755 -2113 -337 2038 3005 2828 2260 155
2926 155 -2170 -2737 -2478 -2611 -696 1829 2784 2702 2529 597 -1803 -2385 -2291 -2699 -961 1763 2286 2536
2944 2536 3006 1040 -1239 -2328 -2532 -3229 -1470 1466 2094 2735 3399 1461 -1483 -1930 -2568 -3228 -1336
2961 -1336 861 1717 2475 3157 1640 -518 -1344 -2448 -3693 -2099 631 1213 2573 3527 1795 -616
2977 -616 -1349 -2270 -3708 -1915 622 1136 2481 3561 1635 -150 -798 -2359 -3331 -1792 -428 -82 1782
2994 1782 3288 2357 463 -155 -2109 -3733 -2516 -592 280 2211 4022 2184 377 -332 -1711 -3237
3010 -3237 -2245 -821 -295 1423 3315 2336 948 633 -1657 -2969 -2165 -1093 -892 1226 3067 3099 1744
3027A744p13k547k015P92J392R46J815J643q86r27n42j126j831j07M55O30J787
3044E10K066K9p67q51j428j966l25O25M28J918K236N48p17j033j894j740l72J243
3062a490Q58P84J643O55j137L75q98k313j203K83M0J884K022J428o87o48j114
3079D82j906j208K09O31Q08K355J403p86m37o80k392j280J151O6J27J941J703
3096B187k13M88j12l061j958M77l03Q11L234J308j138p2p4k350j316R65r76m29
3114b532L071J772j008N69K68k702j381P79j250n09L509R47rJ270M22l880j522
3131b186M19p05J31L261J001j237J292O35k551j179N81k178n89L172J290N5J744
3148B956l13k948k35M26k791l03L112Q61K7K275j11l265o07K88k015n7K753K08
$$ plain form
3027 1744 1031 -1516 -3531 -2739 -1347 -401 1414 3057 2171 1244 702 -424 -2255 -2362 -1907 -1277 510
3044 510 2576 2605 1838 987 -441 -2407 -2732 -2107 -1679 239 2475 3023 2306 1273 -621 -2361 -2733 -1490
3062 -1490 -632 152 1795 2450 1313 1688 790 -1523 -2726 -2443 -2403 -519 1503 2931 2244 1596 482
3079 482 -1424 -2632 -2423 -1792 -984 1371 2774 1988 1551 871 -1521 -2801 -1650 -1584 -1457 484 2187
3096 2187 1974 2462 2350 -711 -2669 -2192 -2495 -1684 1550 2858 1720 1648 1574 -776 -2092 -1127 -2103 -2532
3114 -2532 539 2311 1303 1872 2140 -562 -1943 -1164 -2414 -2923 586 1533 1524 2794 3216 -664 -2186
3131 -2186 -1767 -2472 -2341 920 1921 684 1976 2611 60 -1119 -538 -2716 -3305 -133 1157 1212 2956
3148 2956 2643 -305 -540 -114 -2905 -3208 -96 765 792 3067 2956 -309 -916 -628 -2643 -2700 53 261
3166B61m59K521O33k237l41q68k267l97K368R04M55K567k30k382l42j19k576j3
3184b522J272Q15O44K175K88j996k58l60k251j50J055N69L58K489M64j077j08
3201A407j449k691J27J410K49R76J829K28q35L0q71k329l07O53k8J632J913L31
3219B275j052K67j170j853l00n1l1J575J757N71j4j32j234k030o87L66K14J218
3237c11J412M15K03J87q66j859q34n21R0J162J838Q16L71k57q92j513j131ql74
3256b072J073J349R92M30J43p51j503j213o12R2R50R96J281Q52J5p58j123j400
3274a259o95k85J012J010J061Q59j11j89j183j190q43l4M55N32J801Q46L32p05
3292A414r19j201r84l17L64R82J220R22O63l06j141j186j034k81Q5P39J114J249
$$ plain form
3166 261 -198 2323 2956 719 378 -490 -2757 -3154 -786 118 573 3140 2910 528 186 67 -2509 -2522
3184 -2522 -1250 -435 209 2384 2672 676 418 58 -2193 -2343 -1288 -719 -361 2128 2592 1515 1407
3201 1407 -42 -2733 -2606 -1196 -947 29 1858 2086 1251 1281 410 -1919 -2226 -1573 -1601 31 1944 2275
3219 2275 1223 1490 320 -1533 -1833 -1884 -1915 -340 1417 1988 1974 1842 608 -1422 -2109 -1743 -1529 -311
3237 -311 1101 1516 1719 1906 1040 -819 -1653 -2174 -2084 -922 916 1732 2103 1846 954 -559 -1690 -1698 -2072
3256 -2072 -999 350 1342 1772 1915 1164 -339 -1552 -2164 -2072 -1122 -126 1155 2007 2022 1264 141 -1259
3274 -1259 -1954 -2239 -1227 -217 844 1703 1592 1403 220 -970 -1813 -1847 -1392 -860 941 1787 2119 1414
3292 1414 495 -706 -1690 -2007 -1643 -661 559 1481 2144 1838 697 -489 -1523 -1804 -1719 -980 134 1383
3310A383M88n9r81j153p27q07LQ53J006J354M63P1r95p41r35r23j82M01J365Q12
3330F96R79K63l78j403j045l98m57J12J348R79O99K46m3j218r54q27p09N52Q02
3349g56J370R65L66l07j179o82r55q27M16Q07J399L13P43j06m85j110j015p03
3367a746K74N53R75Q46P09J71o41j040j267o93m5R78Q13P70J018J15p22o92j004
3386f28q57l72J16J129J307R58j0l58l98j196j109k32L49L21J293J207n5J5m58
3405A022j064j194k66J93L02J347P79J88K6l50j087j386M0n2K16J105J521N4j8
3424A376k23r40j267k22j07r1J356J011N88P1k61q16j181o54o8R5J103J048O01
3443A419R9J8j033j343l17k09j83R05J176L30Q14o2r28j218m43o86k0Q01J102
$$ plain form
3310 1383 1871 1812 831 -322 -1049 -1856 -1853 -1000 6 1360 1823 1894 899 158 -777 -1700 -1882 -1481 -116 696
3330 696 1675 1938 1560 157 -888 -1286 -1743 -1631 -283 696 1395 1641 1598 380 -574 -1401 -2110 -1558 -756
3349 -756 614 1579 1945 1638 459 -223 -1178 -2005 -1589 -782 617 930 1673 1567 1082 -28 -1043 -1746
3367 -1746 -1472 -919 56 902 1611 1782 1141 101 -1166 -1859 -1904 -926 -113 657 1675 1790 1068 376 -628
3386 -628 -1485 -1857 -1741 -612 695 1653 1643 1285 887 -309 -1418 -1650 -1301 -980 313 1520 1465 1480 1022
3405 1022 -42 -1236 -1502 -1309 -1007 340 1119 1307 1333 983 -104 -1490 -1450 -1502 -1286 -181 1340 1394 1376
3424 1376 1153 213 -1054 -1276 -1383 -1474 -118 893 1481 1552 1291 475 -706 -1360 -1428 -1333 -230 818 1419
3443 1419 1518 1536 503 -840 -1157 -1366 -1549 -644 532 862 1676 1614 686 -532 -975 -1661 -1681 -880 222
3462B22O79P38j8q47r32p38o72P9P26R50M58O47L94j000n74o47p14o84Q36R39
3482a58O52O70P31q16r34m19j062m44O89P94P06P53O16m99p24q96q01n90N75O44
3502e13O22Q33M76n2q14o08p27p99M2N90P68R86P15j42j135m54n95n20j92R13
3522f06O13N03J280k28q57n77l68j022l20J061K09N87J175K74p62l30j010j235
3540a613J7R94K63P74J166j20j067j2J0j532o17R77l74Q94J652N59j089m05j97
3559B80j500m79R19j20L57J708O06j042Q4k65j938j98R92k7K21J445r5o55J190
3578A483k30k259m27N62n03J61K050Q12j020O67n13j601n69Q91q40N12J897M61
3596A534o76L15l25j845j65N58m90l5J995m91L56J043k87k141m70K59j142J169
$$ plain form
3462 222 901 1639 1621 774 -158 -896 -1568 -1489 -763 187 645 1292 1686 686 112 -535 -1249 -1933 -1097 -158
3482 -158 494 1164 1895 1079 145 -274 -1336 -1780 -1091 -297 409 1162 1778 1279 555 -341 -1142 -1732 -1157 -513
3502 -513 109 942 1418 1366 552 -56 -783 -1582 -1540 -950 -182 804 1519 1377 242 -212 -807 -1327 -1519 -606
3522 -606 7 510 1790 1562 705 128 -240 -1262 -1582 -521 -312 275 1450 1724 962 632 -378 -1613
3540 -1613 -1596 -602 -339 435 1601 1481 414 402 412 -1120 -1737 -760 -1134 -240 1412 1971 882 477 280
3559 280 -1220 -1699 -780 -900 -543 1165 1771 729 813 548 -1390 -1588 -596 -623 -402 1043 948 293 1483
3578 1483 1253 -1006 -1433 -871 -1374 -1213 837 1649 629 1296 783 -818 -1387 -496 -1336 -824 1073 1534
3596 1534 858 1173 848 -997 -1162 -604 -1094 -1129 866 375 731 1774 1487 -654 -1124 -865 -2007 -838
3614h38J960j88l25Q60k83j701K40L1j432J43J972L7j1J513r57j566J88M3j394
3633a708J97J371L11N42R48j87j537k51k91j222O28J452k22J04J337j46j046J07
3651C87r54j022K87Q12J38J020J181q03q74L10j012j081K50J148m38J203J281
3668A833p13q84J2o55o69j73Q38j07N16J175n7l35r5q40j323j12Q96L57N52Q90
3688A106K07m15l62n30j105K4r5L35Q66R69l4Q1n08o33o03m67L17j48R57N38O94
3709A194M4n47n01j022j70l7N34L82O94N08k26j41n81l16p76l73M96O24M17R28
3729A131M6o38j08n34n78m65M32O4P67P18N93o89n05l43o57k09J66J36N91R42
3749H60J77k71j27m95j324j06J93L19Q62M64M41k03o0m91j061m0k96M50M74R54
$$ plain form
3614 -838 1122 934 609 1469 1186 -515 -275 -244 -1676 -1533 439 476 465 1978 1021 -545 -357 -314 -1708
3633 -1708 -1511 -140 171 713 1661 1474 -63 -314 -605 -1827 -1199 253 31 135 1472 1326 280 387
3651 387 -567 -1589 -1302 -490 -352 668 1849 1046 172 482 -530 -1611 -1361 -213 -651 552 1833
3668 1833 1120 236 248 -407 -1076 -1249 -411 -518 -2 1173 1116 781 686 -154 -1477 -1589 -693 -336 216 1106
3688 1106 1313 898 536 6 -1099 -1075 -1170 -835 31 1000 966 1047 539 -94 -697 -1164 -847 -995 -38 500 1194
3709 1194 1238 691 190 -832 -1002 -1039 -505 -123 571 1079 853 712 131 -185 -961 -1334 -838 -214 203 1131
3729 1131 1177 539 431 -103 -681 -1146 -714 -650 117 835 1428 739 234 -109 -766 -975 -809 -673 -82 860
3749 860 1037 766 639 144 -1180 -1286 -1093 -774 88 552 993 790 730 239 -822 -862 -1158 -708 -234 720
3769G20M88jq1p67q90l13o3J70oJ125L33M86r8p28j124j47J06l31P07N11O93L04
3791A094J08p89n42m19j12l55N34Q13J71N28n4l12j021L1p37P6P4N97R01L05n8
3812H33k56m67m95m47k46J91Q68K11N76L80l73m76l49n53n24L09O97M09O06J99
3832A093l62m01n00n99l46L29L12N39N43O14n18l54n63n31m82K06P83J16M30N66
3852H75L4m65p13j14n41J20L79M78M40K13L83m58p13m99l96K05J97K06J043J94
3872H68J67l99l18p25m13j65J14N79O07N46K9L8m49o71l42n89K29L57O17N55L44
3893I79k7n36o93n61J58k34N16M23O35L69m0n73k95n28o08L20QM67N31N06o8j54
3915E95m05k30p62J09J30N92J06M33K48k9n14m69m35l12K02N63N06J62K33J93
$$ plain form
3769 720 1208 1207 1126 359 -531 -844 -907 -737 -743 382 715 1201 1103 375 -749 -896 -790 -1121 -414 97 790 1094
3791 1094 1202 413 -129 -548 -660 -1015 -481 332 503 1031 977 665 -356 -325 -1062 -986 -912 -315 586 891 833
3812 833 577 110 -385 -832 -1078 -887 -19 192 768 1148 775 299 -50 -603 -1127 -818 -121 288 894 1093
3832 1093 731 330 -170 -769 -1115 -786 -474 65 608 1222 704 350 -213 -744 -1226 -1020 -237 -121 309 875
3852 875 909 444 -269 -383 -924 -804 -425 53 493 706 1089 631 -82 -581 -977 -772 -575 -369 674 868
3872 868 1035 636 318 -407 -820 -985 -871 -292 315 861 890 928 479 -192 -534 -1123 -894 -537 80 635 979
3893 979 952 416 -277 -838 -680 -914 -398 25 660 1029 989 416 121 -407 -1015 -695 -687 -220 311 817 749 595
3915 595 190 -40 -802 -693 -563 29 135 568 816 787 273 -196 -631 -943 -741 -178 328 490 723 916
3935I16o65l67n63J68l13J55P20P12j91K72l51o33k77m62l6K16P19L28L16O0O0
3956G84q56l66l62j2L17M06N16L65jl99j00m33l16k13m1P06K77K37J57L74q84
3977A56l29k76k83K93J87M33K41L56k73j99p04l0j73j23O10J26K58P09m21m80
3997G8r8l60n03l4O44L05L54N05m7l92m28p7n36l1L36J85J57R38l8o23j29l69
4019a63q11L28M56k56P20L07K68p76L15k52p38l74L77L96j20P48K04j65jm27p25
4040f89o0O62o47M64P42K43m48K76m78j050K16L94k16O48M89J45n72O09m44p54
4060d70k26J68n4K67Q75Oj92N41m31j100R8J7l95K67J059O9j14M54l68j014j49
4081f92M21n17M04Q95l62K17P74l56q83l28M2o62L30J185n0j20N42k15q56J75
$$ plain form
3935 916 251 -116 -679 -511 -824 -669 51 763 572 844 493 -140 -417 -879 -915 -699 20 348 664 724 784
3956 784 -72 -438 -800 -812 -495 -89 427 792 791 392 292 -141 -457 -670 -711 -5 272 509 666 1040 156
3977 156 -173 -449 -732 -439 -252 181 422 778 505 306 -398 -428 -601 -724 -114 12 270 979 558 78
3997 78 -20 -380 -883 -917 -273 32 386 891 844 452 24 -53 -589 -620 -284 -99 58 996 958 335 206 -163
4019 -163 -974 -646 -190 -446 274 581 849 73 388 136 -602 -976 -599 -203 -323 425 629 464 463 36 -689
4040 -689 -749 -87 -734 -270 472 715 267 543 65 -985 -769 -375 -591 57 546 691 119 728 284 -470
4060 -470 -696 -528 -582 -315 560 566 374 915 484 -616 -518 -501 -896 -629 430 499 385 839 471 -543 -692
4081 -692 -271 -788 -384 511 149 366 1140 784 -99 -427 -385 -1047 -717 468 418 298 840 625 -231 -56
4101e6k94n80J85O33M78K44J74j18l46m78k57l59K00N61p2M78M55q8p81j83l26
4122e30n63M13P60k15M61K53K2l93K1o25l90L02K94J05N48N13k48o18l8k72m18
4143f18k13M65K4P06K89l6j25l95m12j48O6J5M0N56J18K82J51o90k95l09m82K68
4165g43O91J58K49J41K34o07j09m07m94M0M78J50N30L58ll75k35j83m21j05L07
4186c46L76L91L50j46l00k6l84p78K93J34L09K08P78m19j0l58o1n78R5L4J45O77
4208C84L56k80J9k32l47m06K44j27J24M15N07J26l89%l45o97L09J17l05L33N98
4229D04q0P4M0m49n87j33J33l8R10P6j1J35P5m73q2m85j49K80M41M74l32L18J4
4252E55l25o44J69l66j4M86m1M91K20J31m20m13j36l00J87k27P85J70J42J87k66
$$ plain form
4101 -56 -350 -930 -745 -112 366 610 784 666 320 -158 -415 -774 -574 -13 -85 393 848 760 -21 -204 -530
4122 -530 -1093 -680 80 -135 326 579 601 208 229 -396 -786 -484 -190 -85 463 976 728 110 72 -200 -618
4143 -618 -831 -366 -342 364 653 617 492 97 -315 -463 -397 -382 -342 214 332 614 765 75 -220 -529 -1011 -743
4165 -743 -52 106 355 496 730 123 14 -393 -887 -847 -369 -219 311 669 666 291 56 -127 -548 -653 -346
4186 -346 30 421 771 625 325 299 -85 -863 -570 -436 -127 81 859 440 430 72 11 -567 -472 -438 -293 384
4208 384 740 460 479 247 -100 -506 -262 -389 -265 150 657 783 394 394 49 -648 -339 -222 -527 -194 404
4229 404 324 398 438 -11 -598 -731 -598 -636 274 350 339 474 549 76 -6 -491 -640 -360 81 555 223 541 555
4252 555 230 -414 -245 -611 -625 -139 -180 311 531 662 242 -171 -307 -607 -420 -647 138 308 450 637 371
4273C71m40j95k17j0K1Q65r7J9M20m89p6k93k71l35M04L12J25N48j05m53j74J12
4295D2l5m00R9K06L73LK26l40K0n6n76k35L70L9L55M08J67j41j32k77l66n18J46
4318f22L12L49J35L48K6k48k86q3n87J17J91J42M95r1K89K62p40p12L46j33j52
4339f42O50K84j6K98k55p0m01k96l94K84O28j3M91k3q8j24k90m01k13K47k34O81
4361A03K77m0J41m8m63j04l97J08k6K00K59K02K76N3m73j42j30m91j63Q07M70
4382D19k91L30k20j09n92l8O0K05K79ML16L22l64m2j33n13j23j42R9N36M32P9
4404E14j85j6m73l05K29m05L50J76L56L80r9n5r07J80k68K56j38J82M29N2K59
4425E12j79j64k24m3l89QM31K98M7K76J4m74k26j00m77K73K97J73J28M55Kn14
$$ plain form
4273 371 -69 -264 -481 -491 -470 395 298 317 737 248 172 -121 -392 -727 -323 -11 114 662 557 104 -70 42
4295 42 7 -393 -294 -88 285 288 514 174 194 138 -438 -673 -303 -264 91 499 666 525 393 116 -250 -768 -622
4318 -622 -310 39 174 522 548 300 14 -69 -656 -539 -348 -206 289 198 487 749 9 -703 -357 -490 -642
4339 -642 8 292 276 574 319 249 -152 -448 -842 -558 70 57 548 525 437 313 23 -378 -591 -344 -578 103
4361 103 380 340 481 433 -30 -134 -531 -423 -449 -249 10 212 488 541 68 -74 -204 -695 -858 -51 419
4382 419 128 458 238 129 -463 -501 -441 -236 43 47 363 685 321 279 146 -367 -490 -632 -533 3 435 514
4404 514 329 313 -160 -465 -236 -641 -291 -115 241 621 522 467 -440 -260 -528 -272 -410 -228 201 253 512
4425 512 333 169 -55 -98 -487 -479 -48 250 297 573 587 113 -113 -213 -690 -417 -120 53 181 636 638 124
4447A24j26l01k76J86J34K93L96J53k67K02m70j48k00j00L74k50O09J71K92m71
4467C25m89J4k96nj7M93l0M15K07o63K47k08m32J79n8J05K44K33J88j84l0r7m81
4490c40q9J89L9MN92J97j48j69k94l62j9J84m8K08N02K60j89l21j63j57l65q5
4512e74M66M4O99l91R1J71k76n08j3j13j98L05K84K73K33O3j91o56q2L5j98K59
4534b77O74r1K82j51K1m18j52q9l67K63N52j0R3O6K9p29N5j53j4M9J71M15K41
4557D60J13m26l03k1k81p0J91N44l6Q0N90m26k38m26r1k01M1M09n0L91M25j30
4579E45m43k32l64j21J61J65M59r9K88J84l95j33m55q1J47Q0J85J84M45Q0k15
4600C85l03k86j11l8J0J93M42K70j95k1l44k22l09J37L2J73M02%L2k39K22l04
$$ plain form
4447 124 -2 -303 -579 -393 -259 34 430 583 316 518 48 -100 -300 -400 -26 -276 333 504 796 325
4467 325 -164 -150 -446 -451 -468 25 -5 410 617 -46 201 -7 -439 -260 -318 -213 31 264 452 268 238 141 -340
4490 -340 -429 -240 -201 -197 395 592 444 275 -19 -381 -400 -216 -264 -56 446 706 517 196 33 -124 -489 -574
4512 -574 -108 -64 635 244 335 506 230 -278 -291 -404 -602 -297 -13 260 493 556 365 -291 -373 -338 -536 -277
4534 -277 397 306 588 437 458 40 -112 -201 -568 -305 247 237 330 396 425 -304 -249 -402 -416 -367 -196 219 460
4557 460 573 147 -156 -177 -458 -528 -337 207 171 251 841 415 177 -249 -340 -541 -500 -91 -141 250 675 545
4579 545 102 -130 -494 -615 -454 -289 170 71 359 543 148 15 -440 -521 -374 -294 -109 75 520 600 385
4600 385 82 -204 -315 -353 -343 -150 292 562 367 346 2 -220 -529 -392 -360 -187 215 215 247 8 230 -74
4622g4n30J75J64l7L36K49M00m7n51l37l37J49J00R8N4M26o4L59j83n02J79m93
4644d66J06J50NL91J51k7k41k71J96n03J27J8J94K84O68m90K1k08n9m86l67N65
4666b42k97O35K26L98l65k26l30l56n6N36l74K37Q72l57p8Q8k18k38j83j17L25
4687a20J90K85L8L8q6p7n12l4j48O3L58L74j18J0J82k86n62Lj10q7N11J04J17
4710A33K00R8l06m25r5r3j93N79J72O2M03k24Nn14r3j17K3K12K70q5J57O39m01
4733D07n16k90J91l32L88J32J29L07J02l29J5k82j13k21J66OM21rM72m33M4k58
4755cl29m02L96K87k1L36M62l34k85k01j94k53L88m2RK04M11j17k95O2q5l32q8
4778d26J93n3L42L39J40n69J36j70l81p1K21J40M12R0j2jR3p62K2k04P1J24M26
$$ plain form
4622 -74 -604 -429 -265 -302 34 283 683 636 85 -252 -589 -440 -340 -242 -188 238 174 533 350 -152 27 -466
4644 -466 -360 -210 -205 186 337 310 69 -202 -6 -509 -382 -364 -170 114 782 292 313 105 46 -440 -807 -242
4666 -242 -539 96 322 720 355 129 -201 -557 -613 -77 -451 -214 658 301 223 311 93 -145 -328 -445 -120
4687 -120 70 355 393 431 345 268 -244 -278 -426 -363 -5 369 251 261 443 157 -405 -402 -512 -599 -88 16 133
4710 133 333 431 125 -300 -395 -488 -681 -102 70 132 535 311 316 -198 -291 -408 -385 -173 97 12 169 808 407
4733 407 -109 -399 -208 -540 -152 -20 109 416 518 189 204 -78 -191 -412 -246 -240 181 172 644 211 255 -3
4755 -3 -332 -734 -338 -51 -72 264 726 392 107 -94 -288 -541 -153 -195 -186 18 429 312 17 79 -6 -338 -426
4778 -426 -233 -286 56 395 535 -34 102 -68 -449 -520 -299 -159 253 343 331 330 423 -339 -317 -521 -450 -326 100
4801A00L02J17k73j75j91k70L62m70N41J05J14j35K8M6k76j69l59M21M2J45J49
4822A54J50N1m0l87k35j44J89N7J1L73M35m44j35R9m85J45m32R5O19j4K80M2o0
4845C24j32l50k70J41j00J79L10L51k10J83N0m39n02K37q9J98P7O21k18K4q8l12
4867a5r2o04L40J83J38L11J84j06l24Nk20k51J91l29P24J79j5J60m00M0m55p7
4889d33K75J5K23j18K85J24j73j65k06K8k07J06q0M33J93L6K03l1o13j50j54M4
4911c65J53N44j16j58K99j15m21n3k42R6K76L14K1K94k33O8l04j08n39M34K38
4932H3k5o00O66L13j13n02j104J283m10K41L3J45K89J09n0j22k78l30k33N50M92
4953D37n77N31M47n05j43p6k56l21k46L30j9M40L07l0m14J89o11M76m21J41K16
$$ plain form
4801 100 402 519 246 71 -120 -390 -28 -498 43 148 262 127 155 201 -75 -244 -603 -182 -140 5 154
4822 154 304 355 315 -72 -307 -451 -262 -205 -194 179 614 170 35 134 -351 -206 -638 -543 76 62 342 384 324
4845 324 192 -158 -428 -287 -387 -208 102 453 243 426 476 37 -465 -228 -317 -119 -42 579 361 385 297 -15
4867 -15 -107 -711 -371 -188 -50 261 445 339 15 20 -200 -451 -260 -589 135 314 299 459 59 99 -356 -433
4889 -433 -158 -143 80 -38 247 371 198 33 -173 -145 -352 -246 -326 107 300 336 539 508 -105 -255 -409 -365
4911 -365 -212 332 216 58 357 242 -179 -232 -474 -378 -102 212 233 527 294 362 58 -50 -589 -155 83
4932 83 58 -542 124 437 324 -178 -1282 1 -409 -168 -135 10 299 408 358 236 -42 -372 -605 -55 437
4953 437 -140 391 838 333 190 114 -142 -463 -709 -379 -398 42 349 319 -95 94 -517 -41 -462 -321 -105
4974a05L73K18k0k57j94p5j53k49K69K16K83J81j66M8n05J38k82K3j61l16P33
4995aK26k36O23k0o38k59j50o24J060K60N23m81J11r7n88K86P3j305O46J9P99
5016B27P6j02J92k53k46m04JJ01K66J20K34J53J48m80j44M6l54j79M24O61K3l48
5038A62J36p0p2j311L39Q15Q0l5j90R33l4o13N03j124R48p45J94m45P43J84j14
5059B84k8j11k93k57K0j58M88L41N5J60r3m68k26k03j0J87J51L39K17j77J71k54
5081A35j14n8m14j0L49J26J43L7J14J04o32o5l15K8M62R9K30J64k3k26j76j04
5103a46l08K94J24m9K73K69j74N9k84m9n77R2L66nL06M04l73K0p8j65k24j68L14
5126g9q9J73L45j5k48l1Q4m48K7N1p4K98L12M9j91J96o73n6j68o4N82o7O03J7
$$ plain form
4974 -105 268 486 466 209 15 -60 -213 -462 -193 23 306 487 321 369 -136 2 -280 -257 -418 -734 -1
4995 -1 225 -11 612 592 -46 -305 -455 -1079 -19 241 764 283 394 297 -291 -5 68 -1237 -591 -572 227
5016 227 303 201 393 140 -106 -510 -509 -408 -142 -22 212 365 513 33 -111 -65 -419 -598 -174 487 510 162
5038 162 298 228 156 -1155 -816 -1 79 44 -146 787 753 140 643 -481 467 -278 -84 -529 214 398 284
5059 284 256 145 -148 -405 -385 -543 -55 286 341 501 408 -60 -286 -489 -499 -312 -161 178 395 218 389 135
5081 135 21 -37 -451 -461 -112 14 157 194 308 412 -220 -285 -600 -572 -110 -11 219 383 360 134 -42 -146
5103 -146 -454 -160 -36 -85 188 457 283 342 58 9 -568 -476 -110 -115 191 595 222 242 164 -1 -225 -393 -79
5126 -79 -168 5 350 335 87 56 140 -308 -281 -230 -304 -6 306 355 164 360 -313 -369 -537 -601 -19 -86 517 534
5150E34j6pm69q2m73p8K88M1P27j09L69o25J0l22lk24J06L12K85K29p9j85m69
5173b40Q1k05K39k64J35L53K25K40N0k7n49k45J43l95L59P5J60L15q2l1l52n81
5195e96K55j89K51M04j24K27M72o88k47J71l08J09JK83R8J7M99l10n83L5k4k1
5217b68K86J9L2J29K22j11k30K14n39k38L74K14j91L76rNk32j5n07k11M13P4J58
5240c5L67M3O8l07j58p02k5J26N75J5J01K24L69l74m57l0M06m01k00K10M42n2
5262B05L62q6n48Kj67o2J7J25K12K02r3K23k1n20n5k52L99k43L13L68O9O0l45
5285A65q0m82j51K70k31M50L20J62J74j85p39k49L0j2J04N47L65J17j71j43j07
5306A54r6l24l18L48J82M0M70R6l60L1l46l55N7N6M60k11M93O1j58J92r16M70
$$ plain form
5150 534 518 511 42 -40 -513 -591 -303 -262 465 356 725 100 110 -212 -215 -439 -333 -21 264 493 414 229 -240
5173 -240 -159 -364 -125 -389 -254 99 324 564 614 587 38 -207 -64 -459 -100 -25 135 450 368 337 -15 -596
5195 -596 -341 -530 -279 125 1 228 700 12 -235 -64 -372 -263 -262 21 119 136 635 325 -258 -223 -247 -268
5217 -268 18 37 69 198 420 309 79 293 -246 -484 -110 104 -87 289 280 285 53 38 -469 -680 -267 -193 -35
5240 -35 332 375 443 136 -22 -724 -749 -623 -48 -33 68 292 661 287 -170 -200 206 -195 -395 -185 257 205
5262 205 567 481 -67 -65 -232 -294 -277 -152 60 262 169 392 371 -149 -204 -456 -57 -300 13 381 450 510 165
5285 165 85 -397 -548 -278 -509 -59 261 423 597 412 -327 -576 -546 -558 -454 93 458 575 404 261 154
5306 154 58 -266 -584 -236 -54 -14 456 552 192 223 -123 -478 -421 -365 95 -116 377 438 280 472 -444 26
5328B6l87J01J13O78j34Ml36J49l48j91m18L22L07J55K86J90k69J01j27l56l34
5349d68j33P6L11L71R8J07k72n0m56M1m58N13M62K47L2R0j71j72l10k00J17r3
5371c18K95J23K13L43l38k83k29k87J25k6J44L13K54K30k94j37k08k41m1P7P3
5392b12pM18K19O6j60n20J01j23k60L83K84J28P7k4k15j44k78j83K25j57K12N78
5414D08p0J24pk81k98j63j67mL27J85L61J20m65q2M8n13j61M48j56L04L52KJ50
5437D62j09m37k94k98K29K67J66L08L6J20m20O7n15Pq4K0K90N25J35k22K44l43
5459A54l57k56J01J25K01J58N24j70j96m23K17n94L94j28K33J71R7j36M67j36
5479D46n71k09o81O71K00L91p2J58L60p16N4l33l36K15K83L5J72M73j68q6k04
$$ plain form
5328 26 -361 -260 -147 531 397 401 65 214 -134 -325 -743 -421 -114 41 327 517 248 349 222 -134 -468
5349 -468 -601 -525 -214 157 255 362 90 40 -416 -375 -833 -320 142 389 421 511 340 168 -142 -342 -225 -318
5371 -318 -23 100 313 656 318 35 -194 -481 -356 -382 -238 75 329 559 265 128 -80 -321 -362 -285 -212
5392 -212 -219 199 418 484 324 -196 -95 -218 -478 -95 189 317 394 370 155 11 -267 -450 -225 -382 -170 408
5414 408 338 462 455 174 -124 -287 -454 -458 -131 54 415 535 70 -12 36 -477 -638 -190 -346 -42 310 312 462
5437 462 353 -84 -378 -676 -447 -180 -14 294 330 450 30 97 -418 -411 -495 -475 -185 340 475 253 497 154
5459 154 -203 -459 -358 -233 -32 126 650 480 284 -139 78 -516 -122 -250 -17 154 251 115 582 446
5479 446 -125 -334 -1015 -344 -144 247 175 333 693 -23 31 -302 -638 -423 -140 -105 67 540 372 286 82
5500H2n67J43J08J07rO89m3k39Q3k13n06pK96m5m2N55j14J55k74j93j51k89j25
5523e99L64J36K89Q1nJ71l15jm99K11j34L81k28Q23m01J21m3m41k60p4k6k35P60
5546G6N0J5K88n5k81l27J80m11K90k26K90M08J22j75k84q6j41n83M05L49K07m0
5568G1M38k18m35l0l00J35mK2J79M76K13k04k74%l53j41L14k79L70Q8M85j17o16
5591a80L15k74j48j94J64J83M51K65P2n91J29k71m61M5L31j0J03R27l83j80j35
5612A58l34k81j37L11j40M85L47K80n16J56l94l49j74K57o7M69P6L53k67N6m66
5633a77j9k04J08m49O75O18k49J61M9n11m31J49j73J68K51M41kk3j00m16J02m32
5655d64j0R1L66L45k11J22j52J64n47k70Q1P5M96N3J35K65j91k51k94p7j59k08
$$ plain form
5500 82 -485 -342 -234 -127 -136 553 510 271 354 141 -365 -372 -76 -121 -163 392 278 433 159 -34 -185 -474 -599
5523 -599 -235 -99 190 271 266 437 122 121 -378 -167 -301 80 -148 675 274 395 352 -89 -349 -423 -449 -684 76
5546 76 126 141 429 374 93 -234 -54 -465 -175 -401 -111 297 419 244 -40 -126 -267 -850 -445 -96 111 71
5568 71 509 291 -144 -174 -474 -339 -343 -321 -142 334 547 343 69 69 -284 -425 -111 -390 -20 68 553 436 -180
5591 -180 135 -139 -287 -481 -317 -134 317 582 654 63 192 -79 -540 -495 -164 -174 -71 856 473 293 158
5612 158 -176 -457 -594 -283 -423 62 409 689 173 329 -65 -414 -588 -331 -398 71 147 500 233 289 -177
5633 -177 -196 -400 -292 -741 -66 552 303 464 513 2 -429 -280 -453 -285 -34 407 405 382 282 -134 -32 -464
5655 -464 -474 -383 -17 328 117 239 87 251 -296 -566 -485 -410 86 139 274 539 348 97 -197 -274 -433 -641
5677f41N97K68l9K88N6m50k43k1P1j59J03J13K96J66M2m4n22j03k48n2k8N99J78
5700B27K71r2j88j12j49n3m97K49M27k6N61l15J36o37j95J97k39m5N26O5K87k0
5722C78k40J34p15K39k12J37R5K39L0J67L22k80l67k49l96L96r2M33M62k78J05
5743C08M8k67m11P4j33mK36L68L4J70o6n20Q7k82k60J5N88K43K4j99L59om60k76
5767c30P5p4L8L80K00k7k84J07J68n48k59L61K01LK93Q8J94m07j55l94r3J58L39
5790C4N7N7L92j21l25K3m33j16J11K31J5K46J87R6l25j59j48j72r0o3L43L51J22
5813C13n5L44m09j85k19j05L1J11M78m1K79l34r6j30l67N3L8L3M31N7P7L5o9k08
5837F2l14K7j06J82K42R9K54K53l83k90k35k33K58k04K42L61n1K12J04l99n5l81
$$ plain form
5677 -641 -44 224 185 473 529 79 -164 -185 -114 -273 -170 -57 239 405 447 403 -119 -222 -470 -522 -550 49 227
5700 227 498 406 218 106 -43 -96 -593 -344 83 57 618 303 439 -198 -393 -196 -435 -480 46 111 398 378
5722 378 138 272 -443 -204 -416 -279 -184 55 85 252 574 294 -73 -322 -718 -322 -414 19 481 203 308
5743 308 356 89 -322 -248 -381 -385 -149 219 253 423 357 -163 -76 -358 -618 -603 -15 228 252 53 412 406 -54 -330
5767 -330 -255 -329 -291 89 289 262 -22 85 253 -295 -554 -193 8 11 304 392 586 179 24 -370 -463 -305 34
5790 34 91 148 540 419 94 117 -316 -432 -321 -90 -75 171 358 454 129 -30 -178 -350 -440 -503 -160 191 313
5813 313 258 602 193 8 -211 -316 -285 -174 304 263 542 208 112 -18 -385 -332 -294 -261 170 227 304 339 270 62
5837 62 -252 -225 -331 -149 93 192 446 699 316 26 -209 -442 -184 -388 -146 215 164 376 480 81 26 -355
5859c55k53L43K19J78j00M20q7k11l50J01m23K82n9K51K73J21J4j46m60Pnj60
5881d00M04n7M18J17j35k19j22o60L93k60L35KN03J68k58r6p8m68J13Q7J0L6J20
5904d7K02L37k38j41k47n9m60L62L04P5J75N4m7j80j93l62J82k6N7M04J98k08
5926A42o3j18j36m66L45o1n0N93J6l20M16K64o62j68j51J0P5L07J81L46o0q6k25
5949A29j80k96J2J4K30K94J2j52K77k86l09k26M8K33Q9O4M08J59m20J6j32j73
5971a89k60l1L00L50J66L6r5J04k75l36j13n5L84K10K44l03M4J59j02m99K0j02
5993c43R4L06J26K05k06J09J28m00l29J5k6M65J04Kj04J72k33j66k12j07J00J27
6015a73K48J17L4o4r4N0n43L40m98L92M25J5K2K61k67l76j91o1K10j50J10J83
$$ plain form
5859 -355 -608 -265 -46 132 32 452 365 154 -196 -95 -518 -236 -295 -44 229 350 364 218 -242 -235 -240 -400
5881 -400 4 -53 365 482 347 128 6 -654 -261 -521 -186 -184 319 487 229 133 55 -413 -300 -213 -203 -167 -47
5904 -47 155 492 254 113 -134 -193 -653 -291 13 88 263 317 270 90 -103 -465 -283 -309 -252 152 350 142
5926 142 79 -39 -175 -641 -296 -357 -407 186 202 -118 298 562 -100 -268 -419 -409 -334 -27 154 500 440 354 129
5949 129 -51 -347 -335 -321 -91 203 215 63 340 54 -255 -481 -433 -200 -111 -47 361 520 100 116 -16 -189
5971 -189 -449 -480 -180 170 336 372 277 381 106 -230 -343 -398 -14 196 440 137 181 340 238 -261 -241 -343
5993 -343 -249 57 183 388 182 291 419 19 -310 -295 -321 144 248 250 146 318 85 -81 -293 -400 -300 -173
6015 -173 75 192 226 162 68 118 -425 -85 -583 -191 234 249 271 532 265 -111 -302 -363 -153 -303 -193 -10
6037a0N18k29Nm01l24L12l20O7L77J68oJ97j93n0k47k60J03MM12N1J65K06Mo52
6061a03l5O0k87M4K81L6l0M73R2m24k40l2N7l78K81M3K55K07j54J26l09J05m25
6084c57M9K55q6L95J17K4m48Q8k24j53R4N1m2K86L16k02L1j03k88k17l7M19K1
6107a1p4K15K22k39R6o4l98m7k24M14J6N09J67m04J45m84J73j98N6j88m4M42K32
6130C12K28k19m48j68j51K35p5K92n2N43k12k36J29n31K71r5J00N67l78J33J50
6151C95l89k9n4k85m2L06j50N56L5j50J21j75k94j09j5n6N5K12K12K1j07P1j16
6174A3l70K06j15K14R4L00l9K63l70l44M1k83O7J94L03K66q3j3l46q1P2j42o9
6197b22j2M3L14J80j83J42k53j75l10K05J69n8M32q9M1j02M9l39Q3q8j53K00L37
$$ plain form
6037 -10 508 279 284 -117 -441 -129 -449 -382 -5 163 157 354 161 111 -136 -396 -293 -289 123 174 339 545 549 -103
6061 -103 -138 -78 -365 -321 -40 -4 -34 439 531 107 -133 -165 -108 -486 -205 -162 93 300 146 272 -37 68 -357
6084 -357 -308 -53 -139 256 373 397 -51 37 -187 -340 -246 -195 -237 49 365 163 194 91 -197 -414 -451 -32 -11
6107 -11 -85 130 352 113 209 145 -253 -300 -524 -110 -94 415 582 178 323 -161 12 -186 -130 -318 -362 80 312
6130 312 540 321 -127 -295 -446 -211 -286 6 -46 497 285 49 178 -353 -82 -177 -77 490 112 245 395
6151 395 6 -23 -77 -362 -404 -98 -248 308 343 193 314 139 -155 -264 -279 -335 -280 -68 144 165 58 129 13
6174 13 -357 -151 -266 -52 42 342 303 566 196 -148 -107 -390 -323 -129 174 440 357 344 -2 -83 -11 -153 -222
6197 -222 -234 -191 123 303 120 262 9 -166 -476 -271 -102 -160 272 183 224 122 171 -168 -85 -173 -326 -126 211
6220B11O8k8M07o03j35r8k4j84J24J74J06J75M46l26m95L66m63l17M41K07p0J89
6242A71N49n78j95L3k07k63Q0N83l4j05L74k1m45j00N8l3k81L07k9M43pJ61m44
6265A7m6l26j37O05k73j37N79m5O9k9m22L0l35K91m8J51Q1J66J66k56j05j60l04
6288d68j62N16J1K92J7J22j0m21Q0j8j41k32K98K65r4L59m6l08k17k77J88J54
6310i2j28K75O4J1J90j18k51j24q5J19J2j5L73K81R5n00k27Lj61Q3l47N54J80
6333A92J0J29j73l2o74J00KM60j9K29j4L73l84K6l82j58R5L38k4m8MK55j50o4
6357I1q6m75M79k3k36K67K27n1J44k24j32m8k83J86O8M15l05Q2J00m80L06j41
6379a19k45j88R4M06K45J60J40k43l43P8m23M0L96J18nK0K09k46j09k52J37k13
$$ plain form
6220 211 279 251 658 55 -80 -178 -202 -386 -262 -88 18 193 639 313 -182 184 -279 -596 -155 52 -18 171
6242 171 720 142 -53 -20 -227 -490 -410 173 139 34 408 387 -58 -158 -100 -133 -414 -107 -136 307 300 461 17
6265 17 -29 -355 -492 113 -160 -297 282 237 306 277 -145 -115 -450 -159 -207 -56 25 191 357 101 -4 -164 -468
6288 -468 -630 -114 -103 189 206 328 318 -103 -23 -41 -182 -414 -116 149 55 414 368 60 -157 -434 -246 -92
6310 -92 -220 55 119 130 320 202 -49 -173 -258 -139 -127 -142 231 512 607 107 -120 -117 -278 -195 -542 12 192
6333 192 202 331 158 126 -548 -448 -446 14 -5 224 210 583 199 225 -157 -315 -220 118 94 46 50 305 155 91
6357 91 5 -470 9 -14 -250 17 244 193 337 113 -19 -67 -350 -164 -96 319 14 96 196 -284 22 -119
6379 -119 -364 -552 -458 -52 193 353 493 250 -93 -15 -438 -398 -2 116 111 131 340 94 -15 -267 -130 -343
6401c43K32j07L84j43R5J08k78N7k20j59n9M22J23J9L41l51J26j68m26n0K74q2
6423b05N3K84L11m11Q2o4l18j69J27J20K16J13J14K6p7j14l14k11K29K74r3J59
6445A32J30P7m47K52l11j5j65L24P3L5J72j63R5j91J50n07J07K99k10K08o0R4
6467G9J54j10l38k8Qj5J66l0J50L47k29j11j75O5r8j24Q8j76M95J45j2j08j85
6490d2l8j01j38Q1K33J02L34l18J25j87j60r3K58q5j47J59L03j13J43m22l28L88
6512d6j68k28J10K44L08K17j54j13k22k06K99k94L23n5K11j53L3J43m07J0k30
6533c78K73l43M19L43k15L75m41j12n3j65oQ3K60n7J27J37k09j16O9m8j8k3L47
6556B49o3l3J40Q5m47J10J0n22M46k34M19J70r0k51j02J52Lr7j68L47k28N92k01
$$ plain form
6401 -343 -111 -218 166 23 118 226 -52 5 -215 -374 -433 -11 112 131 472 121 247 79 -347 -397 -123 -205
6423 -205 -152 132 443 32 114 50 -268 -437 -310 -190 26 139 253 279 202 88 -226 -437 -208 66 -27 132
6445 132 262 339 -108 144 -167 -182 -347 -23 50 85 257 94 189 -2 148 -359 -252 47 -163 45 -15 79
6467 79 233 123 -215 -243 -235 -250 -84 -114 36 383 154 43 -132 -67 -165 -289 -201 -377 118 263 251 143 -42
6490 -42 -80 -181 -319 -238 -5 97 431 113 238 51 -109 -202 56 -29 -176 -17 286 173 316 -106 -434 -46
6512 -46 -214 -442 -332 -88 220 437 283 170 -52 -258 41 -253 70 15 226 73 106 249 -158 -148 -378
6533 -378 -105 -448 -29 314 99 474 33 -79 -132 -297 -303 -220 40 -17 110 247 38 -78 -9 -57 -75 -98 249
6556 249 186 153 293 378 -69 41 51 -471 -25 -259 160 330 240 -11 -113 39 42 -55 -223 124 -104 488 287
6579B87m8J5j72j90l1K4l8k4J32L82j32N6k66j03l2JM8m2K85L40j12k7m81N2j23
6604a99L4%q3K71K15l5L77m02r4l27k1k8K25J23qM11m01K74n80J68m19N50k06
6627a55P2M86l80O8K7l6j82O6k36J25J23N3K25M4lj99k66k12K62J02j93L04K22
6650C17m2l09K57L3l29r0o8k2K23L46l05L16j44m54J26K06j66j42L72J6j44K40
6672B37j05l14n6J5R8k13M00J0J08J86o9k87j54J1j88j35M84L27j36JP7l70J37
6695F4k33K18k65J02p6K54J12K8j13m07J31l7j59K82M8K24j4Q5j27J78l79k66
6717c50J32P6L1L64L00k66k75J33k53rn9K70k51R6K83N3M4k20Lj79k60J95J12
6740c0k8L01q7K13k90J4j78j13L7J31L6rK95r9jRp20J34L93j34j92O27j77q9K98
$$ plain form
6579 287 239 254 82 -108 -139 -115 -153 -177 -45 337 205 261 -5 -108 -140 -139 -91 -133 152 492 380 353 -128 -76 -199
6604 -199 -165 -165 -248 23 238 203 580 178 84 -243 -264 -292 -67 56 48 459 58 332 -248 -80 -499 51 -155
6627 -155 -83 403 23 91 118 82 -100 -34 -270 -145 -22 31 256 300 297 98 -168 -380 -118 -16 -209 95 317
6650 317 275 -34 223 256 -73 -163 -231 -253 -30 316 11 327 183 -271 -145 61 -105 -247 125 141 -3 237
6672 237 132 -182 -238 -223 -125 -338 62 72 180 366 297 10 -144 -133 -321 -456 28 355 219 220 297 -73 64
6695 64 -169 49 -216 -114 -190 64 176 204 91 -316 -185 -222 -381 -99 -51 173 159 244 117 295 -84 -350
6717 -350 -218 -142 -111 253 553 287 12 145 -108 -117 -176 94 -157 -61 222 275 319 99 102 -77 -337 -142 -30
6740 -30 -58 243 156 369 79 93 -85 -198 -161 -30 6 -3 292 193 192 201 -519 -385 8 -126 -318 309 132 43 341
6765C41j16k24k00j02P3R3J69o5K10j67K05m47r4P5l9N06k70K26N4J62m20k58
6787b88J25N4N0j9J64k8P0l04J48L5k29j10p2L14q3N52k17J47l83K68j52k20r7
6810b75m5J88K68N38m05k11k30J82j05j77K01O5J58J50j64Qj31k95J26P7k80L31
6832b6oJ85N1j00j53k88J34j84J97n9K39K23j03M5j19k3Q4l5j62m4L43Rj80J50
6856A78n48N32n31K95j50k5L10J5J77k71J7L29o34J83j96L08j37J05Q3O3J45l59
6878a11K8r0J06j42M0L14J68j13O8k99j8k49M8j8K87J59j01K11j22k1k62K0j97
6901b94J76M7OK50K08m40j58K01k23l12K37L8j3N02j42r5J78r9m79L47j84N7M15
6924B23l20L76Q6m49pl9k49J38o4L18K73m21L84p6k5j36k73N5N6J49j5J51K24
$$ plain form
6765 341 225 1 -199 -301 -228 -135 34 -31 179 12 217 -230 -324 -249 -288 218 -52 174 228 390 -30 -288
6787 -288 -163 -109 -59 -78 86 58 128 -176 -28 7 -222 -332 -404 -90 -173 379 162 309 -74 194 42 -178 -275
6810 -275 -320 -132 136 674 269 58 -172 10 -95 -272 -71 -6 152 302 138 146 15 -280 -154 -77 -357 -26
6832 -26 -32 153 204 104 -49 -337 -203 -387 -190 -249 -10 213 110 155 36 13 97 62 -100 -144 199 208 28 178
6856 178 -370 162 -369 -74 -224 -249 61 76 253 -18 -1 328 -306 -123 -319 -11 -148 -43 40 103 248 -111
6878 -111 -83 -173 -67 -209 -169 145 313 200 268 -31 -49 -298 -250 -268 19 178 77 288 166 145 -117 -97 -294
6901 -294 -118 -71 -65 185 393 -47 -205 -4 -227 -539 -302 -264 -277 225 83 -12 166 67 -412 -65 -249 -192 223
6924 223 -97 279 365 -84 -91 -130 -379 -241 -305 13 286 -135 249 173 148 12 -261 -206 -150 -1 -16 135 359
6947C59L2k20o0j53k39K29k17L16L2j48J64O6L5m35M9j44K84j2J04K37m3j93N9
6970A02k77O9PR2j10L81Q8rqn5k83l65K00k2K45K01j44J85j97o9Qm14J8N6L76
6995G5L0K1p5K39l64m7j77K01Q0N6J26nm1Q8j85Q7n07L75o2o3l1L51j45M59q6
7020D00l35l05J20J16j66j3L83M2J01q5n17J97o5K00j75K31q7J02j86j44J20R9
7042C3j84r7O8m2K67L5K35k43J92o4k44k79J75O8J88j43m6J44l8R8j31m85K96
7065a97J78Q5k40K41L9J18N7k67p7j08M37n14M23J52o1k98J99n18K13l3J09K2
7087d0J73k0J2K2j42j08j61o0K31j96M5L85r9K97j96j56o5l04J04N04k51J8J09
7110A02k53J62j03J61k72m3J73P8J89J20j89j01M8k2j51J19P7j44L61R6o55M0
$$ plain form
6947 359 391 171 111 -42 -281 -52 -269 47 79 -69 95 161 196 -239 -190 -334 -50 -62 42 279 236 43 102
6970 102 -175 -106 -99 -7 -117 264 352 343 335 280 -3 -368 -168 -190 55 256 112 297 100 31 39 -375 -357 -301 75
6995 75 105 126 51 290 -74 -121 -298 -97 -17 39 165 160 119 207 22 109 -398 -23 -85 -148 -179 172 27 486 400
7020 400 65 -240 -120 -4 -170 -183 200 242 343 258 -259 -62 -127 73 -102 129 42 144 -42 -186 -66 33
7042 33 -151 -248 -180 -222 45 80 315 72 264 200 -44 -323 -148 -80 108 -35 -81 63 25 123 -8 -493 -197
7065 -197 -19 66 -174 67 106 224 281 14 -63 -171 266 -248 175 327 266 -32 167 -351 -138 -171 -62 -40
7087 -40 133 113 125 147 5 -103 -264 -324 -93 -289 -244 141 42 339 143 -13 -78 -382 -278 226 -25 -7 102
7110 102 -151 11 -92 69 -203 -246 -73 5 194 314 125 24 72 50 -101 18 95 -49 312 408 -247 -207
7132b07K43j69k56K84j97J79J37O6R7m4K27k32l23J96Rk23K33J24j55K04J09k81
7154B1k19J66o7N5J78j40J89l1J26k35j98r5j65K23M82r7j7R1k11j11p7N1L98
7177C17n27kL74l61M70jl69J38k81L63l60L05P7J78k52J21k89J3m6J66k3r0N2
7200b7K02j07J02k57j1J7k35J95R0K96l07O29m47l51L65l85M1n9L29p3p2nL30
7223B60j53J32n67L85o9q2K44k77J55m7l0Q9k60J06n0P1M4O2J27l9l9L6j03P8
7247G3j63J40J98l14L20j67J35M0l79k07J91M1J0J88k05J6K04J56k25rn3k10j4
7270b34L17O5P1j00K98n45L11j31m3j20j05K48M05k39j91k3j4M4j30qJ40l7K23
7293B02J73J45o99K1JJ09L5K08j15L5m7J72k66J32pj27K97k99p8J42K65j26j07
$$ plain form
7132 -207 36 -133 -389 -105 -302 -123 14 80 177 133 360 128 -195 1 10 -213 20 144 -11 193 302 21
7154 21 -198 -32 -99 -44 134 -6 183 152 278 43 -155 -250 -415 -192 290 193 176 267 56 -55 -132 -81 317
7177 317 -210 -212 162 -199 271 270 -99 39 -242 121 -239 66 143 321 69 190 -99 -86 -132 34 11 -79 -27
7200 -27 175 68 170 -87 -98 -81 -316 -121 -31 265 -42 587 140 -211 154 -231 -190 -249 80 7 -65 -70 260
7223 260 107 239 -328 57 -12 -94 150 -127 28 -19 -49 40 -220 -114 -164 -93 -49 13 140 101 62 98 -5 73
7247 73 -90 50 248 -66 254 87 222 262 -117 -324 -133 -92 -82 106 -99 -83 121 277 52 43 -10 -220 -234
7270 -234 83 148 219 119 417 -128 183 52 9 -111 -216 32 437 198 7 -16 -30 14 -116 -124 16 -21 202
7293 202 375 520 -179 -158 -157 -48 -13 195 80 115 68 240 -26 106 99 -28 269 -30 -108 34 299 173 66
7316F6J38k08j98J45J83l04K96J33Rj16p3j84J3O9O0k03K24M2j34R7O4j01j62
7339a44J0kJ03K62N7J02m81n4J47j74J70%R8j32K95k67J70N6j82k01n7l4L05j03
7363e6K77j99K59K05o69mM0j98L95P6L5p7K44rl84oJ66n25K17K03p0R3L25k37
7387A01p6k91m1P0O9K71k53M40j17q0r2j64J71m08K74p2M15k30J07j4J46k16J40
7410A50k78Q9j1J92Q5k68Q1O2L28o46N8J17k67o6N21j17j8J67p6j5k61k3J26l7
7434a07o1m2M56j55j7l33J0K0k4RK63K59J44l37k3Kj64r1J24k39P6L98l14N75
7458D29q5l41p1J9K95q0j02P1J80l80K05K52n15J52k92L03l68N80k14J35Q5m8
7480B10k85l4R7j14j53N28q6J30k16L5p3l32j44K43K8K04J31l18N02j83j08n3
$$ plain form
7316 66 204 -4 -202 -57 126 -178 118 251 260 144 71 -113 -100 -31 29 -174 50 92 -42 55 119 18 -144
7339 -144 -134 -136 -33 229 286 388 -93 -147 0 -174 -4 -4 94 -38 257 -10 160 216 34 -167 -224 -258 47 -56
7363 -56 221 22 281 486 -183 -187 -147 -345 50 126 161 84 328 319 -65 -71 95 -430 -213 -10 -80 13 338 101
7387 101 25 -266 -307 -237 -168 103 -150 290 173 93 1 -163 8 -400 -126 -198 217 -13 94 80 226 10 150
7410 150 -128 -39 -50 142 227 -41 40 102 430 -216 -158 -41 -308 -374 147 30 12 179 103 88 -173 -196 -70 -107
7434 -107 -168 -210 246 91 74 -259 -249 -229 -253 -244 19 278 422 85 62 64 -100 -191 -67 -306 -230 168 -146 429
7458 429 344 3 -68 -49 246 166 64 135 315 -65 140 392 -123 29 -263 40 -328 252 38 173 258 210
7480 210 -75 -109 -12 -126 -279 249 163 293 77 112 39 -293 -437 -194 -166 38 169 -149 353 170 62 9
7502Im7k5q4J88J43R2k20j9o2p9L1j24J46m8L41l33L27j85ok28%N9K48k44N02
7527C82l65L6K65k63K12l53J21j23R3J68J51j63J31l59J67k30jO2L15j76k56L22
7549A36N1j02k40R0o1K9k22L96Q1k24K46J6k21j97J7j6J34J01J95o9L06j34m70
7572a58J08j99kJ71k47J95L32J17l36O2J87j44J07r2K3j79J59k2N8j60J00k69
7594a89r4K39k60K03K11q4K1J81j62l64K12L3j45J19J95N1k55l3M68k08o4l0k45
7617b00N8K08K17L2l7J14n67L4J17o0n3K4O3p2M98m93K25j65J07j46J14N5o3R2
7641A02k10Q3K4j72L71n26J77J73j26M55l06k61J38j4N7L08l03j43K80J4O2m77
7663b94N89l05J07k23J91k00q1L14l3K24l41j48P7j2J49j37M1L70j26l05l6J93
$$ plain form
7502 9 -38 -63 -147 41 184 276 56 37 -25 -104 -73 -197 -51 -99 242 -91 236 51 45 -183 -183 -124 124 -120 382
7527 382 17 53 318 55 267 -86 35 -88 5 173 324 161 292 -67 100 -130 -131 -69 246 70 -186 136
7549 136 187 85 -155 -65 -126 -97 -319 77 158 -66 180 196 -25 -222 -205 -221 -87 14 209 140 446 312 -158
7572 -158 -50 -249 -251 -80 -327 -132 200 317 -19 43 230 86 193 101 124 -55 104 82 140 -20 80 -189
7594 -189 -283 -44 -304 -101 110 26 47 228 66 -298 -86 -53 -198 -79 116 167 -88 -121 347 139 75 45 -200
7617 -200 -142 66 283 315 278 392 -175 -141 -24 -84 -137 -113 -50 -122 376 -117 108 -57 50 -96 18 73 10 102
7641 102 -108 -25 -1 -173 198 -328 -151 22 -104 351 45 -216 -78 -92 -35 273 -30 -173 107 121 183 -294
7663 -294 295 -10 97 -126 65 -135 -216 98 65 289 -52 -200 -123 -135 14 -123 -82 288 162 -143 -179 14
7685A4l28K42L4o3j77L85k2j37J62j92K7Jk57J7K67L5K08m1l07N90n44j30j09
7708c25L09J12j54K19Rk05o0J44J34k97MJ14J35k15L87L6l69p0m1P9k91L68K34
7731B57j33j77J06K6j46N6p3j99M32j60L20j36J3j47j69q5J59k2J7J52q9K23k79
7754e4J32O1o6j44j48K69j27J21Mk17L18o3j2j31l6l09L62r8K14p1P2J66j77m02
7778c36K17O8p4q1L06J33k67L69k04J3m60J11J9K64J51k76J35J73j08j05p3j46
7800a71k1K31q7K07J18l99K01k09o6K8o6N24l35K66J1n4l1j90N1J00j17j41j10
7823b60J38M1N3k4j90K37j36J6r9K69J60k9L2j44L4K1k47k70O20k48nP3R7J56
7847B95k21j91J65n9k50J45J14K9J63j60k09j04L30l6l1K0R6N5j7j04k5K36m10
$$ plain form
7685 14 -314 -72 -38 -101 -278 107 85 -52 110 -82 -55 -54 -311 -294 -27 8 216 175 -132 458 -86 -216 -325
7708 -325 -16 96 -58 161 170 -35 -95 49 183 -114 -110 4 139 -76 311 347 -22 -92 -133 -54 -345 23 257
7731 257 124 -53 53 79 -67 -11 -84 -283 149 -11 309 173 186 39 -130 -215 -56 -78 -61 91 2 225 -54
7754 -54 78 139 73 -71 -219 50 -77 44 48 -169 149 86 74 -57 -93 -402 -40 -138 76 5 77 243 66 -336
7778 -336 -119 -51 -125 -206 100 233 -34 335 131 144 -316 -205 -186 78 229 -47 88 261 153 48 -25 -171
7800 -171 -192 39 -48 159 277 -122 79 -130 -196 -168 -234 290 -45 221 232 178 147 -43 8 108 -9 -150 -260
7823 -260 -122 -81 -28 -52 -242 -5 -141 -125 -224 45 205 176 208 64 98 119 -128 -398 222 -26 -31 42 139 295
7847 295 74 -117 48 -11 -261 -116 -2 27 190 30 -179 -283 47 11 -20 0 96 151 134 30 5 241 -169
7870a69J17J25K0q7J46j61J10j21N4j00j08N07m9k80K84k43J45Jj62r0M0k05K52
7893B6q1M4J79k1j89J25p9k1o0j29L41l15K97J56k59p2j79J70M6j76J28j33K07
7916Ek5K53K6l91j49K26Q6J67j4l71K78j13J78q2r0l9J14l70J81L81l6k05K68
7939B78k30j11M0o9J92k36L12k80K20lJ80m74n9K65o2l9J18j03K76j77k09j05
7961b76N90n36M0J75J2J66p7j00J40j79j52K53o9N2o8mP5J6j4R4k25j2J55L07
7985C63k44j40Q0k27L84m78n6N09R6n25M06J60m60M2L84l55J88j46O9j45J39J45
8007A89j18M9P1j75Q6j94J76K4j90N4J76K71k44m92L78q0q3p7K44l1L05k3l33
8030a7N0k99L53On14K40K32j43M39k38j40J3L19l77M9M5K81k87K00j17n9O5j03
$$ plain form
7870 -169 -52 73 93 6 152 -9 101 -20 34 -66 -174 333 284 4 288 45 190 191 29 -61 -21 -226 26
7893 26 -55 -11 168 147 -42 83 4 -17 -77 -206 135 -180 117 273 14 -58 -237 -67 -21 -197 -69 -202 5
7916 5 -20 233 259 -132 -281 -55 31 198 184 -187 91 -22 156 74 -16 -55 59 -311 -130 251 215 10 278
7939 278 48 -63 -23 -92 100 -136 176 -104 116 113 293 -181 -240 25 -37 -76 42 -61 215 38 -171 -276
7961 -276 314 -222 -182 -7 5 171 94 -6 134 -45 -197 56 -13 39 -29 -33 42 58 44 138 -87 -99 56 363
7985 363 119 -21 59 -168 216 -262 -318 191 287 -238 168 328 -132 -90 294 -61 127 -19 50 -95 44 189
8007 189 71 120 191 16 102 -92 84 108 -82 -28 148 419 175 -317 61 -19 -102 -179 65 34 339 316 -17
8030 -17 33 -266 87 93 -421 -181 51 -92 347 109 -31 -18 301 -76 -27 18 299 12 212 95 36 101 -2
8053bj43P7J20j68K82p0o3m8J11K76o54L01O1j56J50l9J30lm46K88k17K79j09
8076d3l14K05K84j74J16P2j28k78M8J29KM2r2K88r2k01O6j59J97l09K31j13J41
8099h2J73Q5N1k76nj11K29j45j44L69j65j49K58m16L65mQ5k68K31K62j61r0J52
8122B44j34j19k7lj26N49n09M21O9j40k10O0K03n44J45Ml5L14J26k66k52Q8K22
8145H0j54Oj4J28n7J07M1j8j22j3M5k26j72M39Oj87J60m4n6j52n8K02J23k20J50
8170fJ43l26K21j08M45m10l2N0j39L12l01r0L39K08j93l89L53j60K2L1m4
$$ plain form
8053 -2 -145 -68 52 -116 166 96 33 -15 96 372 -282 19 80 -76 74 35 165 162 -284 4 -213 66 -43
8076 -43 -357 -152 132 -42 74 146 18 -260 -212 -83 -81 -39 -131 157 65 -136 -70 -229 -32 -341 -110 -223 -82
8099 -82 91 176 227 -49 -54 -165 64 -81 -225 144 -21 -170 88 -328 37 33 118 -150 81 343 182 92 244
8122 244 110 -9 -36 -39 -165 384 -125 296 365 225 15 75 278 -266 -121 -117 -152 162 288 22 -230 -142 80
8145 80 -74 -68 -82 46 -11 96 137 119 -3 -16 29 -197 -369 70 76 -111 49 5 -51 -203 -261 -59 64 -156 -6
8170 -6 137 -189 32 -76 369 -41 -73 -23 -162 150 -151 -241 98 306 113 -276 77 -83 -61 -30 -74
8191g4
$$ Imaginary data points
##PAGE= N=2
##DATA TABLE= (X++(I..I)), XYDATA
0@%%%%%%%%%%%kJ0j6J6j6K0k8L2m0M8n6P1q1R2j08J29j52J73j98K27k60K96l35
34a78L80m28M81n41O05o77P55q38R28j029J141j259J389j534J691j862K052k261
52a185K491k746L033l356L721m138M619n184N857o675P694r004J0759j3246J7074
67I714k3790L8980j37924P644K07446q4141J2395Q5195k4771j05033j1393m1195
79f6873j6544N5742J6747l1000Q9611P1481n6988l7060K13r9572l9568Q2832j0437
92d1416n0485J50882J32167j10206j03443M2007l7996j02675J7441Q2971N1894
103C1141M3654j6011n1669L4349K4887j05899o4782N4246L493j6983R8246P2387
115A07059m3804l303J0025j13012q5949O5411M4469k5136M9428Q6731N023m1297
$$ plain form
0 0 0 0 0 0 0 0 0 0 0 0 0 -2 8 -8 8 -8 12 -16 16 -24 24 -32 39 -42 50 -58 71 -81 92 -106 121 -139 157 -178
34 -178 202 -226 255 -286 319 -358 397 -441 487 -542 599 -660 729 -805 886 -976 1076 -1185
52 -1185 1306 -1440 1593 -1763 1958 -2180 2439 -2745 3112 -3563 4131 -4873 5886 -7360 9714
67 9714 -14076 24904 -113020 -105376 102070 17929 30324 115519 90748 -14285 -25678 -66873
79 -66873 -83417 -27675 -10928 -41928 47683 119164 62176 25116 25329 -74243 -113811 -30979 -41416
92 -41416 -91901 58981 191148 80942 -22501 19506 -18490 -121165 -103724 -20753 31141
103 31141 74795 58784 7115 41464 66351 -39548 -104330 -50084 -46591 -63574 34672 107059
115 107059 63255 59952 69977 -43035 -128984 -63573 -19104 -44240 5188 91919 96942 55645
127E5645n4199n9343Q20K8156l0985n74R4625M2311m2118J4012L2107o8335q0785
140f8663o863l063J1775Q4074O6640j5008j6816o738n3091n6288p049J0820K5586
153c4684M9093K8052P240K2820r452o9819m4555R139r942j6883M2345O1200K5145
166E9699J2163k641n0879o2069k5616m605J5109N3444N3182J4460k839q206l4759
179A6443m1671k0572j4059n056L2491N0473K8153J4679M730l1294n0694k9343
191d5720j5858p529L1104N5991L2631J4298N806l2192n7316l2091r004m508K5450
204c8938M9474K5846Q549J5031r557m4894l8727k0639j1913J8118M2539L4546
216B9435K8032J8332k5634n2976k8578j6176k3252J1077N1004L7191J9606J7913
$$ plain form
127 55645 1446 -57897 -57077 -28921 -59906 -60480 34145 76456 34338 48350 80457 12122 -68663
140 -68663 -75526 -78589 -66814 17260 83900 68892 52076 45338 -7753 -64041 -71090 -60270 -34684
153 -34684 14409 42461 49701 72521 63069 -6750 -51305 -42166 -52108 -68991 -26646 34554 59699
166 59699 71862 69221 18342 -43727 -69343 -73948 -58839 -5395 47787 62247 59408 51202 16443
179 16443 -25228 -45800 -59859 -64915 -32424 18049 46202 60881 65611 34317 -16377 -45720
191 -45720 -61578 -69107 -38003 17988 50619 64917 70723 38531 -18785 -50876 -59880 -64388 -38938
204 -38938 10536 36382 44931 59962 50405 5511 -33216 -53855 -65768 -47650 -5111 29435
216 29435 57467 75799 50165 -2811 -31389 -47565 -70817 -59740 -8736 28455 48061 65974
228F5974j1259m3026l2268j9813k1901O097L8598L4405K4655K1869o613l3181
240B3537l2184l5699k9990J2991M2108K7707K5408L2365p97l8296l4157k5378
252c2385k5037j276K7241L1106L2283K8333j430k7012k9400l2048k9867k520K3927
265c8085K9377L5628L2911L392k2997k7005l4021l3554p551K0253K8824L2127
277A9299K9980R512j4197k7321l5309l2346r242J2856K5052L5670L4203J3213
289F1370j0166k5081l4347l3342j6788O263K3582L4175L2600J6764l261k1507
301C0262l3899l3786j8103K458K0612L2682L4060K1434O57j9369l2714l3409k3062
314e2177l959J6687L0898L4082K3476N519j4891k9530l3778k4465o985J3456K9145
$$ plain form
228 65974 54715 11689 -20579 -40392 -62293 -56196 -17598 16807 41462 63331 56718 23537
240 23537 -8647 -44346 -74336 -61345 -19237 8470 33878 66243 65446 27150 -7007 -32385
252 -32385 -57422 -58698 -31457 -351 31932 60265 58835 31823 2423 -29625 -59492 -62012 -38085
265 -38085 -8708 26920 59831 63223 40226 13221 -20800 -54354 -61905 -41652 -12828 19299
277 19299 49279 58791 44594 17273 -18036 -50382 -59624 -46768 -21716 13954 48157 61370
289 61370 51204 26123 -8224 -41566 -58354 -52091 -28509 5666 38266 55030 51769 30262
301 30262 -3637 -37423 -55526 -53068 -32456 226 34286 55720 56377 37008 4294 -29115 -52177
314 -52177 -56136 -39449 -8551 25531 49007 54526 39635 10105 -23673 -48138 -55123 -41667 -12522
327a2522L3547K6836R051j1295k8111l4336k7953j1756Q927K5910L3638K8168
339D0104J4100o104k5287l3527k7337j3965L082K2395L4681L0549J4704l822k0425
352B9148l1466l2061k0578N37K3309L1286K7347K0924N829j8896l4050k9461j8485
365d6617m988J5948L0713L0144K1362O964j4757l0858l0945k2074q796J0907K7288
378a5709L3374K8252R710j5086k6724k5590k6509j7587J0683L1268K8494K1083
390C5659J4711l289k5980l1641k6717j5372M654K3953K8151K6972K0419k93k1712
403B9515l0038k9523k1477Q67K2787K7672K7646K4121l17k5712k7046k1288k2153
416d4946o513J9084K6121K4475K6599R511j8227k5579k4604k8721j2747J8605
$$ plain form
327 -12522 21025 47861 56912 45617 17506 -16830 -44783 -56539 -47612 -21702 11936 40104
339 40104 54204 48100 22813 -10714 -38051 -52016 -48934 -26539 8142 38691 53395 49573 29148
352 29148 -2318 -34379 -54957 -54420 -31111 175 27522 48446 54275 35379 1329 -28132 -46617
365 -46617 -51605 -35657 -4944 25200 46562 53526 38769 7911 -23034 -45108 -53904 -42997 -15709
378 -15709 17665 45917 55627 40541 13817 -11773 -38282 -55869 -45186 -13918 14576 35659
390 35659 50370 47081 21101 -10540 -37257 -52629 -47975 -24022 4129 31101 51520 51227 29515
403 29515 -523 -30046 -51523 -50656 -27869 -197 27449 51570 51253 25541 -1505 -22793 -44946
416 -44946 -51459 -32375 -6254 18221 44820 54331 36104 10525 -14079 -42800 -55547 -36942
428c6942K6114K3028L0055J4696j9063k7085k3415k9906j4682J9614K6801K2237
440A1452K8605R984j8136j2738j2297l8947k5606J9252J8074J0172L8781L3031
452F1627j4676k5526j9477l7376k3000J9657J8094J3045L8761K6214j6122j6597
464B4624j6615m0719j6009K1406j314Q84N3310L1414l0040n214J4645m2747n2739
477e9114M813J7509J7614M7539K6784j5991l484j1448n4218k3397K5676j461p97
490b9975M7984K2173j8095J8671N940o7086l4083L5310n496k7139M4845N4185
502D7234N26k170r795m7457k4543q59k4317J6615P8797J8441l7662J4172J2494
515D1476n1971j9209K0873l1776j7615O1713L0504k0694K7591K4617n4470m8580
$$ plain form
428 -36942 -10828 12200 42255 56951 37888 10803 -12612 -42518 -57200 -37586 -10785 11452
440 11452 40057 50041 31905 19167 6870 -32077 -57683 -38431 -20357 -10185 28596 61627
452 61627 46951 21425 1948 -35428 -58428 -38771 -20677 -7632 31129 57343 41221 24624
464 24624 8009 -32710 -48719 -27313 -28627 -27743 25567 56981 26941 21727 36372 -6375 -59114
477 -59114 -54301 -36792 -19178 28361 55145 39154 35670 24222 -29996 -53393 -27717 -29178 -29975
490 -29975 18009 40182 22087 40758 46698 -20388 -54471 -19161 -24657 -51796 -6951 47234
502 47234 47760 45590 35795 -11662 -36205 -37064 -61381 -44766 34031 52472 14810 28982 41476
515 41476 -10495 -29704 -8831 -40607 -58222 3491 33995 13301 40892 65509 11039 -37541
527c7541j292j0073Q702M1266R686J1320N0685j3431q3188j3742L0132l2714j3738
540e3928O0350K1521k0309K4673J4734l8459j1643K626m7979k4174M7831L8072
552A3315J6649K9280r214m3641q617j4538n0080J3257O6094J287j8562M6211K1743
565F3184n1156k7595L671k1301p999K5291L596P915M5357J6924k6804j4302k1971
578e190m8566q310L5145J7858K6338M5338j1546n1056l521R159l6114k0288K7342
591b3411J7190N991K6215J6697q612r211k2471l8486j0586J6172N458J5567M2843
604C3356K1735j3913j6680k7256m2301r962K8785J8496R253K5717J4087j6428
616B4889j2296j942j8606k5276p765N249J8851L7401K5856m810j2587j6201l3560
$$ plain form
527 -37541 -38833 -48906 -40204 1062 10748 22068 72753 59322 -23866 -37608 -7476 -40190 -53928
540 -53928 6422 27943 7634 32307 47041 8582 -3061 -435 -48414 -72588 -24757 13315
552 13315 29964 59244 50030 6389 -2228 -16766 -66846 -53589 12505 13792 -4770 41441 63184
565 63184 12028 -15567 -11896 -33197 -41196 -15905 -12309 -4394 40963 57887 31083 16781 -5190
578 -5190 -53756 -62066 -26921 -9063 17275 62613 51067 11 -3510 5649 -30465 -50753 -23411
591 -23411 -6221 -230 25985 42682 34070 24859 2388 -36098 -46684 -30512 -25054 -9487 33356
604 33356 55091 41178 24498 -2758 -45059 -55021 -26236 -7740 1513 27230 41317 24889
616 24889 12593 10651 -7955 -33231 -40996 -35747 -16896 20505 46361 41551 28964 12763 -20797
629b0797k6434O318J5696J3113L0546K7647n426j7775j2582k6668k5041Q174J6207
642a7022K740J5804K6516N090l321n40k6464l9401r431J0003R303L2570L8627
655D4474M01j7571p996k4771l1447Q99J0907L8K2148L5454K853q991J033k1821
669E610l4442k589M977p394K0579L9375Q967j708N426k5819m3381j0522N561J614
683c3746K8496L5558P81n333O723k0709l3592l458j137j1753K0362L5999Q219
696B6410M160J0702k2562l7024p872m289j1239K0774L5392J1692P754Q960k4286
709A8572l4185q067o640r332K1400L0435N611Q436J3769j6057k8149j1090j4459
722b9756j4601J7784K9775J3326J4568J2671j8063k7397j2421j4969j2974J6019
$$ plain form
629 -20797 -47231 -40913 -25217 -12104 18442 46089 40663 22888 10306 -16362 -41403 -33229 -17022
642 -17022 -14282 1522 28038 33128 29807 29267 2803 -36598 -46029 -36026 -26723 5847 44474
655 44474 44875 27304 19308 -5463 -36910 -36011 -25104 -25066 -2918 32536 35389 26398 27431 5610
669 5610 -28832 -31421 -26444 -33838 -13259 26116 35083 33375 38801 12982 -30399 -40921 -35360 -33746
683 -33746 -5250 30308 31089 25756 32479 11770 -21822 -25280 -26417 -38170 -17808 18191 26410
696 26410 30570 41272 18710 -18314 -26186 -30475 -41714 -20940 14452 26144 33898 42858 18572
709 18572 -15613 -23680 -30320 -39652 -18252 12183 17794 26230 39999 23942 -4207 -15297 -29756
722 -29756 -44357 -26573 3202 16528 31096 43767 25704 -1693 -14114 -29083 -42057 -26038
734b6038K5222J2952J6505J2839j4938k3687j2088j7589j3054J2340K0630J3239
746F333J8966J5086r854j9637j6153k0585j4933R909J9823J5694J9624J4340p920
759C0693j7736j5678k0050j3751N212J4574J6892K2169J4039m678j3270j5965
771B451k2003j5586J892J2657J6690K1415J6142J65j1525j7094k1718j6361q77
784c3752J0298J6749K1015J5831L471p970j6385k1773j7184l716O556J5397K1263
797I800J7964O041o411j5399j9833j7817q095M699J4981K0350J8079Q307k898
810B9768j3562k0501j8695r591J903J2766J9628J9124J0956m48j2226j9262j9132
823a9272j1832n49J1164J8141J9832J2769J635r663j8040j9423j3848k826P967
$$ plain form
734 -26038 -816 12136 28641 41480 26542 2855 -9233 -26822 -39876 -27536 -6906 6333
746 6333 25299 40385 30531 10894 -5259 -25844 -40777 -30868 -11045 4649 24273 38613 30693
759 30693 12957 -2721 -22771 -36522 -31310 -16736 156 22325 36364 31686 18416 2451
771 2451 -19552 -35138 -33246 -20589 -3899 17516 33658 33823 22298 5204 -16514 -32875 -33752
784 -33752 -23454 -6705 14310 30141 33612 25642 9257 -12516 -29700 -33416 -26860 -11463 9800
797 9800 27764 33805 27394 11995 -7838 -25655 -33750 -29051 -14070 6280 24359 32666 29768
810 29768 16206 -4295 -22990 -32581 -30678 -17912 1716 20840 31796 31348 19122 -140 -19272
823 -19272 -31104 -31653 -20489 -2348 17484 30253 31888 22225 4185 -15238 -29086 -31912 -23945
836b3945J7863K0174J4015L699o886j6345k0114j5483m850O358J5907J9374J5749
849B5516O589n480j5414j9104j5983p231L151J4202K0010J6709P939k211j3040
862A5653j9966j6866r092J198J2461J9258J7481R568K9j1455j8906j7661j0378
875b8676j550J0208J9346J7105J0577L667q843j8721j7417j1947n245P944J9188
888d364J7645J1815O295o380j8804j8379j1985p099N923J8337J6241J1928R943
901C1116l532j8739j6532j2007j0622K097J7012J6412J2852J3164j834j8258j4345
914c216j2600j6200k89J9608J6834J2271J4380j379j7382j3187j1209j7093p70
927c0232J7338J0691J0761J9475M132j5496j1686j3960k1640j424J7154P550J2394
$$ plain form
836 -23945 -6082 14092 28107 31806 24920 8575 -11539 -27022 -31872 -25514 -9607 9767 25516
849 25516 32105 26625 11211 -7893 -23876 -31107 -27956 -13754 6256 22965 30904 28693 15653
862 15653 -4313 -21179 -30271 -29073 -16612 2646 20127 29695 29724 18269 -637 -18298 -28676
875 -28676 -30226 -20018 -672 16433 27010 30677 21834 3113 -14304 -26251 -31496 -23552 -4364
888 -4364 13281 25096 31391 25011 6207 -12172 -24157 -31256 -25333 -6996 9245 21173 31116
901 31116 27584 8845 -7687 -19694 -30316 -28219 -11207 5205 18057 31221 29387 11129 -3216
914 -3216 -15816 -32016 -32305 -12697 4137 16408 30788 29409 12027 -1160 -12369 -29462 -30232
927 -30232 -12894 -2203 8558 28033 32165 16669 4983 -8977 -30617 -32041 -14887 -7337 5057
940E057K5666M865j9568j0939j1318k2382m307J6381Q903J3148K2609l0j5241
953A2844j251q534k7297p015J2240K816J3025K9846N766j3123j896j4305l2423
966b9307m648J7661K567R448K7312P246j0808j745j5209k7524R6J0902o633J0456
980a0186L1180M500r913P921q462l2090r912L025n150J7161L6838O072j1365K215
994B1834j2778k8836m066O572m955J2172K5070J653o84J4455j2754l3167m973
1007b0457N484j1810O381K7958J1041L994J0585j3225l1257r969k598q481J6748
1020a5606L1752N616m139M994j0666j9263j80m317j7688O343K5387Q076N559J6558
1034C2426n365k6644j5443o991q219R255K1163R750J0743J3154j1039k6076j1699
$$ plain form
940 5057 30723 35588 16020 5081 -6237 -28619 -32926 -16545 -7642 5506 28115 28085 12844
953 12844 11593 3059 -24238 -31253 -19013 -16197 -3172 26674 32440 19317 17421 3116 -29307
966 -29307 -33955 -16294 -13727 -4279 23033 30279 19471 17726 2517 -25007 -24911 -14009 -20642 -10186
980 -10186 20994 25494 15581 23502 15040 -17050 -26962 -23937 -29087 -11926 24912 30984 19619 21834
994 21834 9056 -19780 -23846 -17274 -22229 -10057 15013 16666 15982 30437 17683 -15484 -20457
1007 -20457 -14973 -26783 -20402 7556 18597 22591 33176 19951 -11306 -21275 -23873 -32354 -15606
1020 -15606 16146 21762 17623 22617 11951 -7312 -7492 -11809 -29497 -23154 2233 10309 15868 32426
1034 32426 27061 417 -15026 -22017 -30236 -20981 182 9932 20675 33829 22790 -3286 -14985
1047a4985l588p061P758J9462O466K581J0608q2j2486p747r129k0008n963J9434
1061a4740K1770J3523J0284l347j9646j6548r247q456K460J7677J1921M925J1746
1074B2322M475j6897j5325m291q999n356J1714J0586M063J5655J3949j0260j7957
1087C679j0891j8488j1834J7979K3845R802J0282L952j8926j4385J147r948j3003
1100b6789J1427J2727L74J5234J8129j0838j5990k767j5858j7286J1183J4125
1112f329J856J9210K1344j2217j8159n206j9237j6872J7856J8534n39J2213J3465
1125B5919j3567p868P226j6577k3035P531P759j243K3282K4432j1327j1755o51
1138A0126k1642k0304J3007R182k575K2041K1505j2247r184J128k1557j7222J3571
$$ plain form
1047 -14985 -18573 -25634 -17876 1586 8052 10633 21241 21159 8673 926 -8203 -28211 -34174 -14740
1061 -14740 7030 20553 30837 27490 7844 -8704 -17951 -26407 -23947 -6270 5651 10576 22322
1074 22322 26797 9900 -5425 -9716 -18715 -24071 -12357 -1771 2292 17947 31896 21636 3679
1087 3679 -7212 -25700 -37534 -19555 4290 14092 24374 28326 9400 -4985 -3838 -13786 -26789
1100 -26789 -15362 -2635 -2261 12973 31102 20264 4274 1507 -14351 -31637 -20454 -6329
1112 -6329 -4473 14737 36081 23864 5705 499 -18738 -35610 -17754 780 241 12454 25919
1125 25919 12352 4484 11710 -4867 -27902 -20371 -12612 -13855 9427 33859 22532 10777 10126
1138 10126 -11516 -31820 -18813 -9631 -12206 9835 31340 19093 9909 11037 -10520 -27742 -14171
1151a4171N881o235J9246J8274r180Q92P329k3361k4474M938J450k87K7257K1087
1165B8646r858l708J542k2991j7000R173m26m544K1485J8135n662J986L356k2087
1179a953j6419N432m494n341K1014J7417j038O829L508k3386j9304O35m882M47
1193b1535K3299J4713l359M866K220j8172j2744J15r052m000J8203J4577K862
1206A1993R704J968j8158j3504l360j0301k602J7163J3450N282J0500J580j6633
1219G082j3494n661q849p06J4464J0641N025J0505L182j1763j0240q392j2048
1232b0254l374J1397J1302R377J2369K110j1348j0828q495j1088l462Q694J0729
1245b871J0191J0910L310p260r892j0374j1673l636O625Q682J0128J1633N391
$$ plain form
1151 -14171 -8290 -14525 4721 22995 13815 14707 22036 -1325 -25799 -20861 -19411 -19698 7559 28646
1165 28646 18788 15080 16622 -6369 -23369 -14196 -14622 -19166 2319 20454 14792 16778 20134 -1953
1179 -1953 -18372 -12940 -17434 -22775 -1761 15656 14618 21447 24955 1569 -17735 -17100 -21982 -21535
1193 -21535 1764 16477 13118 17984 20204 2032 -10712 -10597 -19649 -23649 -5446 9131 11993
1206 11993 21697 23665 5507 -7997 -11357 -21658 -24260 -7097 6353 11635 22135 23715 7082
1219 7082 -6412 -12073 -20922 -21628 -7164 3477 8502 19007 22189 10426 186 -8206 -20254
1232 -20254 -23628 -12231 -929 8448 20817 22927 11579 751 -7744 -18832 -22294 -13600 -2871
1245 -2871 7320 18230 21540 14280 4388 -5986 -17659 -21295 -14670 -5988 4140 15773 21164
1258B1164m378q943j1758j2203n247M569Q904J1151J1852N735l330q523j1407
1271b414j0680o329R02P801J1320J2436O381j218o878j0669j1686p708j0O427
1285a2325J0736J1677P877J456n928j1115j1680q476j365N441R569J2063Q956
1298A6886K763m911r586j1725r113l116L382R142J2021J0066L448l557q737j0963
1312d000j0586m908K832Q694J1304R952N562j839p510j1637j0720n493J410O797
1326a0142J0892J1152O453o82o784j0601j1005o715o69N922J0599J1707P266M27
1340A7820m990j0087j1431p623j687M751R931J1400P381K235l668r283j1912q097
1354a5260k564L325Q850J1208Q662L721k703q636j1264q891l854J493P873J1480
$$ plain form
1258 21164 16786 7843 -3915 -16118 -21365 -16796 -7892 3259 15111 20846 17516 8993 -2414
1271 -2414 -13094 -19423 -18521 -10720 600 13036 19417 18199 11321 652 -11034 -18742 -18752 -12325
1285 -12325 -1589 10088 17965 19421 13493 2378 -9302 -17778 -19143 -13702 -4133 7930 16886
1298 16886 19649 14738 5152 -6573 -15686 -18802 -15420 -6278 5743 15809 19257 15700 6963 -4000
1312 -4000 -14586 -19494 -16662 -7968 3336 13288 18850 17011 9501 -2136 -12856 -18349 -16939 -10142
1326 -10142 750 11902 18355 17673 10889 288 -10717 -17432 -18101 -12179 -1580 10127 17393 17820
1340 17820 12830 2743 -8688 -16311 -17998 -13247 -3316 8084 15465 17700 14032 4749 -7163 -15260
1354 -15260 -17824 -14499 -5649 5559 14221 17942 15239 6603 -4661 -13552 -17406 -15913 -8040 3440
1368C440R313M428r80p299j1517r397n022L02P251J1342Q902N328J727o873j2542
1383a597q243n504j968N471J1263R433O342K298n911j0012q078p778m631N448
1397a3467J1597Q932O917M596n200j0740p585q428o282O239J1142O562O030P492
1411A7805k098j0528r416p546n014L304P224O367J0702R457m601j0573n761q412
1425i090r775K067R446P476J0479Q786m796r664l139p242j1877M11Q877P241P957
1440G157P756k71l124m696j4667j2334M847Q116J118R141J4005J421p419o278
1454D772j0433j0834J733N669K162J0131J2618Kp021l774o467q502l590j848K685
1469a2697J5592J4039k566l562J306j0353j7305l089O765M944P989R676K501j39
$$ plain form
1368 3440 12753 17181 16201 8902 -2615 -12012 -17034 -16732 -9481 1861 10763 16091 17818 10945 -1597
1383 -1597 -9840 -15344 -17312 -11841 -578 8855 15197 17495 11584 1572 -6506 -14284 -18915 -13467
1397 -13467 -1870 7062 13979 18575 13375 2635 -4950 -13378 -19660 -13421 -2279 4283 10313 17805
1411 17805 15707 5179 -4237 -11783 -16797 -13493 -6269 98 10800 20257 15656 5083 -678 -9090
1425 -9090 -18865 -16798 -7352 124 10603 19389 14593 4929 1790 -5452 -17329 -16918 -8041 -800 7157
1440 7157 14913 14642 11518 6822 -7845 -20179 -15332 -7216 -6098 3043 17048 18469 11050 4772
1454 4772 -5661 -16495 -14762 -9093 -6931 3200 15818 15820 8799 5025 -1442 -9944 -13534 -15382 -12697
1469 -12697 2895 16934 14368 10806 12112 1759 -15546 -18635 -11870 -6926 1063 10739 13240 13101
1483A3101j200j1519j3274j511L996J458N465R614N812L334q74j1155j2052k640
1497a1445k334l560R840J9386P319n987n192m819r084o508j055J843P400J0229
1511F033M306N00K263l339j2836r481j171P86M928J0489O279L417N340l842j8526
1526d854j1555L229J326K061J3093J0593j300k536l239q695m467J82o979k896
1540a6037J3502J1555J177M565N08j4061j0759o69n113l23J6243R886j910N068
1554A3632L521j5398j3262J385k328j37J2734O513l747P384O255j1847q110J067
1568b338j1265q465J5063J3053J307R971K721j8417r942L852q514n087J5294Q025
1582E258l148J0048O335j5044o972K587j0525o144J3789M737l651J4154R198j2393
$$ plain form
1483 13101 11901 382 -12892 -14403 -10407 -8949 -3484 6130 11942 15276 14402 3247 -8805 -11445
1497 -11445 -13779 -17339 -7499 11887 19206 13219 8027 3208 -5876 -12384 -13439 -11596 -4196 6033
1511 6033 10339 10839 13102 9763 -3073 -12554 -13725 -12939 -8011 2478 8757 12174 17514 13672 -4854
1526 -4854 -16409 -13180 -11854 -9793 3300 13893 12593 10057 6818 -1877 -6344 -6162 -13141 -16037
1540 -16037 -2535 9020 10197 14762 15270 1209 -9550 -10219 -15332 -15655 588 10474 8564 13632
1554 13632 17153 1755 -11507 -10122 -12450 -12587 147 6660 2913 10297 16552 4705 -3405 -2338
1568 -2338 -13603 -22068 -7005 6048 7355 17326 20047 1630 -8312 -4460 -12974 -18061 -2767 5258
1582 5258 2110 12158 18493 3449 -3523 -936 -11461 -17605 -3816 921 -2730 11424 20622 8229
1596H229o298j073j7274p235J6876Q925n1J3298L530j7265l587M463j2821o046
1610a6329J2017J353k540J6256Q446j2432k482l10j6023o341J1919P12l50J8311
1624A2207P671j1659k319k037j8056n044J3507K708j63J4182K719j0468K610K307
1638H165j4971p175N772k898K655J8717O446p683P81l020j6889m853P620k281
1652i614K444J5920M904n680K042l331j5623l588O280k985J974J2623L759k351
1666F774N897j508j4596o992m2m301N193J5289N932k031J775m259j2156l769J062
1681g732l702K519J1282N055J233L800l178j0812n313j566l668J951R497N752
1695E118L731M591k148r852p890m088k972L946R999N567K473L137k269p459n646
$$ plain form
1596 8229 1931 858 -16416 -23651 -6775 2150 2099 15397 18927 1662 -1925 2538 -10283 -16329
1610 -16329 -4312 -2959 -5499 10757 19203 6771 4289 3979 -12044 -18385 -6466 -5754 -6104 12207
1624 12207 19878 8219 5900 3863 -14193 -19237 -5730 -3022 -3185 10997 13716 3248 5858 8165
1638 8165 -6806 -13981 -8209 -11107 -8452 10265 16711 9028 9809 6789 -10100 -14953 -7333 -9614
1652 -9614 -7170 8750 13654 7974 10016 6685 -8938 -12526 -6246 -9231 -7257 5366 9125 6774
1666 6774 12671 11163 -3433 -10425 -10467 -14768 -9575 5714 11646 9615 11390 7131 -5025 -8794 -7732
1681 -7732 -11434 -8915 2367 7422 8655 12455 9277 -1535 -6848 -8414 -12082 -10131 -634 5118
1695 5118 8849 13440 11292 1440 -6450 -10538 -13510 -9564 435 6002 8475 11612 9343 1884 -3762
1710c762l295m325K6O986O925N523M505j462o691p220m772l883K04O032P118O125
1726H034M042o51n865p100n764m085M50N176O783M783L673J540k826p277o495
1741e582m587j296L396O933O743M645J812l933p198n841m735j841K422O964N932
1756C834N295K671k629o733n695m560l875K045O200O081M839L595j102n230o674
1771a938n912m301K178N914N576N165M600p45n597n264n749m373J2M298N826O028
1787E718N124k09m785n377n487n300m30L529N663O160N479N56l298m930o415n821
1803i823j298L604M774O017N359J892k396m674o616n767j479J614M683O047O273
1818H210K655k038m130o445n795k687P95L826O533O319K668p59l645n915o128
$$ plain form
1710 -3762 -7057 -11382 -11356 -4370 2555 8078 12583 11121 4430 -2790 -7562 -11445 -11241 -5209 1909 8034
1726 8034 12076 11425 5560 -1540 -7304 -11389 -10939 -5763 1020 5803 9476 11016 8190 913 -5582
1741 -5582 -10169 -11465 -8069 -1136 5607 10252 12064 8131 933 -4908 -9643 -11484 -9062 -2098 3834
1756 3834 9129 11800 9171 2438 -3257 -7817 -11692 -9647 -3447 2634 7473 11068 9966 4736 -1938
1771 -1938 -7850 -12151 -9973 -4059 1517 6682 11282 10537 4940 -324 -6073 -10446 -10434 -6136 -310 5718
1787 5718 10842 10633 5848 471 -5016 -10316 -10746 -7217 -1554 4606 10085 10641 7343 2413 -4002 -9823
1803 -9823 -11121 -7517 -2743 3274 8633 10525 8129 3455 -3161 -8928 -10407 -8793 -4110 1937 8210
1818 8210 10865 8827 4697 -1748 -7543 -10230 -9435 -5609 924 7243 9911 9152 5507 -408 -6536
1833f536l254k33L692O213O145L026Q21l042n987o033m059q57K729N708O441M060
1849H834J116k210n685o560m018j303K156M914O416M593J911j602n217o389n000
1864h044j838J449M214O370N205K772j081n190n756m319l266o61M972P334M682
1879F843K151K01l325o207n446l943p34M937N653N146L442J137l297n679n560
1894d681m630p59M106M950L757N519L069l749o866m672k939k877J553N035O582
1909C398N070J954l175m845m434m950l211J873N184N081N267K697k852l544l200
1924C13o159n565K469O024L877L363M674J262l970o792n933k980J553K755L530
1939a579O603N308j211m672m129m364m415L0K377L045O054O556j77m040l302l662
$$ plain form
1833 -6536 -9790 -10023 -6331 -118 6027 9053 9874 6832 845 -5188 -9247 -10104 -7375 -1667 4774 8834
1849 8834 9950 7740 2055 -4505 -8523 -9826 -7670 -2756 3660 8253 10164 8562 3345 -3044 -8044
1864 -8044 -9882 -8433 -4219 2151 7356 10128 9047 3857 -1899 -6218 -9484 -10145 -5173 2161 6843
1879 6843 8994 9195 5870 -337 -5783 -9726 -10460 -5523 130 5276 8718 9855 6558 879 -4681
1894 -4681 -9311 -10070 -5964 -1014 2743 8262 11331 7582 716 -3956 -6895 -9772 -8219 -3184 3398
1909 3398 8468 10422 7247 2402 -2032 -6982 -10193 -8320 -3136 1945 7212 9909 7057 3513 313
1924 313 -5846 -11411 -8942 -2918 959 4322 8996 10258 6288 -504 -6437 -9417 -7864 -5109 -1579
1939 -1579 5024 10332 9121 4449 320 -4044 -8459 -8429 -6052 -3007 3047 9603 9426 5386 2084 -1578
1955a578o216l335L382O048N148M178Q21j279k978o369p331j77M559K475L431
1970G79O185K036k546k257l703o782l099K565J332L265Q505N244l126m121m357
1985h0o058k600J712J231M481Q643J974l700k97k118q422m269K900J185J874P632
2001D088L469j783J628j333j0132n753K123L19K754R941M649k697j14l502r537
2016e880j795M067k720o78R666M635k446K715m05r970l983K098l577M13J0511
2031B651M032j702M365p89j1151m857J349l687K609J1898K279l985M005J11r554
2046b426j549K455o885j399J0239K968K34P496o46j1740l365Q55o441O88J0869
2061A353K242n84P528q75j1342j909P52o949J467J0075K74j848P899K18p568J70
$$ plain form
1955 -1578 -7794 -11129 -7747 -1699 3449 7627 8448 7169 4191 -2178 -9509 -9686 -5127 -2652 779
1970 779 6964 9000 6454 4197 494 -6288 -9387 -6822 -5490 -2225 6280 11524 8398 4277 -80
1985 -80 -6138 -8738 -7026 -5795 -1314 7329 9303 5603 5306 3188 -5234 -9503 -6603 -5418 -3544 4088
2001 4088 7557 5774 7402 6069 -4063 -9816 -7693 -7374 -4620 5321 9970 7273 7159 3657 -5880
2016 -5880 -7675 -3608 -6328 -7006 2660 7295 4849 7564 7159 -2811 -6794 -4696 -8273 -7860 2651
2031 2651 6683 4981 9346 8557 -2594 -7451 -6102 -9789 -7180 4718 6997 3012 7017 7128 -2426
2046 -2426 -3975 -1520 -8405 -9804 435 3403 3637 11133 10487 -1253 -4618 -3763 -10204 -9516 1353
2061 1353 3595 3011 10539 9664 -1678 -3587 -2835 -9784 -8317 1758 2032 184 8083 8301 733 903
2077I03j054j0627j078R436K700K822R051k107j0169j082o16p913J342P942p27
2092a177J773Q886n31p468k77k099q278J141O636j550J795R348J115n066J77m430
2108ej0600k33P210J564M186P934k362o096P33k177o954N01K963j549L454Q763
2124G332P09k990q1m186p810n83K426j57L591Q260J781k196p75m693p956j119
2140h447L369J303M285M640N12j719J318k563n800k821k18j131M034P465L140
2155G367n3r80m306o269k472Q20M80K597N479L785N82j054l486n426k697k04L98
2172e439K363M328K935J203Q87j013m805n660k210K03K585N808M908Q56j188j653
2188D108m309m706j139N35M58L915N042K156L27q24m718n090p52n62p88M000N836
$$ plain form
2077 903 -151 -10778 -11856 -2420 280 3102 12153 10046 -123 -1205 -1821 -9734 -8392 -450 -1177
2092 -1177 596 9482 8951 1483 1206 -893 -9171 -8030 -1394 -2944 -1149 8199 9314 4248 4425 -5
2108 -5 -10605 -10838 -3628 -2064 2122 10056 7694 1598 2331 154 -6800 -6299 -3336 -4885 -1431 7332
2124 7332 8041 5051 4970 784 -7026 -7609 -5183 -5340 -1749 6511 8292 6096 5321 628 -7328 -8447
2140 -8447 -5078 -3775 510 5150 5662 3943 5261 2698 -3102 -5923 -6141 -7272 -3238 4227 7367
2155 7367 7314 6334 2028 -4241 -6713 -5893 -5413 -2816 2663 6448 7030 5976 2490 -2936 -5633 -5837 -5439
2172 -5439 -3076 1252 4187 5390 6277 5264 459 -5201 -7411 -7208 -4623 1185 6093 6949 5761 4108
2188 4108 -201 -4907 -6046 -5511 -5053 -1138 3904 6060 6387 5563 845 -4245 -4997 -5559 -6347 -2347 3489
2205C489K152N84O09m218o441k279n48M08M479N703J237k04J007l160m834j936
2221c952j898j393M044N479J682J848J658l893n959j523j499j897L371N112K524
2236C704K236J587l503n127k347j953j696L089M883J566K679K073k956l882k420
2251b067l105k872K873M633K735K792K465k590m128k435l277k341K460L185K515
2266H43L601K910k019l711k301l858k559J938K596K851M017K614j549k703k603
2281F7m055l095J084K814K959L978K996j143j823k804m315k956N44J961K808L849
2297B869K973J92j462l199m360k814j00J570K591L960L350P51j554k919l843k995
2313d990q70J052K591L829L200J111o78k560l941l476j386O24K475L733L485J569
$$ plain form
2205 3489 5641 6225 6834 2616 -3825 -6104 -6652 -6244 -1765 3938 5175 4971 5978 2818 -2016 -3952
2221 -3952 -5850 -7243 -3199 2280 3962 5810 7468 3575 -2384 -3907 -5406 -7303 -3932 1180 3704
2236 3704 5940 7527 4024 -1103 -3450 -5403 -7099 -4010 873 2439 5118 7191 4235 353 -2067
2251 -2067 -5172 -8044 -5171 -538 2197 4989 7454 4864 736 -1699 -4976 -7317 -4857 -1672 843
2266 843 4444 7354 5335 1624 -677 -4535 -7094 -5156 -2560 291 4308 6922 5373 2670 67
2281 67 -3988 -7083 -5999 -3185 -226 3752 6748 5605 3782 978 -3337 -6293 -5749 -3788 -980 2869
2297 2869 5842 6034 4572 1373 -2987 -5801 -5901 -4331 -1740 2220 5570 6321 4767 1848 -1995 -4990
2313 -4990 -5860 -4808 -2217 1612 4812 5923 5245 2685 -1256 -4732 -6118 -5494 -3019 714 4199 5768
2329E768k87k108l559l807j887K59K198L739L100K103K86j931l527l573k177l68
2345e771J721L370L555K337O02j455l424l560k164q55R55L047M079K875N23j469
2361D366k622l347k680j750Q24L357L370K694J253j50k727l985l107j049N44K468
2377b541L306K955J602M34k376l681l724j485J21K105K933L319K664K52k810l244
2393a70k740j921j339K275M071K624J923R02j449l218l445k137j059J433L315
2408i35K804K371J213j252k526k970l236j557J553L220K481K543K132m58l865
2423A518k687k212k383P85K999K536K682K352l34k716k780k592k876N78K455K158
2439e17L082L165l49k601k209k829l411n51L378K745K199L286K5k544k280k151
$$ plain form
2329 5768 5481 3373 -186 -3993 -5880 -5621 -3423 316 3416 5519 5805 3874 347 -3226 -5403 -5771
2345 -5771 -4050 -680 2875 5212 5814 4359 935 -2625 -4789 -5644 -4689 -1642 2437 5312 5835 4366
2361 4366 1744 -1603 -4283 -6033 -5209 -1852 1518 4212 5465 5315 2588 -1397 -4504 -5553 -5009 -2541
2377 -2541 765 3720 5322 5756 3380 -301 -4025 -5510 -5389 -3284 -351 2968 5632 5884 3074 -170
2393 -170 -2910 -4831 -6170 -3895 176 2800 4723 5625 4176 958 -2487 -4624 -5683 -4250 -935
2408 -935 1869 4240 5453 4201 1675 -1295 -4531 -6088 -4535 -1315 1166 3709 5841 5383 1518
2423 1518 -1169 -3381 -5764 -4979 -1980 556 3238 5590 5256 2540 -240 -2832 -5708 -5130 -2675 -517
2439 -517 2565 5730 5381 2780 571 -2258 -5669 -6220 -2842 -97 2102 5388 5413 2869 589 -1562
2455a562l207p60K380J568K362M418K46k004j161k820m824l51K467O96K919M923
2471E290Q45k947q53k050n295o26K723L95K539M225M17j841O26k111n052j247
2487d962J302o30K551O296J302k086M83l133n789n81K273q55K353N666J79j266
2503C103J374k504n819m23J119j254J743N631O22m80K412k254o194j147J63k400
2519f308L284O751P34r74J586l115n356L88M30k549J850N352J97O36L057k450
2535C513n695k36o73k861K163N369L97J004M100k933n365j311j366k625L452N421
2551B354n3M95K379k363l483Q6j059m050J389L973M10K981L722k436m376j029
2567a060k205k994K334L670Q09K376L266k069l843o57k506k605K044L466J21J446
$$ plain form
2455 -1562 -4769 -5529 -3149 -1581 781 5199 5445 3441 2280 -540 -5364 -5715 -3248 -2552 367 5290
2471 5290 6135 3188 2335 285 -5010 -5636 -2913 -2518 21 4246 4663 2822 3448 1337 -3715 -4962
2487 -4962 -3660 -4290 -1739 4557 5859 3773 4256 1123 -4666 -5247 -2974 -3829 -1476 4190 4369 3103
2503 3103 4477 1973 -3846 -4269 -3150 -4404 -2661 2970 3592 3112 5524 3270 -2924 -4071 -3908 -6308
2519 -6308 -3024 3727 4461 3487 5073 1958 -3398 -3010 -2580 -5129 -3279 2073 2270 2906 5963 3513
2535 3513 -2182 -2418 -3091 -5952 -3789 1580 1977 2981 7081 4148 -1217 -2528 -3894 -6519 -3067 2354
2551 2354 2301 2796 5175 2812 -671 -585 -1644 -5694 -4305 -332 78 3059 6781 4345 -31 -1060
2567 -1060 -3265 -6259 -3925 -255 554 2930 6196 4127 284 -373 -2879 -5484 -3440 26 147 1593
2583A593K549l23j648m69k890m485L05K647K171L429L257j418l199j893j943k113
2599d430N68J729J133K290K886L80k053j598k474k401n64K076J127J768L038J064
2615D539p16j301l129m184j133K031L309K228K628M41k197j508j431j973j889
2630d285Q83J069J385L607K562j144k251j715k944k116J278J613J050L283L322
2645E597j471j885j230l727k960K181K325L54K720K177j538n73L69k864l681K22
2661c984Q39K16M336L900j100j678l44m047k899J603Q91n79L722L964j243q60
2677B737J71l821l416J412L02m49L300K972n65P15P54l891m092L93m05k60M570
2694D27L779j272J16L54l909k347O61j304l18L097L509k1Q32N74l997k771M80
$$ plain form
2583 1593 4142 3819 2171 1702 -1188 -5673 -5368 -2721 -550 2879 6136 4718 1519 -374 -2317 -4430
2599 -4430 -3862 -2133 -1000 1290 4176 4556 2503 905 -1569 -3970 -4534 -2458 -1331 437 3475 4539
2615 4539 3823 2522 -607 -4791 -5924 -3893 -584 1644 4272 4713 2516 1008 -423 -2396 -4285
2630 -4285 -3402 -2333 -948 2659 5221 4077 1826 111 -2833 -4949 -3671 -2058 -1008 2275 5597
2645 5597 4126 2241 1011 -2716 -5676 -3495 -1170 -816 1904 4081 2543 1970 2339 -525 -4206 -3984
2661 -3984 -3145 -2929 1407 5307 4207 2529 2185 -1862 -4761 -3158 -2267 -2846 876 4840 3597 2737
2677 2737 2908 -913 -4329 -2917 -2615 -3064 236 3208 2643 3358 4112 221 -3871 -3478 -3883 -4143 427
2694 427 4206 2934 3050 3404 -505 -2852 -2191 -3495 -3813 -716 2793 2772 3604 4178 181 -2590 -2110
2711b110j518p83L990K593M1J809O65l948k942l40j455j71L912K002LJ724N51
2728D023l104j839m13k329q95L161K202Q91K312M19l019j865j131k417l22K514
2744a812K003J254K332P09k637j868j333k605N6K095J753R84K404Q33j830j492
2760H46k088k196o53J670J232K123K465Q24j647j838j244k586m82P55J530K033
2776G44K170Q07j206j239j690k321j016O00J226J890K446R29L01j631j882k742
2792b614j137N60J199J723K020J697J51j233k002k275j428j05Q32J914K283J546
2808C131K13p71j877k125j531o63P89J904K158J491O45o38j347k177k241m02P24
2825b717J634J797K007Q24m95j326k411j804o37LJ236J956K338J045l10j173j888
$$ plain form
2711 -2110 -3628 -4411 -421 2172 2213 4022 4687 739 -2203 -2543 -3998 -4169 -257 1745 1748 3472 4023
2728 4023 919 -920 -1333 -3662 -4557 -1396 806 1697 4009 4428 1409 -456 -1587 -4004 -4326 -1812
2744 -1812 191 1445 3777 4486 1849 -19 -1352 -3957 -3901 -1806 -53 931 3335 4168 2338 846
2760 846 -1242 -3438 -4091 -2421 -1189 934 3399 4223 2576 738 -506 -3092 -3574 -2819 -1289 744
2776 744 2914 3721 2515 1276 -414 -2735 -3751 -3151 -1925 -35 2411 3340 3641 2010 128 -2614
2792 -2614 -3751 -3191 -1992 -269 1751 3448 3599 2366 364 -1911 -3339 -3444 -2612 -698 1585 3131
2808 3131 3344 2573 696 -1429 -2960 -3623 -2834 -930 1228 2719 3364 2726 1379 -798 -3039 -3441 -2717
2825 -2717 -1083 714 2721 3545 3050 1724 -687 -2491 -3128 -3125 -1889 67 2405 3450 3140 1967 79
2842G9k302j193n6J325K271J956J180P0j056j960k239j292k24J081J837K107J271
2859B855M13n44k183k045j708o7N16J504K321J813O84q12j702j883j466r87K06
2876c085J754K387J471Q03n07j494j986j541j059J77J599K239J114R38N71j383
2892A998k234j634j198j5J256J847J571J255N71j371j989j357j433p20J386J679
2908c88J700J146O32o38j858j685j455j045R68K297J084J455J474r48j709j827
2924g97j369j293R39J586J498J629J181o42j628j393j712j414P11J452J273J661
2940A682J675q44j501r02j190k211N28J260J049J686K082o31j149m57k475k031
2956c429L64J816M41K047K072n50j200n30j902k189O26R13j49K131K454j18n83
$$ plain form
2842 79 -2223 -3416 -3472 -2147 124 2080 3260 3330 2274 314 -1925 -3217 -3441 -2360 -523 1584 2855
2859 2855 3268 2724 541 -1504 -3212 -3279 -2763 -1259 1062 2875 3559 2747 1045 -838 -2304 -3291 -3085
2876 -3085 -1331 1056 2527 3330 2823 1329 -657 -2198 -3257 -3080 -1481 758 1872 2810 3381 1998
2892 1998 -236 -1870 -3068 -3083 -1827 20 1591 2846 3417 2046 57 -1300 -2733 -3453 -2067 -388
2908 -388 1312 2458 3090 2452 594 -1091 -2546 -3591 -2623 -326 758 2213 3687 2739 1030 -797
2924 -797 -2166 -3459 -2520 -934 564 2193 3374 2732 1104 -289 -2001 -3415 -2704 -1252 21 1682
2940 1682 3357 2513 1012 110 -1080 -3291 -2763 -1503 -454 1232 3314 2683 1534 1077 -1398 -3429
2956 -3429 -3065 -1249 -808 1239 3311 2761 1561 1031 -871 -3060 -2434 -1521 -1670 461 2915 2797 2214
2973B214n40k070k804L85O67N96J927K817l90o66k70k230k403J27N95J26K232
2990C13K100k32l87N33j910k714J00m79j30K414L003J59j75m3k439k392k69K00
3008b348l80K236K275J00L79L76k167k134j44l50l67J792J870O97K93Q00j784
3025A144k240o15j347m51K562K388P06O01j82j717k244j25p20n47J209J723J321
3042A466P39R22j244k193j180o89r35R00K306J130J226N46p00k427j186j446m77
3059c242J386K387P75L05N37k79j746r79m51j152n33K137J436J443J379n86j897
3076I20k032n02j185J29K274J088O16J576l50j792j554n31j116l05K243J250k40
3093D89J437P52j430r45p20k402r93K571J764L78J958P14k861j425K49j780r69
$$ plain form
2973 2214 1674 -396 -3200 -2815 -2148 -1552 375 3192 2802 2136 1866 -364 -2767 -2640 -2045 -1919 313
2990 313 2413 2181 1794 2327 417 -2297 -2197 -2676 -2806 -392 2611 2770 2595 2552 113 -2279 -2548 -2348
3008 -2348 -2728 -492 1783 1883 2262 2638 471 -1663 -1807 -2157 -2524 -732 1138 1835 2128 2928 1144
3025 1144 -1096 -1711 -3058 -3509 -947 1441 2147 2748 2566 849 -1395 -1520 -2240 -2787 -1578 145 1466
3042 1466 2205 3127 1883 -310 -1490 -2179 -3114 -2214 92 1222 2448 2994 2294 -133 -1319 -2765 -3242
3059 -3242 -1856 531 1306 1611 2148 1869 123 -856 -1307 -2459 -2992 -855 581 2024 3403 2817 920
3076 920 -1112 -1614 -2799 -2670 -396 692 1308 2884 2534 742 -812 -1343 -2459 -2764 -521 729 489
3093 489 1926 2678 1248 303 -417 -2819 -3812 -1241 523 901 2859 3573 712 -713 -464 -2244 -3213
3110c213K327N34P5K638J600k793j137j42k036r98K198O02o9K602R44j595n21
3127A016l17l472j079K420P94L59K772P24k618O3L26k780j239J892k84K6L180
3144A783J354j741k18l12k950p46J887o97J17L464Q77j552L18j23l425r56J664
3161a256k70L46L135L00j399R26J3l007p26M73j001M53L722Q59q33M41o07l136
3179a567m26Q68r48K00K990P69n32R35p22k684n47M88p62J83K460N27k13J427
3197B446k99k577q43m82j278J096K672Q43k04J059o60j419j220l87j044L59J915
3214b3Q81O79J106p40j777r15m99r90L26J553P92J136J019l88j576q84j196q47
3232b343O30J184P87O71J067k65r67p62j201r89l8R57J178J088J351k92j316m74
$$ plain form
3110 -3213 -886 -352 -277 2361 3961 1168 31 -111 -2147 -3145 -947 -345 -414 2188 3132 1537 1016
3127 1016 699 -2773 -3852 -1432 -638 -279 2493 3217 599 662 988 -1792 -3031 -1139 -1423 -1397 1783
3144 1783 3137 1396 1178 866 -2084 -2830 -943 -1640 -1523 1941 2818 1266 1584 1461 -1964 -2920 -1256
3161 -1256 -1526 -1180 1955 2255 856 1782 1795 -1212 -1938 -1465 -2466 -2013 1709 2568 1735 2176 1569 -1567
3179 -1567 -1993 -1125 -2073 -1873 1117 1886 1354 2289 1567 -1117 -1664 -1176 -1938 -1755 705 1232 1019 2446
3197 2446 2147 -430 -1273 -1755 -3033 -1937 735 1578 1374 2433 1773 354 -866 -1253 -2297 -1938 -23
3214 -23 858 1537 2643 1903 126 -789 -1288 -2278 -1952 -399 393 1529 2548 2160 584 -300 -1496 -2343
3232 -2343 -1713 -529 258 929 1996 1731 764 2 -1199 -2188 -2226 -1269 -91 997 2348 2056 740 266
3250B66j201r20K88jJ342J003J130J36n70r73j596r13k1M46J137R22J288M0j01
3269A702o69j986n85q42Q35P43J657P05M30m32n64j273j123n08K90P70J135R34
3287A219Q18J03j116r17j029j036k3Q75J183Q86J010j68n33j001q37j395L27M05
3305a229J030R01J044M47r26o99j148j155l36R65N24J254J016P2j78j028j278
3322g24p51j99J24P63J060J379J32j88m99j475j022n36K27R37R85Q00Q24k87n78
3341I72r15j306n59J95N96J097R03Q44O8o99j213j157n10m6K04J231J278O30K84
3360A897n54p28j338p13m78N01P94J259L77N74J51j334j142m15o46Q8J075J154
3378E22Q61J90K63r59j349p73k55j08O81P66J484K83K61j104q18o11q27m30M95
$$ plain form
3250 266 -935 -1855 -1567 -1568 -226 777 1907 2043 1473 500 -1096 -2009 -2030 -1584 -447 475 1763 1803 1702
3269 1702 1033 -953 -1538 -2380 -1545 -802 855 1560 1990 1558 994 -279 -1402 -1910 -1620 -850 285 1219
3287 1219 2037 2140 1024 107 -922 -1958 -1981 -1106 77 963 1973 1805 1272 271 -566 -1961 -1634 -1229
3305 -1229 -199 702 1746 2193 1267 568 -580 -1735 -2071 -1106 -582 672 1688 1760 1582 554 -724
3322 -724 -1475 -1674 -1550 -787 273 1652 1784 1596 1097 -378 -1400 -1936 -1709 -772 213 1013 1837 1550 972
3341 972 57 -1249 -1808 -1613 -1017 80 983 1827 1895 1196 -17 -1174 -1684 -1730 -1526 -295 983 1613 1897
3360 1897 1343 615 -723 -1436 -1914 -1413 -619 640 1017 1591 1742 408 -734 -1149 -1795 -1707 -632 522
3378 522 1383 1573 1836 877 -472 -1245 -1500 -1608 -927 -161 1323 1606 1867 763 -55 -666 -1493 -1923 -1428
3397a428J572O17O45L81p92o93q87q81l67M46J411M66Q83L15m19j316m71q91n63
3416a972R00O78O33J101M16m06p84o73p28p17J8Q31P45R70Q20n25o93n68j101
3435a055n78K3J046P08J217N61m09o75q91r93n86o1Q49L63J025J029j99l88p48
3454B38p08j001k50O43M13J498P41J06l97p76j089q78Q7K48M18J137J027j75j99
3473A083mj219j243N1J51n4J263J151J51pn68o99j256l43L95L37Q49R04N71j57
3493A356j04j418j141N6N5L39Q20O75N49q3J51q04j280k89j21r5Q23J191Q54j54
3513A380j58o40j146o15p3J20L86J377N88J52j01n42j201o36M5j54K88J150P34
3532I54M62j28J78j743r86j44q2M13J713N99k94M75n13j228n33J40o32J68J453
$$ plain form
3397 -1428 144 761 1406 1787 995 302 -585 -1466 -1833 -1387 24 490 1373 1688 1269 -47 -518 -1409 -1972
3416 -1972 -1072 -394 239 1340 1756 1350 566 -107 -835 -1552 -1534 -703 42 1012 1832 1307 614 46 -1055
3435 -1055 -1633 -1610 -564 144 1361 1922 1513 838 -53 -1046 -1632 -1693 -844 -481 544 1573 1374 986 238
3454 238 -470 -1471 -1721 -1078 -665 833 1574 1680 1283 507 -582 -1460 -1373 -1125 -707 430 1457 1282 1083
3473 1083 1079 -140 -1383 -1332 -1181 -1235 28 1179 1330 1323 755 56 -1200 -1543 -1148 -811 38 942 1513 1356
3493 1356 1252 -166 -1307 -1251 -1196 -857 -37 638 1187 1104 1255 451 -829 -1118 -1239 -1334 -511 680 1534 1380
3513 1380 1222 582 -564 -1179 -1252 -1132 -746 631 1219 1371 1270 728 -473 -1109 -1064 -1218 -930 220 954
3532 954 1416 1288 1466 -277 -1263 -1407 -1489 -1076 637 1236 942 1417 904 -324 -857 -717 -1349 -1181 272
3551B72N04J09Q13r7j559o56j7q02j03J423N90K69Q77p2j717p05J14j051K90J776
3571B58M48j48N51K53j174j2k81j366p48J824M27P0J630K75j795m57p6j182l4
3590a537J302J43J68J510L40j576k10l77j294J50J076J6%J926M53j758K43k54
3608C21k098l37J665o7O80J797l30j306L7l01j718L71J194m39K16J587L47j208
3626D11M30p78j504K36M99l72N40J564K62n73L75p12j832m1Q92j07M98J563k44
3645A107p48O64l16j402l02K2m64P54J489L79k18N7m61j348j61J27l99Q64J188
3664H32J01J33M83r86j319k76J58m44O82J185l9K07M15k42r74n51m25k82M95J221
3684C74O11L43o7n55q69n55r1o45P15R11K29O37M00o49j092k19o51q3N78M49K39
$$ plain form
3551 272 776 885 1698 1601 42 -614 -631 -1433 -1536 -113 477 746 1623 1551 -166 -871 -757 -1808 -1518 258
3571 258 706 558 1109 1362 188 176 -105 -1471 -2219 -395 32 102 1732 2007 212 -245 -321 -1503 -1537
3590 -1537 -235 -92 76 1586 1926 350 140 -237 -1531 -1381 -305 -289 -289 1637 2090 332 575 321
3608 321 -1777 -2114 -449 -516 164 1961 1631 325 362 61 -1657 -1286 -92 -531 -315 1272 1619 411
3626 411 841 63 -1441 -1205 -706 -1078 -538 1026 1288 715 1090 378 -1454 -1495 -603 -710 -212 1351 1107
3645 1107 359 1023 707 -695 -997 -975 -1439 -685 804 1183 965 1022 561 -787 -948 -821 -1220 -356 832
3664 832 933 1066 1549 563 -756 -1032 -874 -1318 -636 549 510 717 1132 890 -84 -635 -1060 -1342 -847 374
3684 374 985 1328 1261 706 -163 -718 -809 -1454 -739 172 401 1038 1438 789 -303 -522 -1173 -1256 -678 -229 10
3705A0P11L35q7o01p71o72m71M57P64R65R9L11j89p38n04l66n00J65M40Q86M92
3726G36K61j43l50n81m91m22j41Q1J177L54L93K66k94o87j267m6J30N64L67O24
3746E31M07L18n99o22n84l5q38K73J111M21M79M90m92r12k0o08l95J88N25N91
3766B29M61L85k78o50k75n71n25L18M12L89N95Q69m26l33n78m85j013R64p7P54
3786A65L14M51l9k52m66m01r49K48O02j58P40Q77K07q22k93n49n33q1L24J90N77
3807A52J131m25jn45o28q68J42K90J75P25O04J30o6k73o92o68k38R3K46N14P77
3828E75M27k28j90o09o83k71l6M62K80R23K26j15n1o69n04o83L26k52J064L23
3848C15M19K69k12n70n63m65j1J65M88M34O12O6k67r3q40j75n44J16P37M57J46
$$ plain form
3705 10 721 1056 969 368 -403 -1075 -1546 -1089 -325 640 739 1050 861 123 -381 -747 -1247 -1082 -642 244 736
3726 736 997 854 504 -77 -568 -990 -1131 -1050 127 481 874 1140 846 159 -1108 -1154 -1024 -460 -93 531
3746 531 938 1256 657 35 -549 -584 -1422 -1149 -38 383 862 1352 860 -52 -72 -680 -1075 -887 -362 229
3766 229 690 1075 797 147 -128 -699 -1224 -906 -494 -105 490 1359 933 600 22 -463 -1476 -512 -589 165
3786 165 479 930 891 639 173 -228 -1177 -929 -327 -485 255 1132 1339 517 224 -325 -858 -939 -615 -425 152
3807 152 1283 858 857 312 -316 -1184 -1042 -752 -577 148 752 882 816 543 -149 -817 -1055 -962 -716 -202 575
3828 575 1002 774 584 -25 -708 -979 -1015 -553 -273 650 876 761 710 41 -463 -1146 -820 -1072 -8 315
3848 315 734 1003 791 221 -342 -807 -818 -653 -165 269 881 947 680 587 -253 -428 -972 -856 -119 338 484
3869D84N83o56no70m35l20J13M90M16N38K96k1l71l46l89m99n4M8N66R08J46J67
3891I89l61m53n95k12n76N15M06P53L59k01K53m61p78l43j13L1P80J90N36K78
3911I97l79m10l91l29l09J66L89M21N46K92l45m17j66n10m16j15L51P68L99J36
3931F78K50n43m71n37k33J58M62l8N22N34Ok52m28l53q40J44O60M5L01N68J43
3952G76k23j92n04o47K10K10oK67O50Q0J49J06q51o76k16J39J34M83N56N01l21
3973F25k27o3q14m77K74J86M54N36K40j99j64k66q31m1m1J22K92N17N80P3j33
3994F43j33r08l70K26R4j36Q97K33j89L84j55j148k56L39k91J08R70J93j43L48
4014G06j12p93l19K50p01L45Q41l5M65K15m44p74j33R2l31l2Q90J08K24M84k63
$$ plain form
3869 484 1067 411 406 -264 -699 -1019 -906 -416 0 538 834 813 442 96 -293 -792 -846 -798 -232 676 822 989
3891 989 628 175 -420 -632 -1208 -693 -287 466 825 624 877 416 -362 -705 -818 -787 -7 183 719 997
3911 997 618 208 -183 -512 -821 -655 -266 155 701 993 648 231 65 -445 -861 -976 -625 143 542 678
3931 678 928 385 -86 -623 -856 -698 -236 -274 248 782 788 536 108 -245 -1085 -941 -281 -236 65 633 776
3952 776 553 361 -143 -790 -580 -370 -376 -109 541 621 770 876 25 -651 -867 -728 -594 -111 445 946 625
3973 625 398 335 -479 -956 -682 -496 -42 494 734 535 371 105 -726 -767 -808 -686 -394 123 703 776 643
3994 643 510 -398 -768 -542 -448 -584 313 546 357 741 586 -562 -818 -479 -770 -662 308 501 358 706
4014 706 594 -199 -518 -268 -969 -624 217 182 647 862 418 -356 -489 -397 -728 -760 130 238 462 946 683
4035F83q79j12j73o08K32J064o8P0Q03m16p90M3n5r57M01Q21J65j0O39j51n94
4056A08j38J05q86J65L35j1N21N47J08q71J11o2r63O2Q70m00M10R48j3o75O1l52
4078b0q25K03M73O2K30O38j92n81P13n80r66J4M28k63O21R32p1p62L75l75j008
4099i54J83L87j12N30M04q0j26L51q39p73L69K70J1N2R66k60k5K92l12o96m21
4120g83Q3L13J59O41K02l1L8o72k18k13m4K6L00L33M68L6J05k88p89J02n22K13
4142e41n7N44O22J64j4j84p65j81m25L73K97M09J57P0K72k62j68n99k39p3J9O21
4164D0N53NJ66k93l30m89k0m0l3M48R8O25j16j31m29o35KK9r8J98N94P9L45K38
4188H06m56n68p1l49j32K73J034j03l7J13k20k89j43j64l47L68L41JJ38M45j66
$$ plain form
4035 683 -196 -308 -481 -1089 -857 207 139 209 1012 596 -194 -151 -206 -1163 -762 59 224 214 853 702 108
4056 108 -30 75 -811 -646 -311 -322 199 746 854 -17 94 32 -931 -869 1 -399 11 959 946 271 332 -20
4078 -20 -845 -642 -169 -107 123 761 569 -12 701 121 -845 -831 -403 -666 -45 887 816 54 429 54 -954
4099 -954 -771 -384 -496 34 438 358 232 583 -256 -1029 -660 -390 -379 -327 639 379 354 646 334 -362 -783
4120 -783 -700 -387 -228 413 615 584 622 -50 -268 -481 -525 -499 -199 134 602 638 743 455 -334 -232 -754 -541
4142 -541 -598 -54 568 732 718 534 -231 -412 -837 -464 -167 242 399 469 741 479 311 -288 -527 -600 -581 40
4164 40 593 598 764 471 141 -348 -368 -408 -441 7 105 730 614 483 54 -581 -579 -550 -648 -450 144 223 568 806
4188 806 350 -218 -289 -638 -770 -497 537 434 397 510 290 1 -142 -306 -653 -285 56 57 195 640 474
4209D74p98o0J08m21K97K34M71M74Jm06l72m25k69j08L21P35j23J29K51j99m83
4230a69lj02m04K51K28K01L88K06Lm65m4m36l30K57j60N23L17L17n2l75j41k79
4252b69o51N94P5L89m2L82j64J06k04m85l40L3J88J73N87K83j21l64J54m87m65
4273f28j01K05L41L47K82L91k99l73l41l17P8n2J9O32J06K52Q2m66k12m28j59
4294f41J72p4P62M1K27j81nl23j56k48J75m00N99J35K78L72l20k01m54k24k2L98
4316i0N8L36p9P17m57O8o60l89M0k43O13K31K63L18j21n20j99k73j75n6N20P3
4338b5L27K02j0M5o60n20q3J44K08P17J00O3j5j82k48j14l88k05M44R3o1O46O5
4361E43q7l42m05l32J69mK88N28K9J2K36m36l22l14l7k66M05N99L30j04J4j08
$$ plain form
4209 474 -324 -384 -276 -697 -400 -166 305 779 780 374 2 -423 -692 -800 -479 256 133 262 513 314 -169
4230 -169 -172 -274 -678 -427 -199 2 390 596 599 134 90 -346 -676 -419 -579 -56 261 578 526 151 10 -269
4252 -269 -920 -326 -251 138 96 478 314 420 216 -269 -609 -576 -388 -215 372 655 534 170 324 -163 -628
4273 -628 -729 -524 -183 164 446 837 538 165 -176 -493 -415 -467 -448 184 290 542 624 158 -54 -482 -641
4294 -641 -469 -543 219 260 487 306 301 -22 -178 -426 -251 -651 -52 83 361 733 413 212 -242 -466 -488 -90
4316 -90 -32 304 225 942 485 553 -107 -496 -456 -699 -86 145 408 726 605 85 -114 -387 -562 -618 -98 -25
4338 -25 302 504 494 539 -121 -641 -724 -580 -372 345 445 508 493 311 63 -51 -439 -644 -200 -107 -168 478 543
4361 543 456 114 -291 -623 -454 -458 -170 358 387 399 635 199 -123 -437 -474 -740 -335 264 594 490 504 396
4383C96k41m63j3J76j79N18J87J37n8kl38l58l34q1J94L52j19N96J78l40J07k37
4405G8n06R0L8J78K45J62J69j10m6l50m81j50K64L32L15Q7K16q9j14l14l81j92
4427e59K87n2M8P22J60l1m54O9n69l08J82K06K01K88J85k24K54l72j52k35L5k50
4449e69L93Q6L59m4L59j41q20r9o3M0K37M37L28j37P0j91n19j65M0n2LM72P7L12
4473D13K12k53l96j98J62l13Q8N24L13j0j09j09l42l00j19l2J49P75j82j39K52
4494C86l08j38l4l64n0j31M87L96L2K39n1o86J96l91k27L55K77J80pL87J08k82
4516C74o93J56k16R3J26J68K56J83j62k5l5P8q08j05N24j9q4N25L39n35j74l1
4538f5n87N8M54j13L65K94M63l61k88k07m28J53P0K76j31L71L68l34J23q57k12
$$ plain form
4383 396 155 -308 -321 -145 -324 194 381 518 460 458 120 -238 -572 -653 -459 -107 -226 370 548 208 315 78
4405 78 -428 -338 -300 -122 123 285 454 344 298 -52 -533 -683 -419 -87 228 315 531 442 328 14 -367 -559
4427 -559 -272 -324 -276 446 606 575 121 190 -379 -687 -505 -299 -98 190 375 151 405 33 -119 -354 -319 -569
4449 -569 -176 -90 269 225 584 443 -377 -476 -539 -499 -262 175 503 366 436 245 -274 -439 -399 -451 -448 24 101 413
4473 413 625 372 -24 -222 -60 -373 -285 239 552 542 433 324 -18 -318 -437 -469 -320 455 273 134 386
4494 386 78 -60 -94 -458 -508 -639 -152 244 276 515 464 -222 -26 -417 -644 -289 -12 168 161 548 656 374
4516 374 -319 -163 -379 -286 -160 8 264 447 285 260 225 303 -505 -610 -86 -105 -189 336 675 140 -34 -65
4538 -65 -652 -594 -140 -253 112 406 869 508 220 13 -415 -262 -192 84 -47 324 692 358 481 -376 -588
4559e88K17K87N4M7K75K3M0j27k63k79k69J64l4M27M07K43k25M9l81o15K28l78
4581f98M10k4N21K37N3j0m04k79j88q3J38M5M52J08J69o3l14j29j83k85L59k87
$$ plain form
4559 -588 -371 -84 -30 17 292 315 355 228 -35 -314 -583 -419 -453 -26 381 624 399 448 67 -548 -320 -698
4581 -698 -288 -312 209 446 499 489 85 -194 -382 -465 -327 -282 170 278 447 384 70 -59 -242 -527 -168 -455
$$ [...]
8191A3
##END NTUPLES=NMR FID
##END=
