##TITLE=1H_DE-123_EXT_2
 200.13MHz,D2O.
 8 sc
 
 23.1.2026
##JCAMPDX= 6.0         $$ Bruker NMR JCAMP-DX V2.0
##DATA TYPE= NMR FID
##DATA CLASS= NTUPLES
##ORIGIN= UXNMR, Bruker Analytische Messtechnik GmbH
##OWNER= pz
$$ XWIN-NMR		Version 3.5
$$ Fri Jan 23 16:13:50 2026 Russian Standard Time (UT+4h)  she@DPX200
##.OBSERVE FREQUENCY= 200.1313
##.OBSERVE NUCLEUS= ^1H
##.DELAY= (6, 6)
##.ACQUISITION MODE= SIMULTANEOUS
##.ACQUISITION SCHEME= undefined
##.AVERAGES= 8
##.DIGITISER RES= 18
##SPECTROMETER/DATA SYSTEM= spect
##.PULSE SEQUENCE= zg30
##.SOLVENT NAME= D2O
##.SHIFT REFERENCE= (INTERNAL, D2O, 0, 14.3821)
##AUDIT TRAIL= $$ (NUMBER, WHEN, WHO, WHERE, WHAT)
$$ ##TITLE= Audit trail, XWIN-NMR		Version 3.5
$$ ##JCAMPDX= 5.01
$$ ##ORIGIN= Bruker BioSpin GmbH
$$ ##OWNER= she
$$ F:/spectra/data/she/nmr/H-C/1/audita.txt
$$ ##AUDIT TRAIL=  $$ (NUMBER, WHEN, WHO, WHERE, WHAT)
(   1,<2026-01-23 16:12:40.45 +0400>,<she>,<DPX200>,
      <created by zg, POWCHK disabled, PULCHK disabled
       configuration hash MD5:
       00 E9 B6 7A A2 85 ED C7 34 08 36 98 17 FE 4E 26
       data hash MD5: 16K
       61 01 7E 83 AF E1 22 66 94 19 E6 D2 51 59 27 A7>)
$$ ##END=
$$ 
$$ hash MD5
$$ AF 59 B2 6B E9 2D 38 13 51 A8 89 07 B3 3F C7 A9
##$RELAX= 
##$RELAX= 
##$RELAX= 
##$RELAX= 
##$RELAX= 
##$RELAX= 
$$ Bruker specific parameters
$$ --------------------------
##$DU= <F:/spectra>
##$EXPNO= 1
##$NAME= <H-C>
##$PROCNO= 1
##$TYPE= <nmr>
##$USER= <she>
##$AMP= (0..31)
100 100 100 100 100 100 100 100 100 100 100 100 100 100 100 100 100 100 
100 100 100 100 100 100 100 100 100 100 100 100 100 100 
##$AQSEQ= 0
##$AQ_mod= 1
##$AUNM= <au_zg>
##$AUTOPOS= <>
##$BF1= 200.13
##$BF2= 200.13
##$BF3= 200.13
##$BF4= 200.13
##$BF5= 200.13
##$BF6= 200.13
##$BF7= 200.13
##$BF8= 200.13
##$BYTORDA= 1
##$CFDGTYP= 0
##$CFRGTYP= 5
##$CHEMSTR= <none>
##$CNST= (0..31)
1 1 145 1 1 1 1 1 1 1 1 1 1 1 1 1 1 1 1 1 1 1 1 1 1 1 1 1 1 1 1 1 
##$CPDPRG= <>
##$CPDPRG1= <>
##$CPDPRG2= <>
##$CPDPRG3= <>
##$CPDPRG4= <mlev>
##$CPDPRG5= <mlev>
##$CPDPRG6= <mlev>
##$CPDPRG7= <mlev>
##$CPDPRG8= <mlev>
##$CPDPRGB= <>
##$CPDPRGT= <>
##$D= (0..31)
0 0.7 0 0 0 0 0 0 0 0 0 0.03 0 0 0 0 0 0 0 0 0 0 0 0 0 0 0 0 0 0 0 0 
##$DATE= 1769170360
##$DBL= (0..7)
120 120 120 120 120 120 120 120 
##$DBP= (0..7)
150 150 150 150 150 150 150 150 
##$DBP07= 0
##$DBPNAM0= <>
##$DBPNAM1= <>
##$DBPNAM2= <>
##$DBPNAM3= <>
##$DBPNAM4= <>
##$DBPNAM5= <>
##$DBPNAM6= <>
##$DBPNAM7= <>
##$DBPOAL= (0..7)
0.5 0.5 0.5 0.5 0.5 0.5 0.5 0.5 
##$DBPOFFS= (0..7)
0 0 0 0 0 0 0 0 
##$DE= 6
##$DECBNUC= <off>
##$DECIM= 32
##$DECNUC= <off>
##$DECSTAT= 4
##$DIGMOD= 1
##$DIGTYP= 9
##$DL= (0..7)
0 120 120 120 120 120 120 120 
##$DP= (0..7)
150 150 150 150 150 150 150 150 
##$DP07= 0
##$DPNAME0= <>
##$DPNAME1= <>
##$DPNAME2= <>
##$DPNAME3= <>
##$DPNAME4= <>
##$DPNAME5= <>
##$DPNAME6= <>
##$DPNAME7= <>
##$DPOAL= (0..7)
0.5 0.5 0.5 0.5 0.5 0.5 0.5 0.5 
##$DPOFFS= (0..7)
0 0 0 0 0 0 0 0 
##$DQDMODE= 0
##$DR= 18
##$DS= 0
##$DSLIST= <SSSSSSSSSSSSSSS>
$$ [...]
##$SUBNAM0= <"">
##$SUBNAM1= <"">
##$SUBNAM2= <"">
##$SUBNAM3= <"">
##$SUBNAM4= <"">
##$SUBNAM5= <"">
##$SUBNAM6= <"">
##$SUBNAM7= <"">
##$SUBNAM8= <"">
##$SUBNAM9= <"">
##$SW= 18.0517328524113
##$SWIBOX= (0..15)
0 0 2 0 0 0 0 0 0 0 0 0 0 0 0 0 
##$SW_h= 3612.71676300578
##$TD= 16384
##$TD0= 1
##$TE= 0
##$TE2= 300
##$TE3= 300
##$TEG= 300
##$TL= (0..7)
0 120 120 120 120 120 120 120 
##$TP= (0..7)
150 150 150 150 150 150 150 150 
##$TP07= 0
##$TPNAME0= <>
##$TPNAME1= <>
##$TPNAME2= <>
##$TPNAME3= <>
##$TPNAME4= <>
##$TPNAME5= <>
##$TPNAME6= <>
##$TPNAME7= <>
##$TPOAL= (0..7)
0.5 0.5 0.5 0.5 0.5 0.5 0.5 0.5 
##$TPOFFS= (0..7)
0 0 0 0 0 0 0 0 
##$TUNHIN= 0
##$TUNHOUT= 0
##$TUNXOUT= 0
##$USERA1= <user>
##$USERA2= <user>
##$USERA3= <user>
##$USERA4= <user>
##$USERA5= <user>
##$V9= 5
##$VALIST= <valist>
##$VCLIST= <CCCCCCCCCCCCCCC>
##$VD= 0
##$VDLIST= <DDDDDDDDDDDDDDD>
##$VPLIST= <PPPPPPPPPPPPPPP>
##$VTLIST= <TTTTTTTTTTTTTTT>
##$WBST= 1024
##$WBSW= 4
##$XGAIN= (0..3)
0 0 0 0 
##$XL= 0
##$YL= 0
##$YMAX_a= 253872
##$YMIN_a= -243193
##$ZGOPTNS= <>
##$ZL1= 120
##$ZL2= 120
##$ZL3= 120
##$ZL4= 120
##$ABSF1= 10
##$ABSF2= 0
##$ABSG= 5
##$ABSL= 3
##$ALPHA= 0
##$AQORDER= 0
##$ASSFAC= 0
##$ASSFACI= 0
##$ASSFACX= 0
##$ASSWID= 0
##$AUNMP= <proc_1d>
##$AZFE= 0.1
##$AZFW= 0.1
##$BCFW= 1
##$BC_mod= 2
##$BYTORDP= 1
##$COROFFS= 0
##$CY= -3
##$DATMOD= 1
##$DC= 2
##$DFILT= <>
##$DTYPP= 0
##$F1P= 0
##$F2P= 0
##$FCOR= 0.5
##$FTSIZE= 0
##$FT_mod= 4
##$GAMMA= 1
##$GB= 0.15
##$INTBC= 1
##$INTSCL= 1
##$ISEN= 128
##$LB= 0.25
##$LEV0= 0
##$LPBIN= 0
##$MAXI= 10000
##$MC2= 0
##$MEAN= 0
##$ME_mod= 0
##$MI= 1.114404
##$NCOEF= 0
##$NC_proc= 0
##$NLEV= 6
##$NOISF1= 3.799351
##$NOISF2= 2.8
##$NSP= 1
##$NTH_PI= 0
##$NZP= 0
##$OFFSET= 14.38212
##$PC= 1
##$PHC0= -3707.023
##$PHC1= 14.19231
##$PH_mod= 1
##$PKNL= yes
##$PPARMOD= 0
##$PSCAL= 0
##$PSIGN= 0
##$REVERSE= no
##$SF= 200.129724274929
##$SI= 16384
##$SIGF1= 3
##$SIGF2= 2
##$SINO= 400
##$SIOLD= 16384
##$SREGLST= <1H.CDCl3>
##$SSB= 0
##$STSI= 0
##$STSR= 0
##$SW_p= 3205.1282051282
##$SYMM= 0
##$S_DEV= 0
##$TDeff= 0
##$TDoff= 0
##$TI= <>
##$TILT= no
##$TM1= 0
##$TM2= 0
##$TOPLEV= 0
##$USERP1= <user>
##$USERP2= <user>
##$USERP3= <user>
##$USERP4= <user>
##$USERP5= <user>
##$WDW= 1
##$XDIM= 8192
##$YMAX_p= 0
##$YMIN_p= 0
$$ End of Bruker specific parameters
$$ ---------------------------------
##NTUPLES= NMR FID
##VAR_NAME=  TIME,          FID/REAL,        FID/IMAG
##SYMBOL=    X,             R,               I
##VAR_TYPE=  INDEPENDENT,   DEPENDENT,       DEPENDENT
##VAR_FORM=  AFFN,          ASDF,            ASDF
##VAR_DIM=   8192,          8192,            8192
##UNITS=     SECONDS,       ARBITRARY UNITS, ARBITRARY UNITS
##FACTOR=    0.0002768,     1,               1
##FIRST=     0,             0,               0
##LAST=      2.2672688,     0,               0
##MIN=       0,             -243193,         0
##MAX=       2.2672688,     253872,          0
$$ Real data points
##PAGE= N=1
##DATA TABLE= (X++(R..R)), XYDATA
$$ [...]
2931d838P7J91n78L767M383N99J090Q1m442k428j180j66l103M028O509p31J009
2948D268K670m045o325r9j160k089M205O127l45M29K253l247n360M31o19l156
2964f062K823M916k63J355M645k660o229j41j712m899L058O835M59J198M316l320
2980D319o722J53k94m269L093N986j521Q25N139k094n611J387j249o621J494O057
2996G2m62J713P090j760p133j6j168o656K373P429p27O52N688k450o245J918k11
3013A07o536J179N577k339O67P816O40n947J250j769q687O89O903j197J553Q373
3029H279j468p321O79J23p515J623O478k351p64Q049m07n631L082R73q973j205
3045f349M656k807J318R874J077o303J706q36r945k60P314j203n1Q003J03o576
$$ y = [-4838, -4761, -4570, -5148, -1381, 3002, 3601, 4691, 4772, 330, -2098, -3278, -3444, -6547, -2519, 3990, 3259, 4268, 6938, 2893, -3432, -3531, -4691, -6780, -2575, 3552, 3207, 3636, 5889, 2642, -2718, -2287, -2906, -6062, -3239, 1677, 1414, 2769, 7414, 4754, -1475, -1616, -3328, -8227, -5169, 1666, 2125, 3323, 7639, 4319, -2403, -2250, -2544, -6813, -3720, 2266, 745, 1570, 6709, 4615, -996, 391, -858, -7479, -5985, 72, -390, 1323, 8413, 6653, -480, -496, -1664, -8320, -5947, 1482, 755, 1407, 7095, 4645, -1600, 318, 107, -6429, -5250, 327, -2012, -1345, 6471, 7111, 1164, 2414, 645, -8042, -7353, -450, -1647, -94, 8279, 6811, -510, 169, 292, -7223, -5600, 878, -1473, -2237, 5812, 5405, -226, 2856, 3829, -5144, -6349, -1693, -4500, -3182, 6692, 7769, 1466, 3172, 2336, -7609, -7869, -555, -1758, -1809, 6194, 6297, -279]
3061b79K609J645q200o81M897l540k274R215K083m090L705K69j0375j966N161
3076a821k745j87J0520K397o894J771R44q979o11N868l084k203P954R11m742M838
3092C937K678q306k666L334m445j465R606L454m106L937J101j0691l408N531k349
3107c858j682Q280K440n483L253K536p158j767M976n297l672P526L105l138N417
3122E478L194q838m266L103m470k762R492M429m593L499K256p649k520L995l423
3137c075k947O380J833l964N033M890o781l110J883n134m571P629M065k132M957
3152D956M237p523m540K649l391l445O618L303l533L384L809n654j961L098m745
3167b738n318N465K493k200N546N522m911l691J651n366m523N329L428j188L311
$$ y = [-279, 2330, 3975, -4225, -4906, -9, -3549, -5823, 3392, 5475, 1385, 5090, 5359, -5016, -6982, -1821, -4566, -4753, 5767, 8164, 1270, 3041, 3985, -4994, -5605, 263, -2821, -5024, 2930, 3841, -901, 3937, 6615, -1691, -4357, -1023, -5468, -6933, 2673, 6127, 2021, 5958, 7059, -3632, -7040, -1509, -3858, -5540, 2740, 5180, -303, 2950, 5486, -1672, -3439, 1537, -3760, -7432, 94, 3199, 61, 5478, 8672, -166, -4432, -1329, -5799, -8561, 931, 5360, 767, 4266, 6522, -1127, -3647, 348, -3075, -6022, 358, 2191, -1773, 3260, 8150, 1369, -1741, 142, -4992, -9563, -1934, 2131, -1, 4956, 9193, 1670, -2870, -221, -3612, -7057, -439, 2864, -669, 2715, 6524, 870, -1091, 2007, -2738, -8056, -2591, -98, -2298, 3248, 8770, 3859, 168, 1819, -3547, -8070, -2741, 687, -501, 2810]
3182B810M152n075j789J289l868m357L905K587k862M826N049k715k573K269n237
3197a589n532J599M225j285M229M693k893k324J113m074m508K960J980k120N023
3212A497M929k930j927J802l460n182J365P82q48M120M703o83j756J091m530n103
3228f130J396K248k28L396M925j344j462Q84l365m689O19R63j452K673N048N46
3244D028j294J319l281m426l92N77p31L612M899P71j360k05k979m167r00J40R08
3261c481J841M079P11J75R31k253m351j274L56n04J608M069J542P16L4k323m766
3278b890j067j92j109K347L289K560O14R60k151l129j373j356j120J911L888J746
3294B928N19J150j486l530k454j149p86J499L029K438J057J256q22l072k715j362
$$ y = [2810, 6962, 1887, 98, 1387, -2481, -6838, -2933, -346, -3208, 1618, 6667, 3952, 1379, 3648, -1589, -7121, -5522, -1297, -2582, 1647, 6340, 3447, 1123, 2236, -1838, -6346, -3386, -1406, -3526, 1497, 6426, 3496, 1569, 3371, -89, -5271, -3906, -3124, -3972, 148, 4851, 4168, 2412, 3503, -1027, -6130, -4734, -2486, -2714, 682, 5607, 4263, 2801, 3685, 320, -4369, -3750, -2787, -4239, -1566, 3482, 4028, 2734, 4053, 772, -3654, -4046, -3469, -4200, -588, 4311, 5082, 3722, 3517, 538, -3629, -4529, -4389, -3481, -1640, 2439, 3150, 3325, 4256, 2003, -2348, -3622, -3266, -3770, -2162, 1907, 3449, 4165, 4199, 1876, -2890, -3957, -4149, -5258, -2911, 378, 2938, 3552, 4512, 2361, -768, -2141, -3497, -4617, -2706, 1182, 2928, 3447, 4597, 3111, -419, -2873, -4022, -4808, -3309, -280, 2158, 3215, 4471, 3649, 577, -2138, -3500]
3310c500r11J511K645J844J511K023j544l265k087j051j774J02K846L075J682
3325C107J077l10k130k237k253j377L58K267K016J919J819o84j915k053k159k205
3341d760L99K335K108J425K467J172k268k899j782j077p07Q07J805K851J779j28
3357C527j533j792j561k433q28J882J842K020K451J156j241k207j539k445j327
3372d028L85K469J684J662J129j66j340k180k970q60J480N41J620L119K059j011
3388C593j352j255k968k044M68R47J439K659J970j01r89j679k654j504J73J87
3404c110J612L458J806q07L81p80l762k513N56L12L42L118K402J31j55r62l172
3421a143j895M71l20N78L162K037j56P87m7l540k665L03j319k61L901J393J487
$$ y = [-3500, -4411, -2900, -255, 1589, 3100, 5123, 3579, 314, -1773, -2824, -4598, -4496, -1650, 1425, 3107, 4184, 3874, 1744, -493, -2746, -4123, -3765, -1498, 518, 2437, 4256, 3572, 1657, -396, -2555, -4760, -4361, -2026, 82, 1507, 3974, 5146, 2878, -21, -1803, -2880, -3587, -2780, -975, 1876, 3655, 3527, 1994, 202, -1359, -3792, -4620, -2738, -896, 1124, 3575, 4731, 3490, 1283, -256, -2701, -4028, -3643, -1174, 510, 2172, 3301, 3135, 1795, -385, -3355, -4215, -2735, -2194, -574, 2545, 4604, 3593, 2241, 986, -1982, -4026, -3558, -2611, -1172, 1487, 3457, 3356, 2367, 688, -1966, -3470, -3297, -3110, -1498, 1960, 3766, 2959, 3340, 2560, -1202, -3715, -3159, -2847, -2505, 613, 3015, 3146, 2991, 2029, -1143, -3038, -2567, -2887, -2309, 853, 2890, 2734, 3521, 3474, -66, -2731, -2428, -3747, -4008, -107, 1286, 2773]
3438B773J511p68k957l851J085o61k5K972K005J18J672n65l270k645J355k306
3454c557j607M039K642l22J868J780l178l242L13k126j572M112K810j59J631J644
3470E076l688k914L71k196j839L532K416o21K218L119l102l010Q81l191k384K614
3486b718L811j198K939L166l875k534Qk288l830M588K370m91J826L656k724k314
3502C92L02j903l664J858L675k423L454L622j239l575Q43l769m409L296L332j350
3518a558L209N207l231m165J645j876m092K092K841j895K450M649k675k157L057
3533C501l441o855K920K410j586L640O448k419l968J844l574m884K675L328k707
3548b668L115N041k781k928M269l554n842K688J462l753L918Q130k508k681K921
$$ y = [2773, 4284, 3516, 559, -3292, -2207, -2868, -2893, 79, 2084, 2202, 3874, 3309, 39, -2606, -1251, -3557, -5164, -1125, 1517, 1195, 3063, 4843, 1665, -1577, -1264, -3390, -4962, -850, 1960, 1801, 3432, 5076, 1388, -1526, -1155, -3351, -5190, -1658, 758, 137, 2355, 5474, 2372, -638, 243, -2948, -5332, -2718, 1093, -105, 2834, 6000, 2125, -409, -401, -2689, -6519, -1931, 439, -52, 1774, 5430, 2706, 392, 694, -1209, -4873, -3015, 660, -1763, 1691, 5313, 4074, 499, 1342, -2427, -6836, -3540, -208, -1558, 1651, 6858, 3627, -538, 1107, -769, -4861, -2769, 72, -1823, 627, 5276, 2601, 444, 3501, 60, -6795, -3875, -1465, -3051, 589, 7037, 4618, 650, 2494, -1080, -5964, -3289, 39, -2668, 447, 5488, 2707, -221, 4048, 494, -5348, -2660, -1198, -4951, -1033, 7097, 4589, 1908, 4829]
3563D829m128o306J268J930j219K406O949k382l023K668k429n230J951J976l330
3578d070K396N874j700j492M738k030p493J78K181m242K447P542j43k840K714
3593D060k520o244R20K429l415K952N866j536j877M257j034o793R38R99n618J169
3609e447Q409r07j170M680j243p491P9J073l089K180O389M12k952L594j006o671
3625c160J540J436m576M85O306j063j408N548K02o211p09J181m588P56N985Q30
3641B554p45L688j155o331k63J456m107P78N632k44k001M827K04m903K17Q58m900
3658d435n87M972O65n04N051M31n600o88k80m310o9N417M64l62M065o2m435J96
3676g1J055l891j550M060M12j224M796J482l951n92L16m959j373M002O78L42M617
$$ y = [4829, 701, -5605, -4337, -2407, -3626, -1220, 5729, 3347, 324, 2992, 563, -4667, -2716, -740, -4070, -1674, 4200, 2500, 1008, 5746, 3716, -3777, -3599, -1418, -5660, -3213, 4329, 4186, 1346, 4060, 1540, -4704, -3784, -1355, -4770, -1818, 4048, 2512, 635, 4892, 3858, -2935, -1997, -998, -6616, -5447, 2962, 2055, 885, 5565, 4322, -3169, -3090, -2017, -5106, -2926, 3463, 3875, 923, 4517, 3511, -3160, -1620, -184, -4760, -4275, 2031, 968, -440, 5108, 5310, -901, -1610, -429, -5017, -4261, 1724, 2554, 1809, 5497, 4342, -1989, -2252, -796, -4903, -4125, 1507, 1263, -738, 4089, 4293, -610, -393, 465, -4435, -5022, -50, 615, 111, 5162, 5593, -7, -695, -975, -5285, -5354, 63, 527, 165, 4230, 4168, -267, -71, 984, -2907, -4457, -397, 15, -1209, 3587, 5069, 1118, 526, 842, -4117, -5490, -1488, -810, -468, 4149]
3693D149N49l659p88O83l805j854M817n93N9L146J321k169j027L06m666j674K933
3710b272O47j95M353K012k223k96j57l971k118K454K98P5L386J473k235K58J35
3727A624l494j835J876o00M76L792L091k771k15K63k688l662J244O46p5L417K171
3744C260j316j30J76k880k247Q10J37m57K748K570l03L28R10l911k223P4l57q71
3762c682L082K276N31O72n40k342j958j34q47k97K213L007L37J6J572j847l071
3779a012q11j595J04K120K897l91Q27J192j383j905k231o63q82K706Q41K225N32
3796B571J694k548k490j448q37k90Q56K484J232R86J236q47k802j154j019l19
3812b695J83J680K331R99L51j499M65k328k224j003P61K370J238J080J796j95
$$ y = [4149, 4698, 1039, 251, 934, -2871, -4725, 92, -501, -442, 2704, 4025, 1856, 829, 1135, -3531, -5205, -2272, -1625, -1820, 2533, 4545, 2322, 2026, 1869, -2102, -4220, -1766, -1468, -1393, 1993, 3466, 1231, 1489, 1624, -1870, -3705, -1829, -2429, -1953, 1839, 4930, 2159, 1944, 2207, -481, -4143, -2899, -2253, -2328, 1089, 3260, 1944, 1814, 1990, -890, -3137, -2327, -2190, -2647, 101, 2671, 2368, 2696, 3606, -305, -2528, -2454, -2811, -3682, -600, 1676, 2207, 2879, 2339, -3, -1961, -2095, -2942, -3239, -1026, 1981, 2318, 2334, 3906, 2059, -1012, -1823, -3418, -3314, -1194, 1703, 1312, 2139, 3331, 1948, 43, -2188, -2851, -3733, -1027, -186, 2039, 2571, 4265, 1717, -773, -2221, -3058, -3348, -2492, -8, 1224, 2210, 3446, 2599, -203, -1357, -2376, -2695, -2512, -832, 1499, 2498, 2849, 1350, 1815, -513, -2737, -3740, -2979, -609, 629, 1709, 3505, 3310]
3828C310k489j497j433q03K69J710J566J715P95k47j260k030k056p10P2J360J147
3845e81K276J959m50j791r70j487j766k87J171J577J768J146P88j441j000k808
3861a896j268j76P64J713J789K053K45r93p59k067k163l95J043J308J457K073
3877B728O86j060j353j723j648r83M98J188J826K608Q66j163j289j333j729j889
3893c770J163J270L97K701J075q33l63j032k098j449K4O33J592K488Q23m37m23
3910A761n06k911r27M00l72J258K817J012k15M73j385k938j332K22l20J596K677
3927A310J551j4M55j577k901j572M72o95J124K711R10K78R35r29k694j419K4j293
3945c324R15L088J582k32J760r37l138j774o6j430Q72L349J025j29J557k91l327
$$ y = [3310, 821, -676, -2109, -2912, -2643, -933, 633, 2348, 3143, 2896, 1636, -394, -2450, -3160, -3088, -1728, -581, 1695, 3654, 3204, 1413, 443, -1044, -2810, -3097, -1926, -349, 1419, 2565, 3353, 1912, 912, -1896, -3164, -3340, -2576, -863, 926, 2979, 3224, 2231, 1472, -595, -2758, -3153, -2110, -802, 655, 2728, 3414, 2354, 1001, -722, -2370, -3353, -2855, -1667, 159, 2767, 3633, 2470, 1181, -152, -1881, -3770, -2607, -1337, -940, 1761, 2836, 2003, 1640, 608, -1490, -2939, -2915, -2282, -690, 1798, 2621, 2184, 1761, 1255, -1656, -2583, -2183, -2555, -1297, 1520, 2532, 2317, 2790, 1405, -1533, -2865, -2643, -2963, -1367, 1310, 2861, 2847, 3302, 1725, -1176, -2748, -2276, -2971, -1847, 864, 1774, 2052, 2987, 2058, -636, -2055, -2031, -3324, -2409, 679, 2261, 2029, 3789, 2852, -286, -2060, -2126, -3556, -2684, 665, 1690, 1561, 3118, 2827, -500]
3962e00p09j99q55p05L296J16J831J620n36k781j929M50k550m4L477L79M36K726
3980C523Q75m256p81l67j977k73L247J114p19K574K08k568o16l36l116p37K970
3997a235R45L33L061J584l563j096l03k606j230L202J244n12L176Q96l384o55
4013a43N36k838j080K484N97q26L504J878k643j348J188k985l144K993J579p99
4029a047L523K331l705q16J148l783j720L066P50j599L838J747k804M3J536l505
4045i97k920K303Q47j817L930L054k571o64P71l675k639L002J31q63L611K611
4061D114l379k68K506l568k961K404L12k234K454L946k708M37L021m542l766K749
4077a483P0j198L461K931k207P77J455n154k240K839k8k611M224J824j976p16
$$ y = [-500, -1209, -1408, -2263, -2968, 328, 444, 2275, 3895, 3359, 578, -1351, -901, -3451, -3495, -18, 361, 797, 3523, 4398, 142, -639, -1006, -2983, -3256, -9, 1105, 386, 2960, 3168, 600, -16, -352, -3468, -4205, -1235, -290, 43, 3104, 4688, 1125, 29, -274, -2880, -4110, -908, 336, -176, 3000, 3896, 512, -143, 393, -2445, -3525, -1041, -444, -1270, 2234, 4112, 1469, 121, 1309, -1676, -4820, -1827, -248, -1047, 2476, 4807, 1102, 286, 1434, -2349, -4069, -1003, -253, -1852, 1986, 3733, 929, 972, 2508, -997, -3917, -1614, -767, -2584, 1346, 4400, 1829, 1165, 1936, -1739, -4378, -1376, -1245, -2108, 1503, 4114, 735, 467, 2973, -595, -3556, -1152, -840, -3074, -620, 3326, 618, 1055, 4076, -466, -4232, -1483, -1413, -2611, 850, 3781, 1574, 2351, 3806, -1348, -3588, -749, -777, -3388, 836, 2660, 684, -32]
4093c2L615l448k978K123m43k908K850M107j606J377R04l755l041K206p98j887
4109c714L512L512j784p47K851k818k906J835Rl538J947K886p80J129L096k257
4125B233m140L07m21j685J719M291j727M33L145k585l750J078L73l074J455L004
4141F56l33L7M295k127l876J514j475l561K301L389j161K970J917k177l954J123
4157d62j829j504K196K572r91L88L741k342k380O47l70k629J024K129j225N91
4173d44M149p96k730K3j209k149L8K814J72J236J923m04k951J912j718l052J573
4190a613P72o12Q21L286p9k305J355j313l831L95K133O68N62K999m61j833K11
4207A155r22l690O08K130p12P05L296o8j284M47q50l023m43J297n46J022L339
$$ y = [-32, 3583, 135, -2843, -720, -1163, -4071, -1221, 2886, 1280, 2657, 3561, -194, -3235, -1029, -1827, -3714, -202, 3310, 1526, 779, 3630, 812, -2094, -259, -250, -3788, -1841, 1045, 265, 1394, 4490, 2233, -1907, -1600, -2021, -3706, -1987, 2304, 577, 1010, 4155, 1570, -2180, -1102, -729, -3803, -2348, 656, 323, 360, 4655, 2528, -1348, 166, -1309, -4870, -2569, 820, -341, 2629, 4546, 2369, -1585, -462, -2291, -3795, -1599, 973, -18, 370, 4111, 1769, -611, 36, -334, -2963, -1939, 190, -1035, -444, 3705, 2909, 179, 202, -1007, -3156, -3118, -304, -132, 1104, 3027, 2623, -328, 1584, -134, -3186, -1613, -841, -1453, -632, 2654, 2575, 270, 1625, 312, -3519, -3124, -991, -323, 239, 3238, 2777, 944, 1155, 233, -3457, -2849, -719, -1431, -726, 2570, 2502, 1218, 1665, 815, -2208, -2651, -1354, -1900, -878, 2461]
4224B461J48j027K9p78l008o91J259j97J268K963k48q36N22o85k861q66J191m53
4242a809M13L070R05r20L38n21k982r47Q35n38O17K862Q55j56%r33k276l41L74
4261a154j202M01K833J393q56N50k84k176j182k02k99M99K069J261K4O75k21k275
4279a46j560l9r19R25J605J808j57P12Q5k566j475j16l99O3J615J427P93Q69j69
4298B356j697j278o35r58j91J813J400N91J071n6j860j387l65r00k15J199J764
4315F52M97Q70k1o73j433j188r49k08J131J227R20R90O56j182j400r88p66n54
4333b419R68J461N97J263Q25r94j272j130j158o54P95R47J236J365M95n49r99
4350G77j274j292m71K54J380J106J275O03l88j035r98j112r13r6J307N00J529
$$ y = [2461, 2609, 1582, 1611, 833, -2175, -2866, -1607, -1804, -536, 2427, 2179, 1343, 1865, 1180, -1681, -2547, -1356, -1809, -1396, 1674, 2579, 1659, 1997, 1476, -1506, -2453, -1618, -2156, -1539, 1323, 2178, 2022, 2022, 1089, -1187, -1528, -1154, -2356, -1955, 878, 2271, 1415, 1965, 1681, -495, -1677, -1879, -2178, -1679, 390, 1651, 1675, 2350, 2129, -146, -1706, -1745, -2664, -1739, -134, 1674, 1517, 2229, 2314, -252, -1727, -1843, -2242, -2179, -564, 863, 1656, 2525, 2356, 659, -619, -1254, -2212, -2403, -590, 810, 1401, 2472, 2416, 556, -831, -1196, -2096, -2311, -1112, 652, 1149, 2019, 1998, 1325, -108, -1296, -2245, -2453, -1322, -95, 825, 1815, 2471, 1289, -111, -1099, -1865, -2419, -1451, 10, 607, 1870, 2695, 1701, 429, -701, -1859, -2513, -1718, -771, 465, 1830, 2325, 1776, 777, -497, -1789, -2260, -2006, -626, 480, 1755, 2358, 1970, 935, -63, -1175, -2088, -2184, -877, -377, 1152]
4367A152J112o92r2j427j515r78M16O73O20J664J262q8r04o78j299j457L06L34
4385a591Q56J104K090r15l75j091n51m91n62J188M12J26J625L06j087qj494j337
4403a795q6m35R50J734J768k7j65n19j071j558o90K50K80K006J461k19j064J127
4421A947j785j567o52L61m82J337J952L19M27O7j367j674l56k33q03K058J753
4438A302M3j3J518j606k280p2j280J65Q28K244K03R99M63r34k411k63l07q80N57
4457a724K372q2P72P68q49k051qQ2k089R08K703J08M16Q82r63j910J98m97j913
4476b877J126K211l50O77J689m51j948m66n91j545O61K060O54l39K425p42k792
4493e98L63n40k079R16K125J39m42K471q05j530N10p37j660L11J695p61R99K366
$$ y = [1152, 2264, 1572, 1480, 53, -1462, -2440, -2024, -1351, -731, 933, 2195, 2107, 1203, 525, -774, -2231, -1925, -1591, -735, 369, 2459, 1544, 1169, 78, -473, -964, -1526, -338, 74, 200, 1825, 2131, 1044, 1036, -458, -1795, -1881, -2316, -1366, 368, 2136, 2109, 1944, 1425, 354, -1204, -1894, -1644, -1364, 642, 2103, 1884, 820, 1947, 162, -1405, -2057, -1696, -2178, -841, 1111, 1430, 1857, 1924, 557, -1117, -1473, -1706, -2509, -451, 1302, 1345, 1332, 2850, 1244, -1036, -1108, -2388, -2223, -1395, 849, 1052, 2051, 2514, 1580, -831, -1094, -1401, -2281, -1724, 648, 566, 1338, 2106, 1257, -794, -802, -720, -2809, -1901, 802, 910, 1326, 2208, 1245, -665, -467, -964, -2877, -1751, 460, 110, 787, 2476, 2025, 77, -389, -980, -2525, -1864, 196, 850, 511, 2936, 2194, -598, -235, -775, -2854, -1938, 187, 326, -116, 2355, 1550, 20, 530, -207, -1867, -1556, 139, -622, 377, 2743]
4511B743j33k233K28q14k781N17J969J08N20K702q8k937L67j57k461Q1J995n63
4529i37J202K437l98k327R88j50l422m3K061n76M72L480J97k053J69n43l063n0
4547b556J750j0L4L826j605j561R62N56l407n20K968k440J159L440j24j940J053
4564A585O0l296j119K051p25J40L022O63j973Q01K67k964p67J964j145o17L222
4581A169P77j514J151P96l580j078J580r80l74L385R81j517Q44m1k826j235J774
4598f88p54m92L411O23j719J216O55l116n19J451k202p87K982R50j555K700M81
4615B637k989j388J103j080q74L176J495j225N09J415l385q18J526j645j060K374
4631b29J341j353J685J46j514n16L00j857j085L086J068l49J474M55k532j450
$$ y = [2743, 2610, 377, 605, -209, -2990, -2473, -504, -396, 124, 2826, 2738, -199, 168, 11, -2450, -2369, -374, -937, 265, 2702, 2304, -23, 965, 815, -2607, -2650, -589, -1165, -693, 2787, 2984, 931, 1100, 557, -2506, -2556, -806, -816, -782, 3044, 1439, -122, 840, 1396, -2011, -2531, 437, -2003, -844, 2596, 2472, 532, 1585, 1645, -1651, -2770, -719, -1444, -1304, 1718, 2381, 408, 1209, 1476, -1488, -2255, -291, -1436, -2053, 1169, 1946, 432, 1583, 2379, -1201, -2279, -699, -1679, -2053, 1332, 2313, 796, 1640, 1599, -1227, -2462, -688, -1442, -1934, 1477, 2100, 381, 1597, 2252, -864, -1383, 68, -2134, -2921, 61, 1011, -544, 2156, 2637, -352, -1740, -637, -1717, -2591, 585, 2080, 855, 1364, 2779, -606, -1424, 102, -1543, -2603, -229, 1112, -241, 1444, 1590, 76, -440, -140, -1997, -3082, 4, 1072, 723, 2197, 2652, 120, -1330]
4647a330J003j231j062K469J349j276J416J328k429r21O58j314j521K132J115
4662C86p42J996J406k113j398P16j917j367K089J546o61J599J149k235r09J145
4678F90j918j341J673J239j024J586J767j758p52K60j360k078J608J619q90J670
4694I91J735j242j444N95j379j922J603R13n64J260J752j500m34O13j407j845
4710b275R80Q19m52J112K131o20j142K66j545j385L76J024L7J028J721p04m59
4727I12J87j327j668O06M82m02J201J772m05l91L44j061j656K4N83m04J055J728
4745A580Q1o63J9q64j750J95N49m58R65J473j65m8O93q44j604m74K89k51P42J515
4765I80L35k40O56j060j696j54j71j15P17J554L32m9O26j126j072n81J8q92J009
$$ y = [-1330, -327, -1558, -2620, -151, 1198, -78, 1338, 2666, 237, -684, -26, -1340, -2861, -729, 386, -356, 1640, 3046, 933, -465, 251, -1666, -3033, -944, 602, -59, 1540, 2689, 454, -455, 690, -1228, -2569, -896, 343, -681, 905, 2672, 914, 162, 422, -938, -3016, -1408, 211, -679, 991, 2726, 1484, 40, 635, -744, -2666, -1063, -150, -714, 546, 2298, 798, 364, 977, -430, -2275, -1295, -476, -928, 184, 2315, 1695, 553, 819, -726, -2111, -1735, -711, -674, 354, 2075, 1371, 912, 1099, -228, -1896, -1290, -808, -1210, -9, 1763, 1358, 967, 1311, 250, -1406, -1382, -799, -1203, -148, 1580, 1661, 998, 1017, 153, -1597, -1402, -853, -1311, -346, 1127, 962, 914, 1607, 763, -841, -1315, -1026, -1277, -535, 980, 1315, 1075, 1731, 671, -1025, -1179, -1350, -1465, -748, 806, 1138, 1089, 1715, 589, -483, -1064, -1046, -1938, -929]
4784i29J290J023n54P87n96j479o16j45J4j79J007J922n63K42L44j850k0m16m81
4803a199p6J033R39N24K42M5j609o36m38o91O92J000O69J002m86L09j024l10m33
4822d47p95j50J336O15M31N81l49o05j085K9j660Q05Q22P21N62P15L1j100p41
4841b84l73m61J64L79O48P78J027n33n50q07n29j543J030M16P93J146m33P58n38
4860A088j274l05o03k75L08P23O71Q78K37n64n03q27p56k58N11L73R22P06Q96
4879A948p78m81l03j125j953J842j05J233J158m02Kl17m70j473j06l3N57J216
4897D10N93O22l25n34n86j306n07K46Q18K0R47J223l57k00o22o40r85j2K13O12
4917c70R43O94L4j501Q11j648O67m24L2p65K005Q77n94Q4L21j564j145M16j86
$$ y = [-929, 361, 1384, 830, 1617, 1021, -458, -1074, -1219, -1205, -1384, -377, 1545, 982, 1224, 1568, -282, -302, -718, -1199, -1275, -242, 697, 1221, 1463, 1508, -101, -737, -1175, -1866, -1174, -174, 495, 1497, 1011, 1320, 296, -14, -447, -1242, -1392, -56, 559, 990, 1571, 1222, 617, -468, -439, -2099, -1294, -472, 249, 811, 1526, 1557, 457, -284, -657, -1118, -954, -575, 73, 851, 1878, 1345, 795, -12, -541, -2084, -1054, -638, 155, 1301, 868, 1626, 1088, -186, -491, -1094, -1369, -1061, -338, 333, 1211, 1448, 884, 381, -446, -1202, -1460, -949, -576, 346, 1052, 1948, 1170, 689, 386, -739, -2692, -850, -955, 278, 1436, 1034, 1036, 719, 249, -1224, -1330, -1363, -806, 410, 1003, 1625, 1300, 766, 180, -1126, -1633, -1387, -569, -549, 398, 1621, 1264, 1064, 442, -198, -1183, -1195, -982, -370, 573, 1267, 1301, -200, 611, -1037, -370, -794, -762, -1527, 478, 1355, 761, 845, 1166, -398, -1543, -1127, -1313]
4936a313O36J025R09k53M11n11j299r68L18j40k75J406R21K52P7L72j613r59J1
4955i93j20r6J405Q57o2K76Lj099j225L83o30m1J277Q71k25R73m4j107q06l15
4975g18k01r39J210J545l04K94R00j570j006J19m76n96J441R55k40P84O59j172
4993F85j165M18r36j248K066R09q48N57J383j890j78J75j098r24J346J189m39
5010BQ60J433j419j306P13j297o97Q96Q12k45P71J440r19j054M72j395j249J145
5028a037R67m54J058J624r90q93M3k038l0P24Q33j26Q33J814k069q29J330q63
5046a03j711J072J074p52Q62J022l16j293J356j900j678J108J078o18Q73J838
5062A912j029k24N85j085j849P54J110j235J205J525q10l60R71j407j824O49J111
$$ y = [-1313, -677, 348, 1257, 1004, 1415, 904, -395, -1363, -1045, -1185, -1460, -54, 867, 1119, 1196, 1568, -45, -1004, -993, -1113, -1209, 196, 1053, 991, 1267, 1270, 171, -1054, -671, -1301, -1342, -65, 806, 581, 1554, 1510, 403, -403, -718, -919, -1858, -648, 897, 593, 887, 1787, 217, -789, -670, -1146, -1742, -301, 654, 414, 1198, 1857, 685, -480, -62, -998, -2246, -180, 729, -119, 438, 1821, -69, -247, -72, -1170, -2094, -748, 441, 2, 862, 2295, 876, -430, 283, -1014, -1711, -815, -3, -248, 523, 1963, 1044, -10, 462, -933, -2182, -1037, -70, -524, 534, 2158, 1168, 275, 318, -1720, -1750, -1026, -193, -319, 514, 2328, 259, -570, 760, -103, -1814, -742, 332, -420, 442, 1464, 1148, -145, 1211, -689, -2367, -1259, -181, -799, 74, 1912, 883, 659, 1244, 159, -1690, -936, 174, -1061, 144, 1669, 859, 499, 1470, 63, -1761, -1112, -1]
5079aj578J119J924j165m25J388j315j713O11J221o74j13K348m18j498K193j119
5096G85j699J194l81j235L19L151q98o59O85n34j693n96J641j483J110N16J114
5113A337k26K75j073k460J502L40p58QK024o20l73J603m28j988J140m40j649P44
5131a042J528k51N06M89L05j966n9Q97k094L81K056j52j63J385L46k964N02k36
5149e32r62K5J812k37L43J189q47o64j186M28r39J43J935P0k48J276k14j501j18
5168b27L94j419k36J606L4j60J300J65j389J1l20j231j06J520N45k04J716l59
5186A640j478Q4l76j356k23J632P98j717K527L73j937M82l65j773M86P81K28K79
5204H5J856N58n25k492N57j069o55J139Q42M50O2K49m64P2J56j145j199J160P1
$$ y = [-1, -1579, -460, 1464, 299, -126, 1262, -53, -1766, -1155, 66, -608, -721, 1627, 1209, -289, 1904, 785, -914, 280, -101, -1336, -1017, 2134, 1236, 577, 1262, 728, -965, -1561, 80, -1403, -293, 223, 1337, 1111, 1386, 313, -2147, -645, -305, -1063, -1055, 969, 349, -24, 1579, 1151, -837, 303, -137, -1786, -1042, 486, 235, 741, 1230, 1535, -431, -490, 407, -1687, -1306, 750, 598, 435, 1820, 2166, -798, -296, -532, -1494, -1469, 343, 106, 449, 1638, 791, 127, -1059, -631, -1570, -1427, 508, 578, 330, 1606, 1392, -109, -227, 167, -1252, -1488, 118, 152, -8, 1292, 1457, 68, 79, -241, -1472, -1578, -58, 487, 283, 1999, 1640, 162, 246, -130, -1486, -1709, -77, 721, -996, 1531, 1904, -33, 449, 84, -1689, -1203, -422, -194, 85, 1941, 2499, 1974, -518, 39, -1030, -1685, -546, 296, 746, 808, 1057, 593, 665, 821, -324, -1523, -363, -292]
5223b92m7J546K91j200J70k02j197o62R91M39q11J068J151j55j852J377j839L37
5241h87M36k10L54Q60M61jo51O05j490r75J017m09J04J905K96j298K85M25j831
5260a004O4j94J02P36J463O61k29o25n86m61j010R13o61J24R80J202j039L59R1
5279H86j273j646R57O15q36J625Q98k14m32n4q96n64L0%%Q88N48R5OM96j013n65
5301d49k82j58j93J132O38L33n5K70j096p39K27J85r67N36J116M75J74m55n26
5320A66n74k28N0j01M21P40k29J392j042m12l1q56K90j31j81J241j6L66J38m23
5340E80q75r5k59j07K47M34J063j92n9N00q97n13o18p30R72P36M55L31k90m08
5360B75k03J64j629O04M45j95P12P28om1m35p06n44J00L92k26M35J302n20p22
$$ y = [-292, -339, 1207, 1498, 298, 468, 266, -931, -1593, -602, -163, -974, 94, 1245, 1090, -762, 615, -1224, -887, -451, -661, -307, 553, 1014, 1013, 362, 967, -523, -1498, -481, -890, -786, 1119, 1415, 117, 402, 827, -1004, -940, -1134, -1032, -296, 1167, 1828, 1599, 974, 388, -73, -1083, -170, -831, -707, 273, 1475, 436, 795, 886, -387, -2033, -1076, -461, -1297, 328, 1226, 1012, 580, 526, -370, -934, -904, -904, -904, -16, 532, 627, 633, 1129, 116, -449, -731, -889, -1082, 50, 688, 1021, 966, 1236, 140, -599, -372, -187, -1154, -618, 498, 973, 1147, 692, 166, -408, -636, -586, -687, -266, 474, 245, 1637, 595, 183, 152, -704, -414, -545, -726, 515, 499, 865, 1003, 580, -295, -390, -649, -756, -509, -75, 988, 796, 737, 1237, 340, -173, -791, -1521, -549, 187, 642, 973, 683, 275, 72, 236, -1393, -789, -344, -539, 173, 901, 895, 854, 419, -287, -831, -731, -339, -565, -130, 1172, 652, -70]
5380g0M72m66j45j89j067J351N22j40R67J71j929M73m44n21L02Q25N65n36Q61
5399A002p2k93l98m13p23Q3K43L75M61O74j47l14n91n8o40j98M31M51N53Q01l64
5420H63k57j15n03p87J67O1L9M97O32k90qJ83j96r16j59L96j29M20P98j8L9j10
5442F07l30r38j40J58j43M58Q17L19l30R6l45p50j05L02J05k36J153K5k55K75
5462G43k20o88n65L3m19P18Q62N9j51L70k58j219M76K21n67q7J063K70k09M14
5482H46k10r19k91K01m15L46M53M05j54M96J38j153j72m2n28o6J238J52J23M04
5502H52p4j011k22Oj30j62Q29M04k40L68K31r31j19N6p52J10J073K41m07O75J59
5523I56q52n55N59r67l18J163J96Q8N14N48j186m60M20r95r3J125p4M5Q50K13
$$ y = [-70, 402, -64, -209, -398, -1465, -114, 408, 268, 1235, 1406, -523, -50, -494, -1015, -713, 112, 677, 141, 1002, 930, 637, 239, -174, -897, -814, -571, -196, 265, 939, 792, 478, -113, -171, -811, -1009, -578, -127, 426, 1227, 863, 606, 491, -12, -799, -632, -571, -532, -35, 597, 307, 299, 482, 286, -630, -789, -393, -522, -102, 696, 678, 717, 607, 277, -661, -801, -643, -786, -328, 489, 808, 478, 574, 229, -521, -626, -324, -219, -455, 698, 723, 468, 743, 523, -165, -730, -697, -1116, -398, 464, 523, 372, 742, 484, -735, -259, -38, -605, -692, 371, 641, 432, 846, 636, -283, -574, -373, -788, -442, 11, 416, 262, 758, 896, -257, -429, -471, -999, -1065, 173, 325, 448, 852, 778, -233, -455, -449, -579, -741, 88, 492, 252, 620, 851, -80, -199, -143, -895, -785, 288, 529, 122, 797, 956, 104, -451, 108, -859, -1177, -14, 182, 270, 784, 1332, 146, -314, 106, -889, -982, 143, 69, 114, 964, 1177]
5543A177j077k57K83q77k10R96N6r2O75P68j013o94P76j067l22P98m4k16O70P85
5563A115j001k36L93j141k36Q39K95l79J128M70r13l33N38j011o07R75k01l10
5581f15J073O91j009k04N45o93r78R37%j54P78J104j120L15k19j111o15Q97J18
5600b60l00J071P40j088j82O79j162k80O10K93p21Q64Q79j199O32K34q04j182
5618a176R00L6m96J209N16q98L11M71j319j39J97J1n65J219J021j012M6M86q40
5637b2n32N09k69q20J285P52l69m10J123j224j068Q22K4o39J088Q74p35q6L25
5656F28o24p64M22K09o58O83N24o32P25J91l40p04M16o02k61Q21N26n94K11P92
5676I69j099o86P56j92j196J099Q90j88J89M58n85p95N70n94m42M83J022n99L47
$$ y = [1177, 100, -157, 126, -751, -961, 35, 91, -1, 674, 1442, 429, -265, 511, -556, -878, -80, -124, -340, 330, 1115, 114, -122, 271, -870, -1106, -267, 28, -351, 777, 1247, 334, 1, 539, -472, -1079, -104, -305, -615, 458, 1149, 140, -64, 481, -212, -1190, -253, -253, -407, 371, 1475, 355, 670, 451, -660, -1275, -378, -260, -560, 511, 1251, 163, -19, 660, -502, -782, -172, 121, -600, 264, 1143, -56, 576, 810, 6, -1176, -276, -240, -736, 473, 989, 91, 402, 873, -446, -585, -388, -377, -942, 277, 1298, 286, 332, 818, -22, -554, -45, -314, -1134, 151, 903, 534, 124, 1247, 23, -1045, -223, -199, -838, 250, 1124, 389, 303, 628, 4, -760, -338, -129, -787, -104, 420, -212, 513, 704, 364, -340, 76, -526, -787, 34, 560, -34, 177, 969, -130, -816, -60, -252, -1448, -349, 541, 353, 542, 1000, 415, -380, 190, -404, -846, -363, 659, 60, 407]
5695D07P17p07q90K34m35k69O30M81j20L8P14o32n31J66J01o96L00N03L4K31P37
5716A013n68p24j7K12q19M86N45l35N34Q37p27p11L22l44n05K42N31N2L49K36
5736F09o7m62k12Q6n66J03N50j30J79Q31j07p79K88k0q29j34Q91l00J31M56j05
5757D13k57j75k57n71M48L12j74L81O63m43j86m0l2q75K99L47K6O2Q38l58j98
5778B23n8L2n69j46N55m63M11O22O5o32K8j7l58r7L36k67K60L84K02j77k37N4
5800A51l40j19o1J1J17P30Q2l70J50l16n11q8K4L01J70L93k4oK18m75j58l89J13
5823c97o2J44O44J23k57M19m41n75R0O1j29J47M42K65k95R1l5j62o34M30k52J8
5845c65O54M56k21M2l89k95k75m4J04J71L73M43L38l16k73n05J47J87l89Q21j51
$$ y = [407, 1124, 417, -473, -239, -674, -943, -313, 168, 48, 86, 800, 168, -363, -197, -96, -792, -492, 11, 45, 276, 1013, 445, -279, -296, -84, -903, -417, 128, -207, 327, 1164, 437, -274, 48, -296, -801, -559, -28, 24, 373, 609, 542, 80, -132, -46, -612, -509, 41, -89, 90, 921, 814, 35, 323, 303, -526, -660, 231, -69, 62, 518, 413, 156, -19, -276, -847, -399, -87, -261, 120, 783, 340, 154, 114, 82, -793, -494, -147, -121, -59, 779, 421, 223, 165, 197, -372, -518, 37, -426, -15, 607, 672, 40, 68, 51, -307, -404, -68, -335, -75, 309, 511, 334, 97, 151, -189, -308, -369, -358, -241, 489, 571, 201, 351, 35, -476, -564, -540, -239, -69, 324, 300, 294, 512, 37, -121, -510, -397, -459, -315, 329, 452, 195, 614, 173, -402, -312, -251, -380, -233, 209, 474, 179, 270, 235, 73, -561, -131, -383, -365, 289, 745, 524, 566, 177, -118, -393, -437, -333, -162, 211, 654, 992, 676, 403, -102, 45, 232, -157, 664, 513]
5866E13R7O54j08k53j283O67o44k32K98M13o7L19K62k65p58L37N6o76j17R33p4
5887G2J24J36K63n82j28l33L31l29M47M00J4N3j84r7j81k72p0q6M49L34l42L43
5909C62j62L40n74j91l79Q8L74M77q0L50O7p18k14K11J64n46j15J140J21m61K79
5930E33p85N76k19p69O5N18l3m96P61N17m33J17n06j42m00L58L34J69K59kk85
5951A37r7M14q23k68K68J79k91R50P12j163J80r7o5l86L93n40N88K77O41k69o19
5972A21M83k20j281O95l85R4J032m1k63k72M44o70l86J13K67J11K73L71l7n13
5992f4L2K7l54r1L61o84P39R11j084O68l47l62j62J52l24L21J01J040n64K08j9
6013E05l83j241N49O73k35K10K19n5j04k42j48K25kk60k5L84M33k37l06M52n36
$$ y = [513, 610, 1264, 1156, 903, -380, 287, -357, -589, -291, 122, 55, 374, 636, 371, -387, -50, 6, -670, -787, 146, 72, 196, 332, 595, 13, -115, -448, -117, -446, 1, 401, 415, 468, 284, 187, 6, -266, -336, -422, 27, 361, 19, 362, 200, 540, -34, -225, -604, -516, -142, 335, 255, 605, 672, -46, -260, -49, 115, -431, -546, 594, 715, 254, 533, -252, 324, 105, -664, -599, -81, -114, -610, 151, 668, 235, 352, -154, -296, -696, -338, -4, 165, 424, 422, 137, 40, 454, -369, -637, -369, -190, -481, 469, 1181, 18, 198, 101, 36, -350, 43, -497, 91, 368, 1009, 740, 121, 604, 384, -897, -202, -587, -493, 539, 498, 235, -37, 407, -263, -649, -536, -269, -158, 115, 486, 449, -64, -32, -5, -359, -450, -89, -773, -34, 877, -207, 461, 114, -248, -410, -258, -582, -261, -160, 880, 316, 524, 505, 122, -1119, -570, 103, -132, 78, 297, 242, 138, -104, -252, -27, -29, -289, -314, 70, 503, 266, -40, 412, -124]
6034a24m63L57J35m92M03N99r5j12K39l88m06K07J14n69O15K00q33N41O42n70
6054@k51n65N70l62O06O75j19k35L91n39n78J36N7m91O34N90l71J21J7L16r03
6075c01J10l16o57P76Q01j15l32R48q88o37K75J65p45P74N72J69n86P95j023K25
6095A0N87p89p83J100n69M81l1M3L23o14L97l31lj45R45n70P1O93l09j007N88
6116H7J15j384R32P86k547K201L79q76m35N80K05k29J85K2JK64J69K05r34L25
6136E1l38k73k6M74l91J300n24L76q15L41o72j62L65K14Q99j49J65j128K88K80
6156B75K57j83j194N51J009q27L08J20K5k24J6n72o2O63l89J12P91Q7l11L12j31
6177F33p69J76l5m21K1K42JM98o10N73q22m78J24Q39J327p52o54N6O1J41o05m0
$$ y = [-124, -587, -230, -95, -587, -184, 415, 320, 208, 447, 59, -347, -140, -26, -595, 20, 220, -613, -72, 570, 0, -251, -816, -246, -608, -2, 673, 554, 319, 710, 171, -407, -271, -214, -705, -71, 519, 148, 269, 286, 602, -301, -191, -507, -1164, -388, 413, 298, -34, 914, 26, -611, -336, -171, -916, -142, 430, 599, 13, 808, -215, 10, 597, -192, -975, 125, -444, 37, 6, 49, 372, -242, 155, -176, -179, -324, 621, 51, 122, 815, 506, -501, 87, 202, -1182, -250, 536, -2011, 190, 569, -307, -742, -162, 43, -186, -1, 21, 22, 286, 455, 660, -274, 51, -287, -560, -586, -112, -503, 797, 273, 649, -166, 175, -497, -659, -294, -80, 819, 670, 835, -293, -5, 275, 532, 349, -845, -294, 715, -112, 196, 316, 341, 117, 133, -439, -501, 162, -227, -115, 676, 763, 452, 764, 633, -136, 40, 5, -416, -395, -153, -152, 346, -264, 309, -513, -991, -867, -28, 1299, 547, -107, -51, 10, 151, -454, -494]
6199d94P67l19K58O54J67p96r8N03j103l37l09P91R34p20K96L40j021J164p38
6218f1l84L16m14K61P85l55n02J183r71q4l34J80J27PL07M74j16J68m32m95l37
6239f77K36J9L21K9N41J90p19O57k0M2m50o39k45R42L09j67k38o1l32R8k72K11
6261b25k14N65K83j25P6P75r66n90O61n80J76K12J81j65K59J01n15k52N49p11
6281e05j28J102J84l30N47j73j026J96n39M25j37K67M69NK22j54l30l26o91L48
6301e74M48J80K1K77J80K83p90K67l10k61l03J029J35n93K38K85k27j95j88m61
6321e59J39l6O81m9L52n4l26l80m12N75J25J07j37L67j30O99r30K42k17j06k69
6342c18l56N87q4J96N67k06n47k89K80k27j91P51j84N6K14L66m33k00j199N32
$$ y = [-494, 273, -46, 212, 866, 1033, 237, 139, 642, -461, -798, -1107, -316, 618, -102, 194, 534, -487, 677, -61, -445, -129, -543, -282, 503, 148, -354, 829, -142, -226, -560, -380, -253, -246, 61, 535, 419, 587, 155, -340, -677, -441, -422, -101, -72, 469, 659, -60, 597, 577, 619, 169, -470, -715, 227, 536, 369, 131, 70, -262, -164, -436, -225, -439, 126, 409, 284, 360, 1135, 169, -421, 240, -340, -164, 48, 229, 64, 323, 424, -91, -343, 206, -505, -633, 469, 653, 323, 870, 697, -329, -133, -672, -247, -384, -117, 352, 357, 579, 425, 95, -231, -922, -574, -126, 54, 75, 352, 532, 815, 25, 292, -18, -279, -582, 447, 582, -11, 227, 512, 285, 90, -98, -559, -420, -456, 225, 176, 528, 474, 148, -232, -644, -69, 56, 163, 26, 393, 263, 962, 32, 274, 57, -49, -318, -674, -87, -171, 25, 592, 386, -161, -450, -170, -397, -588, 163, -21, 35, 249, 615, 182, -18, -1217, -685]
6362f85J399p91M7L16K86j43l31K88l95M43j173M94P2M32K21k12p83J377q85l20
6382c43l69O45l83O71K33L81j306R06q3j314O21j82P84m9l16N38j85L98k31j056
6402f40J90J73M4L79O98m58L46n66l40J33l42L15l16o6P74P62j9j067k42Q51j195
6423e86M2M43M93j52J67K95j007k82J055o49J74k73O14k5k58J42N75l30m92k09
6443b63k55l10J128j6L96n15K82l8p83J26j24n8M50K21N4J16q0j55k47n33K33
6464c71l92K78Q77j72K60n35J416j909o91K80J71J77Q81p66Q18M54n11Q3m39l16
6484d07N35j60Q5L12R9k31K66m83j94n29J75K00J101p35K75R31q26J0J12r32p22
6505a118J288R55j351K15N80j79l18m66J23l75J2O74O2M8N32l45k10Jl78l14j17
$$ y = [-685, 714, -77, -30, 286, 572, 429, 98, 386, -9, 434, -739, -245, -173, 259, 480, 268, -515, 862, -23, -343, -712, -67, -450, 221, 454, 835, -471, 435, 352, -962, -341, -523, 261, 212, -104, 434, 249, 647, 416, -640, -450, -277, -233, 146, 844, 386, 732, 166, -174, -41, -383, -68, -384, -450, 324, 1086, 1067, 0, -242, 609, -586, -544, -101, 392, 240, 407, 702, -305, -587, 468, -181, -7, -280, 334, 309, 51, 193, 768, 438, -54, -263, -518, -828, 300, 284, 680, 165, 447, 409, -374, -248, -372, -430, 20, 241, 295, 411, 331, 176, -71, -604, -371, -763, -485, 392, 220, 480, -55, 1361, -548, -1239, -959, -788, -611, 270, -496, 322, 776, 265, 348, -91, -407, 128, -32, 53, 365, 464, 233, 499, 16, -178, -707, -532, -332, 769, 34, 309, 1240, 414, 424, 536, -396, -1118, 170, 1125, -226, -11, 569, 390, 72, -394, -271, -646, -634, 40, 102, 150, 682, 337, 127, 128, -250, -564, -681]
6526f81N36L69m8l8M57n74J30n58m12M49K47M2M85K18j59q0k11l76m60J51L13
6547b00J64R3M23L9k93p1m22l06j39O22j39M02L68L20p15K34k00q07n6N84j11
6568b10N0N42j6l00J21j4m39m39M83n9L7P07J98m28J31k61m38o23O83K65K68K33
6590D91J69k71n8p2p35P0r5J18L24L76L03j03R2j29p80l20M56j98J98L90K42K63
6612G31l75j33k77n64M53l06J10N20O3J59J21O9q90j20n4l3j41P07M90k52K11
6633D89J53q18m64N17l47O4O40l7M08K23k74l16n91j07kK03J7K73M79k01J60l99
6655G0J91n65m75M52n62J215Q4k59J122p51p94R95l72j285J499k80P8J592j154
6674H01o26L88j259j63M07P12L88j03k18K1k76m10O8o25k11J306n68R58j96M58
$$ y = [-681, -145, 224, 176, 138, 595, 21, 151, -407, -819, -370, -123, -81, 404, 622, 463, 383, 172, -204, -664, -513, -200, -36, 57, 480, 519, 226, 155, -267, -573, -712, -90, -229, 173, 541, 861, 146, 380, 180, -627, -683, -99, -210, -160, 382, 366, 66, 187, 173, -266, -705, -222, -281, -244, 463, 661, 233, 364, 103, -335, -958, -275, -10, 258, 491, 660, 389, 331, 259, -476, -406, -501, -383, -59, 317, 620, 517, 609, 480, -300, -620, -164, -362, -164, 226, 468, 731, 356, 223, -54, -618, -165, -471, -361, 159, 222, 381, 502, 571, -319, -439, -493, -526, -667, 40, 530, 278, 489, 642, -176, -640, -123, -470, -406, 234, 197, 605, 828, 554, 238, -353, -460, -462, -259, -242, 31, 510, 309, 469, 70, 261, -304, -779, -327, -889, 326, 410, 151, 1273, 522, -272, 723, 351, -934, 565, 285, 363, 1955, 801, 175, 563, -696, -859, -452, 260, 648, 545, 327, 348, 72, -338, -270, -895, -1106, 200, -368, 590, 394, 852]
6694H52o73k64k66O54p01P30R27j003O62n24r9P44j350n87R0M93K70j81M44O58
6714H76n96J56m87l68k96L45L18J66NN85j6J29j716L88J66n7L68M80L03l62j4
6735C73k63M87r94J81R0m97O9J138l25L61l3m34m57q1o26K55P47O13j98J06r2
6756D20k80m46k6l96L64L25N19K26k31l44M09o58m50L36M81K26l26n4N67m01K68
6777E29l43o99n6o6K13L92M99Mlk13q4m00o01J98J0M71N10P1K7k57j2o27j24l98
6801i59K35P55R29L14q14P72j219n56J17j02K5J87M72M88j71on14j93r0J9j63
6822d74L58R3P30j02l89O70o57p39k54j1K70N59M00J60j9k67k81l96j12p58Q02
6843d17L91M16j03J92Q7n49k88k53nJ55M24M08J67j47%o10r7n2j94j87M92L68
$$ y = [852, 179, -85, -351, 303, -398, 332, 1259, 256, 918, 394, 295, 1039, -311, -898, -808, -315, -45, -226, 218, 876, 280, 436, -51, -419, -715, -370, -52, 114, 119, 704, 688, 817, -899, -511, -345, -402, -34, 446, 749, 387, 373, 110, 597, -397, -216, -126, -623, -554, 584, 259, 620, 587, 153, -304, -385, -1011, -756, -9, 604, 406, 512, 420, 140, -306, -332, -728, -364, -39, 480, 706, 475, 131, 540, -118, -568, -232, 249, 475, 149, 95, 662, 261, 529, 186, -513, -569, -635, -422, -30, 469, 473, 470, 257, 173, -227, -828, -630, -620, -149, 361, 432, 459, 202, 190, -437, -561, -959, -724, 31, 960, 1274, 460, 1232, 13, -543, -426, -528, -503, -316, 156, 644, 473, 467, -47, -240, -330, -311, -474, -116, -23, 707, 605, 216, 886, 229, -510, -764, -775, -505, 54, 454, 614, 595, 328, 47, -349, -461, -1219, -417, -26, 390, 287, 479, 566, 17, -271, -524, -529, -374, 50, 458, 625, 478, 478, -132, -229, -281, -475, -662, -170, 198]
6865A98K15K49Q0n88l45k10J56k3R7J77N31n3K73n73q3m29K18l60L51J12J15M62
6887E70M12j013J14J3o30j77k38J599K47n70R07o81o64Q1o22J15J13J84N27K32
6907E19l4P1n27m7m64k77J95N03jM12K68j38l20n43o0l29P9M68M52J20K61j84
6929D24j64k24n80J23j78L09K16M09K91J29k04m46n33L3l53L51O75J70k85P63
6949I26p63m03O80r34j5RO75j31N78m00M92o02p44m22J006k89M29J61M6L21N0
6970F70M11j070r12L96L05m78Q24n5L98lkj056O23n84K02j64L04R33m83J89K8
6991D76o43l03p1Q0k15O98K6M95Q75j188J45p07m60N05QP87P0N01k39k17j82m72
7013c1n23j17J34O94N1j00P30m33J19j90j294M05L75m48R55j35M06K53p54j78
$$ y = [198, 413, 662, 742, 154, -191, -401, -245, -268, -171, 6, 537, 484, 757, 184, 101, -328, -110, -470, -119, -7, 108, 570, 982, -31, 83, 96, -534, -711, -949, 650, 897, 327, 1234, 553, -111, -30, -652, -537, -424, -240, 287, 519, 485, 556, 29, -18, -482, -759, -564, -61, -62, 350, 618, 480, 160, -383, -443, -772, -693, -225, 227, 347, 608, 424, 260, 36, -544, -421, -599, -290, -74, 335, 626, 755, 551, 105, -428, -395, -748, -397, 278, 448, 163, 926, 163, -240, 440, -494, -509, -500, 175, 44, 622, 222, 714, 112, -632, -1054, -48, -337, 92, 253, 299, 620, 670, 1081, 11, -901, -505, -200, -678, 146, 91, 489, 486, 484, -572, 51, -533, -331, -495, -191, 742, 259, 448, 476, -167, -470, -541, -461, -676, 22, 48, 543, 1418, 230, 375, -332, -792, -287, -279, 508, 578, 1079, 840, 623, 441, -31, -554, -671, -537, 157, 208, 108, 838, 405, 524, 334, -960, -555, -180, -628, 327, 192, 598, 851, 97, -81]
7033h1m50L9o22Q79j80j82J143q1o26Q0J92q80PL42J20Q38pR9n2k85p22K2j58
7056e65R3M89l8L96J79k93K09n03n54j17J78K58K72N11O08l88p04l15l41J77N29
7077H1p42N03L16N10m85n72K52J05j567L08P58O87J54kk42L96o08Q5k27j137K06
7098a221J562O82j80k4l65j17o06j73r3JM10N0O18L48m0k75o38m53p1l08O80M51
7120B38J35L7K42j33p63k37M5l48M04N16L81j27K53k24m23m01j07k70K54O63N46
7141F81k45L46k29n86m20j39J60j16P02L39M11n7m00j60n65l45k40K84L77N11
7161C09J38Q7K18l88n16k70m19J08L71O00k6M08p3l61m73Q2m53N3K31M93O78m04
7183C93p63M04o94L64k61l26J452j075P30J79L39m87J91j336K37O39n88O81n06
$$ y = [-81, -531, -492, -1114, -235, -415, -597, 546, 465, -161, -81, 111, -769, -762, -420, -300, 538, 531, 630, 578, 293, -429, -407, -565, -472, 17, -21, 375, 554, 261, 470, -33, -587, -704, -526, -268, 4, 515, 1123, 735, 31, -284, -625, -448, 81, -661, -158, 158, 668, 183, -389, -137, -32, -1599, -1291, -533, 154, 308, 306, 64, 460, -148, -63, -290, -1427, -1221, 341, 1023, 843, 819, 454, 337, -269, -442, -535, -534, -124, -74, 544, 892, 852, 577, -61, -514, -585, -893, -213, 238, 373, 410, 652, 519, -244, -481, -436, -784, -380, 136, 517, 390, 643, 419, -4, -405, -512, -782, -528, 135, 681, 436, 782, 553, -33, -453, -592, -432, -548, 154, 493, 904, 847, 447, 287, -278, -623, -863, -579, -202, 309, 447, 534, 752, 364, -152, -422, -841, -733, -362, 238, 212, 620, 547, 186, -287, -205, -658, -605, -374, 119, 797, 393, -370, 34, -660, -296, -557, -883, 569, -506, 224, 403, 742, 255, 446, -890, -653, -14, -602, 79, -427]
7202d27N25J417p80j056m9K21o14R5P46O33j68M89l12o49n23j26N74m38j75O31
7222A4N40m31K30j98j23p4j89j67k1O90K29M57p86M86l83n26m29L8L37L01M58
7243D53K32N1J40j014n89Q4m8P55q15Q19M72J07k75j50k69p10j40K02M97J058
7263H60m91M37n44L17k15r28J85n18P54Q30K36n21J64l41l51M73r37J26L2P48
7283C16N83j05m39j15j46p79K10J34R7R4O46L36m68k0l22j24o77N52q3R14j59
7304D45N63l41M01r63l37kq16N02L41L29N39P3k46l54j84k80n54K44L03K81M99
7325D43p4P14o59n15k48k64q5K97M61L51K60J97k80m45n61o46L22L04N39K04K99
7346F14K18l18n92j63o17Q1L39K12M32O4L88om59l28n07j79J40L06O57J61N24
$$ y = [-427, 98, 1515, 735, -321, -370, -149, -763, -668, 78, 711, 543, 1032, 720, 71, -452, -578, -4, -442, -617, 14, 554, 123, 353, 155, 32, -42, -231, -398, -419, 271, 500, 957, 171, 657, 274, -252, -681, -643, -306, -5, 453, 685, 736, 876, -138, -727, -643, -691, 64, -751, 68, 540, 647, 372, 222, -47, -757, -897, -695, -198, 860, 369, 806, 262, 579, 364, -564, -379, -897, -143, 687, 923, 402, 566, 225, -126, 347, -590, -464, -432, 316, 899, 794, 355, 240, 94, -685, -475, -341, -244, -150, 496, 832, 364, 344, 22, -102, -779, -227, -310, 604, 445, 1008, 667, 1068, 105, -232, -234, -1050, -548, -207, 122, 661, 734, 488, 134, -50, -330, -884, -640, -337, -56, 443, 369, 1083, 424, -91, -339, -603, -688, -391, 70, 421, 681, 878, 598, 153, -408, -1054, -732, -428, 111, 315, 614, 832, 514, -78, -241, -858, -777, -438, -226, 206, 270, 658, 652, 193, -135, -642, -821, -681, -375, 282, 443, 967]
7367I67q08J32j50q14J24k20M91O60O3L14R8l82k88j062L4j29J001l93J146m66
7387C18P41j128k39r11J32J21j02J451j0j50N21l00q76k12m48N71j19o7R27J14
7407C34M55o38J99l46o69K59n12O85J16Q64m8M1l85n19m15j28R7N00K80K93J75
7428F38L40n64n17l64K1n5JM36O69l3m9n0k18m99l90m20N90K03P36J89K0J21o30
7451A75m03m92Q3K66J74M70L50J10k67k92j98n57k02l9N60L65N42J23M1m01m24
7472a6l93k83k9M29L40M07J63n1j2m70n08k73p7L47L47M73J99l0p2m14l91j22
7494d36l80J86O06L38M5M48N7q13l16k57j0k96L87M88L72M02k74k75n60j59k34
7515f81K12j03N01M22K47J88l72m13l56o69QN35Q05K6K46K30l13k83r08n5j9L69
$$ y = [967, 159, 291, 141, -673, -549, -769, -278, 382, 445, 759, 857, 475, 187, -875, -841, -970, 31, -362, 784, 318, 1059, -69, -308, -1219, -1087, -966, -1068, 383, 373, 223, 744, 444, -432, -644, -1092, -521, -640, -707, 220, 334, 789, 151, 350, 4, -665, -406, -918, -233, -117, 747, 699, 740, 355, -164, -579, -707, -610, -110, 170, 463, 638, 978, 414, -103, -467, -446, -501, -500, -64, 605, 572, 523, 473, 255, -244, -634, -1054, -464, -261, 475, 664, 684, 805, 175, -228, -720, -637, -371, -197, 273, 623, 733, 466, 174, -24, -581, -783, -822, -262, 103, 645, 768, 809, 408, -16, -409, -692, -721, -292, 48, 455, 618, 567, 555, 85, -423, -696, -773, -426, -79, 394, 593, 563, 491, 77, -314, -436, -816, -630, -24, 314, 359, 807, 864, 51, -265, -522, -532, -828, -441, 47, 419, 821, 547, 272, -288, -447, -681, -469, -572, -71, 351, 598, 786, 414, 1, -355, -1024, -1016, -481, 324, 350, 596, 826, 513, 230, -678, -733, -752, -383]
7537c83M56J07K90N34o63m12j67n66J11K96j06Q72L18l6o1l18n34n65J31J62N00
7558c4j6N32K41k19O3k83p69l49L45J28L97M49p7m33Q62l11l24j427J51M08L81
7579b85L45j88Q81l19Q6j115q3n41Q61M03j39P09m31N21q38j44m40J6KM95N89
7600C85J95J00l65J4n17m97J65k88M01P81j05M72m5l13k83m59k60j60M79M21J43
7621B64L81p0M10j211j75k47J65k24N33M42K36L4j49m30n04j23rLM84M42L66N6
7643F74J4n89m90j48k6j52P25M28K25p9P5n92l72m0k57j53K91P92J02L03j06r9
7665E26m39n51j5k04K46N51K85L15p6k6l33q02j72l37L87O63N32L6Q8k46o2m04
7687c8o73o7K34M00L02J30O19l16n31j88j50m43J66J30L75O66o1j2l77l86j10
$$ y = [-383, 73, 180, 470, 1004, 341, -71, -238, -804, -693, -397, -503, 369, 687, 651, 590, 272, -262, -827, -696, -534, -34, -50, 482, 723, 504, 567, 284, -485, -834, -489, -361, 36, 485, 408, -25, 837, 526, 202, -1225, -1074, -666, -285, 60, -128, 753, 434, 520, -595, -678, -1219, -358, 45, -94, 615, 184, 705, -133, -277, -717, -701, -699, -204, 385, 580, 680, 315, 329, -188, -685, -520, -808, -407, 374, 269, 741, 696, 383, 100, -359, -619, -779, -300, 121, 264, 645, 575, 985, -226, -401, -648, -483, -707, -174, 268, 504, 538, 389, -41, -545, -668, -677, -674, -190, 252, 618, 674, 688, 99, -391, -539, -565, -717, 8, 436, 661, 582, 657, 65, -307, -347, -604, -757, -466, 326, 428, 731, 625, 526, 87, -464, -479, -683, -437, 114, 399, 714, 638, 612, 279, -523, -695, -1032, -645, 18, 550, 586, 674, 428, 366, -38, -711, -778, -544, -144, 158, 288, 907, 591, 60, -128, -278, -721, -555, -425, -50, 616, 555, 543, 166, -220, -330]
7708c30m47L77P0N21K94K46j3k61n69j94n88k0K35L61N94K05J81k80j34m82l98
7729f32j16M29M74L77K9J24l35k36o04j05nN3j1Q42L82K17l04n9l83q31k33K67
7751f60M00K82M59K97j52l07k91p44j68J60K78K26P15L74j84k43m51l47l71J10
7771f17L48J10O49K24J83l03o38m65j57J60n2K93N50L15J24Jm83n80l00J11J51
7792c76M91J55L83K68j52q03k33l30o7j30L58O00L67J28j31j58m34n41J27p7J24
7813d31J91O79M70j40j04q44m09l40R7O38K53K85K16k2l2n13l32j24l75L34K88
7834b15N85J62L15r4n42n73l96K90J17J26M44N0P9M76p00j69p52P9J09N48J54
7855I3L63J74J76o65j65m16j43J11r0N42K91M65j0j84o12k76k39o5J55N45J89
$$ y = [-330, -777, -400, -330, 191, 485, 731, 718, 457, -112, -306, -894, -914, -679, -318, 276, 481, 662, 382, 248, -234, -632, -748, -319, 155, 532, 561, 685, 350, 114, -490, -595, -600, -547, -558, 284, 666, 883, 579, 520, 137, -694, -927, -660, -260, 22, 481, 778, 626, 319, 28, -716, -884, -724, -446, -220, 495, 869, 685, 442, -9, -356, -727, -617, -269, -159, 490, 714, 897, 594, -44, -509, -666, -506, -558, -265, 285, 600, 724, 725, 242, -338, -638, -527, -376, 115, 270, 653, 921, 769, -34, -267, -597, -664, -794, -436, 164, 531, 659, 528, 370, -64, -605, -478, -555, -431, -240, 439, 909, 769, 665, -179, -588, -928, -831, -193, 60, 345, 561, 539, 507, -6, -338, -462, -837, -503, -215, 370, 532, 847, 753, 211, -362, -758, -468, -351, -225, 219, 269, 348, 824, 124, -45, -797, -718, -609, -61, 93, 456, 630, 806, 141, -24, -440, -583, -472, -562, -20, 271, 736, 726, 542, -70, -346, -585, -650, -495, 50, 239]
7876B39M51q2j48n13j27j26l83N5N37L69L4M98j82n18k65l60j64J54L25K40K59
7897B93L90m8m36j65o01k92K52L41K29N79J51%l17m70k57m48L8L58M3O64L65J34
7919H03m94k68k02m71k35J47P22L19M16K7k43l49m50l45J25M8L10N61J17J13N3
7940G04l32o48r6l14k07N73N34jM84r0l50m24j39l70J80J56J31Q58j4o5j20n81
7962a31k68l6m41N06L89L57M27j57j63l63m07k80r8N9M99O61J20M12m55m82p01
7983e52J21l8k6L74N02M20j76n1m87k68k70l50Q9L70N79M20k40L80l49m65m69
8004d86k24P5N61K75K15l4L10o19j19l94l98J3L91L53L92Q5L14j69l67l33n12
8025f71R1oO56J6N71Jr2m88l35k12m41L53M94R4L51L46l9n05j87j33m16j04N32
$$ y = [239, 690, 608, 460, -53, -180, -306, -689, -634, -97, 272, 306, 804, 622, 104, -161, -521, -685, -531, -206, 34, 293, 683, 635, 199, 34, -567, -859, -607, -266, -37, 542, 693, 693, 376, -94, -351, -799, -761, -403, -360, 304, 669, 803, 309, 41, -161, -632, -867, -720, 2, 321, 737, 764, 521, 172, -278, -623, -498, -450, -140, 421, 538, 651, 704, 372, -276, -372, -686, -893, -320, 214, 213, 697, 607, 257, -167, -306, -676, -496, -340, -209, 649, 635, 570, 450, -131, -399, -435, -876, -370, 19, 376, 803, 646, 483, 120, -287, -567, -665, -606, -107, 554, 674, 1086, 631, 149, -552, -431, -469, -495, -121, 381, 801, 625, 574, 87, -181, -451, -801, -712, -342, 237, 657, 417, 797, 448, -17, -486, -710, -635, -74, 201, 416, 382, 692, 73, -46, -440, -838, -825, -434, -81, 311, 396, 710, 541, 174, -159, -671, -580, -586, 70, 86, 657, 658, 566, 78, -257, -469, -910, -557, -63, 31, 382, 728, 689, 184, -3, -136, -552, -656, -124]
8048a24L34L75J60r4l12q1n08m42k4M32L63J38M60n5m1o25l00k38j82J47M25M86
8070B94L78k64j7k43n34m24O5K90r5N74N07K70m56l03j44l16m02j30L60Q23J13
8091C46P7m4J16k50q70m4L38k52K75J314k45j48j22r40K76m68J22P5K41Q36K92
8112I25k47j08l62p05l04K95k00M76O31j12K50m2k77o13j90Q2j45J78P65n7N25
8133G65J9p22k43k01PM4m3N79J74J63P2l10m57k35j49l1J48M83L06J21L44j49
8155F85j048j68J30o08P71K69L98k9K49k1m72l42m62k64L86O66R3K61J31k6o89
8176i0k51k71l8JJ75O13K04L83L3o30j00l27p60N03J22
$$ y = [-124, 210, 585, 745, 651, 339, 258, -250, -692, -716, -284, 79, 217, 677, 622, 581, -44, -344, -582, -764, -617, -192, 294, 672, 408, 391, 148, -386, -810, -745, -455, -550, 24, 531, 801, 345, 42, -102, -418, -820, -950, -590, 233, 346, 423, 379, 495, 245, -625, -669, -331, -583, -308, 1006, 761, 613, 491, -449, -173, -641, -519, -444, -203, 633, 925, 678, 570, 208, -497, -801, -506, -706, -230, 401, 289, 539, 497, 220, -393, -583, -501, -646, -468, 297, 240, 765, 784, 62, -181, -382, -375, -331, -374, 205, 379, 542, 614, 304, -153, -388, -537, -568, -420, 63, 369, 490, 834, 685, -363, -531, -401, -1009, -238, 31, 429, 400, 649, 628, 156, -186, -648, -912, -526, 140, 233, 494, 625, 599, -90, -341, -612, -650, -649, -474, 139, 343, 726, 759, 129, 29, -298, -1058, -555, -433]
8191d33
$$ Imaginary data points
##PAGE= N=2
##DATA TABLE= (X++(I..I)), XYDATA
0@%%%%%%%%%%%qJ6j6J6k2L0l3M1n1N9p2Q8j04J21j41J65j94K26k58K93l35L82
33B03m32M89n52O20o96P78q67R68j079J197j327J470j624J790j973K176k397K641
51A385k910L207l539L909m322M791n329N951o678P541q591R899j1582J3833j7016
66i451K1908l0464M9701j73025K6904K62337j42395M553J25407l3227j44335L116
78c8971k1731K042Q9861N701j01862P0541R5652o3104k7155N0877j14981r2829
90a45959R8422Q398q6136J78145K01002j50948j76510Q2195P898j34656J5749
101a02400J16373L6396K3605j9381r1169K4639Q7091r8403j03495R6608L4867
112D731r4778P1733J40009m1624l1167N8856j12498j63422P8811J11249m9003
$$ y = [0, 0, 0, 0, 0, 0, 0, 0, 0, 0, 0, 0, -8, 8, -8, 8, -14, 16, -17, 24, -27, 32, -40, 48, -56, 65, -76, 89, -105, 121, -137, 156, -179, 203, -229, 260, -292, 328, -368, 410, -457, 511, -568, 629, -698, 772, -852, 938, -1035, 1141, -1256, 1385, -1525, 1682, -1857, 2052, -2270, 2521, -2808, 3143, -3535, 4006, -4585, 5314, -6268, 7565, -9451, 12457, -18007, 31694, -141331, -114427, 147910, 5515, 10068, 135475, 102248, -42087, -38971, -60702, -58660, 31201, 36902, -64960, 5581, 101233, 38129, 10974, 61851, -53130, -145959, -47537, -39139, -125275, 52870, 253872, 102924, -73586, 8609, 16507, -118149, -102400, 13973, 50369, 73974, 54593, -36576, -11937, 75154, -23249, -126744, -30136, 4731, -90047, -18314, 121695, 80071, 48904, 107760, -4738, -168160, -89349, 21900, -27103]
123b7103K3127J14848k3352q8330k4339m0529q392Q0653j1694p5495Q9242J04706
135A13342q3109l6027J02630l5243j39314L967L2630m0516O4202J16955k9628
146F9889n3013K6989n3496r6984L1795N9684l663M7913M9981n2054j2805N8617
158G2853n2209q7609M3674K1972p9930J9070J05015M863j7682L8553m2554r3045
170f7029O226K3290k2982N5951Q9641k0995l4518K3886l9760p0994K3329K0789
182a3166m4213K0061O3885j2106o037N1694j8497o8579R51J258m5222L2016Q3873
195D5918N844j2044K8957l1704p5583o290J1023k6105K4109N8811l714j0152L4290
208D3360o652m4985k726l768l4023J5711M6682N31J1375M6756j8160o9855j5739
$$ y = [-27103, -3976, 110872, 87520, -810, -25149, -65678, -74070, 6583, -5111, -80606, 8636, 113342, 30233, -5794, 96836, 61593, -77721, -73754, -41124, -81640, -17438, 99517, 69889, 16876, 43865, -9631, -106615, -74820, -15136, -18799, 29114, 79095, 27041, 14236, 72853, 20644, -66965, -23291, -1319, -81249, -62179, 42836, 47699, 30017, 68570, 26016, -67029, -60803, -37513, -60495, -4544, 85097, 64102, 29584, 53470, 13710, -57284, -33955, -13166, -57379, -37318, 26567, 14461, 8424, 60118, 41621, -26958, -26007, -24749, -69971, -37955, 45918, 51762, 39718, 68675, 36971, -38612, -44902, -33879, -59984, -35875, 22936, 19222, 9070, 43360, 36708, -8277, -11003, -14771, -48794, -33083, 13599, 14130, 25505, 72261, 54101, -15754, -31493]
221c1493L328l2508L184N2321K3395P144K1572j0774l4848l966o849l1012M881
234c5625L5945Q154Q493L0635m578l4288j1217j7892m0768J568M2861J8202Q992
247A0482L2388J1243k7733k3128j6621k0075N21J7574Q411J7800L0426l3k4752
260A6503j3010j4864l0662j0219J8500J8326K1121L2008J2103j3908j4842j8311
272B745k8970j3809R369J4920J8946K3783R947p456j2671k1615k8294j2672P385
285c8392J3564K1118L0217J9313n91j2755k1102k6933j9577l579Q646J9995K5958
298A5882J7122K329q835j9459k6847j9770m267J0645K1215K6888K3709J0130o661
311D2081k1061k6956k3167j2456K012J7111K5838K2800J0898l138j6115k4325
$$ y = [-31493, -28165, -60673, -57489, -5168, 18227, 25371, 46943, 36169, 1321, -2645, -9494, -40506, -35625, 320, 8474, 16967, 47602, 43024, 8736, -2481, -20373, -61141, -59573, -16712, 1490, 10482, 42870, 54113, 26380, 3252, -13369, -33444, -32923, -15349, -6938, 10862, 41288, 41255, 16503, 3493, -11371, -42033, -52252, -33752, -15426, 5695, 37703, 49806, 35898, 21056, 2745, -26225, -40034, -30665, -15745, 3201, 26984, 36931, 29475, 16804, -4811, -33105, -45777, -38392, -24828, -3710, 26507, 45820, 45229, 32474, 11372, -15561, -35138, -38717, -30071, -10076, 15882, 33004, 35333, 26498, 7039, -19808, -39578, -43845, -33200, -11985, 14903, 38612, 48742, 42081, 21020, -5936, -29103, -41559, -39547, -22436, 3402, 26202, 37100, 33962, 17847, -6478]
323f478k3952j3036L619J8636K6184K5209J6388J089j6242k7850k7014j6848m143
336d4438J0825K4893K6978J7234L854j1359k3340k5268j7073m783J1054K5462
348e961K8499J9675O313r873k4761k6676k3351j4377O432K8359K6637J5137J3640
361C9693K477k4366l3128j8328o169L882J9984K6167K3462J6355l255k7132k6830
374g188j8182k0421o410K3317K9119J9439K2125P561k5904k8005j3308k0132j2625
387e0614K5383L5465J6674J3847P266j9586k6065j9580k6754j0924K5522K2922
399f444Q646L0103K4558k1935k9193j1230k7035k2830K2876L1047J1999K8238
411C8800K1977k7101l3257j0162k5604k2657K4233K6519L731K6779K9323j8433
$$ y = [-6478, -30430, -43466, -39847, -21211, 4973, 30182, 46570, 47659, 31417, 3567, -23447, -40295, -44438, -33613, -8720, 18258, 35492, 39346, 27987, 4647, -20621, -37694, -42477, -31423, -5961, 22538, 42213, 48526, 38653, 13892, -12784, -36135, -50512, -44080, -15721, 10916, 26053, 39693, 42170, 17804, -15324, -33652, -39821, -35939, -15955, 10212, 33674, 50029, 46774, 19642, -7188, -25370, -45791, -52201, -28884, 235, 19674, 41799, 49360, 23456, -4549, -17857, -37989, -50614, -25231, 10234, 26908, 40755, 48021, 28435, 2370, -17210, -43964, -54888, -29366, -6444, 2202, 32305, 56863, 34928, 5735, -5495, -32530, -55360, -32484, -1437, 10562, 38800, 60777, 33676, 419, -9743, -35347, -58004, -33771, -7252, -3521, 23258, 52581, 34148]
423C4148k2101o84k9449l4183J5983K1813L523L8228L8930k4677l2231l634l4702
436b9036l9199K4831L3726J563L1375L5410k8210k7564J5744k0757m5006J1772
448c5351K4771o200K2718L7372q217n471P352n5711n8571L3550L1334k0041L5919
461C454O9381j8376m4742L639k4179l9798K6907K4564k7132J9517N2398j5484
473C0149k4677K1353j5814m3955K165r637k3990O5337P4684l8250k9354M9137
485E7148k9948r9893N841O1035m32Q185L5277j6265j4057K5637k9612n0002L1777
498a5309J9389m8980Q613N9351J448J0064M3622n3182q4469L2044K3920o8929
510g2418K2667J19014O116p0726j617K396l2109O026K276k4158M4013M6417n5085
$$ y = [34148, 12047, 11363, -18086, -52269, -36286, -14473, -10950, 27278, 66208, 41531, 9300, 5666, -29036, -68235, -43404, -9678, -8115, 23260, 58670, 30460, 2896, 18640, -2117, -47123, -35351, -10580, -16780, 5938, 43310, 35093, 29622, 36974, -18737, -77308, -43758, -12424, -32465, 3454, 72835, 54459, 9717, 13356, -10823, -50621, -23714, 850, -26282, -6765, 45633, 30149, 5472, 26825, 11011, -32944, -30779, -40416, -64406, 931, 75615, 37365, 8011, 57148, 27200, -72693, -66852, -5817, -6249, 1936, 37213, 20948, 6891, 32528, 2916, -47086, -15309, 4080, -44900, -36287, 23064, 24512, 34576, 78198, 25016, -59453, -27409, -3489, -72418, -49751, 69263, 75379, 4653, 3036, 5432, -26677, -20651, -18375, -42533, 1480, 47897, -7188]
523g188j6072Q4717O71p9791N80O289n9335K0046Q1747j2223j2609P0751j9660
536E7923j16701j0445O0325p514j431L9452j390P48K5656m5590m3722O7781J7601
549D2693j04421j4466Q9301j245k6017O5652J5847o9064j1459k814o3090J9752
561e9331J00892O161l8176K9138l388n5947K904Q892l3573L2114M5460o3907k4794
574e3555J03383K2963q3440P196L5874o9406l8121N6224K0245J2515O1624j3332
586F2170q1030n11J7175n2140N212O9485o194k2881M0215r422m6998M4873L0205
599E0159q1588k7421O1544j2274k9781O9281M3963m3568j5716j2798o4913k532
611f5644O3604p25o204O1824R89o9078N767K9085m2930o683M4961k6471l0400
$$ y = [-7188, -23260, 61457, 62128, -17663, -17083, -10794, -70129, -50083, 31664, 19441, 6832, 77583, 57923, -58778, -69223, -8898, -16412, -17843, 21609, 20219, 20967, 46623, 1033, -42689, 25092, 42693, -61728, -76194, 13107, 11862, -14155, 51497, 67344, -1720, -13179, -15993, -79083, -59331, 41561, 47722, 9546, 38684, 35296, -20651, -17747, -8855, -42428, -10314, 35146, -28761, -53555, 49828, 72791, -10649, -3453, 32421, -36985, -75106, -18882, 1363, 13878, 75502, 62170, -18860, -19371, -2196, -54336, -49124, 20361, 14167, -8714, 31501, 22079, -24919, 19954, 50159, -31429, -58850, 2694, -9580, -39361, 29920, 73883, 30315, 14599, 1801, -63112, -65644, -2040, -2765, -8969, 52855, 53844, -15234, -9467, 19618, -23312, -29995, 14966, -11505, -41905]
624d1905O0002K6767l9820J7943K1494o8160m0585L4957O37K098O9123K1836m9392
637A4995n72N143n9428j0750N5288m502k2948M3574J2962m0711J7373K8715m7213
650h074k8031K4382j9120j8344O0237L7312k3220J0730O955o4070l3923L4094
662b1072J962p011M8686K0487l4575K978J3198m0902j5662L1045j5268k5098M0297
675i35K9404j5877J7682J9491m5582l4248J0590j6597j1980N2454L5880j9603
687B0679L035R570m0546k6387J7441n307q664L5883J7936j7986J6479K1808l3417
700A0524k8431Q324j6445k1004L1415L0844j08J6739J3202l6799l1266N226r746
713b7525j0686L1733K7227l904Q397J0720k6300k0730L858j5813j7803K2718K3602
$$ y = [-41905, 18097, 44864, 5044, 22987, 44481, -23679, -64264, -29307, -28670, -26572, 42551, 64387, 14995, 14423, 19566, -39862, -50612, 4676, 174, -22774, 20800, 33762, -6949, 10424, 39139, -8074, -36105, -11723, -30843, -49187, 11050, 48362, 25142, 35872, 42827, -21243, -55166, -21072, -19110, -26121, 22565, 43052, 8477, 11455, 24653, -16249, -31911, -866, -16134, -41232, -935, 28469, 12592, 30274, 49765, 4183, -30065, -19475, -36072, -48052, 4402, 40282, 20679, 23714, 33284, -7262, -33649, -16208, -21515, -30179, 5704, 23640, 5654, 22133, 43941, 10524, -17907, -9583, -26028, -47032, -15617, 15227, 15119, 31858, 45060, 8261, -23005, -17779, -27525, -38211, -6478, 20749, 16845, 25242, 35962, 9662, -11068, -7210, -23023, -40826, -18108, 5494]
726E494J015J5911J8900j9875k5561o269j6509j3872K2328K5154N859J5171J2288
739D0034k1795k3574m690j3734j3464J5684K0559O101J4783J4827j1560j7291
751E880q438j8325j5663J2851J8697Q686J7837J6023j0962j9984j2438j6781j2886
764c5503Q728J6381J1388J7692J4987o636j5546j1007j5571j4578K338J2193J3430
777a704J8737J3647m191j1689j1315j8449j7178R80J3773J4146J6277J4572K289
790B9895q449j4388j8500j5331o94P612J1462J6839J6461L847p420j3507j7227
803i400j4677m841N291J2511J7819J7084N847n024j1580j6596j6449q537K495
816b6057J2087J7068J5279P869r33r674j6980j7618q271J727R628J5308J6977
$$ y = [5494, 6509, 22420, 41320, 21445, -4116, -10385, -26894, -40766, -18438, 6716, 12575, 27746, 40034, 18239, -5335, -10025, -23759, -37223, -21539, -980, 5121, 19904, 34731, 23171, 5880, -2558, -20883, -36546, -23695, -4998, 3688, 21525, 37548, 26586, 6602, -5836, -22617, -35503, -26775, -10394, 994, 18686, 33673, 27037, 11491, 484, -15087, -29665, -27327, -15134, -1704, 17033, 30680, 26489, 14800, 3485, -14964, -32142, -31162, -17389, -3243, 13034, 27606, 29895, 21446, 7058, -11442, -26773, -27467, -19855, -8393, 8446, 24907, 28754, 21334, 7827, -9400, -24077, -28918, -23627, -11116, 6703, 23787, 29634, 24610, 13030, -3566, -20015, -28552, -26057, -13970, 3098, 18377, 26246, 25313, 15639, -1341, -18959, -27230, -25503, -15875, -567, 16410]
829A6410J1333K28r843j6214j6199j0817k628O726J6167J8094J0927J760n792
842B0152j3359j7555j2577l732N733J4878J7287J1885M108l113j3353j9593j3336
855b2575l923K931J1927J7249J3308O765J75j2935j8690j1935n620j933R657J9790
869D191J3981O798J572j0510j9070j2996p819m438R769K0174J3385O470N617p418
883A9706j9131j2438p036q506N638J9728J2551P936R947n204k0149j2084r686
896a8728j2852N682K3369J2779O188J2113k134k1196j2945p486j2586M293J9891
909c612O662N079J9082J940k1832j1317n326j7336k559J7927R266J1788K5036
922C4798j271k7949r218j458k1962o695K3477J3825N483J6037j801j8647J807
$$ y = [16410, 27743, 27971, 18128, 1914, -14285, -25102, -27730, -21004, -4837, 13257, 24184, 25944, 20152, 6793, -10762, -23339, -27071, -21338, -6460, 10827, 22712, 26820, 23707, 10354, -9239, -22575, -26498, -23567, -11640, 5609, 18917, 25682, 25857, 12922, -5768, -17703, -23323, -25256, -15599, 4191, 18172, 24970, 26542, 16032, -3038, -16034, -23853, -28291, -18522, 1652, 15037, 21507, 27124, 19706, 575, -11863, -18899, -27405, -21767, -2039, 10512, 18448, 28395, 23191, 3042, -9042, -18728, -31580, -25898, -2529, 10250, 16438, 28551, 26417, 5221, -7724, -15210, -27796, -23503, -3612, 3050, 8129, 27211, 29151, 7319, -3998, -9324, -26660, -29219, -11292, -2026, 9762, 34798, 33527, 5578, -3640, -5098, -27060, -33755, -10278, 3547, 9030, 25067, 23266, 4619, 6426]
935F426k207l0343q203K6012O174k464K4071J4934j4310p978j3056l3282k645
948c6871K9478J946k439L4165J5044k9077j5106R10j6695k955J5709p972p68L8240
962B3609J1191k9626K245J4956l1049k8944J1251O921R967L7237Q101k6003N932
975A5788N108m6917k1684L7485J3963j1041J8633J1150j5528Q995N101l8384j1199
988b8530K9477j3691k6604L7552L9481j1146l637j005l7577j6364J8747j2022
1000b5319n365N5302K5297m2176j0855K0883k1849k0643J6855n364r961L2040
1012H845R555k6247K4087L4272m0576m2226J4051l658j4466L6956K7769j2733
1024A5629J4766Q127n7129k8641M1671M981k6556K7286K6880k1998K587J7505
$$ y = [6426, 4219, -26124, -34327, -8315, -2141, -4605, 19466, 34400, 20090, 12112, -944, -34226, -36871, -7393, -5447, -7886, 26279, 41323, 12246, -2860, -1950, -18645, -21600, -5891, -13863, -14631, 23609, 34800, 5174, 7419, 22375, -8674, -37618, -26367, -19446, -9479, 27758, 35859, 9856, 15788, 20896, -26021, -47705, -10220, 3743, -7298, 11335, 22485, 6957, 15952, 21053, -17331, -28530, 947, -12744, -39348, -1796, 37685, 26539, 22902, 21897, -15680, -32044, -13297, -25319, -30684, 24618, 49915, 7739, -3116, 17767, -4082, -24725, -7870, -13234, -23195, 8845, 18400, -7847, 16240, 50512, 9936, -32290, -18239, -21897, -36363, 593, 28362, 15629, 30395, 38522, -18607, -47248, -5577, -596, -27152, 134, 27014, 5016, 7603, 25108]
1036B5108k5428q994K3293k9518l9110L9022L8739j7480J3352K9756l4848l7646
1048b3754Q245j4530j3846N1373L1337l3276N67K7691l1786k8310K5442n18k5156
1061b6521J9357J1838k2699K6842M2700l0976l2176J8032j9982m1796L0049M1652
1073A6320o021J4767K2978m1619l4923K3982n588k7009L2629K7550k8314K361
1085b887L1593j7462j4932K4735k0043m5483J9326K6358j6801K3136M6958k3746
1097C0752l8160P301j7695l2592L2277L5835j5893Q167K7652k8485k5687K5830
1109I302m363l3722J5969J6613k5919J2296M4862q657k0481J5223k0653m6585
1121d6115J3871K9381q322K0065L9651k2558l4102J2207q579l0076J9866K3879
$$ y = [25108, -320, -9314, 13979, -15539, -54649, -15627, 23112, 5632, 18984, 48740, 13892, -23754, -15509, -30039, -43885, 7488, 38825, 5549, 6116, 33807, 2021, -26289, -847, -1365, -26521, -7164, 4674, -18025, 8817, 51517, 20541, -11635, 6397, -13585, -55381, -25332, 16320, 10299, 25066, 48044, 6425, -28498, -4516, -10104, -37113, -4484, 23066, -5248, -2887, 28706, 11244, -3688, 21047, 1004, -44479, -25153, 1205, -15596, 7540, 54498, 30752, -7408, -107, -17802, -50394, -18117, 17718, 1825, 9992, 37644, 9159, -16528, 9302, 4939, -28783, -12814, 3799, -22120, -9824, 35038, 26381, 5900, 21123, 470, -46115, -32244, -2863, -11185, 8880, 48531, 25973, -8129, 4078, -4501, -34577, -14711, 9168]
1133I168k0771M732L2384j2680j4762K5559p950m2952K589J5318j5742J7110M4027
1146C6030n622j9747R852k0063m1743J3155K7348j0644R076L1996j1082k0351
1158a795J5582n513k8401P707J1266k2491O099L7306J471j0320J5684j0984l9251
1171b3640l244J1654j0137J5556L8059k851j7948R858q212l0787L636J4619j1896
1184a5333L382K5726j280p666J8033l884l0771m285M664j6494O796L3447P477
1197A9812m943J1673r032l2121m377Q018r971P336K6394J731p865J1555k464k3689
1211g943l231L685j4169Q20K3097P819J147J4804k901k4879r256p64j2988L807
1225b0952K4095Q588n74R451l655k0189o073L47j1195Q77J8981P373P34J2694
$$ y = [9168, -11603, -6871, 25513, 12833, -1929, 23630, 15680, -27272, -24683, -9365, -25107, -7997, 36030, 30408, 10661, 20513, 450, -41293, -28138, -790, -11434, -2358, 29638, 18556, -1795, 13787, 8274, -20127, -12420, -1154, -23645, -17546, 19760, 21231, 10911, 26595, 15611, -23640, -26884, -15230, -25367, -9811, 28248, 25397, 7449, 17307, 9095, -21692, -18056, -3437, -15333, -11951, 13775, 12495, 4829, 22862, 18978, -11793, -16078, -11414, -27908, -21112, 12335, 19812, 14869, 26542, 17510, -14611, -18988, -10970, -20941, -13605, 12789, 14520, 6655, 18210, 15746, -7943, -11174, -7489, -21658, -20838, 2259, 10078, 11225, 26029, 23128, -1751, -11007, -11771, -24759, -20952, 3143, 11731, 11157, 20608, 16953, -3236, -9309, -8962, -20157, -19280, -299, 7074, 7808, 20502]
1239B0502K144j6066r963n873j2489r1J5973Q240N652J3216J95j6645r686l846
1253h737j0315j054J4089R084N219J1107J769j2115q602n852j1867m836R974R058
1267c078P955J1867L082q426p521q540j2698l119R667Q895O678J1383M808o489
1281A4464r272r102j1051m948M541O853R039J2329O000m180o497p955j1823o420
1295a8022K940O965R204J1454O329k068p059r163j2031p750R33N967R238J1417
1309H354Q381J095m539q811j1781p989o82L946P207J1821R249J510m624q776j0709
1324f348r508l283K706R340J1770R289L989j348p264j1175j0059m722J375O675
1338h563J0827R992M266j563o013j0776j0931n534P38O032J1193J0908O658J231
$$ y = [20502, 22646, 6580, -3383, -9256, -21745, -21836, -5863, 2377, 8029, 21245, 21440, 4795, -4891, -8737, -19052, -20106, -6017, 3067, 8286, 19393, 21162, 9047, 445, -5407, -17274, -22110, -12136, -3078, 4877, 16744, 19826, 11400, 3879, -4661, -17359, -20478, -10811, -1916, 4762, 16145, 20953, 14464, 5192, -3910, -14961, -19909, -15368, -8515, 524, 12853, 18853, 14673, 8176, 221, -11602, -18022, -15082, -8117, 1087, 12541, 18870, 16802, 9743, 580, -11451, -19201, -18268, -12301, -3063, 8354, 16735, 17830, 13291, 4480, -7301, -15290, -15972, -12026, -4819, 7002, 16251, 17761, 13137, 4361, -6348, -15856, -19139, -16433, -7093, 4677, 13966, 17955, 16607, 9343, -1832, -11891, -16613, -15238, -8563, 2264, 12256, 16522, 14959, 8946, -1830, -12761, -18295, -17557, -11525, -332, 10576, 17234, 18465]
1352A8465m598j1107j1229o329k013L374J0558J0739N905K755k815j1240j1821
1365i356n950j974J649J0278J2873P525M077k034j0437j1241o171n881j873R649
1379h866J3480P050L721L55q165j0865p752q160p02J3259J3070L451N770O225
1393B1871q624j5908p727m236l555O507J0173N961R167P273q791j3974n386o118
1407a3367o130O135J1348Q599J2977N964j4781j3290J438q648j6530P435K0396
1420A546M939J341P268j025p654n830j2617j0655R954J1463P1R863J6355n089
1434A9930j3783n567j4688j3514J2839J4054m979R082K3256n728k2739k478K458
1447a857j0329l126M834M830J5917J2875j1324p222R204j3824k8867L616J7750
$$ y = [18465, 13867, 2760, -8469, -14798, -16811, -13437, -2879, 7860, 13765, 16520, 13705, 2465, -9356, -15306, -17280, -15631, -5353, 7520, 15045, 19122, 17088, 6651, -4590, -10761, -16642, -18515, -8866, 4614, 11664, 15385, 15740, 7575, -3290, -11042, -19202, -19904, -6645, 6425, 9876, 15646, 21871, 13247, -2661, -10388, -14624, -18179, -11672, -1499, 4462, 13629, 20902, 12111, -1863, -7249, -13367, -19497, -13362, -2014, 6585, 19562, 25526, 10745, -2545, -1107, -9755, -26285, -18850, 1546, 6485, 7826, 15094, 14069, 6415, 585, -12032, -22687, -12733, -1270, -1199, 8664, 25019, 19930, 6147, 580, -14108, -27622, -14783, -729, -5708, 3374, 26630, 20902, -1837, -4315, -1857, -12186, -15312, -10478, -5648, 10269, 23144, 11820, 4598, 13802, -22, -28889, -25273, -7523]
1460g523N53J0134K1863o299j5088M781q703k5053M959K2545j446k504J3266L560
1474A5045l800P00j5526j7445J0576M534j8672J2832L9299r28k0976O147m434
1487G352k7921k135J5595j994Q835K4087n843j8457O218m92j8895K27N984r276
1501a6715R219K2552p217m354K4923o865m2580l376K0285j0316m07L1414Q722
1514B5285j4569P76q482k4500N331J5475j1214J769K3895l457j0957J8061j5k5854
1528h456K534P014k7057r72L9654O821j5180J4757J873l4655r909J2478n761P530
1542i329K7801m306j4569J5594o26k7009O258J4879k2773q032K6034m17q896K6212
1556B0821P979l2620r071Q874j9729k523L4342J0266j0484J3252l064l0691j14
$$ y = [-7523, -6970, 3164, 25027, 18728, 3640, 8421, -282, -25335, -20376, 2169, 723, -1781, 11485, 15045, 11245, 11945, -3581, -21026, -10450, -5916, -24588, -11756, 27543, 26615, 5639, 11786, 7352, -20569, -22704, -7109, -9103, -268, 23819, 17976, -481, 5737, 5245, -13650, -13423, -7439, -16715, -7496, 15056, 7839, 3485, 28408, 21543, -21037, -24413, -4128, -14444, -14851, 16563, 25285, 10716, 11492, 3010, -21490, -16159, -684, -11898, -10129, 13766, 10309, -648, 17413, 17398, -8456, -5922, 1092, -25965, -26937, 12717, 19538, 4358, 19115, 20988, -13667, -23576, -11098, -16859, -9329, 18472, 14166, -403, 15191, 14565, -12444, -6186, 8693, -14080, -22112, 3922, 3505, -5391, 20821, 28800, -3820, -12891, -4017, -23746, -26269, 8073, 18339, 7855, 21107, 18043, -12648, -12762]
1569a2762J6153j5838l723K4934m269j6641K1650J2619k3195J63J0481k6773j3699
1582c0900K7123Q879m842K3910O715l1747q864Q382j9106l662L1422L561j6485
1595e614J4818P132k2751K802J5880j9624j2888J9591k565j1239K7763J7755k2259
1608H801o294N294k6152j3356K5765P684o278K1073Q163k7686m863J4580j4460
1621g729r274J9619n43j4198J7484J3495j5107L402J2106k5882k0901J6314L352
1634g862p294K4629J8200j8408o385N389k0472j1126K1562M741j1130J5409J0869
1647A8122j7290M54J3626j6164j4978J0968m287j2439K1204K0383r762L07Q877
1660A9021k1721j9271J1748L538m946J8787J3886j4373l236Q439j4932j3044J1837
$$ y = [-12762, 3391, -12447, -16170, 8764, 4495, -12146, 9504, 22123, -1072, -909, 9572, -17201, -30900, -3777, 5102, 260, 24170, 30885, -862, -9726, -1344, -20450, -24112, 7310, 10871, -5614, 9204, 16336, -6415, -3613, 12267, -7357, -20245, -654, -3219, -14458, 13305, 31060, 8801, 2507, 7801, -18351, -31707, -5942, 1742, -4536, 16537, 24700, -2986, -7849, 6731, -7729, -17003, 2616, 2073, -12125, 5359, 18854, 3747, 7149, 19255, -6627, -27528, -11214, -7862, -15156, 9473, 27673, 9265, 2880, 8269, -12203, -23329, -1767, 2974, -8156, 7253, 18122, 832, 1286, 14912, -1252, -16230, -5262, -9549, -21988, -784, 19599, 9837, 10144, 19021, -2700, -21971, -10223, -6685, -11631, 7156, 21042, 6669, 3433, 11872, -3060, -16104, -4267]
1673d267j053j2216J3117J5702o394M365J2155j5116j8239M320l184q427J7156
1686b081J8561o012n49O307j6464j6251P295J286p774J2438J3762n755K365J0469
1700A7597r956j3432K709m978j1067J0631J5365m08M777Q499j3071j6859J362
1713h831l602p337J2605J6267j227J612P757q374j2466K92m211q894P293J1419
1727B303m26N702J0108p386j3134k792n820q567Q027J4244L526N665Q175o935
1741A2690j2879l336m679p633M378R854L554N238P226m096r115l113o185r553
1755a7649M305J0821M832O829R499l002j0147o132p053q179K241P924M884O948
1769F121P556j769p583m752o397p839J697O912N628P667Q763m14o870o358p669
$$ y = [-4267, -5320, -17536, -4419, 11283, 4889, 9254, 21409, 6293, -11946, -7626, -10810, -19237, -2081, 16480, 10468, 9919, 16226, -238, -16489, -9194, -7908, -15682, -3244, 10518, 4763, 7128, 17597, 7641, -5791, -3082, -8060, -19127, -8496, 6869, 6461, 11238, 19737, 6666, -10193, -8831, -12433, -19770, -7165, 9102, 7875, 9487, 17244, 8870, -3596, -3304, -7515, -16409, -9116, 2303, 1877, 7579, 17687, 10301, -2833, -5625, -11445, -20012, -11985, 2259, 5785, 11450, 19625, 12690, -189, -3525, -8204, -15837, -11459, -1605, 1949, 7187, 14413, 10317, 1202, -1911, -8096, -17649, -13344, -2523, 2309, 9138, 18637, 15635, 5488, -644, -7697, -15876, -13635, -5711, -827, 6121, 13677, 11908, 4325, -427, -6824, -14663, -12966, -6054, -426, 7241, 16004, 15590, 8720, 2362, -5307]
1784e307q565j566N662O174P498P692J262m553n285p949p414n31M952N380P547
1799D997Q308K167m357o395p756q236l754K759N454P817P973L546k584m881o659
1814a601q028j748J792N087P293Q638J943j392n230p641q485m281J99M336P307
1829a811Q468M735j3l079o225p561n199j03M025O999O892M345L20k831o940q776
1845f754n883m00K615N787Q062O072K267r78n451q885m877l91J019L327P714O988
1861A0232J893l455n306o672n108l851j148N485J0428N410J690J807k534p895
1875I76p161k448j226L094Q538N155J55J597n32p872r081k523Q24L245N060M343
1891B144O320O860m089j1201l171q5o297k748R203Q415J417J706j51p387n498
$$ y = [-5307, -13872, -15438, -9776, -3602, 3896, 11588, 12850, 8297, 3012, -4937, -12351, -12882, -7930, -2550, 4997, 13305, 15472, 11115, 4720, -3036, -11272, -15026, -12267, -6813, 1004, 8977, 12523, 9939, 5058, -1601, -9629, -11377, -9585, -4498, 2795, 11433, 13376, 11984, 6754, -887, -9372, -13653, -13454, -9118, -1811, 6657, 11392, 11379, 8300, 2075, -5486, -10685, -10788, -6763, 236, 7128, 11473, 11793, 8962, 2022, -6754, -12637, -13037, -10422, -4635, 3427, 9499, 11766, 10788, 5337, -3548, -8425, -8816, -7797, -4470, 3244, 10232, 12125, 8670, 3364, -3308, -8416, -12267, -13415, -7930, 2498, 7908, 9598, 11405, 8871, 976, -6185, -8633, -9859, -6765, 1773, 6928, 7083, 8680, 8148, 276, -8805, -11328, -10504, -7259, -2199, 2144, 8464, 15324, 11235, 34, -3137, -3222, -9519, -12267, -3064, 5351, 6768, 8474, 8323, 936, -4562]
1906d562j979m199p06P999P711K417L175j57l641k444o003j0773M70J1595J953
1921H56l442J0153Q139j0399j0703j90k284k815N351N623L460P796J533q316l516
1936A246J4p983m637N312J110Q10J2609M669j0982j696N586j1903j3107J0346
1950h606J1325n89M304O389l691m534l421j0364k941R340n10n359J1406Q813p208
1965D354r22M866j1587j0537Q392K408o110J3033J5471p740q705J132p689r900
1979a3534M102K967M7J2178N308j0603J581R826j1565j2101Q738Q78r943R998
1993b123J5546m935j446P253j3941j7143N310M140m028J1700J2897o156k211M898
2007I761j1961r386J2137m75j3041J0383J3726q642j72J3592q755j7565K963j448
$$ y = [-4562, -6541, -10740, -11446, -3447, 4264, 6681, 9856, 9699, 6058, 3614, -2389, -13162, -12692, -1097, 856, -2586, 7567, 15706, 5307, -5396, -5586, -7870, -10685, -5334, 289, 3749, 11545, 13078, 4762, 1246, 1260, -6723, -11360, -6048, -4938, -4128, 8481, 13150, 2168, 472, 6058, -5845, -18952, -8606, 2719, 2130, 6434, 12823, 9132, 4598, 1177, -9187, -12128, -2788, -3298, -8657, 2749, 11562, 4354, 3432, 8298, -3289, -13826, -5434, -3026, -9136, 3897, 19368, 11628, 2923, 4055, -3634, -13534, -9432, -6465, -6418, 5760, 11068, 465, 2046, 11872, 307, -11794, -3056, -2178, -12121, -2123, 13423, 8488, 7042, 14295, 354, -16789, -11479, -7339, -11367, 333, 13230, 7074, 4863, 9761, -2200, -11586, 551, 76, -12965, -2582, 11144, 2502, 2330, 15922, 7167, -10398, -7435, -8883]
2021h883j0226J2474J8754k979p48P709j3341j5808P331K391q719J1736J2803
2034A2494j1278j872J3594p466j3962P672j284j6861P003J7339k481L813J5413
2047B2124j0267k0027K616j471j1412J2582J8227p418j871J1230j0843j5253J0123
2060a660K446j5201O091J3450p572K145J9102m364j5843M025m984j9793P348J9737
2074D927j785K185J4721j0332j9339M500R64j2332R288J6477q412k655J5831l828
2088A0210j2911P974j053j9886J390J3377m967M215K1365k954j8144J240l205
2101c349j6804O320J9103k843L22J4543p063j6020P162K316j5577K180J1320q213
2115f603n28J9346R64j1499O074l297k1552o1J5045j643M059J8589k782j6280
$$ y = [-8883, -19109, -6635, 12119, 9140, 8392, 16101, 2760, -13048, -5717, -3326, -12045, -309, 12494, 1216, -656, 12938, 5472, -8490, -818, -2102, -18963, -11960, 5379, 2898, 6711, 22124, 11857, -8170, -5554, -7025, -18437, -5855, 12372, 4954, 3083, 14313, 3470, -11783, -1660, 786, -14415, -8324, 5126, -2446, -301, 18801, 14437, -1406, 2619, -2365, -22158, -14810, 4927, 3142, 5327, 20048, 9716, -9623, -5123, -4159, -16491, -7203, 9274, 862, -1793, 14038, 10210, -2701, 5273, 4220, -15666, -14276, -899, -5866, -1651, 19714, 16760, -1384, -144, -3349, -20153, -13833, 5270, 2427, 2749, 17292, 10229, -5791, 1371, 3687, -11890, -9710, 1610, -6603, -7131, 12215, 13179, 1680, 7754, 4457, -17095, -17156, -2111, -3754, 305, 18894, 16112, -168]
2129a68J751j301j5666L585J4227m887k626J4245m09r992Q001J769j7834k609
2143a1914R448o381J348K0305L914j1385J975k987j8757j607J3238j994Q05J5451
2157A1459K71j2257M216K249j3176n96P417o792r78J5138L528p045O820Q8j8153
2172g811n991P531l405J672J6482M050p966K166o27j3784k576Q825l256j686J1234
2187D858K756n788O063J780j3068m492M369o861k144J5169P270m177L190J237
2201A0162j2894o700M363k800M13J1811L643m983L514J922j0078m235L078n322
2215h106k709J0354N150j921O212L476j0888o804J083m081j873R337O090o06L708
2230H422K65q848m388J668m767k624Q395N074r90M799L658o613n379m08n285l692
$$ y = [-168, 1583, 282, -15384, -11799, 2428, -2459, -5085, 9160, 8751, -1241, 6760, 8529, -9305, -11914, -2466, -8847, -7499, 12806, 16720, 5335, 7310, 4323, -14434, -16041, -2803, -4797, -3992, 11459, 11730, -527, 3689, 5938, -7238, -7834, -417, -7209, -8187, 6951, 10479, 3434, 10254, 10342, -7811, -13802, -6271, -9676, -8004, 8478, 12528, 4562, 6728, 6101, -7683, -10259, -1434, -4690, -6376, 4858, 7614, 1826, 7889, 9669, -3399, -7891, -3522, -10383, -12527, 2642, 9912, 5735, 8925, 10162, -2732, -9432, -5069, -7869, -7456, 4355, 7998, 3015, 6529, 8451, -1627, -5862, -2784, -8106, -10815, -461, 4689, 2768, 8980, 12456, 1568, -5236, -4153, -8234, -10107, -770, 5320, 4714, 8422, 8687, -161, -4549, -2881, -7648, -10272, -1877, 3197, 2207, 7006, 10664, 4051, -1328, -1736, -7021, -10713]
2246a0713O611N867O15M896K917o088n594j545m288k551N922M604R53N039L332
2261I977m732m408j389m969m095L877M363J948M912L703k919m660k639n022l607
2276i660L524L739K988N126L540k655l799k363m796l865J353L152K769M988L632
2291G673r14l019k580n438l827L70L170L253N053M428j79k648k837n555m439j09
2307g598K108K537M880M889N27j792l096m734m407j203J522K857M982N507J125
2322H104j509k622m528n014k731O64L279M901M548J602K86j965m975n499k267
2337g726J142K049L869N331L249J70k250m884n155k451j003J441L799N488L854
2352F923R00j859m254m275k975k027O3N298O208K621J26lk381o253m838j684J463
$$ y = [-10713, -4102, 1765, 2380, 7276, 10193, 4105, -1489, -3034, -7322, -9873, -3951, 653, 1606, 6645, 9977, 5245, 837, -552, -5521, -9616, -5739, -1376, 572, 5484, 9187, 6268, 1608, -1031, -6053, -9660, -6136, -2397, 591, 5717, 9257, 6602, 2803, 440, -4356, -8221, -6868, -3716, -947, 4041, 7673, 6759, 3740, 1160, -4278, -8105, -7735, -4565, -1312, 3741, 8169, 7990, 5342, 2505, -3050, -7489, -7598, -5490, -2953, 1927, 6816, 7343, 5551, 2455, -2279, -6686, -7889, -6367, -3510, 1472, 6979, 8104, 6595, 3973, -555, -5569, -8300, -7636, -4357, 544, 5092, 6694, 6980, 5015, 40, -5459, -7726, -6584, -4535, -666, 4665, 7914, 8084, 5834, 950, -4205, -6656, -7659, -6218, -2419, 3069, 6923, 7823, 5964, 1710, -2565, -5540, -7567, -7504, -2206, 4002, 6623, 6749, 6746, 4365, -1888, -6726, -8410, -6947]
2369f947L638M395L443K518O40l175o129l475j701l31L042M847L530K905J933
2384I133m204p132k245j161k554J003O635N537K067L67k413m130k596m018l665
2399i376L754O198K261J751L992j531n776l553l328l947K074O387K920K285M785
2414H896j88o519m658k577k641J507M317J807M323N160k450o733o68j367o944
2429h735p29O439K685K742O741P6n971k143k925p051n82O814K968K089N646o3
2445H001n711r52k808p545R35O489r50Q69R212K509n943j299j554q539k110N134
2461d262L43L051R771J367p271r65j375q770j157O932k63P39R270P10o264K138
2477C994J263j0426m025N329j457M7J0569M518n043R27j328j1780l396P116o35
$$ y = [-6947, -3309, 1086, 4529, 7047, 7687, 4512, -1617, -5092, -6793, -7124, -4082, 765, 4295, 7200, 9133, 4929, -2203, -4448, -5609, -8163, -7160, -525, 5012, 7079, 7446, 5033, 903, -1693, -5711, -9376, -5622, 576, 2837, 4588, 8580, 7049, 1273, -2280, -5608, -9555, -7481, -1094, 1826, 4111, 8896, 8708, 2189, -2469, -5046, -7687, -6180, -1863, -56, 4267, 9427, 6977, 244, -424, -1791, -8735, -9464, -3025, -340, 2402, 9143, 9219, 3248, 1105, -1820, -8871, -9453, -2639, 329, 2418, 8064, 8001, 2290, 1338, -1470, -9015, -8080, -1591, -2541, -1672, 7540, 10049, 4106, 2807, 1253, -7286, -9396, -4262, -3919, -868, 8903, 10270, 2999, 2034, 659, -8111, -9268, -2336, -2599, -1860, 7410, 8120, 1856, 3994, 5257, -5169, -9194, -3865, -5322, -5275, 5294, 9812, 4769, 5696, 4368, -7412, -10808, -3692, -4327]
2492d327P36J0857K175p319J636J263j0053k353O565l745l255J0424M566m815
2506B355M336K360j2255n610M543l066p91J3366N297o162J801N91j2056l945P770
2521a466k876k876J0431L395p237M801N609r903n049M815o346n079J2158O715
2535G092l830N140L364j3422p698N437l041k604J2893M976p382L269M816j0608
2549a598m202P892n323o981Q480N217n150P801P559j1122p346L767p092o173J2630
2564a641Q382m463M805M776j2713o137P252l863n892J0333L965q070N095Q644
2578A0473p738m622N447p703j0068Q994O929l951Q252R598j0934q551L553n562
2592e883o567J0942O645o327M232P139r156m940P780m501r786O425L780n485P492
$$ y = [-4327, -3591, 7266, 9441, 2122, 3758, 5021, -5032, -7385, -820, -4565, -7820, 2604, 7170, 2355, 6691, 9051, -3204, -8814, -4271, -7337, -8128, 5238, 10535, 4373, 6174, 6765, -5291, -9236, -1466, -4342, -7218, 3213, 6608, -629, 4172, 9781, -122, -5171, -356, -6702, -11781, 377, 7092, 3262, 8402, 11766, -1656, -9354, -3917, -6958, -9562, 3331, 8307, 925, 4194, 9010, -1598, -5800, 2092, -3231, -10212, -1732, 3485, -1665, 6136, 13695, 2573, -4773, -1006, -8098, -14271, -1641, 6741, 2278, 7083, 11859, -854, -6991, 261, -3602, -9494, 839, 4804, -3266, 1829, 10473, 2735, -1887, 3560, -4143, -14211, -5217, 1712, -2239, 6013, 15611, 4677, -3874, -321, -5883, -12450, -1508, 5137, -1190, 3042, 10181, 1025, -3915, 3865, -636, -10422, -3997, -217, -5702, 1790]
2607A790J1255o653n699M417q477j1558Q114P800k728O287P946q985o422N464
2621B551n059p938Q244M505p354M111J0022m686l231N973o496j1448M422L865
2635b519m844P758J2170m545o544K652o526r219O513N728m865N155Q526n695m802
2650a057O923l294r891K740K458n850N142J0931k397j924M754o448j1812K287
2664g438M816l527N524J0363l705m171L681m704q607L748L358o132K949R373j544
2679C984j549N701l277r888M5J192n175M624J0956k48k523L756m246r532O06K670
2695b904l879L377Q285j116j934N086k005p869l83R44n682J977Q702P37M24N048
2711H808k867q871j525O54m289K469Q639R20n86L524j504p150p10L17m853J402
$$ y = [1790, 13045, 6392, 693, 5110, -3367, -14925, -6811, 989, -1739, 4548, 12494, 3509, -2913, 2551, -2508, -10446, -2202, 2303, -5051, -940, 9082, 4396, 1165, 7138, 642, -10806, -6384, -2519, -7363, 395, 12565, 8020, 1476, 4128, -2398, -11617, -5104, 624, -4241, 914, 9440, 3745, -1057, 5866, 2572, -7319, -4579, -2121, -7971, -2829, 8102, 5705, 3781, 8535, 2087, -9725, -7438, -2622, -6149, -625, 9738, 6033, 1862, 5543, 839, -7768, -4020, -662, -6794, -3845, 5528, 3984, 2435, 8136, 4859, -5029, -4984, -3792, -8967, -4343, 6613, 6365, 3842, 7598, 3352, -6180, -5574, -2904, -6783, -3406, 4879, 3763, 1829, 6915, 4910, -2959, -3342, -2398, -8080, -6103, 2599, 3336, 3760, 8808, 5941, -2930, -4455, -3801, -8090, -5621, 3018, 3938, 3352, 6876, 5372, -1778, -2488, -2171, -7024, -5622]
2727e622O123J027Q18N099o56o616j918j170n400J170P174K038J359M091r11o156
2743D50k329r45m212Q31N472J984R48M113K67m874j892j606m828k40M415K554
2759A08J766M930O68m687l075j907m248l62L820K556K076M373Q48m226j835j771
2775i66m442j276K578K610K395M628J221k657j699l064m672k020K902K557K328
2790D23M024K252j681k398k955m055j792J604J675K414M443K751j717k079k510
2805C99l694k411J37J523L361M372K248p68j396k298l943l689M92J763K842L853
2821B791K435O3o86k270m549l082l70J307J979L750L273J287o27k878m147k776
2837d500o06K60J519L752M364R18j045j854l129l152k078k94K457L772L558J114
$$ y = [-5622, 501, 1528, 2346, 7445, 6789, 173, -1745, -2915, -8315, -7145, 29, 2067, 3426, 7517, 6606, 450, -1879, -2824, -7036, -6205, -733, 1251, 2199, 6312, 6579, 1705, -187, -1793, -6621, -6861, -2446, 108, 1874, 6804, 7472, 2785, -290, -2197, -6445, -6807, -2987, -431, 1645, 6018, 6866, 2640, 805, -966, -5408, -6684, -4106, -1496, 899, 5527, 6748, 4091, 2392, -672, -5344, -7364, -4462, -1905, 423, 4447, 6699, 5018, 2620, -335, -4390, -6182, -4578, -2903, -489, 3954, 6705, 4988, 2909, 399, -3295, -5706, -5569, -4046, -685, 3687, 5935, 5167, 3771, 1473, -2470, -6159, -5667, -3904, -1062, 2791, 5226, 5289, 4603, 2333, -2216, -5298, -5668, -4361, -2382, 1368, 4641, 5928, 5301, 2423, -1724, -4500, -5106, -4846, -3327, 425, 4789, 5707, 4662, 2808, -321, -3473, -5551, -5845, -3388, 384, 3942, 5056]
2853E056j26p93l735m097j882K08J503L565L060J897P92o37l488m690j426m09
2869e202Q82K561L833K642J311p60m186l558j027j765o01L565M623J791J259m23
2885D945k585l440k126j982p05L230L713K085J408J195k046m071k048k550p56
2900e733K343L338J963K722K205l158m358j976j443j617J969L212K322K670J606
2915F065k520l255j162k648l219K405L624J292L219L012k356l623j254k723l567
2930f710J793M020J308J734L904j883k379r11l612k002P32J935J06L368N454k026
2946D831k721J31m140n165J420L940j45L177N852j914l494j16k778m744J356K754
2962a756o59L046N325j529k334J659l102o650N69K716j538L746P235p76l017Q43
$$ y = [5056, 4930, 4137, 402, -3695, -5577, -5369, -3866, -301, 2759, 4656, 5448, 4811, 1323, -3367, -4793, -5202, -4320, -1759, 2074, 4716, 6027, 5267, 1081, -2477, -3504, -5269, -5870, -2305, 2318, 4109, 5368, 4945, 2360, -1080, -3206, -5188, -5893, -2663, 1050, 3135, 4543, 5738, 3692, -379, -2427, -4977, -5733, -3390, -52, 1911, 4633, 6838, 3680, -678, -2654, -4097, -5714, -3745, -533, 1789, 4459, 6065, 3545, 290, -872, -3520, -6739, -4334, -710, 582, 3801, 6813, 4457, 834, -420, -3143, -6710, -4917, -897, 411, 2145, 6049, 4166, 1787, 876, -2736, -4738, -4006, -2071, -1965, 1403, 6857, 4831, 2110, 2241, -1899, -7064, -5644, -1704, -1849, 1328, 7180, 5266, 1772, 1656, -1122, -5866, -4510, -1756, -2415, 631, 5956, 4427, 2093, 3752, 650, -6000, -5431, -2715, -4253, -507, 6728, 5952, 2935, 3778]
2978C778l381p123J114L660j531K879O378j385k888K496k309o734P39K434l748
2993e621K349P974K6j699L304l271q681k94L076l088L059Q451j17l651L113k779
3009B151p384J333K928m273J335P719n55j920N171r17q524p36J234n396K082R737
3025C985O86k214M657k196r925j93L434m141J996Q242j195l170N803j08q059R5
3041b303K278o257j153Q287Q36o95O902j81r757j488J739o259J055J0219J218
3056D441k969N151q41q778M74L315o476r36Q068r08k153P092K461p403n09L36
3072C65q043r49R073R47j289Q207O42j0329j352K507o329n62Q437J80l097O337
3088D745J923p034O39L192p904l555O547L14j451R330K866q188j101J181r029
$$ y = [3778, 397, -6726, -5612, -1952, -3483, -604, 5774, 4389, 1501, 3997, 1688, -5046, -4307, -1873, -5621, -3272, 4702, 4728, 3029, 6333, 3062, -5619, -5913, -2837, -5925, -2866, 5585, 5468, 1817, 4930, 2151, -5233, -3900, -972, -5245, -3910, 3809, 3254, 1334, 6505, 5588, -2936, -3672, -2438, -7834, -5752, 3985, 4671, 2457, 7114, 4918, -5007, -5200, -1766, -5907, -3911, 4331, 3136, -34, 5769, 5661, -2398, -2303, -25, -6282, -7435, 852, 1688, 993, 7895, 7714, -2043, -3531, -1792, -8051, -6996, 3223, 4441, 1472, 6623, 5782, -2996, -2522, 793, -5683, -6619, 1449, 541, -1612, 5480, 7941, 538, 29, 365, -7678, -8627, 446, 1393, 104, 8311, 8953, -1376, -2728, -221, -6550, -7112, 1325, 1505, -1592, 4745, 6668, -366, 273, 3465, -4439, -7994, -1447, -1133, -2584, 6746, 9612, 1424, 323, 1504, -7525]
3103g525k668R239K298k514O634K469p860n69L035o307k730O604j102l060P663
3118C607M036n847N10J752q792m859O645R17j767R217M357p486j741K484p205
3133d172l421O792K79k586N998K989n452J418L009p257m437M833j429k347Q580
3148B797N248m250o42J930p967n379N282J223k098O468L959m892m31K724n746
3163a774l595M498j506l558O639M899l302J422L228o629o490K854p12j711N869
3178A32O125l624j28J772n538m295M067l91k911N605K960k267J537L269m527n623
3194c837J753q98l907M821N567j542R66L346m985m984K452j914k762N765M484
3209D325k560J212L189l954m044l04j24l464K706M426o63J308M790l997m518J92
$$ y = [-7525, -10193, -954, 1344, -1170, 5464, 7933, 73, -496, 2539, -3768, -6498, 106, -996, -4056, 3607, 7643, 1796, 2306, 4058, -4734, -9593, -2948, -2031, -3798, 5419, 9776, 2290, 549, 3033, -4172, -7593, -801, -522, -3108, 2890, 5879, 427, 1845, 4854, -2403, -6840, -2007, -3436, -5783, 2797, 8045, 3795, 3153, 5083, -2884, -8263, -2981, -1758, -3856, 2612, 6571, 1679, 1248, 3972, -1774, -5369, -871, -2377, -5935, 704, 5603, 2301, 3723, 6951, 322, -6168, -3314, -4026, -5737, 132, 6257, 2633, 2505, 4277, -1261, -5556, -1489, -1880, -4791, 814, 3774, 1507, 3044, 6313, 1786, -3837, -2084, -2982, -6889, -2068, 3499, 1957, 2923, 6269, 1284, -3700, -1248, -3162, -5924, -159, 4325, 1765, 2977, 6166, 2212, -1832, -2136, -2260, -5724, -3018, 1408, 745, 2053, 6843, 2846, -1672, -1480]
3225a480j646l158L429N142k95J406K531l019m125P7j521l344L033L391k96J165
3241A290L465j324l047n46k220k669J480L309P68J828M015k499l792o16j501l487
3257e546O93L330J089K777K427q50k501k53k326l600P66K626P16J382L666k02
3273D194j924j124k276l097r76K748J339N79M374J519k950j084k110k575k11J213
3289b361O31K331L392K70k036o23j921l162j495J323J387K563K925J208r63o69
3305B800j892l456j547P01J021K052K823J142O0p69k484l629j096P50O55J616
3321a253L444K297q0q19k115k554k407p18N34K138K936K036M81p09j683l056j883
3338c411o95m8K311L356K418M8J20j245k989l225r32O27J334K172K125J716O58
$$ y = [-1480, -3126, -6284, -2855, 2287, 1992, 3398, 5929, 2910, -1215, -1138, -2659, -6003, -2970, 421, 125, 1290, 4755, 3431, 384, -162, -2382, -5051, -3571, -262, 506, 2334, 6349, 3850, 58, -558, -2059, -5546, -4853, -1523, -434, 2343, 4770, 3920, 1419, 1166, -1160, -4760, -3994, -1368, -652, 730, 4396, 4194, 2270, 1146, -1130, -4227, -5203, -2455, -1116, -537, 3837, 5356, 2406, 1322, -788, -3363, -3574, -2361, -1730, 601, 3993, 4263, 2227, 1604, -317, -3479, -4974, -3651, -2264, 299, 3224, 4432, 3469, 2800, 908, -2548, -4095, -3394, -2373, -321, 2502, 3644, 3704, 2935, 451, -3178, -4274, -3524, -2869, -1253, 2191, 4488, 4408, 3589, 1474, -1080, -3487, -4205, -3671, -1533, 1403, 3439, 3920, 3211, 1528, -1528, -3411, -4106, -4154, -1843, 1513, 3931, 3979, 4099, 2854, -135, -3360, -4292, -3665, -2331, -159, 1966, 3682, 4340]
3355D340j709l136j821j149r57J413L240K595R34P60r09l360k599j200j033M08
3371d183L061K788J746L71o58k071k300j865j743J431L052K155J094J466J80l280
3387A244k988j144j516k41K852K569J697J691J92k535k612j773j323l09K440K235
3403D79J878K489n1k719j952j797k946r80K696K667J686K437J006k279k741j205
3419a332k746m43K194K101J614K583R57k421j547j243l838j339K412J920R00L975
3435C747J637k774k374m52k846j494R53K759R02L268J348k314j183q46l648j767
3451e084K298R72L05L833K708k193p05k16l685l403J957J517k9L837L549k708
3467B953j223l83l837l076K699Q59k97M258K600j870m58M42l470l634J785J15
$$ y = [4340, 2631, -505, -2326, -3475, -4432, -3019, 221, 2816, 3750, 4510, 3601, 241, -2358, -3558, -4591, -4183, -1122, 1666, 3412, 3783, 3125, 1054, -1246, -3111, -4854, -3423, -371, 1784, 2878, 4344, 4524, 1244, -1744, -2888, -4404, -4645, -1793, 776, 2473, 4164, 4356, 1821, -791, -2564, -3887, -4196, -1756, 479, 2357, 4846, 4795, 2076, 124, -1673, -4619, -5599, -2903, -236, 1450, 3887, 4893, 2614, -127, -1332, -4078, -4521, -2327, -226, 1388, 3971, 4928, 2507, 960, -283, -4121, -5460, -3048, -1128, -228, 3747, 5384, 2610, 236, -216, -3062, -4556, -3603, -844, 58, 3326, 4674, 2360, 1177, 331, -3317, -5084, -2786, -1814, -1509, 2324, 5032, 2839, 2134, 1918, -1767, -5170, -3213, -1696, -1725, 2112, 5661, 2953, 1730, 1347, -2490, -5566, -2867, -2008, -2305, 1953, 4553, 2683, 2225, 2667, -803, -4437, -2652, -2537]
3483b537j249M959K612m71j031J532n453m246L053P33j296M399M069k206q07J215
3499C276l124m239K150n72q65K791M354k414j78L248l858l957M53J48k716N258
3515b45M568j036j119K313m594m368K320J052l144L359L954j896M76L099l011
3530A728m646J897p18m317L359N632j303J209L348l914n512J651p03l036K422
3545b903O470k374o13L515l305m030L515l26m783K791M514k129m62O829k303n478
3561a072J226j807n241K963O057j328r3M964l089n540J914J85l907K497M285k636
3577f22R75N104k143m300K798r47o866Q00N620j878J147O476j162o126J531j044
3593f37n217J792N333j315J1N669k797m196L152n56n923P35L905k527p06Q758
$$ y = [-2537, -3786, 1173, 3785, 3314, 2283, 3815, -1638, -5884, -2831, -2098, -3394, 1005, 5074, 2868, 2061, 3276, 152, -4087, -1937, -2509, -3374, -583, 3771, 1357, 1179, 4427, 569, -3388, -2935, -2787, -5503, -245, 4323, 3287, 2168, 4481, -113, -4481, -2161, -1109, -4253, -894, 3060, 1164, 1640, 4739, 1728, -2918, -1021, -1739, -6056, -2697, 2935, 1632, 2841, 6189, 2275, -3237, -1586, -2289, -5325, -2903, 3567, 1193, 580, 4095, 790, -3240, 275, -51, -4834, -2043, 2471, 342, -120, 6709, 4406, -1072, 154, -1653, -6894, -3931, 2126, 798, 705, 5669, 2580, -2960, -1046, -861, -4768, -2271, 2014, -622, 353, 5457, 3314, -986, 1812, 865, -6001, -5201, 419, -1459, -312, 6164, 5002, -1124, 407, -637, -5854, -4062, 1271, -44, -33, 5636, 2839, -1357, 1795, 1239, -4684, -3949, -44, -2571, -3277, 5481]
3609E481o86m684K145p87o302k13L913j36R75O036j658n456K761n23n213L78M422
3626D53l344L49O138M24l776K839N00o285k048L871j982p22P146J224l004Q38
3642B621q44o589L17L425j474J90N786K9l429K971N54n584j126K460k568m57N077
3659A359K572k385K364m72o126j627J747j138N48N819J660k678J311K26m899r76
3675b695K242k580q82M991J665j840K336J339n368k279J146k466j89N554K208
3690C182j381K091O81n531j939K300k424j108M562J680j110K284P65m001k224
3705b173R97j971j284M044K277l49K477J273m392k419J51k361j245M265K422n98
3721A114J748J149l328k192N92j872j957L954K165m49L133J348l610k379m77k085
$$ y = [5481, 4795, 111, 2256, 1469, -4833, -5046, -1133, -1269, -294, 5742, 4084, -1372, 1389, 866, -4347, -3969, 453, -2891, -2542, 3596, 4020, 244, 3083, 3583, -2702, -4750, -879, -2861, -3583, 3563, 4787, 1783, 2621, 1777, -4812, -4495, -1070, -2544, -2354, 3432, 3461, 32, 3003, 3557, -2027, -3153, -693, -3261, -3718, 1359, 3931, 1546, 3910, 3438, -2688, -4315, -2568, -3706, -3158, 2661, 4321, 1643, 2954, 3180, -1719, -2695, -453, -3033, -3915, 1076, 2741, 901, 3237, 4576, -792, -3071, -1925, -4391, -4580, 974, 3182, 1801, 3892, 4573, -958, -2897, -597, -3021, -4129, 433, 2113, 1003, 3287, 4052, 51, -2173, -1176, -3147, -4431, -387, 1890, 1541, 4018, 5291, 899, -1520, -1369, -3730, -4975, -710, 1712, 1114, 2862, 4011, 683, -1509, -917, -2789, -4746, -792, 1373, 924, 4057, 5405, 1795, -584, -1061, -3146]
3737c146j867K011L418L93K182J571l001j943m13k312j037K208K054K68K956Q82
3753D224j942k157K08l326j539J925K290p5K223J370j032j400j126k031j478J786
3769b080J603M98K879R51n33k862r35j562k295N30R36K672K186K073p25k208K13
3786A341k298k443N48N52Q94L688Q56L06j922r69k725j512J533k40J222K162K195
3803C188j85q01r91j922k076M42n2J238J494K099Q5Q8j460k062j571k88M18J91
3821b165K751K068J23p20L14j906k573j050P36Q03J485K254J221j071l30k040
3837a00j738j245K79N10J631K081J259K49j73j856k399n97k76k00J320K629J182
3854B556M22q11j660j423k004K55o56K131K083J216Q85j37j295j966j159r22l93
$$ y = [-3146, -5013, -3002, 416, 809, 2991, 4562, 1561, -382, -795, -3107, -4144, -1936, 118, 386, 3342, 4224, 2282, 125, 333, -2993, -4532, -2607, -317, -392, 1831, 3201, 2169, 769, -357, -2388, -3866, -2080, -477, 21, 2900, 3851, 3318, 456, -479, -2041, -4336, -3806, -2870, -198, 1988, 4061, 3336, 1128, 1341, -957, -3400, -2852, -2300, -1406, 2282, 3138, 3444, 1522, 553, -2172, -3684, -2151, -2391, -1169, 993, 3188, 3003, 2202, 1211, -711, -2787, -2345, -2397, -1159, 335, 2434, 2519, 2607, 1147, -915, -2486, -2774, -2356, -2165, 586, 2654, 2777, 2057, 2371, 465, -2108, -3158, -2422, -1619, -134, 2120, 3341, 2270, 1940, -100, -1838, -3083, -2804, -2294, -663, 1418, 2677, 2926, 2753, 897, -1502, -2099, -2375, -2575, -1255, 1374, 2556, 2978, 2167, 507, -916, -2920, -2665, -3321, -1190, 893, 2109, 2994, 2857, 1562, -404, -1563, -2485, -2878]
3871b878Q97K595R82L92P33p75k108j687n44j19N74J702J689R24P65j055j172
3888I15k151j082q52J063J800J045O67J661N7m301Q86j757L56r56K210J309J411
3905B281J102j061j517n53k222j412L71K170P69J200J614n4j842p55r47k118k23
3922c197J834J354J108K096J06j517j165j534j993m9J409Q27J248K292K25j838
3938A206o77p64k367l29J383O85J042K653N98j710l77j081k792j024J460P50R66
3955c78K928P74j738%o07l198n78J441O1M42K397J118j106K75j082l011j282J576
3973a968k66Q27L346K472k109j62p91l172o76J850n0k70L104P73j482K05R2l122
3991a399j068J440j118o60K972K520j217J767k14l749k463J498p28k55L904J675
$$ y = [-2878, -1981, 614, 1596, 1988, 2721, 1946, -162, -1849, -2393, -2512, -1938, -236, 1453, 2377, 3142, 2087, 915, -1236, -2318, -3170, -2107, -307, 738, 1405, 3066, 3123, -1178, -292, -2049, -1693, -2649, -439, 870, 2281, 3383, 2322, 805, 252, -1970, -3382, -3011, -841, -72, 1128, 2742, 2688, 846, 91, -856, -2974, -3197, -1363, -9, 1099, 3195, 3301, 1784, 619, -915, -2908, -2957, -1548, -721, 527, 2819, 3044, 1206, 529, -235, -2602, -2931, -1548, -863, 179, 2832, 3430, 1720, 1343, 262, -2530, -3554, -2094, -1344, -378, 2550, 3324, 1586, 1586, 979, -2219, -2797, -1356, -1295, -853, 1544, 2662, 1556, 1831, 749, -2262, -3544, -1968, -2234, -1407, 1939, 4411, 2302, 2140, 1349, -1823, -2499, -649, -699, -969, 2135, 2908, 1426, 1631, 1723, -1399, -2467, -1027, -2145, -2805, 167, 2687, 1470, 3237, 3023, -726, -3189, -1691, -2419, -2674, 1230, 2905]
4007B905j370P41J03l844j263J337o48r86L777J368j304J719J111l838j879J800
4023b71k386j524M205K914j438J019J169l839k262J352j387j377M663J809k026
4038F21J717J506l588k213K011k184k200L504K576j459K347K314m011k849J025
4053h83k005j727M216K405j438K137J894m506j637J358j752k055L422J465j468
4068e74J715L936l741k478K092l027l150L303K238j07K057K771l343l374J610
4083g2j682k018L489Q77k568L036K779k788j199M40k500k349K344K613k547K978
4099H33L963k261k598J710l870l073M122Q41J36J763K634l312k424K790j377m069
4115d192K410K225k744K124L142M0k852K448k696m128J679K210j222K352M022
$$ y = [2905, 1535, 2276, 2379, -1465, -2728, -1391, -2039, -3025, 752, 2120, 816, 2535, 3646, -192, -2071, -271, -2657, -4181, 24, 2938, 1500, 2519, 3688, -151, -2413, -1061, -2448, -3825, 838, 2647, 621, 2338, 3844, 256, -1957, 54, -2130, -4330, -826, 1750, 291, 2638, 4952, 941, -1908, -883, -2888, -4615, -399, 2006, 568, 2705, 4599, 93, -1544, -186, -1938, -3993, -571, 894, -574, 1141, 5077, 1336, -1142, 950, -2077, -5227, -1924, 314, 207, 2264, 5035, 1692, -1682, -72, -1754, -3772, -283, 594, -1974, 1062, 3841, 1053, -146, 294, -2206, -4555, -2211, 402, -2145, 833, 4796, 2535, -63, 1647, -2223, -5296, -1174, -333, -197, 1566, 4200, 888, -1536, 1254, -123, -4192, -1782, 443, -2301, -177, 2965, 3005, 153, 2601, -95, -4223, -2544, -334, -1556, 796, 4818]
4130D818k453k172J509k473k860J976J250j369K269L317k321j458K019j578l486
4145c012K006k94j476K143L946q23j378K29m30n211K481L19r41K412L094o44j998
4162D23K712k546k995N58O21j611J513M295j590m85J886m81m204R19P3k528K053
4179a387L468K24n65J148j666m031O53J354j695N03M040j078l65J562p03k776
4195a314j18J137l100J716L353m20J44J815p09l994j47J22j852J377L013R9l8
4212A084J696n89l293MK78j739LK662O18%K232k67k882j039K88k261M85K730P89
4231G99P29J738q42k648k92O4k629M20K750L09J48J957j1j880q99o57j873l3K291
$$ y = [4818, 2365, 193, 1702, -771, -3631, -1655, -405, -1774, 495, 3812, 1491, 33, 2052, 474, -3012, -1006, -1300, -2776, -633, 3313, 2490, 1112, 1341, 911, -4300, -1819, -1500, -2441, -29, 3065, 2421, 423, 3135, 589, -2406, -1848, -1227, -2838, -1325, 2970, 1380, 895, 2781, 2300, -1904, -985, -912, -3440, -1387, 2081, 2305, 1740, 2888, 1222, -2809, -2156, -802, -2497, -1994, 2046, 968, 603, 2165, 1462, -1314, -1432, -295, -3395, -1679, 1674, 1254, 1398, 3213, 2504, -1490, -1637, -1515, -3367, -1990, 1023, 1122, 1084, 2780, 2191, -1102, -1098, -820, -2559, -2556, 106, 724, 724, 2956, 2689, -193, -1232, -944, -3205, -2720, 10, 799, 1528, 3266, 2424, -224, -516, -452, -3081, -2661, 89, 398, 546, 2503, 2492, 612, -287, -944, -2817, -2850, -559]
$$ [...]
8191G14
##END NTUPLES=NMR FID
##END=
