##TITLE=1H_DE-123_1
 200.13MHz,D2O.
 8 sc
 
 23.1.2026
##JCAMPDX= 6.0         $$ Bruker NMR JCAMP-DX V2.0
##DATA TYPE= NMR FID
##DATA CLASS= NTUPLES
##ORIGIN= UXNMR, Bruker Analytische Messtechnik GmbH
##OWNER= pz
$$ XWIN-NMR		Version 3.5
$$ Fri Jan 23 16:22:25 2026 Russian Standard Time (UT+4h)  she@DPX200
##.OBSERVE FREQUENCY= 200.1313
##.OBSERVE NUCLEUS= ^1H
##.DELAY= (6, 6)
##.ACQUISITION MODE= SIMULTANEOUS
##.ACQUISITION SCHEME= undefined
##.AVERAGES= 8
##.DIGITISER RES= 18
##SPECTROMETER/DATA SYSTEM= spect
##.PULSE SEQUENCE= zg30
##.SOLVENT NAME= D2O
##.SHIFT REFERENCE= (INTERNAL, D2O, 0, 14.3821)
##AUDIT TRAIL= $$ (NUMBER, WHEN, WHO, WHERE, WHAT)
$$ ##TITLE= Audit trail, XWIN-NMR		Version 3.5
$$ ##JCAMPDX= 5.01
$$ ##ORIGIN= Bruker BioSpin GmbH
$$ ##OWNER= she
$$ F:/spectra/data/she/nmr/H-C/1/audita.txt
$$ ##AUDIT TRAIL=  $$ (NUMBER, WHEN, WHO, WHERE, WHAT)
(   1,<2026-01-23 16:21:39.32 +0400>,<she>,<DPX200>,
      <created by zg, POWCHK disabled, PULCHK disabled
       configuration hash MD5:
       00 E9 B6 7A A2 85 ED C7 34 08 36 98 17 FE 4E 26
       data hash MD5: 16K
       AC 6B 54 73 36 16 82 D1 03 71 72 96 46 E5 E5 2F>)
$$ ##END=
$$ 
$$ hash MD5
$$ BE 51 DB 6C 24 C5 0C 59 8D FC 42 CA 98 C5 EA 8D
##$RELAX= 
##$RELAX= 
##$RELAX= 
##$RELAX= 
##$RELAX= 
##$RELAX= 
$$ Bruker specific parameters
$$ --------------------------
##$DU= <F:/spectra>
##$EXPNO= 1
##$NAME= <H-C>
##$PROCNO= 1
##$TYPE= <nmr>
##$USER= <she>
##$AMP= (0..31)
100 100 100 100 100 100 100 100 100 100 100 100 100 100 100 100 100 100 
100 100 100 100 100 100 100 100 100 100 100 100 100 100 
##$AQSEQ= 0
##$AQ_mod= 1
##$AUNM= <au_zg>
##$AUTOPOS= <>
##$BF1= 200.13
##$BF2= 200.13
##$BF3= 200.13
##$BF4= 200.13
##$BF5= 200.13
##$BF6= 200.13
##$BF7= 200.13
##$BF8= 200.13
##$BYTORDA= 1
##$CFDGTYP= 0
##$CFRGTYP= 5
##$CHEMSTR= <none>
##$CNST= (0..31)
1 1 145 1 1 1 1 1 1 1 1 1 1 1 1 1 1 1 1 1 1 1 1 1 1 1 1 1 1 1 1 1 
##$CPDPRG= <>
##$CPDPRG1= <>
##$CPDPRG2= <>
##$CPDPRG3= <>
##$CPDPRG4= <mlev>
##$CPDPRG5= <mlev>
##$CPDPRG6= <mlev>
##$CPDPRG7= <mlev>
##$CPDPRG8= <mlev>
##$CPDPRGB= <>
##$CPDPRGT= <>
##$D= (0..31)
0 0.7 0 0 0 0 0 0 0 0 0 0.03 0 0 0 0 0 0 0 0 0 0 0 0 0 0 0 0 0 0 0 0 
##$DATE= 1769170898
##$DBL= (0..7)
120 120 120 120 120 120 120 120 
##$DBP= (0..7)
150 150 150 150 150 150 150 150 
##$DBP07= 0
##$DBPNAM0= <>
##$DBPNAM1= <>
##$DBPNAM2= <>
##$DBPNAM3= <>
##$DBPNAM4= <>
##$DBPNAM5= <>
##$DBPNAM6= <>
##$DBPNAM7= <>
##$DBPOAL= (0..7)
0.5 0.5 0.5 0.5 0.5 0.5 0.5 0.5 
##$DBPOFFS= (0..7)
0 0 0 0 0 0 0 0 
##$DE= 6
##$DECBNUC= <off>
##$DECIM= 32
##$DECNUC= <off>
##$DECSTAT= 4
##$DIGMOD= 1
##$DIGTYP= 9
##$DL= (0..7)
0 120 120 120 120 120 120 120 
##$DP= (0..7)
150 150 150 150 150 150 150 150 
##$DP07= 0
##$DPNAME0= <>
##$DPNAME1= <>
##$DPNAME2= <>
##$DPNAME3= <>
##$DPNAME4= <>
##$DPNAME5= <>
##$DPNAME6= <>
##$DPNAME7= <>
##$DPOAL= (0..7)
0.5 0.5 0.5 0.5 0.5 0.5 0.5 0.5 
##$DPOFFS= (0..7)
0 0 0 0 0 0 0 0 
##$DQDMODE= 0
##$DR= 18
##$DS= 0
##$DSLIST= <SSSSSSSSSSSSSSS>
##$DSPFIRM= 0
$$ [...]
##$SUBNAM0= <"">
##$SUBNAM1= <"">
##$SUBNAM2= <"">
##$SUBNAM3= <"">
##$SUBNAM4= <"">
##$SUBNAM5= <"">
##$SUBNAM6= <"">
##$SUBNAM7= <"">
##$SUBNAM8= <"">
##$SUBNAM9= <"">
##$SW= 18.0517328524113
##$SWIBOX= (0..15)
0 0 2 0 0 0 0 0 0 0 0 0 0 0 0 0 
##$SW_h= 3612.71676300578
##$TD= 16384
##$TD0= 1
##$TE= 0
##$TE2= 300
##$TE3= 300
##$TEG= 300
##$TL= (0..7)
0 120 120 120 120 120 120 120 
##$TP= (0..7)
150 150 150 150 150 150 150 150 
##$TP07= 0
##$TPNAME0= <>
##$TPNAME1= <>
##$TPNAME2= <>
##$TPNAME3= <>
##$TPNAME4= <>
##$TPNAME5= <>
##$TPNAME6= <>
##$TPNAME7= <>
##$TPOAL= (0..7)
0.5 0.5 0.5 0.5 0.5 0.5 0.5 0.5 
##$TPOFFS= (0..7)
0 0 0 0 0 0 0 0 
##$TUNHIN= 0
##$TUNHOUT= 0
##$TUNXOUT= 0
##$USERA1= <user>
##$USERA2= <user>
##$USERA3= <user>
##$USERA4= <user>
##$USERA5= <user>
##$V9= 5
##$VALIST= <valist>
##$VCLIST= <CCCCCCCCCCCCCCC>
##$VD= 0
##$VDLIST= <DDDDDDDDDDDDDDD>
##$VPLIST= <PPPPPPPPPPPPPPP>
##$VTLIST= <TTTTTTTTTTTTTTT>
##$WBST= 1024
##$WBSW= 4
##$XGAIN= (0..3)
0 0 0 0 
##$XL= 0
##$YL= 0
##$YMAX_a= 186697
##$YMIN_a= -167596
##$ZGOPTNS= <>
##$ZL1= 120
##$ZL2= 120
##$ZL3= 120
##$ZL4= 120
##$ABSF1= 10
##$ABSF2= 0
##$ABSG= 5
##$ABSL= 3
##$ALPHA= 0
##$AQORDER= 0
##$ASSFAC= 0
##$ASSFACI= 0
##$ASSFACX= 0
##$ASSWID= 0
##$AUNMP= <proc_1d>
##$AZFE= 0.1
##$AZFW= 0.1
##$BCFW= 1
##$BC_mod= 2
##$BYTORDP= 1
##$COROFFS= 0
##$CY= -3
##$DATMOD= 1
##$DC= 2
##$DFILT= <>
##$DTYPP= 0
##$F1P= 0
##$F2P= 0
##$FCOR= 0.5
##$FTSIZE= 0
##$FT_mod= 4
##$GAMMA= 1
##$GB= 0.15
##$INTBC= 1
##$INTSCL= 1
##$ISEN= 128
##$LB= 0.25
##$LEV0= 0
##$LPBIN= 0
##$MAXI= 10000
##$MC2= 0
##$MEAN= 0
##$ME_mod= 0
##$MI= 1.114404
##$NCOEF= 0
##$NC_proc= 0
##$NLEV= 6
##$NOISF1= 3.799351
##$NOISF2= 2.8
##$NSP= 1
##$NTH_PI= 0
##$NZP= 0
##$OFFSET= 14.38212
##$PC= 1
##$PHC0= -3707.023
##$PHC1= 14.19231
##$PH_mod= 1
##$PKNL= yes
##$PPARMOD= 0
##$PSCAL= 0
##$PSIGN= 0
##$REVERSE= no
##$SF= 200.129724274929
##$SI= 16384
##$SIGF1= 3
##$SIGF2= 2
##$SINO= 400
##$SIOLD= 16384
##$SREGLST= <1H.CDCl3>
##$SSB= 0
##$STSI= 0
##$STSR= 0
##$SW_p= 3205.1282051282
##$SYMM= 0
##$S_DEV= 0
##$TDeff= 0
##$TDoff= 0
##$TI= <>
##$TILT= no
##$TM1= 0
##$TM2= 0
##$TOPLEV= 0
##$USERP1= <user>
##$USERP2= <user>
##$USERP3= <user>
##$USERP4= <user>
##$USERP5= <user>
##$WDW= 1
##$XDIM= 8192
##$YMAX_p= 0
##$YMIN_p= 0
$$ End of Bruker specific parameters
$$ ---------------------------------
##NTUPLES= NMR FID
##VAR_NAME=  TIME,          FID/REAL,        FID/IMAG
##SYMBOL=    X,             R,               I
##VAR_TYPE=  INDEPENDENT,   DEPENDENT,       DEPENDENT
##VAR_FORM=  AFFN,          ASDF,            ASDF
##VAR_DIM=   8192,          8192,            8192
##UNITS=     SECONDS,       ARBITRARY UNITS, ARBITRARY UNITS
##FACTOR=    0.0002768,     1,               1
##FIRST=     0,             0,               0
##LAST=      2.2672688,     0,               0
##MIN=       0,             -167596,         0
##MAX=       2.2672688,     186697,          0
$$ Real data points
##PAGE= N=1
##DATA TABLE= (X++(R..R)), XYDATA
$$ [...]
2228A820p52j232j66p13o30N87J286J53O28O25q73r52m8n09p00M31J105l0J68
$$ 1820 1068 -164 -330 -1043 -1673 -1086 200 353 981 1606 733 -219 -267 -776 -1476 -1045 60 30 198
2247A98J293m07o84k59m78j299M18Q66J77R96N60j14o71o91l60q02j5R77j0Q43
$$ 198 1491 1084 400 141 -337 -1636 -1218 -352 -175 821 1381 1267 596 -95 -455 -1257 -1272 -295 -305 538
2267E38O59J38q56r3r85n20m0P40N7P00P78k74j24m66p01o03l98P23L85M84Q94
$$ 538 1197 1335 479 386 -599 -1119 -1159 -419 -362 338 1116 842 718 252 -449 -1052 -1450 -727 -342 142 1036
2288A036k37k6k80n06r99l4K56M32K98Q84K15k19l29n24r35k23M50J86N45N13
$$ 1036 799 773 493 -13 -1012 -1046 -790 -358 -60 824 1039 820 491 -33 -968 -1191 -741 -555 -10 503
2308E03M92j80p0n39p46m91j30O28L56O67M05J39j48r81m16n06J9L9Q58M80M99
$$ 503 995 815 745 206 -540 -1031 -1161 -533 -177 490 895 1034 886 -95 -511 -1017 -998 -959 -101 379 878
2329H78K5l33l43o63l32n5L80rL94R12k33K34n89p81k1m13K8O92P6R28M0J20l63
$$ 878 903 570 227 -436 -768 -823 -443 -452 -58 854 621 855 266 -515 -536 -949 -921 -229 -153 775 815 935 572
2352E72o13q03M2m7J87J016K07J86K06k48p89n00J63m10J43M44N97K47J14j30
$$ 572 -41 -844 -802 -849 -662 354 561 747 953 705 -84 -584 -421 -831 -688 -244 353 600 714 584
2372E84n62k67j58m45N6O15M04M23R8J60o50m70k34l85L01L25M01L64L04j39k53
$$ 584 22 -245 -403 -848 -792 -177 227 650 748 908 258 -212 -446 -831 -530 -205 196 560 864 725 472
2393D72r54j72l76K40O59K18M8O51K1o34k48l18j50m39M36M27K51N05L16n44m63
$$ 472 -482 -654 -1030 -790 -131 87 135 786 807 173 -75 -393 -543 -982 -546 -119 132 637 953 409 -54
2414e4l18k98m95R43K45J21N02M58n80m08n2q19j83M60L83P8O18L03o90l46L62
$$ -54 -372 -670 -1165 -222 23 144 646 1104 524 116 64 -755 -938 -478 -95 -17 601 904 214 -132 230
2435B30q43k52M66J88Q7N13Q39n61l44jp89n56L22M75ON39O11m42l80M19j031
$$ 230 -613 -865 -399 -211 -124 389 1228 667 323 322 -467 -1023 -701 -226 -220 319 930 488 108 527 -504
2456e04m11N87J12l08O52R78n06l89K80o20p81K30o5L0Q42R66n10l57N71j116
$$ -504 -915 -328 -216 -524 128 1106 600 211 491 -129 -910 -680 -745 -715 127 1093 583 226 797 -319
2476c19o52J79M90m95J071O30q27J82M75m31j277N56j99m57Q01J035r1l27L34
$$ -319 -971 -792 -302 -797 274 904 77 259 734 303 -974 -418 -617 -1074 -273 762 671 344 678
2495F78n45j180N06L13m21O22Q96n29k91Q68p69j029P90J9r52O05J097m14K0Q44
$$ 678 133 -1047 -541 -228 -649 -27 869 340 49 917 148 -881 -91 -72 -1024 -419 678 264 284 1128
2515A128o86j173M65o6j023J050J209j34m95P24r03j028O42K13n95M89Q99n67
$$ 1128 442 -731 -266 -332 -1355 -305 904 770 275 999 96 -932 -290 -77 -672 -183 716 149
2533A49l39J153j85j099L01n3j067M20J237m13j04J393m48j657L77l2p32N89J253
$$ 149 -190 963 778 -321 -20 -73 -1140 -720 517 104 0 1393 945 -712 -335 -367 -1099 -510 743
2552G43m90m99J067n48q81M85K64j066P1Q86n24L54J395j34j272K67l26j130M2
$$ 743 253 -246 821 273 -608 -123 141 -925 -854 32 -492 -138 1257 1123 -149 118 -208 -1338 -1296
2571a296J624k14J62Q19m82j349P41K12r79J46J285p57k46P90N64j000L1O08j431
$$ -1296 328 114 276 1095 613 -736 5 217 -762 -616 669 -88 -334 456 1020 20 51 659 -772
2590g72k72Q89K7L1J439k41r80j01rr79J75R22k34J80O36k0r28N29j44p05q4M17
$$ -772 -1044 -155 -128 -97 1342 1101 121 20 11 -968 -793 129 -105 75 711 691 -237 292 148 -557 -641 -224
2612b24l30K11Q80M86o03L07j92j274k51Q49j41M0J326k82j105L13N13p77o42
$$ -224 -554 -343 537 1023 420 727 535 -739 -990 -141 -282 -242 1084 802 -303 10 523 -254 -896
2631h96J122o10m94J393L1o00N07j27m83o05P25n50L0P50Q78q24q0N84j153n27
$$ -896 226 -384 -878 515 546 -54 453 326 -157 -762 -37 -587 -557 193 1071 247 167 751 -402 -929
2651i29P25k56M4J146k27o94M25N88q10l82K23n22J4N81P40l84P3N04j092o77
$$ -929 -204 -460 -416 730 503 -191 234 822 12 -370 -147 -669 -655 -74 666 282 355 859 -233 -910
2671i10O10K7m20J017M03l39p5J63p16L6L19k20m48N27O05n51L99J5l58n50J17
$$ -910 -300 -273 -693 324 727 388 313 476 -240 -204 115 -105 -553 -26 579 28 427 442 84 -466 -349
2692c49N4q00R22Q55m91J05N39p57m72J06k33k62P87L78m98N45M69q87j12p1k4
$$ -349 -295 -1095 -173 682 191 296 835 78 -394 -288 -521 -783 4 382 -116 429 898 11 -101 -172 -196
2713a96p20P18M53J1K30J60m61m91K50m14n33P68M12j14N60R6k89n29l1j69l13
$$ -196 -916 -198 255 266 496 656 195 -296 -46 -460 -993 -225 187 73 633 729 440 -89 -120 -289 -602
2734f02L16J63L30J28O15m18m15k60m41N8J41K26K63L06Kp0k65q7n70oN2M11j70
$$ -602 -286 -123 207 335 950 532 117 -143 -584 -526 -385 -159 104 410 412 342 77 -10 -580 -586 -534 -123 -293
2757b93O51K48J5n94J68l03n71R6M22K30p8N82j07l59K21n67j74L45l05K08M81
$$ -293 358 606 621 27 195 -108 -679 -583 -161 69 -9 573 466 107 328 -239 -413 -68 -373 -165 316
2778C16J38J83l74j31l27J29m11K05J13n7N96J56n9k14m88j84m7N8L36J77J05
$$ 316 454 637 263 132 -195 -66 -477 -272 -159 -216 380 536 477 263 -225 -409 -456 -398 -62 115 220
2799B20K76p2k94o1m78O2J05NJ70L47K90j42k68k36j80n05M20o1N04L01K2K89
$$ 220 496 424 130 69 -409 -347 -242 -237 -67 280 570 428 160 -76 -256 -761 -341 -402 102 403 425 714
2821G14l36j70n93J1p1JL02K83M53j08p6l95m46m5J37L4J30L58L71j03j18l40
$$ 714 378 208 -385 -374 -445 -444 -142 141 594 486 410 15 -431 -476 -339 -305 -175 183 554 451 333 -7
2843gm7k28l38M14R4k19P55p0L26l44n82r8j30J60J63K74J09M72l99k32k90M6
$$ -7 -54 -282 -620 -206 -112 -331 424 354 680 336 -246 -344 -474 -314 -151 123 232 704 305 73 -217 -171
2865a71m43O3L14J92R0J89J71n4m6o03j06k7J16j33Q43k37N58l39j47n05n86L57
$$ -171 -614 -551 -237 -45 45 234 405 351 305 -298 -404 -431 -315 -448 395 158 716 377 230 -275 -861 -504
2887e04M41j12P10P7l05J45k14j63m16m36L40L51J13j21N54K56K5j037R81q98
$$ -504 -63 -175 535 612 307 452 238 75 -341 -777 -437 -86 27 -94 460 716 741 -296 685 -213
2907b13J64j16J6N18m02N77l19m37r3j18q6J44N35J6M64j66k98j71J1l68m36M35
$$ -213 -49 -165 -149 369 -33 544 225 -212 -305 -423 -509 -365 170 186 650 484 186 15 26 -342 -778 -343
2929c43l3K80K13O88m51k26l7n91j62L71K93k74O93R9m02k3o7k85l27L33L1J06
$$ -343 -376 -96 117 805 354 128 91 -500 -662 -291 2 -272 421 520 118 95 28 -257 -584 -251 -220 -114
2951a14N38R2k70J55k19m43k66Q6J22K03Q46N8l51j73q2o43k47L61J09kM82L90
$$ -114 424 516 246 401 182 -261 -527 -441 -319 -116 730 788 437 264 182 -461 -708 -347 -238 -240 242 632
2973F32l58O9K11r35k26L43j47n7Q56L80n74J34j37k26o58N14j40J95L07N24m99
$$ 632 274 343 554 -381 -607 -264 -411 -468 388 768 194 328 191 -35 -693 -179 -319 -124 183 707 208
2994B08j42J20j63k36J74j53l84L93P00j01j77K59n04p26M62k11M3N60M55k52
$$ 208 66 186 23 -213 -39 -192 -576 -183 517 416 239 498 -6 -732 -270 -481 -438 122 577 325
3014C25K4ol76m63K28L33o53N84P70q16M28L43n93n24K28l19k65O40O89m15L52
$$ 325 349 343 -33 -496 -268 65 -588 -4 766 -50 378 721 128 -396 -168 -487 -752 -112 577 162 514
3035E14J78m40q35K39O1l16N08N69o09K96N81n97m11J0j96l56M66P75l75J83R21
$$ 514 692 252 -583 -344 -283 -599 -91 478 -131 165 746 149 -262 -252 -448 -804 -338 437 62 245 1166
3056A166q43n61j85K30p35O21Q69m11J46L37m13m73p0K16n58M84M84n05K65P39
$$ 1166 323 -238 -423 -193 -928 -307 562 151 297 634 221 -252 -322 -106 -664 -180 304 -201 64 803
3076H03n8p11J32l64l24l5M97N7L94M04k70p54p4m2n30K80R40l68J52O81l82n14
$$ 803 745 34 166 -198 -522 -557 -60 -3 391 795 525 -229 -303 -345 -875 -595 345 -23 129 810 428 -86
3098h6M16k50n39j67N81p7j02P66j21m58N1m8o99J31N86L0P8O68k53m92Q9j56
$$ -86 330 80 -459 -626 -45 -122 -224 542 421 -37 14 -34 -733 -602 -16 14 92 760 507 15 104 -52
3120e2o98M83M58m19oJ022k76m76M91m67n48J61M2q5L74P65j03o57m9O1n22m1
$$ -52 -750 -267 191 -228 -234 788 512 36 527 60 -488 -327 -285 -370 4 769 666 9 -40 21 -501 -542
3142e42M59k86Q0N69J77n45M53n02j84m9L79n9j6P38j08m09M15p71n78Q4N95j79
$$ -542 -83 -369 -289 280 457 -88 365 -137 -321 -370 9 -50 -66 672 564 155 570 -201 -779 -695 -100 -279
3164b79K50J70L11k95L4m8p65M59J20k67r3P00J92n3J15p1p98k0J83j37J9N57
$$ -279 -29 141 452 157 191 143 -622 -163 -43 -310 -403 297 489 436 551 480 -318 -338 -155 -292 -273 284
3186B84J52m5L0k62o27j0L15k10R6O71%k11L06N6q34m06N51j54K6M99j07L44K23
$$ 284 436 391 421 159 -468 -478 -163 -373 -277 394 394 183 489 545 -289 -695 -144 -298 -272 227 120 464 687
3209F87m40k93l95J71m9j84N07M65l71M20l13k23l18J88r0m25P50J49q9N36l95
$$ 687 247 -46 -441 -270 -319 -503 4 469 98 518 205 -18 -336 -148 -238 -663 87 236 147 683 288
3230B88j47m26J30m4k65L02L60k60O26J86n97m92J08j79o7L43L44k9J81O7j89
$$ 288 141 -285 -155 -199 -464 -162 198 -62 564 750 153 -339 -231 -410 -477 -134 210 181 362 429 240
3251B40m41j30J8k25K50K38L71K53m6m49j91m64r0K71J48J91M89NQ0m22r4m3n24
$$ 240 -201 -331 -313 -538 -288 -50 321 574 528 79 -112 -576 -666 -395 -247 -56 433 438 518 96 2 -41 -565
3274e65K38P4K04K04K63L07n40n3m15k11L7j02O01O5L76K49m41j25l58m16O3K64
$$ -565 -327 -253 -49 155 418 725 185 132 -283 -494 -457 -559 42 107 483 732 291 166 -192 -608 -545 -281
3296b81M07K55k21N20q2n09m35m5j87L6N19N4L72J44M0k88m02k24k86J92L30L0
$$ -281 126 381 160 680 598 89 -346 -391 -578 -542 -23 31 403 547 587 299 -103 -327 -613 -421 -91 -61
3318f1M57L00k70j48l14k08j65L23q3J38L17J20l3k9j46l57k12l08O85k34N49
$$ -61 396 696 426 278 -36 -244 -409 -86 -169 -31 286 406 373 344 198 -159 -371 -679 6 -228 321
3339C21K93j09j21k51m25j75N6N2o7N74K53r1J42m92P8m65K72j0n9J41L02J70
$$ 321 614 505 384 133 -292 -467 -411 -359 -426 148 401 310 452 -40 38 -427 -155 -165 -224 -83 219 389
3361C89J34l61n7j55n72K05J81L03L54J21l05n1j49k98k7R2n7K32J34M47p1k40
$$ 389 523 162 105 -50 -622 -417 -236 67 421 542 237 186 37 -261 -288 -196 -253 -21 113 560 489 249
3383B49K4n77r4J6MJ23P11n3l68L91l05k60k35j22J12J15N46K86k71J07j11l60
$$ 249 273 -304 -398 -382 -378 -255 456 403 35 426 121 -139 -374 -496 -384 -269 277 563 292 399 288 -72
3405g2j79k67K93R5L03K51K5J04m97k60j12k20J72M8O75J79k07L74m01l69l9k05
$$ -72 -251 -518 -225 -130 173 424 449 553 56 -204 -316 -536 -364 -316 359 538 331 705 304 -65 -104 -309
3427c09j71j58O44J55K44J04k72k22j78j45j09j11O20L55j57K36k5n86j19l0m32
$$ -309 -480 -638 6 161 405 509 237 15 -163 -308 -417 -528 92 447 290 526 501 -85 -204 -234 -666
3448f66N60m4J81L82R5k10m91p7p9j3o7N10K31r3Q8K64n49ok72j36k22M40J63
$$ -666 -106 -150 31 413 508 298 -193 -270 -349 -362 -429 81 312 219 307 571 22 16 -256 -392 -614 -174 -11
3471a1J16N50j87m93k25J63n42JN34l2O32R2j15n58Q0M3o65J62N91l11L79K02
$$ -11 105 655 468 -25 -250 -87 -629 -628 -94 -126 506 598 483 -75 5 48 -617 -455 136 -175 204 406
3493D06L63l59m23l7o65k2O06J35M8M99L3l57k19N7m20j95L26K94j66M36J21m27
$$ 406 769 410 -13 -50 -715 -737 -131 4 52 551 584 227 8 65 -355 -550 -224 70 -96 340 461 34
3515C4K59p4p22l03M49J77N3M70K71k10l17J86p25l30R56l25j51M70K36j73P0
$$ 34 293 219 -503 -806 -357 -180 -127 343 614 404 87 273 -452 -782 174 -151 -302 168 404 231 301
3536C01J9n87k10K29K58l46K95N11m40M75r5n90l06m3M06l8M66M10n49K86l26
$$ 301 320 -267 -477 -248 10 -336 -41 470 30 505 410 -180 -486 -529 -123 -161 305 715 166 452 126
3557A26l36n77N49N9j69L10O61k39n5K59p52l52K47o9n7N96M13m47J32M35j103
$$ 126 -210 -787 -238 -179 -348 -38 623 384 329 588 -164 -516 -269 -338 -395 201 614 167 299 734 -369
3578c69n4R3j05m4P19K98k44J96k49j87l89L67m10J24M18L00m02L81J47o12l99
$$ -369 -423 -330 -435 -479 240 538 294 490 241 54 -335 32 -378 -254 164 464 62 443 590 -22 -421
3599d21j16m7J7O88L04k21j54M80p16j48K64j51m75Q39J90k84L49J69o26k84J76
$$ -421 -537 -584 -567 121 425 204 50 530 -186 -334 -70 -221 -696 143 333 49 398 567 -59 -343 -167
3620a67m56N3L97O64m15M29k4p68p6l0p3j09O52J16j66L24L40n11k78n6j59m23
$$ -167 -623 -570 -173 491 76 505 481 -287 -363 -393 -466 -575 77 193 27 351 691 180 -98 -154 -313 -736
3642g36L27O65l04J75P36n68k56O1o79k60M66P04j60j67O29m69k05p6j85m69M91
$$ -736 -409 256 -48 127 863 295 39 100 -579 -839 -373 331 171 4 633 164 -41 -117 -302 -771 -280
3663b80M60O2p0N61l46l69J54n89q1P5O01k03L39N83o97k56k2k20j32P5M01p9
$$ -280 180 242 172 733 387 18 172 -417 -498 -423 178 -25 314 897 200 -56 -78 -298 -430 -355 46 -33
3685c3K24M72j40n58P6j23n93L90L20j0R2K67q0l70M22o37l63L89q5M75K44K40
$$ -33 191 663 523 -35 41 -82 -675 -285 35 25 117 384 304 -66 356 -281 -644 -255 -340 135 379 619
3707F19k86l83L17m70k59Q4R2M25k51M33j07J07j05m31k34L6J87J18L04K86K2
$$ 619 333 -50 267 -203 -462 -378 -286 139 -112 321 214 321 216 -215 -449 -413 -226 -108 196 482 504
3728E04l16J87l42l90K4J31J58J23M72j8m26j41o5l78m7J36p0Q11j0J58l73J15
$$ 504 188 375 33 -357 -333 -202 -44 79 551 533 107 -34 -99 -477 -524 -388 -458 353 343 501 128 243
3750B43j35l88n1k10L99J31L08P5j27j89K73o00j39J27p3K73L84p4MJ44j97n04
$$ 243 108 -280 -331 -541 -142 -11 297 372 245 56 329 -271 -410 -283 -356 -83 301 227 231 375 178 -326
3772c26R5k45q2J32O35M5J93j80k79k30R3k9l37J61N45J07j7J8l08j99k09J46
$$ -326 -231 -476 -558 -426 209 254 447 267 -12 -242 -149 -178 -515 -354 191 298 281 299 -9 -208 -417 -271
3794b71k4Q5M33J88nJ92m23l01k65J12k06J64P23KKJ96j28n14j87j00l25L56L52
$$ -271 -295 -210 223 411 406 598 175 -126 -391 -279 -485 -321 402 404 406 602 474 -40 -227 -327 -652 -296 56
3817E6M46j70N19n00m53l2o7k57R3J87J57J58K12J95j89o77j21N1q1M67ML66J54
$$ 56 502 332 851 351 -102 -134 -201 -458 -365 -178 -21 137 349 544 355 -322 -443 -392 -473 -6 -2 364 518
3840E18O9n43l04j44j01J92K26L58l5K61l11K9j96l00l37K89N48j46O5K00L86
$$ 518 587 44 -260 -404 -505 -313 -87 271 236 497 186 215 19 -281 -618 -329 219 73 138 338 724
3861G24n40l0o1p38K23K82J02K94L87n19J32k35l37k52J97p9L10K67M35j26k1
$$ 724 184 154 93 -645 -422 -140 -38 256 643 124 256 21 -316 -568 -371 -450 -140 127 562 436 415
3882D15l54l63L3j42J60K52J0M85L2J4o51J36o21L9L41K91J74J30L27o38k3Nm31
$$ 415 61 -302 -269 -411 -251 1 11 496 528 542 -109 27 -594 -555 -214 77 251 381 708 70 47 52 -379
3905c79k38J92J72K23M13L19l81n8l30j67l49K10j5J96P46k41j6k00r8m15j01
$$ -379 -617 -425 -253 -30 383 702 321 263 -67 -234 -583 -373 -388 -192 554 313 297 97 -1 -416 -517
3926e17n7L82J04N02J41j40J85l55m17l82L55K30j86N25K41l63o7Q6l67m86K14
$$ -517 -574 -192 -88 414 555 415 600 245 -172 -554 -199 31 -155 370 611 248 181 267 -100 -586 -372
3947c72J34l09R29L19q0k84k14m76J28O1k41kK17N88J11M8l06k08l84L1j94L7
$$ -372 -238 -547 382 701 621 337 123 -353 -225 -164 -405 -407 -190 398 509 557 251 43 -341 -310 -504 -467
3969d67N40N10K4j13j61n77j40J68m3j97R5P72j44l5J13m98k55J70j51k32M88
$$ -467 73 583 607 494 333 -244 -384 -216 -259 -456 -361 411 267 232 345 -153 -408 -238 -389 -621 -133
3990a33M60n2K11J28n34n87J86k21M4N47L69j45R3N1m42j40R0m6n29O61N74l67
$$ -133 327 275 486 614 80 -507 -321 -542 -498 49 418 273 366 417 -25 -165 -75 -121 -650 11 585 218
4012B18j47O76r41j84j8O3l84O74J51j12K77J72k5n40K01k88m18N90J99j09K0
$$ 218 71 747 -194 -378 -396 -333 -717 -43 108 -4 273 445 420 -120 81 -207 -625 -35 164 55 75
4033G5N54k31o14L63m95l79M30K28O0K28O31l32p34pm35j3L86L62k87O81K29m52
$$ 75 629 398 -216 147 -348 -727 -297 -69 -9 219 850 518 -216 -223 -658 -671 -285 77 -210 471 700 248
4055B48l63K90n45l67J10M60M96m1M91l61m67J73n83j86J17P37o4QM47l9o20Q8
$$ 248 -115 175 -370 -737 -627 -167 329 288 779 418 -49 124 -459 -645 -528 209 145 153 600 561 -59 29
4077B9J0n88N49J52j22K22M49P3p25L52m74o98K59K97p9M27N93m90k53M4k26l51
$$ 29 39 -549 0 152 30 252 701 774 49 401 -73 -771 -512 -215 -294 133 726 236 -17 27 -199 -550
4099e50J36M93l01jQ58p8o22N38m89l69k47O69j36k26J106m72l28J81r2q23J09
$$ -550 -414 79 -222 -223 635 557 -65 473 -16 -385 -632 37 -99 -325 781 309 -19 162 70 -753 -644
4120f44N24j17J40N26K03o16J51k0o34K35j27k5L25M12K40l87M20k17j056J90
$$ -644 -120 -237 -97 429 632 16 167 147 -487 -252 -379 -404 -79 333 573 186 606 389 -667 -477
4140d77J72j05L29P37m23O2J87l51p17K18Rj26L96O89j14k21K58k93p65J81k0
$$ -477 -305 -410 -81 656 233 295 482 131 -586 -368 -359 -485 -89 600 486 265 523 230 -535 -354 -374
4161c74k54L19N29Q6q1N4m5o18k87K56L1k5P69J84l74K11K36p01l96K25k36K45
$$ -374 -628 -309 220 306 225 279 234 -384 -671 -415 -384 -409 360 544 170 381 617 -84 -480 -255 -491 -246
4183b46O52rl78O69k40o65P9j47l57O35M2N39l97L21j28p24K91l67J13J66L62
$$ -246 406 397 19 688 448 -217 -138 -285 -642 -7 35 574 177 498 370 -354 -63 -430 -317 -151 211
4204B11J46K4%K80m33o11n5j4l9O37K46l36L19K37p38m56K71rJ0L02m2M66J01
$$ 211 357 381 381 661 228 -383 -438 -452 -491 146 392 56 375 612 -126 -582 -311 -320 -310 -8 -50 416 517
4227E17K1n42k43J52l72k08O43J25k5L62j22k27n4m27m28J41O51J45K8N16m19
$$ 517 538 -4 -247 -95 -467 -675 -32 93 68 430 308 81 27 -400 -828 -687 -36 109 137 653 234
4248B34j09k43j2k01j72M73J27K03K63M1m10k07l22o8k30K23P57k86N15N1k37
$$ 234 125 -118 -130 -331 -503 -30 97 300 563 604 194 -13 -335 -403 -633 -410 347 61 576 627 390
4269C90l21kk87k12M02K58k34K14K22l06O8k24l87j03J60K58L08K46L3j86m57
$$ 390 69 67 -220 -432 -30 228 -6 208 430 124 192 -32 -419 -522 -362 -104 204 450 483 297 -160
4290a60K28m44k46M09j40K03L76L15q0j98j60m72j27m4J73L82J03L66k81N61n50
$$ -160 68 -376 -622 -213 -353 -150 226 541 461 263 103 -369 -496 -540 -367 15 118 484 203 764 214
4311B14m99j13j49J56M60K09J18J16m40P1m43k16M2K06L49J65j60J09K07k44l20
$$ 214 -285 -398 -547 -391 69 278 396 512 72 143 -300 -516 -474 -268 81 246 86 195 402 158 -162
4332a62k49K46O2j04L87K16J46l10R5k14k58l15Q5M58J24J89k38L13l40j93l7
$$ -162 -411 -165 -103 -207 180 396 542 232 327 113 -145 -460 -375 83 207 396 158 471 131 -62 -99
4353i9l32K95m06P60k10M32j57L8j15m07Q0k28q6K90L87l0J61O8l03m30n1j00
$$ -99 -431 -136 -542 218 8 440 283 321 206 -201 -121 -349 -435 -145 242 212 373 441 138 -292 -343 -443
4375d43q8M62N23o9n2J02l96l57l4K2j9L05M34K9N9k34p0l67k36J71k10M42P4
$$ -443 -531 -69 454 385 333 435 39 -318 -352 -330 -349 -44 390 419 478 244 174 -193 -429 -258 -468 -26 48
4398D8J19K40N8k1m42l25n8J0J61o7N77R6p6L7n81M9l14J08j00O99K3L33j27j32
$$ 48 167 407 465 444 2 -323 -381 -371 -210 -277 300 396 320 357 -224 -175 -489 -381 -481 218 241 574 447 315
4422C15l68R1o70K85O9K74K83M2J77l05J11o64P3K61m15L24K18P8M79m94k2j46
$$ 315 -53 38 -632 -347 -278 -4 279 321 498 193 304 -360 -287 -26 -441 -117 101 179 658 164 142 -4
4444dl17q8J74K53j22L51N19n17q7R3p35j29K53J98K16J87K96l92p9k60K08q56
$$ -4 -321 -409 -235 18 -104 247 766 249 162 255 -480 -609 -356 -158 58 245 541 149 70 -190 18 -838
4466h38K44L83N2N67j3K10m66k98K16n69L13J31l9K79K49J43m31J00k05n18k19
$$ -838 -594 -211 -159 408 395 605 139 -159 57 -512 -199 -68 -107 172 421 564 133 233 28 -490 -709
4487g09N19j65M57N14r3j97j84K46o40k89M35l34J74N08L18l26K08l41p28J98
$$ -709 -190 -355 102 616 523 326 142 388 -252 -541 -106 -440 -266 242 560 234 442 101 -627 -429
4507d29L39k55J98Q07j33l43J25J6m75l43K45j37L52N39p0k26J94k32m80r5M38
$$ -429 -90 -345 -147 660 527 184 309 325 -150 -493 -248 -385 -33 506 436 210 404 172 -308 -403 35
4528C5j60k25O65J68k35Q1k19r12M65j21K54r5N68K15l31J95qn95P2%l05J28N71
$$ 35 -125 -350 315 483 248 329 110 -802 -337 -458 -204 -299 269 484 153 348 340 -255 -183 -183 -488 -360 211
4551B11L40m33L19R5r19l9K75o02M59Q27k86j44L42J49m73l00K63m08p2K51M51
$$ 211 551 118 437 532 -387 -426 -151 -753 -294 533 247 103 445 594 121 -179 84 -324 -396 -145 306
4572C06j57K72jo05j83J03k43j33P92K64l20L46R6m90o34K80k98K21P27j09k60
$$ 306 149 421 420 -185 -368 -265 -508 -641 151 415 95 441 537 47 -587 -307 -605 -384 343 234 -26
4593b6O27j81n71k21K74l53k18N61J36p0M80J11p82OM2l20k90R88kj17L32J11
$$ -26 601 420 -151 -372 -98 -451 -669 -108 28 -42 438 549 -233 -227 -185 -505 -795 193 191 74 406 517
4615E17m54R8j93m54R3J42L89j32N89N8m48m08L91n64p31J012K64k99L89M70n01
$$ 517 63 161 -32 -486 -393 -251 138 6 595 653 205 -203 188 -376 -1107 -95 169 -130 259 729 228
4636B28k80R9k71j68J55K95l99O12J53k34l25L07o23k52N31O45o96K81O28o84
$$ 228 -52 47 -224 -392 -237 58 -341 271 424 190 -135 172 -451 -703 -172 473 -223 58 686 2
4656Bj67J56k79o60O92K02j6K79M51m20k45P2l45m50N12K54l10N04NP1k42K60
$$ 2 -165 -9 -288 -948 -256 -54 -70 209 660 240 -5 67 -278 -728 -216 38 -272 232 237 308 66 326
4678C26n17k79K69M3J53M66rj43k76K03n72m24M52K71k83P27M16n55l78L39r2
$$ 326 -191 -470 -201 -158 -5 461 452 309 33 236 -336 -760 -308 -37 -320 407 823 268 -110 229 137
4699A37o91L50M2k35M14M18k90N5Q9m19p33M23L26k10O27K62l81j58K43l63k33
$$ 137 -554 -204 -162 -397 17 435 145 200 289 -130 -863 -440 -114 -324 303 565 184 26 269 -94 -327
4720c27J82J96n93N39O61l10m6m2n20k71J35J61M7L79K56K4j09j77j30l43K63
$$ -327 -145 51 -542 -3 658 348 302 260 -260 -531 -396 -235 -188 191 447 471 362 185 55 -288 -25
4741b5j15l13N54J60K85k50J93n09n30N08j85J46j60N34jn3J11l30k94j05Q4k02
$$ -25 -140 -453 101 261 546 296 489 -20 -550 -42 -227 -81 -241 293 292 239 350 20 -274 -379 -295 -497
4763d97M35J29L48r6Nn8m63J26l27r8M23K03M17k02J17l33k18k52p6kJ60J04K98
$$ -497 -62 67 415 319 324 266 -197 -71 -398 -496 -73 130 547 345 462 129 -89 -341 -417 -419 -259 -155 143
4786A43K50j68k4j71l53j67N55j40L4M20j43L44j83l99k39l82J35K49M83Q7J62
$$ 143 393 225 201 30 -323 -490 65 -75 -41 379 236 580 397 -2 -241 -623 -488 -239 244 331 493
4807D93N3q4n27k65P5k39Q6K74J91L21J19q7l37k7n44k5J95M78j32J65J75pj85
$$ 493 546 462 -65 -330 -255 -494 -408 -134 57 378 497 410 73 46 -498 -523 -328 150 18 183 358 351 166
4830A66m48o9j80J77M07k21L94J41R8l13l35N3l11r0M66J3J90N52N9o82k24O7
$$ 166 -282 -351 -531 -354 53 -168 226 367 465 152 -183 -130 -441 -531 -65 -52 138 690 749 67 -157 -90
4852i0j22k61J51N07L6q1L51l56N9q6p08K92J47p2M93J23L82l02k84J02n26l66
$$ -90 -212 -473 -322 185 221 140 491 135 194 108 -600 -308 -161 -233 260 383 765 463 179 281 -245 -611
4874f11O00k18K16N06jm05L4J0k20j94j61J97L17J49K14k02j04l8n87J20k8R0
$$ -611 -11 -229 -13 493 492 87 121 131 -89 -283 -444 -247 70 219 433 231 127 89 -498 -378 -406 -316
4896c16J84M36j39L6j78m0m45J8K60J67j64M69j73l4K24Lp19L3J19l94L83L89
$$ -316 -132 304 165 201 23 -17 -462 -444 -184 -17 -181 288 115 81 305 308 -411 -378 -259 -653 -270 119
4918A19r8J38J12L3m45j71O0J24m5M07J24l14Q7p9k79k21K33J00j7J84M89j87
$$ 119 21 159 271 304 -141 -312 -252 -128 -173 234 358 44 131 52 -227 -448 -215 -115 -132 52 541 354
4940C54j39j76m69K81m9o9r0P48j26k60L25k61o9j27j55o8o2L92M76l10J35J08
$$ 354 215 39 -430 -149 -198 -267 -357 391 265 5 330 69 0 -127 -282 -350 -412 -20 456 146 281 389
4962C89m75k08J95k85j10L12L39J89M1K00n69j29k38O1p3M78J64jK28j80m23O6
$$ 389 -86 -294 -99 -384 -494 -182 157 346 387 587 18 -111 -349 -288 -361 117 281 280 508 328 -95 -29
4984b9p8k94j04M0O73j01M00j56m88J00j55j95k03O94Qj71O60M6n33j81J04l39
$$ -29 -107 -401 -505 -465 208 107 507 351 -137 -37 -192 -387 -590 104 112 -59 601 647 114 -67 37 -302
5006c02m62P00N99m61L47K7j70m89K62l15j19J58P2P2K31M55n14j38l2R1o73O33
$$ -302 -764 -64 535 74 421 448 278 -211 51 -264 -383 -225 -153 -81 150 605 91 -47 -79 12 -661 -28
5028b8M2m2J42K49j68k76L45n01k26J66L0j6M96K93k91n07L36l57l42N56J68k06
$$ -28 14 -28 114 363 195 -81 264 -237 -463 -297 -267 -283 213 506 215 -292 44 -313 -655 -99 69 -137
5050a37M16M22n59j83J6l62l37N14J16k8M49J08m17P9M29o30p73R49L5k95M23
$$ -137 279 701 142 -41 -25 -387 -724 -210 -94 -122 327 435 18 97 526 -104 -877 72 107 -188 235
5071B35K35l68L91k99o08r6M65J74m71M22J93j15r4L48n31l84K20lJ82J75K32
$$ 235 470 102 493 194 -414 -510 -45 129 -342 80 273 158 64 412 -119 -503 -283 -286 -104 71 303
5092C03r5P0J90m97o11J90N34m03L13M54m58L10J3k41n56K01L98q35O80M94l37
$$ 303 208 278 468 -29 -640 -450 84 -319 -6 448 -10 300 313 72 -484 -283 115 -720 -40 454 117
5113A17L30J79n51k46q6J66j79J64J73J80r0K03m03k88o9L75k12j43Q34m63q5
$$ 117 447 626 75 -171 -257 -91 -270 -106 67 247 157 360 -43 -331 -400 -25 -237 -380 454 -9 -94
5134i4O89n00m14J32Pj7j89Q48k80O5K87m93l39J0o1j62K65N20p6k40O19l78n52
$$ -94 595 95 -319 -187 -180 -197 -386 462 182 247 534 41 -298 -288 -349 -511 -246 274 198 -42 577 199 -353
5157c53K34K49n05J97M63k52OM93j23m33j81q2k14L36M89m61J84M21L0n87lk6
$$ -353 -119 130 -375 -178 285 33 39 532 409 -24 -205 -287 -501 -165 324 -137 47 468 498 -89 -92 -118
5179a18j96k19O27nK1p5mr9N9N7o25j27O49RJ81L29l0m20l2j0m48L8N12l08Q5
$$ -118 -314 -533 94 89 110 35 31 -68 -9 48 -577 -704 -55 -46 135 464 434 14 -18 -28 -476 -438 74 -234 -149
5204a49N06k2l34j35K31n24q5P80k34l5K27J31k51J26r9n13L4L49N0P9L42k44
$$ -149 357 335 1 -134 97 -427 -512 268 34 -1 226 357 106 232 133 -380 -346 3 53 132 474 230
5226B30j31P2k14j96r4J04m1M17K35L5k8m42J24m30N8J78rJ63L68n4k10k26J28
$$ 230 99 171 -43 -239 -333 -229 -270 147 382 417 389 -53 71 -359 -301 -123 -132 31 399 345 135 -91 37
5249C7l53j94M31j59K71O3K13j71p2j9n64M6M34K27l47L56J16o1j85j35j63r0
$$ 37 -316 -510 -79 -238 33 96 309 138 66 47 -517 -471 -37 190 -157 199 315 254 69 -66 -229 -319
5271c19K12J0K03K09L31m47j96Q6q6n42J35L47L1J89R4j32J49k84l06j86K11L
$$ -319 -107 -97 106 315 646 199 3 89 3 -539 -404 -57 -26 163 257 125 274 -10 -316 -502 -291 -288
5293b88j6K45K66K21k23q0k47k61J72Q1p0J54K90Np3L08o27l13J57M3r2L63N3
$$ -288 -304 -59 207 428 205 125 -122 -383 -211 -130 -200 -46 244 249 176 484 -143 -456 -299 -256 -348 15 68
5316F8n1J23p1k39j93j38K81J17J86M6J46J17M7n42j45L2l02J27N86k39K31J95
$$ 68 17 140 69 -170 -363 -501 -220 -103 83 129 275 392 439 -103 -248 -216 -518 -391 195 -44 187 382
5338C82k82K85q42Q3L4K21K44o7Q5K75j82k00m5qm02J56L51kL7K46k82o8l43R4
$$ 382 100 385 -457 -374 -340 -119 125 58 143 418 236 36 -9 -17 -419 -263 88 86 123 369 87 19 -324 -230
5362b30L3o0J02K29J9L75k3m23k32l5J74k19L28K5J05k12N62j51k07j66l99R7
$$ -230 -197 -257 -155 74 93 468 445 22 -210 -245 -71 -290 38 63 168 -44 518 367 160 -6 -405 -308
5384c08M3L72K16k37L20k05k96J4j65M0l5L95L18l46M74n69j45N1j77j53Q4K62
$$ -308 -265 107 323 86 406 201 -95 -81 -246 -206 -241 154 472 126 600 31 -114 -63 -240 -393 -309 -47
5406d7O9R6O42o37j56j97Q4N52p18N16k59M23j16j12k09L7P2n31K48L51j27L6
$$ -47 22 118 760 123 -33 -230 -146 406 -312 204 -55 368 252 140 -69 -32 40 -491 -243 108 -19 17
5428A7J76N9k04M5k41m54J41J12L23q7N32m44o5K56j55k24K07J84m89M40j96K64
$$ 17 193 252 48 93 -148 -602 -461 -349 -26 -113 419 -25 -90 166 11 -213 -6 178 -311 129 -67 197
5450A97l7n2Kl99j11L27j93L40K84j58P1j57k72J04k84L33R5j95O06l66L52m30
$$ 197 160 108 110 -289 -400 -73 -266 74 358 200 271 114 -158 -54 -338 -5 90 -105 501 135 487 57
5472E7j61l16J96J22j80M83O6k3%J61m60l62j25J62k3K74R1O96l92j6k46l51K02
$$ 57 -104 -420 -224 -102 -282 201 267 244 244 405 -55 -417 -542 -380 -403 -129 -38 658 266 250 4 -347 -145
5495a45M1N0j57P21n18M3L90j53k60j05L34k36J96k10J8N68m81J83K8l36J3p24
$$ -145 -104 -54 -211 510 -8 35 425 272 12 -93 241 5 201 -9 9 577 96 279 307 -29 -16 -740
5517g40J205l60J21K28J30k53q08M48l24k12O54R2j18J96K89n16L9l19J56n34
$$ -740 465 105 226 454 584 331 -477 -29 -353 -565 89 181 63 259 548 32 71 -248 -92 -626
5537f26p0K17Q18p5M7k27j90Q4L46r61M34O51m11O8M41l92j06k11J14l13R8L15
$$ -626 -696 -479 339 264 311 84 -106 -22 324 -637 -203 448 37 105 546 154 48 -163 -49 -362 -264 51
5559E1j39O3O05r4o59n1K28m34J96L08M2l3J10K23p66K77J82l71k51O53j2m47
$$ 51 -88 -25 580 486 -173 -224 4 -430 -234 74 116 83 193 416 -350 -73 109 -262 -513 140 128 -319
5581c19O59K74o75K5Q7l01k22O43l95K37M58n7l48O8j99m25N6K59J01j1N95j13
$$ -319 340 614 -61 -36 51 -250 -472 171 -224 13 471 414 66 134 -65 -490 -434 -175 -74 -85 510 397
5603C97m50J18k00j27j34L85k19J08M80k9l83K49k65j30k90L27L0k16J193L96
$$ 397 -53 65 -135 -262 -396 -11 -230 -122 358 329 -54 195 -70 -200 -490 -163 -133 -349 844 1240
5623A240j247l94M78j23p65J229p67J58J101o42M89O23k83j261q04R55R12j157
$$ 1240 -7 -401 77 -46 -811 418 -349 -191 910 268 757 1380 1097 -164 -968 -13 899 -258
5641b58N34L77j147O60O95j496j99N72R1m7q3J141l51L36l92n69k07J21M11p32
$$ -258 276 653 -494 166 861 -635 -834 -262 -171 -218 -301 840 489 825 433 -136 -343 -222 189 -543
5661e43N70M09k17j7K09o30k64M79l06n0O90Oo65N43L14n88k62J83j86J03L29
$$ -543 27 436 219 202 411 -219 -483 -4 -310 -360 330 336 -329 214 528 -60 -322 -139 -325 -222 107
5682A07J39M0m1K45m35l37L09q6q7L84N4k39l9Q0J13o95O07k01n15L78L72J24
$$ 107 246 286 245 490 55 -282 27 -59 -146 238 292 53 14 94 207 -488 119 -82 -597 -219 153 277
5704B77m6j30j44K6k18k03J77L46Q7j17N6P7p1o8l36J53j94M75R8n89L22M53m83
$$ 277 231 101 -43 -17 -235 -438 -261 85 172 55 111 188 117 49 -287 -134 -328 147 245 -344 -22 431 -52
5727e2m45J16K00j06J97K49j42K59J9j39m59K10L60l53n49R13k37M42Q1p3p33
$$ -52 -497 -381 -181 -287 -90 159 17 276 295 156 -303 -93 267 -86 -635 278 41 483 564 491 -242
5748b42K75j35k47L41M54k05L21l62k9m76j17L89m41K31O5J14N4J73l78j55Q27
$$ -242 33 -102 -349 -8 446 241 562 200 171 -305 -422 -33 -474 -243 -178 -64 -10 163 -215 -370 457
5769D57r26l34Q64k18O12q25Q56j255J246L03j057O15o22l2L63N40P8j98m11p
$$ 457 -469 -803 61 -157 455 -370 486 -769 477 780 -277 338 -284 -316 47 587 665 467 56 49
5789D9m4l85m4J148j542m29J878L04n35k72q0j67J15N4j94J24N4M48o54K42J38
$$ 49 5 -380 -424 724 -818 -1247 631 935 400 128 48 -119 -4 50 -144 -20 34 482 -172 70 208
5810B08j84l41o8N90l51M39O08r64K88n83L42k89J28j95N63r3J34n6J1m14Q2j9
$$ 208 24 -317 -385 205 -146 293 901 -63 225 -358 -16 -305 -177 -372 191 98 232 176 187 -227 -145 -164
5832a64M4J05r6L62j1R3j86k86l0j68J78n6J13K26K19k70j57l2j02K54k94K23
$$ -164 -120 -15 -111 251 240 333 147 -139 -169 -337 -159 -215 -102 124 343 73 -84 -116 -218 36 -258 -35
5854c5o4K82J33j83J52k28r7l7K0L5J13R2L33k77k40J04j96j55L69k65j65J84
$$ -35 -99 183 316 133 285 57 -40 -77 -57 -22 91 183 516 239 -1 103 -93 -248 121 -144 -309 -125
5876a25N52j29l44L8j66Pj41J58K02J83k9j41K51k15o0l88N3J17j10J77J42q5
$$ -125 427 298 -46 -8 -174 -167 -308 -150 52 235 206 65 316 101 41 -347 -294 -177 -287 -110 32 -53
5898e3K01n2kj53m63K50J72j08K56M3K55k65R9l30J5r3o4L74J72k20J81J7j95
$$ -53 148 96 94 -59 -522 -272 -100 -208 48 91 346 81 180 -150 -135 -228 -292 82 254 34 215 232 37
5921C7j63J2k46j5N35k6m8k12K47m9J3k72P3k1J33J36J41Q4j42k27nl05J98j6
$$ 37 -126 -114 -360 -375 160 134 86 -126 121 72 85 -187 -114 -135 -2 134 275 359 217 -10 -15 -320 -122 -138
5945a38N1n5l6J16M57l42l03J65k94J51L72k22K33J25Pk33k3k05P2j41L6K87l69
$$ -138 -87 -142 -178 -62 395 53 -250 -85 -379 -228 144 -78 155 280 287 54 31 -174 -102 -243 -207 80 -289
5968b89M80L1k61M0j91q4n2J4K97N9oM59k72l32P9l81J24J66j02K49N0J26k20
$$ -289 191 222 -39 1 -190 -274 -326 -312 -15 44 38 497 225 -107 -28 -409 -285 -119 -221 28 78 204 -16
5991a6K07O5o61j35M95j2kK52r2R4K0k91p2m34N39Kk51P62m97L10k96O0j06l03
$$ -16 191 256 -405 -540 -45 -57 -59 193 101 195 215 -76 -148 -582 -43 -41 -292 470 -27 283 -13 47 -59 -362
6015c62K40M33o75M54J86j68j80L56m33k20L02j69j64L20L14k21J07j98M3l20
$$ -362 -122 311 -364 90 276 108 -72 284 -149 -369 -67 -236 -400 -80 234 13 120 -78 -35 -355
6035c55K31p1k15M19J36L0R0p7l13jJ20k33K39k36M75k02L69m87J1j80OL19k32
$$ -355 -124 -195 -410 9 145 175 265 188 -125 -126 -6 -239 0 -236 239 37 406 -81 -70 -250 -244 75 -157
6058a57M00Q2n51R4M64j38n03l9N47m99L20J94l05L53Q5l87l30L65k49p4N30J11
$$ -157 243 325 -226 -132 332 194 -309 -348 199 -300 20 214 -91 262 347 -40 -370 -5 -254 -328 202 313
6080C13n19L87J85k56l30J53j00l28M37M25k53p6L84l49k23M0n4J74J7J99k96
$$ 313 -206 181 366 110 -220 -67 -167 -495 -58 367 114 38 422 73 -150 -110 -164 10 27 226 -70
6101g0N5P12p55o15O73M6K0j91K35j37J68j76R8k34R5K94m76K18N4J24r6J66o7
$$ -70 -15 697 -58 -673 0 46 66 -125 110 -27 141 -35 63 -171 -76 218 -258 -40 14 138 42 208 141
6124A41k89J60J91p16L98J64Q9L9Q6r1k82J32l9k92J88L25m6K62R6m13j68J87
$$ 141 -148 12 203 -513 -115 49 138 177 263 172 -110 22 -17 -309 -121 204 158 420 516 103 -65 122
6146A22j52l92L78K69j91L39j44J83o16J27J86n14K20K39l4J23m7J78j9m9o9l52
$$ 122 -30 -422 -44 225 34 373 229 412 -204 -77 109 -405 -185 54 20 143 96 274 255 206 137 -215
6168b15j6K59l2J29K21q6j70O6m4m94Q2J23l1J29J91k43J11o9P3N1l43M99o0j83
$$ -215 -231 28 -4 125 346 260 90 156 112 -382 -300 -177 -208 -79 112 -131 -20 -89 -16 35 -308 191 131 -52
6192e2K34r8m0K71n92J07K77k66n3L91l3J09k18N1p3j9k49J56K22q0J89m0l32
$$ -52 182 84 44 315 -277 -170 107 -159 -212 179 146 255 37 88 15 -4 -253 -97 125 45 234 194 -138
6215a38L08J9p25K77j42J86J53qL28j90k73L04n9m52J49K96N9R0k8k29O1Rj90
$$ -138 170 189 -536 -259 -401 -215 -62 -70 258 68 -205 99 40 -412 -263 33 92 182 154 -75 -14 -5 -195
6238a95Q4l41J50M7O02j68j7Q1j82j59j95M4J91N9J0L90l69J99pl33J39l40L40
$$ -195 -111 -452 -302 -255 347 179 162 243 61 -98 -293 -249 -58 1 11 401 32 231 224 -109 30 -310 30
6261C0k40M21n13N38r4m13N13k82n0j84J98m4K77l79M93k55j87n7J85k41J91K61
$$ 30 -210 211 -302 236 142 -271 242 -40 -90 -274 -76 -120 157 -222 271 16 -171 -228 -43 -284 -93 168
6283A68k16OM15P2o24K51k31nJ78R6K21l30j05K50l53r8K86j70L8jK67k53J01
$$ 168 -48 -42 373 445 -179 72 -159 -164 14 110 331 1 -104 146 -207 -305 -19 -189 -151 -152 115 -138 -37
6306c7M18j13j49j99k05K47j3M2N1J67J17l54k19J51r4n1L83Jq3J25j47n1L7J50
$$ -37 381 268 119 -80 -285 -38 -51 -9 42 209 326 -28 -247 -96 -190 -241 142 143 60 185 38 -13 24 174
6330A74m06L5L74J13m23K75J20j22k69p6L43l77J68L83m06J24L15j34Lm09J41
$$ 174 -232 -197 177 290 -133 142 262 140 -129 -205 138 -239 -71 312 -94 30 345 211 214 -195 -54
6351e4l91O28r0J26M4m09n8J40K9j81k52L50K44l12L85J28k27l15p8L1l7J91j64
$$ -54 -445 183 93 219 263 -146 -204 -64 -35 -216 -468 -118 126 -186 199 327 100 -215 -293 -262 -299 -108 -272
6374b72J02K72J10j43J16j72l69J12o6L32K07j72J48Q8k82O1R4j96j12r9J70K0
$$ -272 -170 102 212 69 185 13 -356 -244 -310 22 229 57 205 293 11 72 166 -30 -142 -241 -71 -51
6396e1J66K36q2o7j26r5k53K93p3L7P5R5Q9l0j52q8k17L02k2k46M31j02r1R2k89
$$ -51 115 351 269 202 76 -19 -272 21 -52 -15 60 155 244 214 62 -26 -243 59 37 -209 222 120 29 121 -168
6421a68J0M2J79mn2J40J65k08r7J34l08m2N7J50J14J10k01J78L04n28j62Q9j21
$$ -168 -158 -116 63 59 7 147 312 104 7 141 -167 -209 -152 -2 112 222 21 199 503 -25 -187 -98 -219
6444b19K4o3N91q3J04r9l64K14j27j51q0M21j61K28j09Oj13l8M2K69l13k14K51
$$ -219 -195 -258 333 250 354 255 -109 105 -22 -173 -253 168 7 235 126 132 19 -19 23 292 -21 -235 16
6467A6K00k63Mp4p9J67j6j65m6J08K36j24J93j13j52J35M9k16O2K80k88K54j01
$$ 16 216 -47 -43 -117 -196 -29 -45 -210 -256 -148 88 -36 157 44 -108 27 76 -140 -78 202 -86 168 67
6490F7J80l83k3L28m84K74j29Q0R7Q8k54m1K47o3j47j40L48R6k07J54j55j8M7
$$ 67 247 -136 -159 169 -315 -41 -170 -90 7 95 -159 -200 47 -16 -163 -303 45 141 -66 88 -67 -85 -38
6513c8J27m18L28L41n11L93p1p1J42l84J10l4n3J53m16L53K58j67K12j82R7l70
$$ -38 89 -329 -1 340 -171 222 151 80 222 -162 -52 -86 -139 14 -402 -49 209 42 254 72 169 -201
6535b01K85J74m28J45K33N5l36K75j56j61j01M86n20M33j77J32N4j44o2o4L0o4
$$ -201 84 258 -170 -25 208 263 -73 202 46 -115 -216 270 -250 183 6 138 192 48 -14 -78 -48 -112
6557a12qK35p4J02k82J21J76n05K41K50k44nL28o4L9n7k61J55n7j8J10l68M57
$$ -112 -120 115 41 143 -139 -18 158 -347 -106 144 -100 -105 223 159 198 141 -120 35 -22 -40 70 -298 159
6580A59l31K41J89k23j10M6J48l33rJ92L72m24L05J18o79M42j1k05R7K43j00k52
$$ 159 -172 69 258 35 -75 -29 119 -214 -223 -31 341 -83 222 340 -339 103 92 -113 -16 227 127 -125
6602a25K87j15o3m8J20m10K84L03N8l60K07k79L3j61M49k36J27k10N25l60O3K29
$$ -125 162 47 -16 -64 56 -354 -70 233 291 -69 138 -141 -108 -269 180 -56 71 -139 386 26 89 318
6624C18l67j99K49O5K2NM5k18J20J26j99o7k12K69j50L08l0n4k7K06j84N8j89
$$ 318 -49 -248 1 66 88 93 138 -80 40 166 -33 -100 -312 -43 -193 115 85 31 4 210 26 84 -105
6647a05lR4q8M03k24J2J34k12j03O7j28N3J07J84m22K75J56j52l78K67N1q9O6
$$ -105 -108 -14 -102 301 77 89 223 11 -92 -25 -153 -100 7 191 -231 44 200 48 -330 -63 -12 -101 -35
6670c5J86j66J87j79K28l24K40l07O6J48j6l56K67K28p2n07M74j70ro5K80n5o7
$$ -35 151 -15 172 -7 221 -103 137 -170 -104 44 28 -328 -61 167 95 -412 62 -108 -117 -182 98 43 -24
6693b4P0J03p4q3J85m26K20J38m9J89O8l68k40L53k10k11K70N6J33j2J48m01n5
$$ -24 46 149 75 -8 177 -249 -29 109 60 249 317 -51 -291 62 -148 -359 -89 -33 100 88 236 -165 -220
6716b20l3L00k1J33j18Q0K4M0j34l6j04k34K71k4o0K01RK10m78L31L43n58J81
$$ -220 -253 47 26 159 41 121 145 185 51 15 -89 -323 -52 -76 -136 65 74 284 -194 137 480 -78 103
6739A03l64k48L40K04mk2M8k11k0qK27KO5k64L44m5k00L47j91j94J03J51m65L44
$$ 103 -261 -509 -169 35 31 9 57 -154 -174 -182 45 47 112 -152 192 147 -53 294 103 -91 12 163 -302 42
6763D2N5Q5j33P5J34j22k20K00j46N7P1J11Q0k27j17q1J12j61J92J28j17L9J02
$$ 42 97 182 49 124 258 136 -84 116 -30 27 98 209 289 62 -55 -136 -24 -185 7 135 18 57 159
6786A59k30QP4j22K13l61N94j45r1J5J47l25r9M5K07j18J67M1j68j02l0M4K37
$$ 159 -71 -63 11 -111 102 -259 335 190 99 114 261 -64 -163 -118 89 -29 138 179 11 -91 -121 -77 160
6809A60k92J74j57L29j4k91J76J89k75Jn3M8R8k69J92L48l92k7J01R0j43P7p3
$$ 160 -132 42 -115 214 200 -91 85 274 -1 0 -53 -5 93 -176 16 364 -28 -55 46 136 -7 70 -3
6832cl24J95L39k29K99k59p1r1J11P5rl03L65K6J04j71k17J66k86Q5Q7J70J90
$$ -3 -327 -132 207 -22 277 18 -53 -144 -33 42 33 -270 95 121 225 54 -163 3 -283 -198 -111 59 249
6855B49k06k28M80k64K1k28L37k97j3M27k1k02r5J52k09m0M0j62j33O34j67O1
$$ 249 43 -185 295 31 52 -176 161 -136 -149 278 257 55 -40 112 -97 -137 -97 -259 -392 242 75 136
6877A36P5j84j51K36m07K68q6K08o3J01Q4j51qJ58j12l22j43M37j84J16j5j2P4
$$ 136 211 27 -124 112 -295 -27 -113 95 32 133 217 66 58 216 104 -218 -361 76 -108 8 -7 -19 55
6900E5k20J3J60j65Q9pL91k15j18r7K38j61j96J79l84M64K7K96k34k35J00l6n6
$$ 55 -165 -152 8 -157 -68 -75 316 101 -17 -114 124 -37 -233 -54 -438 26 53 349 115 -120 -20 -56 -112
6923a12j6j31L07J10k0l59J97Kn7r1K2M2J98N0j77J10O5m03P3J09R6K4n5j2M3
$$ -112 -128 -259 48 158 138 -221 -24 -22 -79 -170 -148 -106 92 142 -35 75 140 -263 -190 -81 15 39 -16 -28 15
6948A5O0j96j23L42l22J96P7j69M70l12k68K52QMP9r5j34K14R6l41R2J02J93k28
$$ 15 75 -121 -244 98 -224 -28 49 -120 350 38 -230 22 30 34 113 18 -116 98 194 -147 -55 47 240 12
6972A2R6j91pj30L76J0j37K7j79Q4J6l5j10K24J58k01J65Kp8k24m1q7Q3m7J60
$$ 12 108 -83 -90 -220 156 166 29 56 -123 -39 -23 -58 -168 56 214 13 178 180 102 -122 -163 -250 -167 -214 -54
6997e4n7j13J00M74m99M60l49p9R8pJ55j11m9J48j97M8K93l29j44K5R5J26J21
$$ -54 -111 -224 -124 350 -149 311 -38 -117 -19 -26 129 18 -31 117 -80 -32 261 -68 -212 -187 -92 34 155
7020A55q9R8j36o2k10J47L69l05K59J0k2j58n0l1j60L27p3l39K11O5K22j36k44
$$ 155 66 164 28 -34 -244 -97 272 -33 226 236 214 56 6 -25 -185 142 69 -270 -59 6 228 92 -152
7043a52N7M4j51K44L05m70R7L6j15K2J91l47L75P5j86p2j5K47K56o62M93m97P8
$$ -152 -95 -51 -202 42 347 -123 -26 10 -105 -83 108 -239 136 211 25 -47 -62 185 441 -221 272 -225 -147
7066a47M1N9J79l36L07p9LL02l31O3j14J18j32K98j62O7p0N0J24l45J92j90L6
$$ -147 -106 -47 132 -204 103 24 27 329 -2 61 -53 65 -67 231 69 136 66 116 240 -105 87 -103 -67
7089f7J49J97m31K43j87j2k0O5Q6q6J58K65n39oK32j65p7j08N18k35r5L88j17
$$ -67 82 279 -152 91 -96 -108 -128 -63 23 -63 95 360 -179 -185 47 -118 -195 -303 215 -20 -115 273 156
7112A56j57L47l48N4j63M9j21L58J63m39K46K6k82n3K95j97j0j4L94l41rJ78J56
$$ 156 -1 346 -2 52 -111 -62 -183 175 338 -101 145 171 -111 -164 131 -66 -76 -90 304 -37 -46 132 288
7135B88k67J29K5k19o6K95o1m10M49j56j73L1J17r4j5Q0n5K22L0j45k57N4K40
$$ 288 21 150 175 -44 -110 185 124 -286 163 7 -166 -135 -18 -112 -127 -47 -102 120 150 5 -252 -198 42
7158D2k57J76J18J6R2p0N6k84K4L41l83Q5J76l04L25j38J48j22l12M71j73j09
$$ 42 -215 -39 79 95 187 117 173 -111 -87 254 -129 -44 132 -172 153 15 163 41 -271 200 27 -82
7180h2K64k45J60j23J94k31j34J31J03o5P5K51j77j43Kk62Q9K18k70L62l32J02
$$ -82 182 -63 97 -26 168 -63 -197 -66 37 -28 47 298 121 -22 -20 -282 -193 25 -245 117 -215 -113
7202a13L78Q9j66l77L84j02l8j89K30L3j60J61k01r4NL64j85j18R3J15J25j02
$$ -113 265 354 188 -189 195 93 55 -134 96 129 -31 130 -71 -165 -160 204 19 -99 -6 109 234 132
7224A32l6k3n8j17K84m25L03P7k29P8p0L33l42K08l61M1K1O01o64O43o5k08j62
$$ 132 96 73 15 -102 182 -243 60 137 -92 -14 -84 249 -93 115 -246 -205 -184 417 -247 396 331 123 -39
7247c9N3m9k6p6R9m7J29K45j89p7J3L5k42J13K14n0j44L68k97L0J27j90r2R0O5
$$ -39 14 -35 -61 -137 -38 -85 44 289 100 23 36 71 -171 -58 156 106 -38 330 33 63 190 0 -92 -2 63
7272F3j15N3R9o9M8j60J85j69k19L10O0J5J35k50M2J26k76R5O6l2N7N0l00J29
$$ 63 -52 1 100 31 79 -81 104 -65 -284 26 86 101 236 -14 28 154 -122 -27 39 7 64 114 -186 -57
7296e7Q7p9K15m88K63J94l20K37r7K44m1nN6l18K75k26j79J63J96j21J20O3j2
$$ -57 30 -49 166 -322 -59 135 -185 52 -45 199 158 153 209 -109 166 -60 -239 -76 120 -1 119 182 170
7319A70k45j15L68j96j56L99Ok13l6KK6Q9k44J76P2r4Q6J35j14r6L0j07j74K45
$$ 170 -75 -190 178 -18 -174 225 231 18 -18 -16 10 99 -145 31 103 9 95 230 116 20 50 -57 -231 14
7343A4M8N8K62k68n1j49KR5k5l4K99o13K72J41n8l60M77j30k03O8k1K44m03L97
$$ 14 62 120 382 114 63 -86 -84 11 -14 -48 251 -362 -90 51 -7 -367 110 -20 -223 -155 -176 68 -335 62
7367F2k5l1J15k72K05o9K23k74J79j62k12L24k05R3o9j50L81n0J05J3m5m69N10
$$ 62 37 6 121 -151 54 -15 208 -66 113 -49 -261 63 -142 -49 -118 -268 113 63 168 181 136 -333 177
7390A77l35K4J32k58L43l9m3K85k65r8n2RJ6m0P0J62k02J03N6K74j40j66j00M2
$$ 177 -158 -134 -2 -260 83 44 1 286 21 -77 -129 -120 -104 -144 -74 88 -114 -11 45 319 179 13 -87 -45
7414d5J03k06q0J28K36k21j0j63J94l1K5M51j13q7j97O9J72l02j4Q4j81K22r6
$$ -45 58 -148 -228 -100 136 -85 -95 -258 -64 -95 -70 381 268 181 -16 53 225 -77 -91 -7 -188 34 -62
7437f2K25q9j39n2K51k63k0J30l0J72l97N81m71L2M4j03J55k2J38j9P5K02j97
$$ -62 163 74 -65 -117 134 -129 -149 -19 -49 123 -274 307 -164 -132 -88 -191 -36 -58 80 61 136 338 141
7460A41j32J40n1j90r2R8J02J75k38n9j67L24J32o4j15K03m00J54P5K11n5k96
$$ 141 9 149 98 -92 -184 -86 16 191 -47 -106 -273 51 183 119 4 207 -193 -39 36 247 192 -104
7482a04o0PJ55q1J66L0J93k40j0Q6m98L19R3j78R7K29m61N21J16l88j80j24M36
$$ -104 -164 -157 -2 -83 83 113 306 66 56 142 -356 -37 56 -122 -25 204 -257 264 380 -8 -188 -312 124
7505A24J3k62M4J10j94K66j05K1m02L25j11J08l7Q4q1J38k11N0L31m39L30k09
$$ 124 137 -125 -81 29 -165 101 -4 17 -385 -60 -171 -63 -100 -16 -97 41 -170 -120 211 -228 102 -107
7527a07K64j6l13J94m3j51J84K1k68j17M27M6j99R7O9r7l04K36l1j6J9K84l01
$$ -107 157 141 -172 22 -21 -172 12 33 -235 -352 75 121 -78 19 88 -9 -313 -77 -108 -124 -105 179 -122
7550a22K94l24R0k57M66j25j47L52k4p3J02k13o7K79l11mJ25P5n7r7j03J61ll03
$$ -122 172 -152 -62 -319 147 22 -125 227 203 130 232 19 -48 231 -80 -84 41 116 59 -38 -141 20 17 -286
7574b86K88J08l78J57J6J55k35J46P0L1q7R6k82M90r6m36K79o6J20j40n7J2J93
$$ -286 2 110 -268 -111 -95 60 -175 -29 41 72 -15 81 -201 289 193 -243 36 -30 90 -50 -107 -95 98
7597I8R5q4j10K42k58j15O7j0j56K66J40j44j1o1j9J58J1M0k06q7J10J42k13L20
$$ 98 193 109 -1 241 -17 -132 -65 -75 -231 35 175 31 20 -41 -60 98 109 149 -57 -144 -34 108 -105 215
7621B15o2j1l01K66k91kn2K86ko7J03o9k59L02j38L5K29j57k2L6K96l66K89l09
$$ 215 153 142 -159 107 -184 -186 -238 48 46 -21 82 13 -246 56 -82 -47 182 25 3 39 335 -31 258 -51
7645e1l1j5K88n19L31J9m3J40r1L75o79K62K65n46M09m3k4l26Q0K41l6p4J3l3
$$ -51 -82 -97 191 -328 3 22 -21 119 28 403 -276 -14 251 -295 114 71 47 -279 -199 42 6 -68 -55 -88
7669h8R2K8J5j96J58Q1j26o0J40q4Q6J77k17K78m87L32j94l6J12j95l25M54R1
$$ -88 4 32 47 -149 9 90 -36 -96 44 -40 46 223 6 284 -203 129 -65 -101 11 -184 -509 -55 36
7692C6m10J67K34n4l07K88J36N7l6J89l02p6L70j68l38J58K64m30J03L1K40j17
$$ 36 -374 -207 27 -27 -334 -46 90 147 111 300 -2 -78 292 124 -214 -56 208 -222 -119 -88 152 35
7714C5o8L2j78K25K33m94L07K63j92r4m86L92r4J36RJ76l21L23Q0j60m9J05j32
$$ 35 -33 -1 -179 46 279 -215 92 355 163 69 -417 -25 -119 17 26 202 -119 204 284 124 75 180 48
7737D8k76J68j84N3M87m68L34p8L00k65j24j44J99J49j38K63p10L37J75k97R1
$$ 48 -228 -60 -244 -191 296 -172 162 84 384 119 -5 -149 50 199 61 324 -386 -49 126 -171 -80
7758h0Mk7J59n4j77K04j07M7J48j42M6k48K20J06j96m6L58k48k77N19k4r8j23
$$ -80 -76 -103 56 2 -175 29 -78 -31 117 -25 21 -227 -7 99 -97 -143 215 -33 -310 209 185 87 -36
7781c6jP9N2M8o9k44K44o5q2q5J15P1q7K48j29j15Rq6Q8mJ31m3l5jK41k68J5j62
$$ -36 -37 42 94 142 73 -171 73 8 -74 -159 -44 27 -60 188 59 -56 -47 -133 -45 -49 82 39 4 3 244 -24 -9 -171
7809a71k75L77K16k97J91J25p4j38k01J76R9J28m13L53k5J04n26K90L1j49J12
$$ -171 -446 -69 147 -150 41 166 92 -46 -247 -71 28 156 -257 96 71 175 -351 -61 -30 -179 -67
7830f7L8j60K55K22p7K83n75r4R6l2n4R8K18Q3j76J4j10J23j2j01p2L17j53j73
$$ -67 -29 -189 66 288 211 494 -81 -175 -79 -111 -165 -67 151 234 58 72 -38 85 73 -28 -100 217 64 -109
7854a09J57K49l74J14j50J1O2R7k48J26M3lO9j13L1K11j22j39l6N5K95k09lLK5
$$ -109 48 297 -77 37 -113 -102 -40 57 -191 -65 -22 -25 44 -69 -38 173 51 -88 -124 -69 226 17 14 17 42
7879D2m6j44J51j97K52L9j74o0O4O8K38l85N6P5l19L50j03J27J88l10R2Ko1O7
$$ 42 -4 -148 3 -194 58 97 -77 -137 -73 -5 233 -152 -96 -21 -340 10 -93 34 222 -88 4 6 -55 12
7903A2M5L9k53q9K26m4K91m67K09J06p5J55j11m4o3M1P3j46k4O3r5J60M7O1n1
$$ 12 57 96 -157 -246 -20 -64 227 -240 -31 75 0 155 44 0 -63 -22 51 -95 -119 -56 -151 9 56 117 66
7928F6K9po3O8j46J02k0K62k87o9J95o0k95k7L32k5J45o8J09k06k64Q3Q2j04L3
$$ 66 95 88 25 93 -53 49 29 291 4 -65 130 70 -225 -252 80 55 200 132 241 35 -229 -146 -64 -168 -135
7953a35j82J39L26j09k3J04j25J1K9nk68J01q6M30m51M15k04K20j43k70r1N77
$$ -135 -317 -178 148 39 16 120 -5 6 35 30 -238 -137 -223 207 -244 171 -33 187 44 -226 -317 260
7975B60k22k14J03O9O0k19k1L30k39LJ2%K66j27j59M11r4j1k72r0K15o6n0P4M8
$$ 260 38 -176 -73 -4 56 -163 -184 146 -93 -90 -78 -78 188 61 -98 313 219 208 -64 -154 61 -5 -55 19 67
8000F7j80j61J98J60k13l0R9J21O5j59j93K79j34J37j30K73O2k19k28J95n1P0
$$ 67 -113 -274 -76 84 -129 -159 -60 61 126 -33 -226 53 -81 56 -74 199 261 42 -186 9 -42 28
8022B8J21k23J19o6J83o7J78j95M8j7K2l69J18K49k45K90j92J49r2R6j19R6m39
$$ 28 149 -74 45 -21 162 95 273 78 126 109 131 -238 -120 129 -116 174 -18 131 39 135 16 112 -327
8045c27N47Ol95L77j80l7j55J65J2J12j69o9K18%j29Q9O8j5r4J57kl81M2K87o7
$$ -327 220 226 -169 208 28 -9 -164 1 13 125 -44 -113 105 105 -24 65 133 118 24 181 179 -202 -160 127 60
8070F0J8K56l82n8O5j9r0L02k22k71N99l02J4k20K10L47m54QM02k92j24L93l63
$$ 60 78 334 -48 -106 -41 -60 -150 152 -70 -341 258 -44 -30 -250 -40 307 -147 -139 263 -29 -153 240 -123
8093a23R5p9J56J16J18j97j37j3J74l4j51J13J42j28k51P9L0l4K85q1j70K23k42
$$ -123 -28 -107 49 165 283 86 -51 -64 110 76 -75 38 180 52 -199 -120 -90 -124 161 80 -90 133 -109
8116a09l2K78L2l54M08k92L66k44k88K48k68K22J90K01m44J45m3n9Q0j89J09l5
$$ -109 -141 137 169 -185 223 -69 297 53 -235 13 -255 -33 157 358 -86 59 16 -43 37 -152 -43 -78
8138g8K23m9J4J33O5m27J28p4R6o0J38J02j01j0j30r0K03K60m17J99k27J36n6
$$ -78 145 96 110 243 308 -119 9 -65 31 -29 109 211 110 100 -30 -120 83 343 -74 125 -102 34 -22
8161b2K51Kj86J21j60k45K8K51J46q7J1k5k14R1j09k7K51j18O0j08J96j22K73
$$ -22 229 231 45 166 6 -239 -211 40 186 99 110 85 -129 -38 -147 -174 77 -41 19 -89 107 -15 258
8184B58j82m5P4m87L52K45k57
$$ 258 76 31 105 -382 -30 215 -42
8191d2
$$ Imaginary data points
##PAGE= N=2
##DATA TABLE= (X++(I..I)), XYDATA
0@%%%%%%%%%%%%Qj6J6j6J6k4L2l4M2n4O2p2Q8j04J20j36J57j82K07k36K69l05
$$ 0 0 0 0 0 0 0 0 0 0 0 0 0 8 -8 8 -8 8 -16 16 -18 24 -30 32 -40 48 -56 64 -72 85 -97 110 -126 143 -162
34a62L44l88M37m90N48o12O82p58Q43r35J034j142J260j391J534j688J861k052
$$ -162 182 -206 231 -259 289 -323 359 -399 444 -491 543 -599 661 -730 804 -884 977 -1075
52a075K259k490K751l043L375l755M192m705N313o054O978q166R758j2015J5490
$$ -1075 1184 -1306 1445 -1598 1777 -1978 2214 -2491 2822 -3232 3746 -4420 5338 -6677 8813
67H813k1589L5424j26683N27J80830o4546K4672Q1354k3325j06066k0491l0337
$$ 8813 -12776 22648 -104035 -103508 77322 12776 37448 118802 95477 -10589 -31080 -61417
79f1417p087N2785K3033l4152N8858O2177l7668l4050M76q6359n6432N7707J3858
$$ -61417 -68504 -15719 7314 -26838 32020 94197 56529 22479 22955 -63404 -119836 -62129 -48271
92d8271k2167J34303J22832r9295j10023L7202k1718j01810J3773R0736L6034
$$ -48271 -70438 63865 186697 87402 -22621 14581 -7137 -108947 -95174 -4438 31596
103C1596K3167N021m1928j008K1333p4650o7064M9973K6877k7241O6363Q9308
$$ 31596 54763 59784 17856 16848 38181 -36469 -103533 -53560 -26683 -53924 12439 101747
115A01747k1399j8526J2420r7620j06652N3342O7225k4759L8071R6058j2716p2469
$$ 101747 80348 61822 74242 -23378 -130030 -76688 -9463 -34222 3849 99907 87191 14722
127A4722k6104k8989k3511K5306J107j3247P1413O6409l7554j5200M0404n0014
$$ 14722 -11382 -40371 -63882 -38576 -37469 -50716 20697 87106 49552 34352 74756 24742
139B4742r5595j590J6939j2260O3402Q6796j5675l3149J1219n0268q2262R778
$$ 24742 -70853 -72443 -55504 -67764 -4362 82434 66759 33610 44829 -5439 -87701 -77923
151g7923M6228J0287L6455M7446r279o652J2055n1183o1410J3163L268l6173L6734
$$ -77923 -31695 -21408 15047 62493 53214 46562 58617 7434 -53976 -40813 -37545 -73718 -36984
164c6984Q0725J0777p525J5581m4566p4834o295J3054n812M9966P3132J289j9624
$$ -36984 43741 54518 46993 62574 18008 -56826 -63121 -50067 -55879 -5913 67219 68508 48884
177D8884M088l8176o0126l662N710j7415K9696N6049Q035L569K4512k6491n9362
$$ 48884 52972 14796 -45330 -48992 -43282 -60697 -31001 25048 33083 36652 61164 34673 -24689
190b4689j5620n831j7923L5837O5159J7522J518J1084l7160o3552j7308j579j2447
$$ -24689 -40309 -46140 -64063 -28226 36933 54455 55973 67057 29897 -33655 -50963 -52542 -64989
203f4989K9670N4951J3533J996J9407j5654m7600k0858q021j5058J8481M3030
$$ -64989 -35319 19632 33165 35161 54568 38914 -8686 -29544 -37565 -52623 -34142 8888
215H888K2756J9259J8657k9371n4087k2458j4059k0853K0649N2837K7860J2602
$$ 8888 31644 50903 69560 40189 -13898 -36356 -50415 -71268 -50619 2218 30078 42680
227D2680J6887j5431m2382k1398j2738j8905J0159L9132K5924J5075J5306j1324
$$ 42680 59567 44136 1754 -19644 -32382 -51287 -41128 -1996 23928 39003 54309 42985
239D2985l4029k8661k7234k1013J6075L9757K4790K2868K6854o914l8236k9083
$$ 42985 8956 -19705 -46939 -67952 -51877 -12120 12670 35538 62392 55478 17242 -11841
251a1841j8608j8306M102K8919K6509K2099J8118o338k8768k7273k4369k0732
$$ -11841 -30449 -48755 -44653 -15734 10775 32874 50992 44654 15886 -11387 -35756 -56488
263e6488L291K6366K9816K9644K3528j362k3547k6531k7598k5052j966K2002K6819
$$ -56488 -53197 -26831 2985 32629 56157 54795 31248 4717 -22881 -47933 -49899 -27897 -1078
276a078K4603K0803K543j9214k7815k8032k1400k233J7976K6850L0475K5491O331
$$ -1078 23525 44328 46871 27657 -158 -28190 -49590 -51823 -33847 -6997 23478 48969 55300
289E5300j4871k5599k9320k5285r773J1024K3820K8116K3413P835r573k2835k8686
$$ 55300 40429 14830 -14490 -39775 -49548 -38524 -14704 13412 36825 44660 35087 12252 -16434
302a6434k4659q567J0544K3641K9572K6341J2519o860k2788k9719k7181j3870
$$ -16434 -41093 -49660 -39116 -15475 14097 40438 52957 46097 23309 -6410 -33591 -47461
314d7461K790J9138K7917K6163J4414k882j8428k6668k5916j4445K857J8381K8420
$$ -47461 -44671 -25533 2384 28547 42961 40079 21651 -5017 -30933 -45378 -42521 -24140 4280
327D280K7682J6664n13j6750k7364k9455j9512k917J4103K4882K7602J9905M399
$$ 4280 31962 48626 48113 31363 3999 -25456 -44968 -47885 -33782 -8900 18702 38607 43006
340D3006j2180k4657k6655j8115l446J0399K3973L0285K0581L040j0904k1017
$$ 43006 30826 6169 -20486 -38601 -42047 -31648 -7675 22610 43191 46231 35327 14310
352A4310k9741k4944q236Q806K1953K7743K2347R379l410j9663k9670k2218o291
$$ 14310 -15431 -40375 -48611 -39805 -17852 9891 32238 41617 38207 18544 -11126 -33344 -39635
365c9635N253J7617K8950K2829P806k559j7473l2345k5066p627L02J1215K9518
$$ -39635 -34382 -16765 12185 35014 42820 40261 22788 -9557 -34623 -42250 -41948 -30733 -1215
378a215L0060J2631q71j3238k6097k4257j3388n186J3510L2921K4408O512M154
$$ -1215 28845 41476 40605 27367 1270 -22987 -36375 -41561 -28051 4870 29278 35790 39944
391C9944q238l1792k8291r532n390P406K9925K6407J0190J0202n93k8009k9541
$$ 39944 31706 -86 -28377 -37909 -43299 -35893 -5968 20439 30629 40831 40238 12229 -17312
404a7312j1841r006J648K6842K7155J3593J2721m270l4039k8022p831j1792j210
$$ -17312 -29153 -38159 -36511 -9669 17486 31079 43800 39530 5491 -22531 -30362 -42154 -43364
417d3364L1893K8993P854J2952M817k6505k5842p378j7609j0475K5505K7697R572
$$ -43364 -11471 17522 25376 38328 43145 16640 -9202 -16580 -34189 -44664 -19159 8538 18110
430A8110J8817J1326k8716l0825j1056j9418j0616L0999L3603J0316J6269Q400
$$ 18110 36927 48253 19537 -11288 -22344 -41762 -52378 -21379 12224 22540 38809 47209
442D7209k6989k4835n686k1459j3626K7521K1500k688K2814K5166k1352k7976
$$ 47209 20220 -4615 -10301 -31760 -45386 -17865 3635 947 23761 48927 27575 -401
454d01n748k5521k4992K5128L1538P630K7121K6939k7144l7902r398j7617j4913
$$ -401 -6149 -31670 -56662 -31534 4 7634 34755 61694 34550 -3352 -12750 -30367 -45280
467d5280K1971J9414L096K8973J8393l2947j6329J7753k6114m4191J8068L1178
$$ -45280 -23309 -3895 -799 28174 46567 13620 -2709 15044 -11070 -55261 -37193 -6015
479f015K6K3797L7488j2086k6745p738l5561l6912K4188L5770L854K0572K4493
$$ -6015 -5989 17808 55296 43210 16465 8727 -26834 -63746 -39558 -3788 66 20638 45131
492D5131j8427j9008o93l0882k1683L4500J0779l0809K8631N8652j3681l3127
$$ 45131 26704 7696 7003 -23879 -45562 -11062 -283 -31092 -2461 56191 42510 9383
504I383R771j5723m8340m964J7910R370M1236M0386k2437k6841M831k6890l7737
$$ 9383 19154 3431 -44909 -49873 -31963 -22593 18643 59029 36592 9751 14582 -12308 -50045
517e0045J9066K3914m917K6890K6256k9635o578L7178k7930o4515J1895K9573
$$ -50045 -30979 -7065 -11982 14908 41164 11529 4951 42129 14199 -50316 -38421 -8848
529h848k3484P831N7201J7804j1520p225m0183m1451J6931J4811j2999L5403N0287
$$ -8848 -32332 -24501 32700 50504 38984 31759 -8424 -49875 -32944 -18133 -31132 4271 54558
542E4558j9671k8500J1310j8272l2600J9234N574l6086K2131N8024r085j9203
$$ 54558 34887 6387 17697 -575 -33175 -13941 -8367 -44453 -22322 35702 26617 7414
554G414L5036l247o0843k3762P001K65L3308M2163p034l618J7837l9527n7523
$$ 7414 42450 39203 -21640 -45402 -38401 -38136 -4828 37335 30301 26683 44520 4993 -52530
567e2530J9670K8064k0940J1426M0026j0037p813L2081j2744m8017O791Q097m1320
$$ -52530 -32860 -4796 -25736 -14310 25716 15679 7866 39947 27203 -20814 -14023 -5926 -47246
580d7246J995N8581K1645k764J2674k2828m5888l605l342k0966L5746N6896j3791
$$ -47246 -45251 13330 34975 32211 44885 22057 -23831 -27436 -30778 -51744 -15998 40898 27107
593B7107k1954K7387p083m3793K998J1097k9335L136L7089j596L97M1614o08n0807
$$ 27107 5153 32540 25457 -18336 -15338 -4241 -33576 -30440 6649 5053 5450 47064 46456 -4351
607d351j6035l393k5874J2857M6596J1426O002K4299k3981n1447M286J2728k7860
$$ -4351 -20386 -23779 -49653 -36796 9800 21226 27228 51527 27546 -23901 -19615 -6887 -34747
620c4747M892M1635o61r893K8513K837l0744j281m239l9335k774M0005J1471P489
$$ -34747 -29855 11780 11119 1226 29739 32576 1832 551 -3688 -43023 -45797 -5792 5679 13168
634A3168L5692k589m4040j3763o495k8851J0634M3261M684m601K6696k635l4083
$$ 13168 48860 46271 2231 -11532 -18027 -46878 -36244 7017 11701 7100 33796 31161 -2922
647b922j137M788k9094n878K5829K511M317L6949R272k9261r876r901l7272n097
$$ -2922 -4059 729 -28365 -34243 -8414 -5903 -1586 35363 44635 15374 5498 -4403 -41675 -46772
661d6772L3929J3270Q035L0129P99l3028r173k155k5064k339K5703K987J439K8402
$$ -46772 -12843 427 8462 38591 39390 6362 -2811 -4966 -30030 -32369 -6666 -3679 -2240 26162
675B6162P933k0615k168m066l4314j4422K0056Q349R725L4037J1787k1678j0528
$$ 26162 34095 13480 11312 7246 -27068 -41490 -21434 -13085 -3360 30677 42464 20786 10258
688A0258j0124l0437p780K2625Q682N796K5874Q028j7491m477m324k6819j1580
$$ 10258 134 -30303 -38083 -15458 -6776 -980 24894 32922 15431 10954 6630 -20189 -31769
701c1769J3167J442N455K9704J6695j0289n346q775k9323j5880J0283P148J0208
$$ -31769 -18602 -17160 -11705 17999 34694 24405 19059 10284 -19039 -34919 -24636 -17488 -7280
714g280K7756J2910j1408o143p669k5008j2517Q207L589N972K3760J4669m016
$$ -7280 20476 33386 21978 15835 8166 -16842 -29359 -21152 -17563 -11591 12169 26838 22822
727B2822j468o522k4563j6717J465J537Q445K5155J7277k363k436q702k3851j6385
$$ 22822 21354 14832 -9731 -26448 -24983 -23446 -15001 10154 27431 25068 22632 13930 -9921 -26306
741b6306J502K459P829K2103J5651J70n48n904k0265j7478k852k93O266J9361
$$ -26306 -24804 -22345 -14516 7587 23238 23408 22860 16956 -3309 -20787 -23639 -23932 -17666 1695
755A695J6758N682J517o745k0893j7103m309j780N445J9559J8131O428N73o149
$$ 1695 18453 24135 25652 18907 -1986 -19089 -23398 -25178 -19733 -174 17957 24385 24958 18809
769A8809j6543j6545q364k876M795J6931J7065Q389L272m239j4550j7078j0920
$$ 18809 2266 -14279 -22643 -25519 -20724 -3793 13272 21661 24933 20694 6144 -10934 -21854
782b1854m912N390J5370J6087J0128N787k328j4922j7883j1323m576K866J1580
$$ -21854 -26766 -21376 -6006 10081 20209 25996 23668 8746 -9137 -20460 -25036 -22170 -10590
795a0590J6132J3510O572k814j2536j5025j2454p487R83J1453J5918J3512P454
$$ -10590 5542 19052 25624 22810 10274 -4751 -17205 -24692 -23709 -12256 3662 17174 24628
808B4628r32j0563j4359j4183q863n03J0071J5128J3823Q669J104p947j4382j4781
$$ 24628 23696 13133 -1226 -15409 -24272 -24775 -14704 424 14247 22916 24020 16073 1691 -13090
822a3090r749q20P445J3398J4349J0844K622p616j3812j3989j0289l972N936J3142
$$ -13090 -22839 -23659 -16214 -2816 11533 22377 24999 17383 3571 -10418 -20707 -24679 -18743 -5601
836e601J5058J0997L822n445j1538j4615j2187m870M953J2125J3348J2040O428
$$ -5601 9457 20454 24276 18831 7293 -7322 -19509 -24379 -19426 -7301 6047 18087 24515
849B4515l715j2027j4153j2553o381L565J0725J3054J3078Q176k833j0720j2453
$$ 24515 20800 8773 -5380 -17933 -24314 -20749 -10024 3030 16108 24284 21451 10731 -1722
862a722j3078q290J416R374J2074J4143R382k010r058j0703j4062j1057R70R466
$$ -1722 -14800 -23090 -21674 -12300 -226 13917 23299 21289 12231 1528 -12534 -23591 -22621 -13155
876a3155J1204J3491J0857n04p827j0160j4498j1767R07P664Q228J3218J3069
$$ -13155 -1951 11540 22397 21893 14066 3906 -10592 -22359 -21452 -13788 -5560 7658 20727
889B0727R58o420q533j3338j4060j443O104P525J4221J5352J465n835p120j4668
$$ 20727 21685 15265 6732 -6606 -20666 -22109 -16005 -8480 5741 21093 22558 16723 9603 -5065
903e065j5833r48O447N145J3316J6245J544n768l857j2664j5589k427L439J813
$$ -5065 -20898 -21846 -15399 -10254 3062 19307 20851 15083 11226 -1438 -17027 -19454 -16015 -14202
917a4202J2795J8551M337m619j512j2819j9281n013L252K099J5569J9555J062
$$ -14202 -1407 17144 21481 16862 15350 2531 -16750 -21763 -18511 -16412 -843 18712 19774
930A9774n418J367j1291k0859l491O150l37Q940J6860L864J75M753j1754k2129
$$ 19774 14356 15723 4432 -16427 -19918 -13768 -14105 -5165 11695 15559 15734 20487 8733 -13396
944a3396m062K241o213R837K3425Q426j099J582j3920k1690j512K676p082J0787
$$ -13396 -17458 -15217 -21430 -11593 11832 20258 19159 20741 6821 -14869 -16381 -13705 -20787 -10000
958a0000K4636K552p408O082m215j7507n186k319j0210R260K2504K745MJ5601
$$ -10000 14636 17188 9780 15862 11647 -5860 -11046 -13365 -23575 -14315 8189 10934 10938 26539
972B6539n095k8497j0471Q38o680J0179K2898L179r1J1612j0613k7204J6Q462
$$ 26539 21444 -7053 -17524 -16686 -23366 -13187 9711 12890 12799 24411 13798 -13406 -13390 -4928
986d928j1750o41J9066N443J425J4142m340k0149j236l386k2813J201L0695J0967
$$ -4928 -16678 -17319 1747 7190 8615 22757 18417 -1732 -2968 -6354 -29167 -27966 2729 13696
1000A3696j420J1882l916k3195p263k147j3659J0205K6243j722q692J7606L414
$$ 13696 12276 24158 20242 -2953 -10216 -12363 -26022 -15817 10426 8704 12 17618 21032
1013B1032k0834m137J553j5926k654J6389O38M695K7746K433k9156q319J069j9611
$$ 21032 198 -3939 -2386 -18312 -20966 -4577 -3939 756 28502 30935 1779 -6540 -5471 -25082
1027b5082k144K5212R101K537J5189o562k5284L262O878k0433n012K2364Q37n845
$$ -25082 -27226 -2014 7087 9624 24813 18251 -7033 -3771 3107 -17326 -22338 26 863 -4982
1041d982J8701Q622j3872j83l947k8734o321K3986N278Q0K5299P263k4717r811
$$ -4982 13719 22341 8469 8286 4339 -24395 -30716 -6730 -1452 -1372 23927 31190 6473 -3338
1055c338j625j7328J745K2291j170n623K0874N368k0782J432R066k0101j2967
$$ -3338 -4963 -22291 -20546 1745 575 -5048 15826 21194 412 1844 10910 -9191 -22158
1068b2158J1554j15R05K7215J0806j7215k219j210k8264j0917K2274P910P4J9903
$$ -22158 -10604 -10719 -9814 17401 28207 10992 8773 7563 -20701 -31618 -9344 -1434 -1360 18543
1082A8543M229k0532k48M904j9608o447J8078l782r903K0395J4365j0189K666
$$ 18543 22772 2240 1992 6896 -12712 -19159 -1081 -4863 -14766 5629 19994 9805 12471
1095A2471K999k5058j5203J1729l24M30K7828J3683j7070n022J009k1264r442
$$ 12471 15470 -9588 -24791 -13062 -13386 -12956 14872 28555 11485 6463 7472 -13792 -23234
1108b3234J7144J832m986J7974Q206j3868L555R491j8180j3741P574m751o422
$$ -23234 -6090 -4258 -9244 8730 16936 3068 6623 16114 -2066 -15807 -8233 -12984 -19406
1121a9406K1829J7542o808K257J771k4454j6212J1009J652j447K1075J1746j3245
$$ -19406 2423 19965 13157 15414 17185 -7269 -23481 -12472 -10820 -12267 8808 20554 7309
1134G309p47N607j6493r696R902l751r117J5469J3246n574O701Q396j8729j6881
$$ 7309 6562 12169 -4324 -14020 -4118 -7869 -16986 -1517 11729 6155 12856 21252 2523 -14358
1148a4358L757m767m671K0738J6478n561J729K351j8237j3468Q136j131n764J4849
$$ -14358 -10601 -15368 -20039 699 17177 11616 13345 15696 -2541 -16009 -7873 -9004 -14768 81
1162H1J0956o725M054Q776j2428j2047K583o914q959J3779J5056k61O113O501
$$ 81 11037 4312 8366 17142 4714 -7333 -4750 -11664 -20623 -6844 8212 7951 14064 20565
1176B0565j5549j5401J252m060m697J4715J2929k856L072N674j1597j0549K411
$$ 20565 5016 -10385 -9133 -13193 -17890 -3175 9754 6898 9970 15644 4047 -6502 -4091
1189d091m662q143R324J0849j58P371Q606r497j2279k029p439p786J1070J2858
$$ -4091 -8753 -16896 -7572 3277 3119 10490 19096 9599 -2680 -4709 -12148 -19934 -8864 3994
1203C994J687O307O232j0182j2381p46m470o345P662R659J276N957P106o157q882
$$ 3994 5681 11988 18220 8038 -4343 -5089 -9559 -15904 -8242 1417 2693 8650 15756 9599 717
1218G17j739p160q968N273J0207L827P400P403n544r477m021p380p036N943R545
$$ 717 -1022 -8182 -17150 -11877 -1670 2157 9557 16960 11416 1939 -2082 -9462 -16498 -10555 -1010
1233a010K852N780P235l627q102l733o400o855K968O270L647P445Q401k516p111
$$ -1010 1842 7622 14857 11230 3128 -605 -7005 -13860 -10892 -4622 -975 6470 14871 12355 5244
1248E244m473o945q064J868N960N390P497P479j928o367l991o945p233L22N596
$$ 5244 771 -6174 -14238 -12370 -6410 -1020 6477 13956 12028 5661 1670 -5275 -12508 -12186 -6590
1263f590M651O483O881M3l379m285q045p932k7M241M098P153P685J663l919m761
$$ -6590 -1939 4544 11425 11468 8089 3804 -4241 -12173 -12200 -7959 -3861 3292 10977 12640 8721 3960
1279C960p376o893j688K763M546P334P091K022k345m203o731p159k800J412M213
$$ 3960 -3416 -10309 -11997 -9234 -4688 2646 9737 11759 9414 5211 -1520 -8679 -11479 -10067 -5854
1294e854P061P134K623q55l701o588p642l829J426L747O099P135M128rl886o478
$$ -5854 1207 8341 10964 10109 6408 -180 -7822 -11651 -10225 -6478 -379 6756 10884 10875 6989 511
1310E11p002l805k71K854N840P939M169L35l022n492o947m782j569L079N952O916
$$ 511 -6491 -10296 -10567 -7713 -1873 6066 10235 10570 7548 2056 -4891 -9673 -11242 -8163 -2211 4705
1326D705M429J768k038n444o975n467j606J920N045O577N335K337j193m875p283
$$ 4705 9134 10902 8864 3420 -3555 -9022 -10628 -8708 -3663 2914 8249 10586 9393 4518 -2765
1341b765n383j804P10M375O752N823K530p14m337o228n891k880l58M221O975N386
$$ -2765 -8148 -9952 -9242 -4867 1885 7708 10238 9524 5187 -1041 -6932 -9812 -10170 -5949 1026 6412
1357F412K985N70l376o838n461l249j283L669O222N654L380J848l399o607n612
$$ 6412 9397 9967 6591 -247 -5708 -8957 -10240 -6571 -349 5305 8685 10533 7134 527 -5085
1372e085l305j788K611O207N611L326K420j808o308n503l738k348J304O207N197
$$ -5085 -8390 -10178 -7567 -1360 4251 7577 9997 8189 1881 -3622 -7360 -9708 -8404 -2197 3000
1387C000L914L843j863o484n577l363l508J003O446M683M005L950o51o494n269
$$ 3000 6914 10757 8894 2410 -3167 -6530 -10038 -9035 -2589 2094 6099 10049 9398 2904 -2365
1402b365k248m115j111N879N000L899M386K54n309l980m317o652J0O979M510K572
$$ -2365 -4613 -8728 -9839 -3960 1040 4939 9325 9579 4270 290 -4027 -10679 -10669 -3690 820 3392
1418C392N876J234n997m592l042n869j004O545L389J036O121L529n163m534k685
$$ 3392 9268 10502 4505 -87 -3129 -8998 -10002 -3457 -68 968 7089 10618 5455 921 -1764
1433a764n809k352L795K392M317R357J864p506k809j142q188m167O399M378K005
$$ -1764 -7573 -9925 -6130 -3738 579 9936 11800 4294 1485 343 -7845 -12012 -5613 -1235 770
1448G70O388K278n613j645K04q356m521M969K762N44O898M781k086j008l573j0867
$$ 770 7158 9436 3823 2178 2382 -5974 -10495 -5526 -2764 -2220 4678 9459 7373 6365 2792 -8075
1464h075l752P121J145m92J0415O462o974m389j72o250m156N100M35p53Q294N517
$$ -8075 -11827 -4706 -3561 -4053 6362 12824 5850 1461 1289 -4961 -9117 -4017 -3582 -4335 3959 9476
1480I476n061n08K358q079p001J948n56J332J0966N800n614O29J721j2236q352
$$ 9476 4415 3907 6265 -1814 -8815 -6867 -7423 -6091 4875 10675 5061 5690 7411 -4825 -13177
1495a3177P375M000j782O525N545m406L8J600p984m738M446j922m926Q334Q611
$$ -13177 -5802 -1802 -3584 2941 8486 4080 4118 5718 -2266 -7004 -2558 -4480 -9406 -1072 7539
1510G539j927J266K386j0864p560M064j731l137J2421R927o955k731L471p059
$$ 7539 5612 6878 9264 -1600 -9160 -5096 -6827 -9964 2457 12384 5429 2698 6169 -890
1524h90p006L962M55l363O816N107m251K930P146p768q764K359k639n775R430
$$ -890 -7896 -3934 -3479 -6842 -26 5081 830 3760 10906 3138 -5626 -3267 -5906 -11681 -2251
1539b251R473k394K520M015j1326r904N282Q85m841P922P882m499m20N097n923
$$ -2251 7222 4828 7348 11363 37 -9867 -4585 -3700 -8541 -619 7263 2764 2344 7441 1518
1554A518n502M572l284q371O352Q674l152L689Q454p647r892J174l306n748R509
$$ 1518 -3984 588 -2696 -11067 -4715 3959 807 4496 12950 5303 -4589 -3415 -6721 -12469 -2960
1569b960R985l650P45N118p283q144M414L54o104M675N788m513K768R106m565
$$ -2960 7025 3375 4120 9238 1955 -6189 -1775 -1421 -7525 -2850 2938 -1575 1193 10299 5734
1584E734p204K417m018r554N247R318r14L855P856p291j0001K439j776o011O926
$$ 5734 -1470 947 -3071 -12625 -7378 1940 1026 4881 12737 5446 -4555 -2116 -3892 -9903 -2977
1599b977P779m267K09O939l889n890M415k097r313K608O179k741M013J0106k949
$$ -2977 4802 535 744 7683 3794 -2096 2319 222 -9091 -6483 -304 -3045 968 11074 8125
1614H125q061J080m092q968N089Q404j120K259O796m785p590L087n24p309L321
$$ 8125 64 1144 -2948 -11916 -6827 1577 457 2716 9512 4727 -2863 224 -300 -7609 -4288
1629d288N276l789J095R167j065m723K656l586r637R19N596n75L845R138k466
$$ -4288 988 -2801 -1706 7461 6396 1673 4329 743 -8894 -7975 -2379 -2954 891 10029 7563
1644G563p213R33k543p375L075O189k181J253O681j457m484L227j370q165K46
$$ 7563 350 1283 -1260 -8635 -5560 629 -1552 -299 6382 4925 441 3668 2298 -5867 -5621
1659e621L475k814L049R044j75l949J211l472q479N91M914p57L088O534r99m237
$$ -5621 -2146 -4960 -1911 7133 6958 3009 4220 748 -7731 -7140 -2226 -2983 105 6639 5640 1403
1675A403J466j279o748M47L086k394J160O565R28j951K426j855p799j331K418
$$ 1403 2869 1590 -5158 -4711 -1625 -4019 -2859 3706 4634 2683 5109 3254 -4545 -5876 -3458
1690c458j546K499P227J454k572O07k425o483l34K710j706J394N927P94j883J767
$$ -3458 -5004 -2505 4722 6176 3604 4211 1786 -4697 -5031 -2321 -4027 -2633 3294 4088 2205 3972
1706C972m80n730j531Q65k327J295O304K161q01J583j301o334k360Q35q66J745
$$ 3972 3492 -2238 -3769 -2904 -5231 -3936 2368 4529 3728 5311 4010 -2324 -4684 -3849 -4715 -2970
1722b970N106J740j224J995j307m902j482M04j574L4M810K481k6J823o50m535
$$ -2970 2136 3876 2652 4647 3340 -1562 -3044 -2640 -4214 -4180 630 3111 3085 4908 4258 -277
1738b77k734n83j459O44M734K595N17J042n05l798k689m50j694P70L904J836N42
$$ -277 -3011 -3594 -5053 -4409 325 2920 3437 4479 3974 176 -2513 -2963 -4657 -3887 17 1853 2395
1755B395J824L37l506k759j069j560k26K960K805J847J722k02l187k465j238j919
$$ 2395 4219 4556 1050 -1709 -2778 -4338 -4564 -1604 1201 3048 4770 4568 1381 -1084 -2322 -4241
1771d241o8K824K685J202J577K87k590k136j519k018k05K110K267K091J556P47
$$ -4241 -4309 -1485 1200 2402 3979 4266 1676 -460 -1979 -3997 -4202 -2092 175 2266 3822 4569
1787D569k140k366j807k131j55J726J993J880K193O54j950k092k000j717p39J077
$$ 4569 2429 63 -1744 -3875 -4030 -2304 -311 1569 3762 4416 2466 374 -1626 -3343 -4082 -3005
1803c005K347K082J930P43j107k141j865k217p65P02J928K200J780J230q96j555
$$ -3005 -658 1424 3354 4097 2990 849 -1016 -3233 -3998 -3296 -1368 832 2612 3842 2946 1391
1819A391j976k181j173L59K430J481K259J189m42j499k074j891j547L39J357J876
$$ 1391 -585 -2766 -3939 -3580 -1150 331 2590 3779 3337 1838 -236 -2127 -3674 -3335 -1978 -102
1835a02K216J281Mj287j702k232j651K19J131J572K564J515K2j216j582k139j620
$$ -102 2114 3395 3399 2112 410 -1822 -3473 -3254 -2123 -551 2013 3528 3550 2334 752 -1387 -3007
1852c007l13J157J463J982J729L02o80j667k188j704o59J251J205K507J556K81
$$ -3007 -3320 -2163 -700 1282 3011 3313 2633 966 -1222 -2926 -3585 -2334 -1129 1378 2934 3215
1868C215k3j523k550j772n78N78Q62K144K350M10m47p27k154k419m55M21M54K267
$$ 3215 3192 1669 -881 -2653 -3231 -2653 -1791 353 2703 3113 2666 1939 -215 -2634 -3089 -2668 -2214 53
1886E3K083J042o19q89j713j835n46o90M25K723K398q0L06L38k406k404p89j87
$$ 53 2136 3178 2559 1670 -43 -1878 -2424 -3114 -2689 34 2432 2352 2658 2996 590 -1814 -2603 -2790
1904b790J42J919K575N53L19J81k761k028o33j84L77J320K400N23R08M07k061
$$ -2790 -2648 -729 1846 2399 2718 2899 138 -1890 -2523 -2707 -2330 -1010 1390 1913 2821 3228 1167
1921A167k301k60n78j544J554L477P04K15Q29j325l197n52q11r06K468K156L76
$$ 1167 -1134 -1394 -1972 -3516 -1962 1515 2219 2434 3263 1938 -1259 -1811 -2622 -3528 -1060 1096 1472
1938A472K81J404j438k683L8q03j398J384K539m11R96K681j355l372p17o09j797
$$ 1472 1753 3157 1719 -964 -926 -1729 -3127 -1743 796 385 1381 4062 2707 -665 -1382 -1991 -3788
1955c788J268K686J026R33J416j908k610K45n00k006J113K378J7M04K176n60k259
$$ -3788 -2520 166 1192 2125 3541 1633 -977 -732 -1232 -3238 -2125 253 270 674 2850 2290 31
1972C1L98r16l242N92L208O2O29K823j24k962p21j264k403J428L129p05L62L092
$$ 31 429 -487 -3729 -3137 71 133 762 3585 3461 499 -222 -1486 -3889 -2461 668 -37 325 3417
1990C417j179k917R96N8l378O66K214j106Q33L643K6k650N43q38m013j02K914
$$ 3417 2238 -679 317 375 -3003 -2337 -123 -1229 -396 3247 3273 623 1166 328 -3685 -3787 -873
2007h73M28O91L664j020l319R42j92l778J177L056j415n68L394Pj933J464lm007
$$ -873 -445 246 3910 2890 -429 513 321 -3457 -2280 776 -639 -1207 2187 2194 261 1725 1722 -2285
2025b285j259K599j188Q08M525O33l022K25o39m008O21L060o31N8L334j77l308
$$ -2285 -3544 -945 -2133 -1325 3200 3833 811 1036 397 -3611 -2990 70 -561 -503 2831 2654 -654
2042f54J751M10l012o55K381k191n09M045Q88j571J705k74m694r02K241q49N58
$$ -654 1097 1507 -1505 -2160 221 -1970 -2479 1566 2454 883 2588 2314 -2380 -3282 -1041 -1890 -1332
2059a332M201L55k692P28O5l670M0K699j361p95L303L30k217K279J025l512j480
$$ -1332 2869 3224 532 1260 1325 -2345 -2305 394 -967 -1762 1541 1871 -346 1933 2958 -554 -2034
2076b034J349j729q42M677J562j839R52K02m456p31K274n81j92L178L70k872J732
$$ -2034 -685 -2414 -3256 1421 2983 1144 2096 2298 -2158 -2889 -615 -1196 -1388 1790 2160 -712 1020
2093A020R50k597m39J539j763j856L111J377r26K180Q63l689j948J244j373o66
$$ 1020 1970 -627 -1066 473 -1290 -3146 -35 1342 416 2596 3459 -230 -2178 -934 -2307 -2973
2109b973M252J345k120R54P72l397p70K526j083j638K480P79j750K055J518k347
$$ -2973 1279 2624 504 1458 2230 -1167 -1937 589 -494 -2132 348 1127 -623 1432 2950 603
2125F03j323Q12k386j194K866K016q17J578R39l020j869J413j022q31K372J122
$$ 603 -720 92 -2294 -3488 -622 1394 577 2155 3094 74 -1795 -382 -1404 -2235 137 1259
2141A259j568J135J504k285o53J558j595k170J736J363n89J691J755k187j509
$$ 1259 -309 826 2330 45 -608 950 -645 -2815 -1079 284 -305 1386 3141 954 -555
2156e55Q70k054j724K860J489j097J566J129k358r40J162j258j195J711O41j038
$$ -555 315 -1739 -3463 -603 886 -211 1355 2484 126 -814 348 -910 -2105 -394 247 -791
2172g91J322K123j496j166Q87j595j763J077J321m20J718J814j872j400M61j030
$$ -791 531 2654 1158 -8 879 -716 -2479 -1402 -81 -501 1217 3031 1159 -241 220 -810
2188h10j379R82J652p90P05J559j236n51P99j304j616P38P89q77J676J877m32
$$ -810 -2189 -1207 445 -345 360 1919 683 132 931 -373 -1989 -1251 -462 -1339 337 2214 1782
2205A782j155L34j459j698R21R30l31R41J500o13j152P29q13j339N23L53m73R95
$$ 1782 627 961 -498 -2196 -1275 -345 -676 265 1765 1152 0 729 -84 -1423 -900 -547 -1020 -25
2223b5J456j12p44M75r69j485J56L26k9J207J014J2m14J05r73j391J76P53l40
$$ -25 1431 1319 575 1050 81 -1404 -1248 -922 -951 256 1270 1282 868 973 0 -1391 -1215 -462 -802
2242h02N93J276q3l81N18o51j536P1rk23R26R97K73R5J11o30j113m75K45m30K96
$$ -802 -209 1067 984 603 1121 470 -1066 -995 -1004 -1227 -301 696 969 1064 1175 545 -568 -1043 -798 -1228 -932
2263i32J259O14J77n8l29r84q20J88n72P16R54P04O8M8l82j012l24m83J32N70
$$ -932 327 941 1118 1060 731 -253 -1073 -885 -1457 -741 213 917 985 1033 651 -361 -685 -1168 -1036 -466
2283d66N18R18j42J49n13n76m54k07n16j18J538P1L91J86K19o29p58n57r6J50
$$ -466 52 970 828 977 464 -112 -566 -773 -1289 -1407 131 202 593 779 998 369 -389 -946 -1042 -892
2303h92Q03N15K97J36j50n48n12k69l59Q6P70M09L40L10k43l95p20m75J98K7K82
$$ -892 -89 426 723 859 709 161 -351 -620 -979 -893 -123 286 626 936 693 298 -422 -897 -699 -672 -390
2324c90N40M29M94k46m08m94p30R1j94K87O07N38K85J48n15l95n76j25k51L79
$$ -390 150 579 1073 827 419 -75 -805 -714 -908 -621 -14 524 809 957 442 47 -529 -654 -905 -526
2344e26K77O09L82K56j98n85m48o76J56K64L21L74K18N03l54l44n26n15j33K36
$$ -526 -249 360 742 998 800 215 -233 -909 -753 -489 -168 206 424 927 573 229 -297 -812 -945 -709
2364g09K61N80N53L03k73j60o50m38m17N59j69M55Q16J41N4n74j24n06p32M89
$$ -709 -448 132 685 988 715 555 -95 -533 -950 -391 -560 -105 711 852 906 332 208 -298 -1030 -541
2384e41P2L11P29K01l37L32l99j217P6k49L68L45O72K73K9M3k67r33O0l22J74
$$ -541 -469 -158 571 772 435 767 368 -849 -773 -1022 -654 -309 363 636 665 708 441 -492 -432 -754 -580
2405e80R1O00P95l64J18m62m83l32M2J57l34Q84P84m21O2J49q95m48Q3j32J88
$$ -580 -489 111 906 542 660 198 -285 -617 -575 -418 -752 132 916 495 557 706 -189 -637 -554 -686 -498
2426d98O47N83K9l20K75o41o42J60lm45O74P84l25N49K62r81p04Q9j13k43Q44
$$ -498 149 732 761 441 716 75 -567 -407 -410 -855 -181 603 278 827 1089 108 -596 -507 -620 -863 -19
2447a9O82j19j41L83q25n07L28m41j77N84M85k39M58N66p39o06Ll28n54Q45O04
$$ -19 663 544 403 786 -39 -546 -218 -659 -836 -252 233 -6 452 1018 279 -327 -324 -652 -1206 -361 243
2468B43MJ49P95q92p49P9j0k72O39L21k98N42M60o74p53P60n94r24Q08J33kM46
$$ 243 247 396 1191 299 -450 -371 -381 -653 -14 307 9 551 1011 337 -416 344 -250 -1174 -366 -233 -235 211
2490B11Q57o19o03J52n68o76O83Q23k76M12Q91p02r48K51J98j017M84Q34r24M96
$$ 211 1068 449 -154 -2 -570 -1246 -563 260 -16 396 1287 585 -363 -112 86 -931 -447 387 -537 -41
2510d1J126k72q44P90q21j104N70O95m06M67J336r90o15L79n69r29N43Q83n83
$$ -41 1085 813 -31 759 -62 -1166 -596 99 -307 160 1496 506 -109 270 -299 -1228 -685 198 -385
2529c85L42Q61m56m64R92j99j632O35J14m19M82J015k17o65O57m33j272J95J153
$$ -385 -43 818 362 -102 890 691 -941 -306 -192 -611 -129 886 669 4 661 228 -1044 -849 304
2548C04q60M48J236o25m30M49k82r99K74P28r26L5J471k82m49P87n10j207L11
$$ 304 -556 -108 1128 503 73 522 240 -759 -485 243 -683 -648 823 541 92 879 369 -838 -527
2567e27J6o49R12J216p0p40M37l39j303N92M28o59N71R72m17p46O89J65r20O1
$$ -527 -511 -1160 -248 968 898 158 595 256 -1047 -455 -27 -686 -115 857 440 -306 383 548 -372 -311
2587c11L60p92l61J446N0l11Q45q3j569k32Q08p07L35J417j38o90N81k54r79O4
$$ -311 49 -743 -1104 342 392 81 926 843 -726 -958 -150 -857 -522 895 757 67 648 394 -585 -521
2607e21R54j294J16R79j52n7Q35L83j266l81J94q77j28J431M73o46Q21J11j302
$$ -521 433 -861 -745 234 82 25 860 1243 -23 -404 -210 -1087 -1215 216 689 43 864 975 -327
2626c27k61O41o42J44P75O4r60J027M52q75K00K28j040n36R31L64o09J385j6r70
$$ -327 -588 53 -589 -445 330 394 -566 461 913 38 238 466 -574 -1110 -179 185 -424 961 945 -25
2646b5m36P78q04l30R17L15m24N71J68j012J76K37n28n20P32K41l62P16P21p69
$$ -25 -461 317 -487 -817 100 415 -9 562 730 -282 -106 131 -397 -917 -185 56 -306 410 1131 362
2666C62j19l69m22p96R76N26k91P29O46j059l14J89n40k20M20M68m70O39M32n92
$$ 362 243 -126 -548 -1344 -368 158 -133 596 1242 183 -131 58 -482 -702 -282 186 -284 355 787 195
2686A95k24L51n79o31P62kl44P90N40m03n88N40r41j67L22M53k03P15R0m24k12
$$ 195 -29 322 -257 -888 -126 -128 -472 318 858 455 -133 407 -534 -701 -379 74 -129 586 676 252 40
2707D0M70l65q91M60l3J28L7P45n2l52K36l20r81J97L74p3N53L75n7Kqo41l72
$$ 40 510 145 -746 -286 -319 -191 -154 591 539 187 423 103 -878 -681 -307 -380 173 548 491 493 485 -156 -528
2730e28j32N32j79L96N44l15jJ37l63n08l0j54M5K56P91k00R8l9l52o24M5K29
$$ -528 -660 -128 -307 89 633 318 317 454 91 -417 -447 -601 -556 -300 491 291 389 350 -2 -626 -581 -352
2752c52r3L90O25k76k7L01n55k51j38m1p6J31O44J60J72j63j94m35M3j28l46P02
$$ -352 -445 -55 570 294 267 568 13 -238 -376 -417 -493 -362 282 442 614 451 257 -178 -135 -263 -609 93
2774I3K17J7O4L38n43k45l63L18k89j3P15J94R7j09r7n18j42M9m13J8O68J61J77
$$ 93 310 327 391 729 186 -59 -422 -104 -393 -406 309 503 600 491 394 -124 -266 -217 -630 -612 56 217 394
2797C94K69k16m63n0j75l49J75M43O32k13P4J60n11l58k46k20J38M55J41M89O2
$$ 394 663 447 -16 -66 -241 -590 -415 28 660 447 521 681 170 -188 -434 -654 -516 -61 80 569 631
2818F31k60l00m42M3k08j64O07M5M23J82r5o2m69l72j63j4M66K26O4M57k85l75
$$ 631 371 71 -371 -328 -536 -700 -93 -48 375 557 462 400 -69 -441 -604 -618 -152 74 138 595 310 -65
2840f5j41N4l78j50O16L5M13O06m95P0n78j24m15J86J28P9L56O8K14j20k69l09
$$ -65 -206 -152 -530 -680 -64 -29 384 990 495 565 -13 -137 -552 -366 -238 -159 197 265 479 359 90 -219
2862b19O9p70O00K89O4K24K38K0m70j47l37j79L16J67J60K95K96k80j52K5m33
$$ -219 -150 -920 -320 -31 33 257 495 515 45 -102 -439 -618 -302 -135 25 320 616 336 184 209 -224
2883b24l31J54l69J062n78Q44k91n73O25q39j33N3M10m4O70J9m34L55o39J73l62
$$ -224 -555 -401 -770 292 -286 558 267 -306 319 -520 -653 -600 -190 -234 436 455 21 376 -263 -90 -452
2904d52l83L49mN29L08M40j5j93o37k82j07J76O3L20L86j45N8j03o03l5j92K7
$$ -452 -835 -486 -490 39 347 787 772 579 -58 -340 -447 -271 -208 112 498 353 411 308 -295 -330 -522 -495
2926d95K74K58N81l07M41k70o91j66P2O3j56L83N44j23l0R3n48k09L26p44J10
$$ -495 -221 37 618 311 752 482 -209 -375 -303 -240 -396 -13 531 408 378 471 -77 -286 40 -704 -594
2947e94P71J02j19L84J62o52o09K84l95J44P74K36l83M53M2p43l4k2j39q2N21
$$ -594 177 279 160 544 706 54 -555 -271 -666 -522 252 488 105 558 600 -143 -177 -199 -338 -420 101
2968A01J90j71J91J04j87n61L87l75l85M88N75m38P31k9m58l42J92o71K05L52
$$ 101 291 120 311 415 228 -333 54 -321 -706 -218 357 -81 650 621 163 -179 13 -658 -453 -101
2988a01N07m37M15L6l16j38M7k97l28J91N28j76L96K79l85j60j14m9q55N95P28
$$ -101 406 -31 384 420 104 -34 13 -284 -612 -421 107 -69 327 606 221 61 -53 -102 -957 -362 366
3009C66l68L90N15p98j39J08m40l83O77J50k67J29P86l34l75M15p04m61L52J72
$$ 366 -2 388 903 105 -34 74 -366 -749 -72 78 -189 -60 726 392 17 432 -272 -733 -381 -209
3029b09lK88P43m71l41J69n36l35N7L54o8P43N31o59m67N97m54l66K92R1j70j41
$$ -209 -212 76 819 348 7 176 -360 -695 -638 -284 -352 391 922 263 -204 393 -61 -427 -135 -44 -214 -355
3051c55R01j63l14K68l40o44J01K15K85j07J032j59n95K51l98q57M95J06l03O81
$$ -355 546 383 69 337 -3 -647 -546 -331 -46 -153 879 720 125 376 -22 -879 -384 -278 -581 100
3071A00J60k09J75K15m01l43j82K79m62M44J040m39oJ10o35o71K38L00N8K59N96
$$ 100 260 51 226 441 40 -303 -485 -206 -668 -224 816 377 371 481 -154 -825 -587 -287 -229 30 626
3092F26m68j6K78l34o02K69K66p09K50J172l63l15N11P6q57j51L77o03L97J008
$$ 626 158 142 420 86 -516 -247 19 -690 -440 732 369 54 565 641 -216 -367 10 -593 -196 812
3112H12k07l63L46n59o82K65J83l96p1J184m12o4J60L50q83K8L18q07L01Q51J70
$$ 812 605 242 588 29 -653 -388 -205 -601 -672 512 100 36 196 546 -337 -309 9 -798 -497 354 524
3133E24m27N10o0q85l12K18j55K52Q74l51j00M75j24o14j41N55o57l09Q58n2P4
$$ 524 97 607 547 -338 -650 -432 -587 -335 539 188 88 563 439 -175 -316 239 -418 -727 131 79 153
3154A53N44l31o41K32j44j74n7P62k7m56N91N8p29oK67p53K27N80l63J97M47K81
$$ 153 697 366 -275 -43 -187 -361 -418 344 317 -139 452 510 -219 -225 42 -711 -484 96 -267 -70 377 658
3176F58m07l07rn59l94J220J59l37N89L3k96l89J93o58J7M60J09M4O01nn44r2
$$ 658 251 -56 -65 -624 -1018 202 361 24 613 646 350 -39 154 -504 -487 -27 82 126 727 722 178 86
3198H6k4m11n0L03N0q1O54M0n22J81o39K67m15L15k2L81L55J64l87k38q1m16j56
$$ 86 62 -349 -399 -96 -46 -127 527 567 45 226 -413 -146 -561 -246 -268 113 468 632 245 7 -74 -490 -646
3221f46N95l6j50P80n9j05j38o7o56k6J68K7J77M34M05l82k70r0l86k20M75l9
$$ -646 -51 -87 -237 543 484 379 241 174 -482 -508 -340 -313 -136 298 703 321 51 -39 -425 -645 -170 -209
3243b09L83J72J56k86j31K44m47n55P4L36J52K18M47j09j49J2o56j85j26L27K53
$$ -209 174 346 502 216 85 329 -118 -673 -599 -263 -111 107 554 445 296 308 -348 -533 -659 -332 -79
3264g9K69L07k78o6k49Rk60o0L40r4L90K06k2J25n55rm85J12Om0N57J00L66j2
$$ -79 190 497 219 153 -96 -87 -347 -407 -67 -161 229 435 413 538 -17 -26 -511 -399 -393 -433 124 224 590 578
3288E78k08o55j12J37K04o6r8N78Q7QP3m92l44o8P3kK97J47L46r3J50o98j85j25
$$ 578 370 -285 -397 -260 -56 -122 -220 358 445 453 526 34 -310 -378 -305 -307 -10 137 483 390 540 -158 -343 -468
3312d68m9K0P05J3R3O8K6l04k55j31j30J8K94J54O53l20n5j31k20m39k80K42K69
$$ -468 -517 -497 208 221 314 382 408 104 -151 -282 -412 -394 -100 54 707 387 332 201 -19 -458 -738 -496 -227
3335b27K78M96k48J59l34j23n14J47k8K68L01o1N9K11k14k28k37J23l49K56K78
$$ -227 51 547 299 458 124 1 -513 -366 -394 -126 175 114 173 384 170 -58 -295 -172 -521 -265 13
3356A3Q3M41K24l78k58n19j01L53n7K20J66J86nj51r4j72n54L30m6J10N20rL60
$$ 13 96 537 761 383 125 -394 -495 -142 -199 21 187 373 368 217 123 -49 -603 -273 -319 -209 311 302 662
3379F62k54l44m25L9J51O3o0L52J27K03R5m43r8l18k75J5L76J92k9K72N55o38
$$ 662 408 64 -361 -322 -171 -108 -168 184 311 514 609 166 68 -250 -525 -510 -134 58 29 301 856 218
3401B18k43k49j45l27L89M41J10M23j45l37K0n57k20q7K43L38M57M57k50m35j85
$$ 218 -25 -274 -419 -746 -357 84 194 617 472 135 155 -402 -622 -709 -466 -128 329 786 536 101 -84
3422h4K74r18J65L41K44J36P8J72k06Jl13p29M52L12q3M13K62q7r8j95k95j77
$$ -84 190 -728 -563 -222 22 158 236 408 202 203 -110 -839 -387 -75 -158 255 517 430 332 137 -158 -335
3444c35l76M53j38M30K53J34l4j15n9o12o8q2M17j18M10M98n58J36n7o43l0J81
$$ -335 -711 -258 -396 34 287 421 387 272 213 -399 -467 -549 -132 -250 160 658 100 236 179 -464 -494 -313
3466c13J15K8L50K84m2k4m77j10r6L2j69K63N52k8J59J33l13l83m04L42l77J56
$$ -313 -198 -170 180 464 422 398 -79 -189 -285 -253 -422 -159 393 365 524 657 344 -39 -443 -101 -478 -322
3488c22O94k7k58K42j50n00O0Qj54j02N68O19m58K12J00r70J53J20l81K73O39
$$ -322 372 345 87 329 179 -321 -261 -253 -407 -509 59 678 220 432 532 -438 -285 -165 -546 -273 366
3509C66j62J83J07j41m59l13L1l06J88M86M03j94J88O0l23l91K43n74J48M85K15
$$ 366 204 387 494 353 -106 -419 -388 -694 -506 -20 383 189 377 437 114 -277 -34 -608 -460 25 240
3530B40J83j36L00r45K6K04Om88O11O8k38O45l1o18o0K58o66j79N46M74k48M49
$$ 240 423 287 587 -358 -332 -128 -122 -610 1 69 -169 476 445 -173 -233 25 -641 -820 -274 200 -48 401
3552D01J82m65n37M40o35M6O11M01l92K81M08n46l17M35m81p9L08k48L62L39K54
$$ 401 583 118 -419 21 -614 -568 43 444 52 333 741 195 -122 313 -168 -247 61 -187 175 514 768
3573G68m81n29J31q1n60M51O10l29N34J21p28J10q0k68j48M58J66k41L07L91m44
$$ 768 287 -242 -111 -192 -752 -301 309 -20 514 635 -93 17 -63 -331 -479 -21 145 -96 211 602 158
3594A58j27K01n23k36PK07J00O17J45k73k12l4l16m84N93K20k83N09L36l58j89
$$ 158 31 232 -291 -527 -520 -313 -213 404 549 276 64 30 -286 -770 -177 43 -240 269 605 247 58
3615E8j15k43k55L51J4nL55L56j46k28k7l57o78M54L34KM99L89n57k11K28m52
$$ 58 -57 -300 -555 -204 -190 -195 160 516 370 142 115 -242 -920 -466 -132 -130 369 758 201 -10 218 -234
3637b34l89M91k00J62K74N73j05n22N46n66o31J91N4P6N17N77j83l79L31q87k60
$$ -234 -623 -132 -332 -170 104 677 572 50 596 30 -601 -410 -356 -280 237 814 631 252 583 -304 -564
3658e64J35J6K56P7M95j73%M74n02o83J02n6l76Q86K17%j07J70l45m41K3J92r2
$$ -564 -429 -413 -157 -80 415 242 242 716 214 -469 -367 -423 -799 87 304 304 197 367 22 -419 -396 -204 -296
3681b96O51j11J12k28P1l61l46K27k5j65M14K21J66j95M68m02m71j0n8j85L55
$$ -296 355 244 356 128 199 -162 -508 -281 -306 -471 -57 164 330 135 603 201 -270 -280 -338 -523 -168
3702a68P45L7j36j02J04q01P0j83j81M57M12M0P7K5l08k08l20J51k09j87R01j8
$$ -168 577 614 478 376 480 -321 -251 -434 -615 -158 254 294 371 396 88 -120 -440 -289 -498 -685 216 198
3724A98n1M13J72q97o3j01j02J23N53J32j35M71l85k28k20j66k84R9M01L70J12
$$ 198 147 560 732 -165 -228 -329 -431 -308 245 377 242 713 328 100 -120 -286 -570 -471 -70 300 412
3745D12K60k87k46n40j71K7J82K24K37K60J19j03k67l56l1l64Q7M27L83j87K33
$$ 412 672 385 139 -401 -572 -545 -363 -139 98 358 477 374 107 -249 -280 -644 -557 -130 253 66 299
3766B99Q5k81k73P3o36K91M19P2P2L62j38k25m0j33n93J35O21J22J08K89n9k72
$$ 299 384 103 -170 -97 -733 -442 -23 49 121 483 345 120 80 -53 -646 -511 110 232 340 629 570 298
3788B98l17l13m1l00P36j26K25K13J22j62k36j94j42l35K31L50J61J67K70k31
$$ 298 -19 -332 -373 -673 63 -63 162 375 497 335 99 -95 -237 -572 -341 9 170 337 607 376
3808C76k54l05k89L59k04K16J39J37M71l22j32m13j84J03j98K80k6P39j1j25j31
$$ 376 122 -183 -472 -113 -317 -101 38 175 646 324 192 -221 -405 -302 -500 -220 -246 493 482 357 226
3829B26m9o30J34o7L06j79L23M24J3k73j30m34k41K8K82P1M36K10K00l14N7q30
$$ 226 177 -453 -319 -386 -80 -259 64 488 501 228 98 -336 -577 -549 -267 -196 240 450 650 336 393 -437
3851d37qJ12J9K31L12K45L5N7n66j90k54m2L97p5M47J76J81j16o11ql08j37J83
$$ -437 -445 -333 -314 -83 229 474 509 566 0 -190 -444 -486 -89 -164 283 459 640 524 -87 -95 -403 -540 -357
3874c57K19M33K33k9J5r7p34l33K03J5K82K22K97L7J9p9m85k77l6O1O4L75M97
$$ -357 -138 295 528 499 514 417 -317 -650 -447 -432 -150 72 369 406 425 346 -139 -416 -452 -391 -327 48 545
3897E45j04J34k19l38l02j27mK25K09K22O0J71K57m16k03o67K61l10N32L59M2
$$ 545 441 575 356 18 -284 -411 -415 -190 19 241 301 472 729 313 110 -557 -296 -606 -74 285 327
3918C27J22k34k71k54n1k06R8P00R1LK67kl42j72l15k74K16n1M60R8K48L66m82
$$ 327 449 215 -56 -310 -361 -567 -469 231 322 325 592 590 248 76 -239 -513 -297 -348 112 210 458 824 342
3941C42l71j63n52K31L96J62N4M39j13l13k68J34j19m49K34K95L37J24O1L9n17
$$ 342 -29 -192 -744 -513 -117 45 99 538 425 112 -156 -22 -141 -590 -356 -61 276 400 461 500 -17
3962a7l0m48q7K93K04L01L01J72k72m60K29n90k75M16J01J54J20O48m23k79K4
$$ -17 -47 -495 -582 -289 -85 216 517 689 417 -43 186 -404 -679 -263 -162 -8 112 760 337 58 82
3983H2l89l37K51N22j81L54J89m1p26M37l27o48K79L11N0P60M6l39r2j39m25l94
$$ 82 -307 -644 -393 129 -52 302 491 450 -276 161 -166 -814 -535 -224 -174 586 632 293 201 62 -363 -757
4005g57N2O12j22M48L52l36k22K43n54m42L00L77Q7K83K58q8k76q6l81l45L34
$$ -757 -705 -93 -215 233 585 249 27 270 -284 -726 -426 -49 38 321 579 491 215 129 -252 -597 -263
4026b63L00m36Q25J4j12j46K61n05n00J44J70qQ3O94Q5p12L78j69p20L06K82l02
$$ -263 37 -399 426 440 328 182 443 -62 -562 -418 -248 -256 -173 521 606 -106 272 103 -617 -311 -29 -331
4048c31M29M80m17J13q8j32o73M75m0l27M32Q74o14R5L25l70q37K08K74j72M53
$$ -331 98 578 161 274 186 54 -619 -144 -184 -511 -79 795 181 276 601 231 -606 -398 -124 -296 157
4069A57P88m78j85K00j69q35K71N6k68N21M82m18P7M50n06o69J13K86l54L16O66
$$ 157 945 467 282 482 313 -522 -251 -195 -463 58 540 122 199 649 143 -526 -413 -127 -481 -165 501
4090E01j49p1L36k01j080M86n5l81M93M56J5n13O25j63n25K84j6p49M07M83k24
$$ 501 352 281 617 416 -664 -178 -233 -614 -121 335 350 -163 462 299 -226 58 42 -707 -300 183 -41
4111d1L00L27j36p01M9ql27o7P80J10j7L83k04r87J35N5l21L79N60J9j63N42l33
$$ -41 259 586 450 -251 -202 -210 -537 -604 176 286 269 652 448 -539 -404 -349 -670 -291 269 288 125 667 334
4134C34k26l29o9k24j58M62L97J89K66J23j022M5j7m14L50N91j41N8K13k24n5
$$ 334 108 -221 -290 -514 -672 -210 187 376 642 765 -257 -212 -229 -643 -293 298 157 215 428 204 149
4155A49k06L8m54k3K38J45J17N98j35m72p9J52p29j36O82N2N7M98K21q22L37k16
$$ 149 -57 -19 -473 -496 -258 -113 4 602 467 -5 -84 68 -661 -797 -115 -63 -6 492 713 -109 228 12
4177A2n84J7O70k71P1N45K19n43M3j43m60l95N16K59J33N90j79m08j34J59o22
$$ 12 -572 -555 115 -156 -85 460 679 136 179 36 -424 -819 -303 -44 89 679 500 92 -42 117 -505
4198e05O2J93J31O3N49n2k75p3k65o5m0k12M8N18N95R5o69Q5j87n54k70N67P8
$$ -505 -443 -250 -119 -56 493 441 166 93 -172 -237 -277 -489 -441 77 672 767 98 183 -4 -558 -828 -261 -183
4221a83P5K92M73m35J64n40O1n66L93j72P4N98L02j23j54M9o30j24K47j30K73
$$ -183 -108 184 657 222 386 -154 -93 -659 -266 -438 -364 234 536 413 259 308 -322 -446 -199 -329 -56
4242e6K98L58l69M3k68j39l03pJ53J33L49K65j66Kj03m75L9j40Q5J25L61K19o8
$$ -56 242 600 231 274 6 -133 -436 -443 -290 -157 192 457 291 293 190 -285 -246 -386 -301 -176 185 404 336
4265C36j60K20o90J93l11J5M10R8K3L30m6n0l47l48O3O0l20M97J59K21J8J08o80
$$ 336 176 396 -294 -101 -412 -397 13 111 134 464 418 368 21 -327 -264 -204 -524 -27 132 353 371 479 -201
4288b01j41J9j71r2N28N98O7j86l18nj41l51j40J76K98L06l3K49m1k42m48J02
$$ -201 -342 -323 -494 -586 -58 540 607 421 103 98 -43 -394 -534 -358 -60 246 213 462 421 179 -269 -167
4310a67j69j91L02K28L01J72k29j00k31k00j34J6K21J12J95L33j32R7j89m22l27
$$ -167 -336 -527 -225 3 304 476 247 147 -84 -284 -418 -402 -181 -69 126 459 327 424 235 -187 -514
4331e14qJ39N68o7M73k15l3k90l20N1k89K47O6N36k06M28r3n61j70J22o1j99M68
$$ -514 -522 -383 185 118 591 376 343 53 -267 -216 -505 -258 -192 344 138 566 473 -88 -258 -136 -197 -396 72
4354G2R6N0L9j46j87J9k05k97J37L36o6L69K23j64l12k25l05J76Q7L00K01J38
$$ 72 168 218 257 111 -76 -57 -262 -559 -422 -86 -152 217 440 276 -36 -261 -566 -390 -303 -3 198 336
4376C36L65k93k06l29jj96m0J56J81L35O5j87J25j02n60k18Q9M37L4L53J21o0
$$ 336 701 408 202 -127 -128 -324 -364 -208 -27 308 373 186 311 209 -351 -569 -480 -43 -9 344 465 405
4398D05o5k03J15p96M00l8Q3L69K03j14m19J26p1m54J75K64l18L20K86J11k10
$$ 405 340 137 252 -544 -144 -182 -99 270 473 359 -60 66 -5 -459 -284 -20 -338 -18 268 379 169
4419A69j76q2l32j87K47K25M7N85l26K45l06j98j99j48K41L7K22N49m4j13q3j95
$$ 169 -7 -89 -421 -608 -361 -136 -89 496 170 415 109 -89 -288 -436 -195 -158 64 613 569 456 373 178
4441A78m45q5N3J41J15K84N2P6Lk77m51N0l8k40M16L45O9J51j65k38k64m2j85
$$ 178 -267 -352 -299 -158 -43 241 293 369 372 95 -356 -306 -344 -584 -168 177 246 397 232 -6 -270 -312 -497
4464d97L26L3L49j3R9o9j40l40M9j35J4Q6K13K89j16J09O1n66r0J52j76K08M58
$$ -497 -171 -138 211 198 297 228 88 -252 -203 -338 -324 -238 -25 264 148 257 318 -248 -338 -186 -362 -154 304
4487C04Q9RM50n46n75J89M2m11K39L94N7j10K71p4m49q8k09j58J99N67j07K46
$$ 304 393 402 852 306 -269 -80 -38 -449 -210 184 241 131 402 328 -121 -209 -418 -576 -377 190 83 329
4509C29J41J6o96N1J94n14J96L71l9K8M63l16k26j20P2k27j56M01k74M05L24r6
$$ 329 470 486 -210 -159 35 -479 -283 88 49 77 540 224 -2 -122 -50 -277 -433 -32 -306 99 423 327
4531C27l70pj64m69L65M28k19J13O67M0j014L41J37m43p7J96J83j5P10Kn09j53
$$ 327 -43 -50 -214 -683 -318 110 -109 4 671 711 -303 38 175 -268 -345 -149 34 19 729 731 222 69
4553F9j49m74k97P79J06R6M27l3n28l9K09n51J18J33J4M1M70N4m07J63j47p76
$$ 69 -80 -554 -851 -72 34 130 557 524 -4 -43 166 -385 -267 -134 -120 -79 391 445 38 201 54 -722
4575g22J03M78J96l65Q60j51o4j00n6n93p9L25L9pN59J29o33M8L82n63k88O31
$$ -722 -619 -141 55 -310 550 399 335 235 179 -414 -493 -168 -129 -136 423 552 -81 -33 349 -214 -502 129
4597A29k18q6M22L34k31l32L39p20j92M77j86J33J61O39m70mk51l98l11Q16k64
$$ 129 -89 -175 247 581 350 18 357 -363 -555 -78 -264 -131 30 669 199 195 -56 -454 -765 51 -213
4618b13j17N04P3m8K95l78k47m83J47L82j69N80k1m7j07p6l33n18P43p8n10P74
$$ -213 -330 174 247 199 494 116 -131 -614 -467 -85 -254 326 305 258 151 75 -258 -776 -33 -111 -621 153
4640A53L12l29J77on65m2K73l56M3M91K51l23L77J30m83k92q9r6K15l2N31k18
$$ 153 465 136 313 307 -258 -300 -27 -383 -340 151 402 79 456 586 103 -189 -278 -374 -159 -191 340 122
4662A22L7L57p32j28K09j46j40M77K01J2K18J95o24k57n0j28n2M01K87k05L80
$$ 122 159 516 -216 -344 -135 -281 -421 56 257 269 487 682 58 -199 -249 -377 -429 -28 259 54 434
4683D34J06n52o89M10M3m02P82J38j41L30J35n42k72n2J7k99m4P54j94L35L82
$$ 434 540 -12 -701 -291 -248 -650 132 270 129 459 594 52 -220 -272 -255 -554 -598 156 -38 297 679
4704F79m62k18M3n77P5J28O79kN1J47l54l04J52l78j29M43J29j6L01J51k46l21
$$ 679 217 -1 42 -535 -460 -332 347 345 396 543 189 -115 37 -341 -470 -27 102 86 387 538 292 -29
4726b9j18N5n19M22J37K61J45L62n82o8j7k35l62K55L39L23J26L3k04n42K30k51
$$ -29 -147 -92 -611 -189 -52 209 354 716 134 66 49 -186 -548 -293 46 369 495 528 324 -218 12 -239
4748b39j60l6K73J20J0N57j67l95J26k50n54J86O16m11N10M54k97k70K4j95k33
$$ -239 -399 -435 -162 -42 -32 525 358 -37 89 -161 -715 -529 87 -324 186 640 343 73 97 -98 -331
4769c31L30j29J0J49N85j74k21j99k41m22Q9N15l2K76N32k22l23K1L5o23L1R6
$$ -331 -1 -130 -120 29 614 440 219 20 -221 -643 -554 -39 -71 205 737 515 192 213 248 -375 -344 -248
4791b48K17K90j10L10l59L41n06n45J49Q5Q9L03M58k3m26m5j22k37j29J63j45
$$ -248 -31 259 149 459 100 441 -65 -610 -461 -376 -287 16 474 451 25 -20 -142 -379 -508 -345 -490
4812d90N18L80j07N6N6k56n20J9R9p2j27N18L28r1P9l91l63j38J84q7L83K17J66
$$ -490 28 408 301 357 413 157 -363 -344 -245 -317 -444 74 402 311 390 -1 -364 -502 -318 -405 -22 195 361
4835C61J22m40j15k55N5J67o9O0L88j10L11j5j61m33j05R5l89L12J08K93K80j99
$$ 361 483 43 -72 -327 -272 -105 -174 -114 274 164 475 460 299 -134 -239 -144 -533 -221 -113 180 460 261
4857B61R5l51m74K03O6R4J82O1J12L80m79O0n21P3j37L1L81Q0P7J10k7ml95n85
$$ 261 356 5 -469 -266 -200 -106 76 137 249 629 150 210 -311 -238 -375 -344 37 117 194 304 277 273 -122 -707
4881g07M61j49N54K40k03R0m8k91j10j95M1j48J89K89N8M59M1m68j64J24n66J53
$$ -707 -246 -395 159 399 196 286 238 -53 -163 -358 -317 -465 -276 13 71 530 571 103 -61 63 -503 -350
4903c50M0L69%M20r2k45l81K8k06j78O86j97P1M23L41m32k86q0j04l93M71j5K50
$$ -350 -310 59 59 479 387 142 -239 -211 -417 -595 91 -106 -35 388 729 297 11 -69 -173 -566 -95 -110 140
4926A40L08j49k43k46J98m94j35L86K86J0J36K73m99J25j89k69J34K43K86m3O2
$$ 140 448 299 56 -190 8 -486 -621 -235 51 61 197 470 -29 96 -93 -362 -228 15 301 258 320
4947C20l7l00K10l54n06N28J01J35j12K75P0j39k26J69l70o1Q4NO5N08p7k45j21
$$ 320 283 -17 193 -161 -667 -139 -38 97 -15 260 330 191 -35 134 -236 -297 -213 -208 -143 365 288 43 -78
4970g8Q6k30l9N4j39J65O91q9k59j14m7l39jK63J71k51K37M54k80J50o3n66m8
$$ -78 8 -222 -261 -207 -346 -181 510 421 162 48 1 -338 -339 -76 95 -156 81 535 255 405 342 -224 -272
4993b72M5j96J82O44j37L25m01K5k84l02K35j2M2N06J18j81K3p1n81J21k39L08
$$ -272 -227 -423 -241 403 266 591 190 215 -69 -371 -136 -148 -106 400 518 337 360 289 -292 -171 -410 -102
5015a02r1M36L52n48K53j0n43l58L02r5K30J8O84l17L6r4k83k21K98r5l46J21
$$ -102 -193 243 595 47 300 290 -253 -611 -309 -404 -174 -156 528 211 247 153 -130 -351 -53 -148 -494 -373
5037c73O36j68J06K08n00M1j8k78r2L70P95m62r7L71n57k14J53L40n82K61K90
$$ -373 263 95 201 409 -91 -50 -68 -346 -438 -68 727 265 168 539 -18 -232 -79 261 -321 -60 230
5058B30K5r7L38n78l33K44j81m2M05L60p0J95P0m77m52K58p0l80M29M85l17K9
$$ 230 255 158 496 -82 -415 -171 -352 -394 11 371 301 496 566 89 -363 -105 -175 -555 -126 359 42 71
5080G1L63r3m81R5Po45N35N86m55J99M56n27q4Q0l69m56N85N79o20M18M27m29
$$ 71 434 341 -140 -45 -38 -683 -148 438 -17 182 638 111 27 107 -262 -718 -133 446 -174 244 671 242
5102B42n95L51o7p54M80L52J57JK53J1n26L63m57j97K35J01N6O9L99j61j77l9
$$ 242 -353 -2 -69 -823 -343 9 166 167 420 431 -95 268 -189 -386 -151 -50 6 75 474 313 136 97
5124I7l00m97K95L47n1J68L51k59l38K76j80k86L37m7l74M11M96k79l13N35o16
$$ 97 -203 -700 -405 -58 -109 59 410 151 -187 89 -91 -377 -40 -87 -461 -50 446 167 -146 389 -227
$$ [...]
8191b2
##END NTUPLES=NMR FID
##END=
