##TITLE=1H_Ser DHA-N-P
 200.13MHz,CDCl3.
 8 sc
 
 19.12.2025
##JCAMPDX= 6.0         $$ Bruker NMR JCAMP-DX V2.0
##DATA TYPE= NMR FID
##DATA CLASS= NTUPLES
##ORIGIN= UXNMR, Bruker Analytische Messtechnik GmbH
##OWNER= pz
$$ XWIN-NMR		Version 3.5
$$ Fri Dec 19 15:53:30 2025 Russian Standard Time (UT+4h)  she@DPX200
##.OBSERVE FREQUENCY= 200.1313
##.OBSERVE NUCLEUS= ^1H
##.DELAY= (6, 6)
##.ACQUISITION MODE= SIMULTANEOUS
##.ACQUISITION SCHEME= undefined
##.AVERAGES= 8
##.DIGITISER RES= 18
##SPECTROMETER/DATA SYSTEM= spect
##.PULSE SEQUENCE= zg30
##.SOLVENT NAME= CDCl3
##.SHIFT REFERENCE= (INTERNAL, CDCl3, 0, 14.3821)
##AUDIT TRAIL= $$ (NUMBER, WHEN, WHO, WHERE, WHAT)
$$ ##TITLE= Audit trail, XWIN-NMR		Version 3.5
$$ ##JCAMPDX= 5.01
$$ ##ORIGIN= Bruker BioSpin GmbH
$$ ##OWNER= she
$$ F:/spectra/data/she/nmr/H-C/1/audita.txt
$$ ##AUDIT TRAIL=  $$ (NUMBER, WHEN, WHO, WHERE, WHAT)
(   1,<2025-12-19 15:51:44.34 +0400>,<she>,<DPX200>,
      <created by zg, POWCHK disabled, PULCHK disabled
       configuration hash MD5:
       00 E9 B6 7A A2 85 ED C7 34 08 36 98 17 FE 4E 26
       data hash MD5: 16K
       91 27 49 BD 9D A9 16 8D 81 3F BF 97 D1 BB 0A D8>)
$$ ##END=
$$ 
$$ hash MD5
$$ 13 00 75 17 F2 83 84 FE A6 8F 06 6D B0 80 44 39
##$RELAX= 
##$RELAX= 
##$RELAX= 
##$RELAX= 
##$RELAX= 
##$RELAX= 
$$ Bruker specific parameters
$$ --------------------------
##$DU= <F:/spectra>
##$EXPNO= 1
##$NAME= <H-C>
##$PROCNO= 1
##$TYPE= <nmr>
##$USER= <she>
##$AMP= (0..31)
100 100 100 100 100 100 100 100 100 100 100 100 100 100 100 100 100 100 
100 100 100 100 100 100 100 100 100 100 100 100 100 100 
##$AQSEQ= 0
##$AQ_mod= 1
##$AUNM= <au_zg>
##$AUTOPOS= <>
##$BF1= 200.13
##$BF2= 200.13
##$BF3= 200.13
##$BF4= 200.13
##$BF5= 200.13
##$BF6= 200.13
##$BF7= 200.13
##$BF8= 200.13
##$BYTORDA= 1
##$CFDGTYP= 0
##$CFRGTYP= 5
##$CHEMSTR= <none>
##$CNST= (0..31)
1 1 145 1 1 1 1 1 1 1 1 1 1 1 1 1 1 1 1 1 1 1 1 1 1 1 1 1 1 1 1 1 
##$CPDPRG= <>
##$CPDPRG1= <>
##$CPDPRG2= <>
##$CPDPRG3= <>
##$CPDPRG4= <mlev>
##$CPDPRG5= <mlev>
##$CPDPRG6= <mlev>
##$CPDPRG7= <mlev>
##$CPDPRG8= <mlev>
##$CPDPRGB= <>
##$CPDPRGT= <>
##$D= (0..31)
0 0.7 0 0 0 0 0 0 0 0 0 0.03 0 0 0 0 0 0 0 0 0 0 0 0 0 0 0 0 0 0 0 0 
##$DATE= 1766145103
##$DBL= (0..7)
120 120 120 120 120 120 120 120 
##$DBP= (0..7)
150 150 150 150 150 150 150 150 
##$DBP07= 0
##$DBPNAM0= <>
##$DBPNAM1= <>
##$DBPNAM2= <>
##$DBPNAM3= <>
##$DBPNAM4= <>
##$DBPNAM5= <>
##$DBPNAM6= <>
##$DBPNAM7= <>
##$DBPOAL= (0..7)
0.5 0.5 0.5 0.5 0.5 0.5 0.5 0.5 
##$DBPOFFS= (0..7)
0 0 0 0 0 0 0 0 
##$DE= 6
##$DECBNUC= <off>
##$DECIM= 32
##$DECNUC= <off>
##$DECSTAT= 4
##$DIGMOD= 1
##$DIGTYP= 9
##$DL= (0..7)
0 120 120 120 120 120 120 120 
##$DP= (0..7)
150 150 150 150 150 150 150 150 
##$DP07= 0
##$DPNAME0= <>
##$DPNAME1= <>
##$DPNAME2= <>
##$DPNAME3= <>
##$DPNAME4= <>
##$DPNAME5= <>
##$DPNAME6= <>
##$DPNAME7= <>
##$DPOAL= (0..7)
0.5 0.5 0.5 0.5 0.5 0.5 0.5 0.5 
##$DPOFFS= (0..7)
0 0 0 0 0 0 0 0 
##$DQDMODE= 0
##$DR= 18
##$DS= 0
##$DSLIST= <SSSSSSSSSSSSSSS>
$$ [...]
##$SUBNAM0= <"">
##$SUBNAM1= <"">
##$SUBNAM2= <"">
##$SUBNAM3= <"">
##$SUBNAM4= <"">
##$SUBNAM5= <"">
##$SUBNAM6= <"">
##$SUBNAM7= <"">
##$SUBNAM8= <"">
##$SUBNAM9= <"">
##$SW= 18.0517328524113
##$SWIBOX= (0..15)
0 0 2 0 0 0 0 0 0 0 0 0 0 0 0 0 
##$SW_h= 3612.71676300578
##$TD= 16384
##$TD0= 1
##$TE= 0
##$TE2= 300
##$TE3= 300
##$TEG= 300
##$TL= (0..7)
0 120 120 120 120 120 120 120 
##$TP= (0..7)
150 150 150 150 150 150 150 150 
##$TP07= 0
##$TPNAME0= <>
##$TPNAME1= <>
##$TPNAME2= <>
##$TPNAME3= <>
##$TPNAME4= <>
##$TPNAME5= <>
##$TPNAME6= <>
##$TPNAME7= <>
##$TPOAL= (0..7)
0.5 0.5 0.5 0.5 0.5 0.5 0.5 0.5 
##$TPOFFS= (0..7)
0 0 0 0 0 0 0 0 
##$TUNHIN= 0
##$TUNHOUT= 0
##$TUNXOUT= 0
##$USERA1= <user>
##$USERA2= <user>
##$USERA3= <user>
##$USERA4= <user>
##$USERA5= <user>
##$V9= 5
##$VALIST= <valist>
##$VCLIST= <CCCCCCCCCCCCCCC>
##$VD= 0
##$VDLIST= <DDDDDDDDDDDDDDD>
##$VPLIST= <PPPPPPPPPPPPPPP>
##$VTLIST= <TTTTTTTTTTTTTTT>
##$WBST= 1024
##$WBSW= 4
##$XGAIN= (0..3)
0 0 0 0 
##$XL= 0
##$YL= 0
##$YMAX_a= 215070
##$YMIN_a= -291376
##$ZGOPTNS= <>
##$ZL1= 120
##$ZL2= 120
##$ZL3= 120
##$ZL4= 120
##$ABSF1= 10
##$ABSF2= 0
##$ABSG= 5
##$ABSL= 3
##$ALPHA= 0
##$AQORDER= 0
##$ASSFAC= 0
##$ASSFACI= 0
##$ASSFACX= 0
##$ASSWID= 0
##$AUNMP= <proc_1d>
##$AZFE= 0.1
##$AZFW= 0.1
##$BCFW= 1
##$BC_mod= 2
##$BYTORDP= 1
##$COROFFS= 0
##$CY= -3
##$DATMOD= 1
##$DC= 2
##$DFILT= <>
##$DTYPP= 0
##$F1P= 0
##$F2P= 0
##$FCOR= 0.5
##$FTSIZE= 0
##$FT_mod= 4
##$GAMMA= 1
##$GB= 0.15
##$INTBC= 1
##$INTSCL= 1
##$ISEN= 128
##$LB= 0.25
##$LEV0= 0
##$LPBIN= 0
##$MAXI= 10000
##$MC2= 0
##$MEAN= 0
##$ME_mod= 0
##$MI= 1.114404
##$NCOEF= 0
##$NC_proc= 0
##$NLEV= 6
##$NOISF1= 3.799351
##$NOISF2= 2.8
##$NSP= 1
##$NTH_PI= 0
##$NZP= 0
##$OFFSET= 14.38212
##$PC= 1
##$PHC0= -3707.695
##$PHC1= 12.19231
##$PH_mod= 1
##$PKNL= yes
##$PPARMOD= 0
##$PSCAL= 0
##$PSIGN= 0
##$REVERSE= no
##$SF= 200.129724274929
##$SI= 16384
##$SIGF1= 3
##$SIGF2= 2
##$SINO= 400
##$SIOLD= 16384
##$SREGLST= <1H.CDCl3>
##$SSB= 0
##$STSI= 0
##$STSR= 0
##$SW_p= 3205.1282051282
##$SYMM= 0
##$S_DEV= 0
##$TDeff= 0
##$TDoff= 0
##$TI= <>
##$TILT= no
##$TM1= 0
##$TM2= 0
##$TOPLEV= 0
##$USERP1= <user>
##$USERP2= <user>
##$USERP3= <user>
##$USERP4= <user>
##$USERP5= <user>
##$WDW= 1
##$XDIM= 8192
##$YMAX_p= 0
##$YMIN_p= 0
$$ End of Bruker specific parameters
$$ ---------------------------------
##NTUPLES= NMR FID
##VAR_NAME=  TIME,          FID/REAL,        FID/IMAG
##SYMBOL=    X,             R,               I
##VAR_TYPE=  INDEPENDENT,   DEPENDENT,       DEPENDENT
##VAR_FORM=  AFFN,          ASDF,            ASDF
##VAR_DIM=   8192,          8192,            8192
##UNITS=     SECONDS,       ARBITRARY UNITS, ARBITRARY UNITS
##FACTOR=    0.0002768,     1,               1
##FIRST=     0,             0,               0
##LAST=      2.2672688,     0,               0
##MIN=       0,             -291376,         0
##MAX=       2.2672688,     215070,          0
$$ Real data points
##PAGE= N=1
##DATA TABLE= (X++(R..R)), XYDATA
0 0 0 0 0 0 0 0 0 0 0 0 0 0 0 0 0 0 0 0 0 -2 8 -8 8 -8 8 -8 11 -14 15 -17 19 -22 25 -28 31 -35 39 -43 49 -54 61
41 61 -67 73 -82 89 -100 110 -120 132 -146 161 -177 196 -217 239 -268 296 -335 376 -428 491 -570
62 -570 677 -819 1030 -1362 1944 -3185 6934 -42028 -242019 -291376 -253918 -175468 -75737 18972
76 18972 108240 168689 173301 144806 90475 59650 42474 -29532 -107822 -139309 -155335 -139904
88 -139904 -99218 -59650 9862 101655 178236 212838 169206 94172 23711 -73069 -155230 -188473
100 -188473 -192137 -136992 -46420 28228 99293 153755 174227 158293 92453 23789 -26590 -90814
112 -90814 -134006 -149968 -167307 -136192 -56695 31083 127763 196676 210135 172885 81307 -19057
124 -19057 -101162 -163221 -161734 -121680 -91708 -41120 16469 49633 85403 112652 124546 124182 86707
137 86707 27385 -44571 -129250 -171732 -169745 -141485 -57754 40851 110681 163354 177264 145084
149 145084 86171 4636 -63172 -111106 -151436 -144861 -109225 -70487 -5758 52895 87570 124361
161 124361 139053 121330 84957 23828 -40170 -103183 -159393 -162428 -129740 -78774 14323 100872
173 100872 147472 167892 139660 74824 6788 -59822 -98351 -110390 -110370 -84862 -63630 -46022
185 -46022 7390 62235 101637 142122 148536 112655 48011 -41384 -114681 -159373 -171890 -128408
197 -128408 -62334 7692 89882 133749 133848 121004 78832 22746 -22501 -65228 -90162 -105481
209 -105481 -111434 -82978 -46025 -3076 62331 108958 129850 136772 100913 40823 -21989 -92745
221 -92745 -141615 -156928 -136055 -69628 119 61053 119552 131416 110370 83260 37116 -4987
233 -4987 -34864 -71452 -95155 -105741 -102498 -68266 -24992 32619 103044 135914 138080 118241 50812
246 50812 -30133 -95119 -141927 -144723 -111871 -57686 11435 58467 86876 106297 93356 75783
258 75783 61182 18740 -24616 -58141 -96099 -116014 -113006 -83709 -24936 30035 85175 133986
270 133986 136755 110915 64219 -13584 -77922 -113000 -130160 -110244 -66247 -15068 38490 68842
282 68842 89834 102258 81309 56283 31107 -16942 -56632 -85290 -111129 -108392 -83342 -39095
294 -39095 27181 83601 125697 139340 103544 54828 -158 -67605 -101926 -105021 -97161 -67136
306 -67136 -31622 4562 45850 70078 89057 97153 76720 51310 10386 -52864 -94495 -115227
318 -115227 -121864 -87456 -29529 33900 91914 117651 118813 93988 39475 -5738 -42628 -79457
330 -79457 -87036 -82666 -75212 -45293 -12389 19291 56331 81899 99753 96062 61401 23776 -27395
343 -27395 -89766 -118714 -120455 -97247 -37544 25854 77997 115042 115082 90748 46732 -7579 -40614
356 -40614 -67233 -87908 -77301 -62866 -50574 -19657 11200 43261 78690 97469 102541 81052
368 81052 28915 -23877 -80205 -122642 -118348 -92279 -47790 19708 68877 91934 96435 76357
380 76357 49284 13942 -22974 -39691 -57593 -75418 -70782 -63660 -43779 2369 43002 77562
392 77562 104984 102720 76938 28258 -31370 -73483 -108094 -118461 -86306 -44734 3695 58004
404 58004 84586 89141 80046 51172 23492 -3643 -31480 -48006 -68662 -78820 -65330 -50527
416 -50527 -18939 34571 73222 97173 103890 79001 37188 -19591 -75490 -102934 -109311 -85056
428 -85056 -33885 7304 43710 73815 70971 61245 54304 37147 18983 -9273 -43101 -67946 -89911
441 -89911 -88658 -55670 -19555 28498 77284 95557 97598 79202 32344 -16173 -60429 -89662
453 -89662 -91966 -78664 -42651 3446 27804 49663 68142 65102 60026 48877 20915 -6300 -39124
466 -39124 -71848 -86814 -88425 -63905 -20356 18446 65784 102000 99549 79290 40696 -14218
478 -14218 -54955 -78850 -81153 -60482 -38787 -11486 13786 24606 43308 60096 59519 59940 44546
491 44546 4555 -33614 -69209 -91591 -89196 -69871 -24176 29864 65614 93500 97919 69228
503 69228 36007 -5098 -47116 -64360 -69020 -64167 -46667 -28827 -2694 22054 36391 58592
515 58592 70766 60950 48253 17487 -27239 -60100 -85643 -91120 -67215 -29491 20114 62987
527 62987 82370 89153 67839 26793 -2516 -31712 -57361 -59938 -56693 -47556 -31724 -18040 6831
540 6831 34226 55127 76533 76955 53066 25508 -21051 -68068 -86779 -86972 -66304 -26891 12404
553 12404 50730 72078 70647 63093 37099 3030 -16874 -39187 -54325 -50191 -49455 -42455 -23297
566 -23297 -2334 27889 56586 75349 84030 60369 17890 -19685 -61035 -86887 -81547 -64004
578 -64004 -30180 11019 39395 60710 66327 55552 39826 11763 -11881 -20795 -37593 -50150
590 -50150 -48587 -48817 -36765 -7812 23132 57816 78214 76129 58466 18076 -24388 -52044 -77411
603 -77411 -79074 -57015 -33597 -689 35158 54255 62289 55478 40546 26886 2919 -16724 -28369
616 -28369 -49508 -60750 -56380 -46890 -16171 25528 54223 73845 72823 52884 22650 -19221 -49580
629 -49580 -60232 -67271 -53893 -25557 -3974 21346 41307 46876 51074 46288 34389 19625 -8059
642 -8059 -33688 -53292 -72891 -66312 -40603 -14598 24159 58787 71264 70480 50014 18918 -10416
655 -10416 -41299 -55500 -53563 -47400 -25610 -4161 4869 22623 37622 41111 46258 42490 28466
668 28466 7320 -26940 -52840 -67195 -73157 -51432 -16116 17411 56282 77544 71495 54528
680 54528 22088 -13306 -36825 -51872 -48706 -38835 -32726 -14291 907 9365 29157 44857 48722
693 48722 48651 31286 3909 -22168 -49638 -62632 -61762 -48518 -13293 19932 42124 63559 64179
706 64179 45054 23579 -3765 -25918 -36217 -44993 -42426 -35936 -29922 -10030 7443 23045 47390
719 47390 56751 51175 41636 13970 -20404 -48068 -66975 -63912 -46116 -18960 20628 46369 54203
732 54203 55805 37523 13894 -335 -18576 -30242 -32810 -36741 -34960 -31319 -21300 3828 24668
745 24668 42502 61700 58110 39216 15418 -20747 -48473 -59776 -60641 -43492 -18740 5911 32493
758 32493 42733 43725 44019 26455 8514 -2072 -19581 -32035 -37301 -41757 -34558 -22161 -4491
771 -4491 24406 44718 56895 60008 37075 8450 -17214 -46718 -59882 -53494 -39053 -14489 6938
784 6938 23072 37636 36488 32229 29652 16392 7203 -963 -21790 -37090 -44829 -48985 -35129 -10033
798 -10033 19905 50212 59252 55599 40352 5572 -21932 -38055 -51699 -47528 -33072 -18528 3310
811 3310 19202 28281 35553 32637 30438 25945 9033 -2959 -15956 -38812 -49079 -47763 -37715
824 -37715 -10767 17067 40675 56499 51892 37394 15114 -15845 -32618 -39886 -44345 -31337 -14319
837 -14319 -3407 10577 19530 24912 31153 30202 30520 24131 980 -19147 -39858 -58303 -52098 -34388
851 -34388 -10943 22209 44895 52716 49416 31094 13281 -6176 -27819 -33115 -32185 -31751 -19277
864 -19277 -9055 -2169 11552 20070 27360 35167 32525 25141 7708 -19771 -36701 -49366 -53129
877 -53129 -32317 -7080 16267 41637 50281 45922 32740 9844 -7738 -20614 -31274 -28275 -26607
890 -26607 -25296 -13466 -8035 -1094 17024 30678 40065 42801 29790 11135 -14795 -41597 -49429
903 -49429 -47960 -34386 -5145 16857 31582 44428 39223 26600 13564 -3326 -14154 -24186
915 -24186 -31055 -26432 -25229 -21406 -5495 4409 15213 32120 37964 38270 31050 9549 -11891 -33606
929 -33606 -46901 -42154 -32522 -13271 13559 24949 30058 34018 24854 15945 7351 -5467 -12970 -22416
943 -22416 -30526 -29728 -28407 -17949 4205 18311 34761 48896 42044 26928 6378 -20388 -37090
956 -37090 -44225 -40183 -22577 -9140 5282 19946 21900 24802 27453 19312 13686 6304 -8801 -19040
970 -19040 -27691 -31735 -26173 -21067 -5380 17582 30066 40887 43028 26039 6353 -14887 -35841
983 -35841 -39652 -35048 -23417 -6329 3346 13466 22087 19940 23535 26588 17773 11556 492 -17825
997 -17825 -30139 -39840 -39417 -24150 -6704 17861 38620 42142 39600 24913 -1607 -17696 -26601
1010 -26601 -32521 -25747 -17320 -7797 3004 6148 13607 20214 19708 23404 21293 9529 2297 -11616
1024 -11616 -29530 -36511 -37479 -28417 -8873 10581 31730 43564 37747 28892 11433 -12031 -22338
1037 -22338 -28930 -30313 -19806 -12007 -3205 6081 10094 17353 22033 21193 24371 16017 -2560 -14542
1051 -14542 -28994 -38585 -32977 -21366 -3126 16827 26852 33329 30029 18915 11541 -997 -14015
1064 -14015 -15541 -21245 -25271 -20030 -16517 -7831 5221 15526 28033 32901 26794 19988 1753 -19669
1078 -19669 -28954 -36885 -34415 -17360 -2368 13867 28190 31215 29181 18086 3872 -2386 -12110
1091 -12110 -18551 -15210 -17503 -18828 -14226 -12528 -3578 11991 23646 33669 33599 22984 9389 -13027
1105 -13027 -30559 -33097 -33148 -22583 -2830 9094 19509 25417 21120 18130 10628 1698 -2046 -11834
1119 -11834 -19095 -19996 -25426 -21089 -6903 3296 17054 29511 31528 28502 16123 273 -11038
1132 -11038 -25109 -30518 -24907 -20196 -7990 6732 11064 16502 19998 15713 14444 9461 4040 -971
1146 -971 -13268 -21415 -23370 -27065 -18275 -614 12936 29227 37826 31457 19240 -367 -18829
1159 -18829 -27878 -32430 -24139 -9836 -3888 5701 12782 9754 12055 15062 14666 16076 10408 821 -8560
1174 -8560 -22565 -28057 -26064 -21706 -4407 14562 23587 32320 30461 16981 3406 -12320 -22715
1187 -22715 -23993 -24173 -15389 -5055 95 9232 14974 13931 17935 17193 11432 8582 349 -10305 -19365
1202 -19365 -28667 -26860 -18868 -9004 10675 25707 28656 28447 17649 1498 -7382 -16087 -18619 -15487
1216 -15487 -13565 -7334 -3203 -1932 7444 13767 15135 20937 18447 9504 1216 -12993 -23970 -27790
1230 -27790 -27439 -16514 -1890 9903 24371 27295 21327 17790 6652 -4788 -8539 -14049 -16667
1243 -16667 -15914 -15978 -9124 -2347 3030 14645 19079 19119 20032 10240 -2036 -9879 -20919 -25645 -21692
1258 -21692 -13991 598 11508 17276 22937 17805 9499 6469 -885 -5769 -5727 -11791 -15693 -16906 -17980
1273 -17980 -10457 -816 10027 23829 26962 24089 19046 2240 -14694 -23299 -29473 -24447 -11959
1286 -11959 -372 13716 19681 18069 15771 6728 1102 1492 -4175 -6889 -6742 -13604 -16570 -14607 -10897
1301 -10897 84 9623 17857 25601 22410 15325 7024 -9167 -19154 -21974 -24119 -15885 -3969 3881
1315 3881 12548 14559 13590 13234 7016 4318 3195 -5518 -10754 -13614 -18877 -15261 -8066 -1076 11601
1330 11601 20267 23523 22856 11862 756 -8947 -21447 -23284 -17215 -12477 -2728 5517 6927 10178
1344 10178 9592 9424 12497 9405 7299 2792 -9724 -15551 -18701 -21341 -12590 -424 8949 19161
1358 19161 21914 20000 13639 226 -8906 -14364 -20191 -16514 -10032 -6957 1997 7472 8523 12584
1372 12584 13385 13220 11992 4388 -554 -7519 -17993 -19326 -17787 -14900 -1991 8258 14939 21291
1386 21291 18541 11432 3226 -7238 -11160 -12804 -13947 -7401 -4330 -4503 1727 5205 7614 14153 15320
1401 15320 13987 9546 -2076 -11067 -19101 -23841 -17522 -10222 -1909 11748 17262 16935 16410 9976 3384
1416 3384 -1835 -8352 -9166 -10207 -12005 -7850 -6188 -3792 4855 8756 11776 16587 13726 7528 63
1431 63 -10269 -15968 -19590 -18831 -8059 -167 7187 16517 16707 13614 10842 3096 -1976 -3816 -7722
1446 -7722 -8022 -10578 -12453 -9214 -8303 -2926 9408 15314 18867 19402 10346 -225 -10056 -18817 -18850 -14781
1462 -14781 -7917 3359 7949 11302 14466 9418 5872 5127 -460 -3262 -5182 -9291 -10434 -12423 -11968
1477 -11968 -5252 -518 7059 16537 17359 16872 12967 696 -7903 -14319 -18212 -15160 -10257 -2773 6653
1492 6653 8292 9826 11232 6204 4287 3638 -1121 -2547 -5376 -11296 -12586 -12614 -8304 1294 8200 16543
1508 16543 21481 15294 8715 935 -10701 -15029 -15385 -13690 -7011 -2551 1593 6404 6376 8522 9886
1523 9886 6691 7406 4859 -3113 -7150 -10622 -14225 -11300 -7464 -416 8818 12488 15725 15304 7130
1538 7130 1301 -5427 -13906 -13611 -11649 -9622 -2830 1121 4378 7429 6937 10246 11356 7382 6318
1553 6318 730 -8829 -13038 -15880 -15687 -7628 203 7731 14279 14590 12863 6282 -2700 -5231 -8017
1568 -8017 -10695 -7232 -5527 -4847 -1370 -136 3478 8840 10455 13398 11125 3601 -1519 -9150 -16158
1583 -16158 -14608 -12618 -8626 3 6490 11579 14094 11382 8868 2853 -4182 -5295 -7562 -8404 -4258
1598 -4258 -4994 -5174 -1071 585 4857 10002 11957 13149 7188 -2543 -7958 -15207 -18028 -12285 -6624
1613 -6624 1217 10225 12589 12558 10600 4503 1161 -1982 -4516 -3087 -5834 -8261 -6759 -8435 -6252
1628 -6252 908 5777 11069 13779 11077 6895 -311 -7805 -10092 -13481 -12066 -4950 -1658 4422 10990
1643 10990 11426 9895 7344 1851 -222 -4301 -6519 -5428 -8049 -9014 -6438 -6354 -1222 7282 10711 14140
1659 14140 14162 7720 1025 -7477 -12692 -12166 -11281 -5554 2284 4093 6431 7735 4750 4528 4077 1632
1675 1632 1576 -1615 -5758 -8400 -12743 -10426 -4041 252 7843 14027 13458 11697 7017 -755 -5386 -10231
1691 -10231 -12180 -9865 -8003 -2659 3225 3973 7112 7997 4472 4535 3519 443 -386 -4268 -6871 -7617
1707 -7617 -10067 -6304 19 4235 11028 13762 10011 7072 574 -6945 -9464 -10799 -9065 -5280 -3652
1722 -3652 601 3645 2952 6183 7960 7422 8104 5339 -1076 -5157 -10512 -12699 -9905 -6253 1633 7335
1738 7335 8773 11288 8591 2610 360 -3458 -6987 -6472 -6569 -5444 -2592 -1482 1675 4248 4803 8258
1754 8258 8176 5497 5637 552 -6134 -9462 -12302 -11195 -6271 -1583 5765 10164 9669 9817 5096 -438
1770 -438 -1342 -4714 -6529 -4534 -4821 -3940 -2151 -1458 2139 4489 5980 9776 8412 3883 457 -7112
1786 -7112 -11956 -11657 -10541 -5127 1893 6239 9486 8821 6219 5430 1342 -1726 -839 -3653 -5367 -4852
1802 -4852 -5887 -5065 -2515 -760 3779 6862 8599 9980 5262 -398 -3839 -9989 -11750 -8145 -4952
1817 -4952 532 5595 7249 8656 6876 4335 3787 -611 -2881 -3157 -5876 -6403 -5222 -6049 -4156 26
1833 26 2786 8072 9763 9002 7711 714 -4978 -7104 -10112 -7956 -3147 -1091 3196 5526 4863 5413
1849 5413 3893 2438 1697 -1373 -2984 -3485 -7266 -7686 -5616 -4255 697 5885 8087 10612 8498 4297
1865 4297 450 -5371 -7001 -6718 -7664 -4157 -809 -450 2437 4077 4154 5196 4019 3182 2398 -1780 -4154
1882 -4154 -5756 -8592 -6074 -2337 -465 5620 9478 8763 7930 4236 -250 -3638 -7884 -7747 -5862 -5177
1898 -5177 -1266 1142 1200 3370 3830 3556 5523 4986 3452 1086 -4227 -6688 -7888 -8593 -3588 1727
1914 1727 3948 8172 8180 5209 3408 -1379 -4177 -4465 -5855 -4072 -3102 -3282 -186 684 1109 5387 6687
1931 6687 6496 6685 3041 -1211 -4541 -8765 -8529 -6729 -4745 844 4010 5546 8213 6144 2805 1196
1947 1196 -2133 -4033 -4137 -4624 -2073 -1689 -1729 806 1502 2219 5836 6007 5412 4641 -698 -4620 -7894
1964 -7894 -10072 -7663 -4223 -121 6013 6945 5919 6511 2646 575 325 -1752 -1997 -2530 -4594 -3739
1980 -3739 -3977 -2892 1380 3374 5252 7771 4980 1860 -384 -5023 -6942 -6755 -5868 -2095 238 2608
1996 2608 5643 5439 4879 5337 1718 -85 -740 -3864 -4586 -4091 -5149 -3275 -2641 -635 3594 4926 6928
2013 6928 8036 3815 -76 -3316 -7556 -7031 -4747 -2583 1999 3770 4065 4586 1985 1704 2703 364
2029 364 10 -244 -3709 -5026 -5956 -6341 -2536 412 3917 8210 7339 6494 4012 -1443 -3400 -4120 -6333
2046 -6333 -4359 -2532 -1639 870 1516 2874 4671 2864 2512 2093 -1178 -1703 -2689 -5370 -4145 -3232 -2687
2063 -2687 906 3717 6139 7487 5253 3462 296 -4419 -4997 -4680 -5239 -1835 -856 -908 1072 1503 2347
2080 2347 4173 3785 4724 3509 -847 -2573 -5232 -7635 -5090 -2104 1148 5909 6443 6144 4451 -38
2096 -38 -2003 -3134 -4841 -2414 -2225 -2811 -1024 -1106 -855 1359 2773 4612 5627 3680 3547 711 -3586
2113 -3586 -4632 -6678 -7302 -3325 -529 2495 6702 6526 5475 2772 -1469 -2728 -4125 -4778 -2212 -1070
2129 -1070 -1109 1020 641 543 2596 2707 3310 3900 2130 820 -2290 -5459 -4984 -5828 -4797 359 2197
2146 2197 3882 5896 4134 2758 1554 -815 -838 -1844 -3340 -2512 -3854 -3176 324 1264 3216 5483
2162 5483 4157 3047 1170 -2097 -3000 -5233 -5754 -3290 -2318 106 3540 3532 4215 4322 1998 1370 915
2179 915 -1056 -964 -2683 -3741 -2933 -3749 -2417 805 1992 3563 5280 3795 2917 570 -3335 -4113 -4928
2196 -4928 -4231 -1233 421 2677 4282 2452 2558 2497 717 852 361 -1920 -2440 -4517 -5036 -3166 -2295
2213 -2295 847 4328 4417 5188 4892 1435 -361 -2083 -4148 -3094 -3074 -1830 282 -6 1322 2237 1540
2230 1540 2681 2605 854 495 -726 -3273 -3449 -4422 -3457 -1120 -14 3059 5478 4659 4988 3196 -877
2247 -877 -2147 -3856 -4966 -3389 -2132 -398 1317 741 1827 2243 851 2503 2755 642 704 -1663
2263 -1663 -3677 -3777 -3748 -2095 1312 2789 4634 4510 2171 1627 -484 -2781 -1924 -2509 -3046 -2196 -2519
2280 -2519 -1100 534 1367 3567 4140 3239 3586 1580 -1610 -2212 -4091 -5023 -3022 -1729 279 2482
2296 2482 2779 3960 3299 806 391 -1618 -3291 -2114 -2431 -1816 314 -91 337 1020 1269 2668 3237
2313 3237 2803 3168 612 -2811 -3526 -5323 -4897 -2053 -800 2081 3711 3207 3088 1934 373 360 -1396
2330 -1396 -2062 -1338 -2424 -2434 -853 -415 1597 3201 2936 3481 1844 -499 -1143 -2886 -3581 -1907 -2595
2347 -2595 -1607 98 -117 1611 3057 2643 3658 2010 391 394 -2118 -2952 -1971 -3302 -2206 -371 -194
2364 -194 1881 3647 3624 3399 1342 -952 -2243 -4293 -3728 -1746 -1123 1162 2934 1943 2068 1036 347
2381 347 1224 923 576 385 -2154 -3276 -3496 -4436 -1785 1125 2490 4353 4477 2747 1284 -1017 -2280
2398 -2280 -2325 -3185 -2018 -323 -794 898 1777 1005 1812 1845 956 986 -328 -1233 -1544 -3138 -2256 -1288 -1825
2417 -1825 237 1723 2319 4496 4146 2320 673 -1686 -3428 -2852 -3089 -1005 156 136 785 1021 207
2434 207 1817 2217 1874 1703 -412 -2004 -2644 -3779 -2324 -573 354 2971 3481 2617 2756 897 -938
2451 -938 -1086 -2113 -2200 -1874 -2235 -975 -585 -594 1783 2154 1979 2814 1627 234 311 -1353 -2038 -2035 -2608 -1446
2471 -1446 -102 651 2884 2918 2027 1893 -144 -1532 -1536 -2243 -2059 -832 -1168 -137 159 61 2279 2424 2472
2490 2472 3164 1072 -510 -1876 -3590 -3509 -1944 -1514 862 1533 1395 2509 1127 625 1236 -313 -781
2507 -781 -556 -1850 -1588 -1247 -1314 281 953 1535 3210 2029 1494 1327 -976 -1787 -2277 -3481 -2393 -1254
2525 -1254 -582 1219 1814 1948 2930 1388 469 765 -792 -1132 -786 -1759 -1220 -1420 -1494 261 1407 2122
2543 2122 3234 1679 348 -143 -2617 -2582 -1887 -1973 -363 723 861 1972 1632 1262 1810 567 428 917
2561 917 -1190 -1571 -1580 -2834 -2381 -1149 -223 1672 2081 2373 2726 941 -37 -403 -2638 -2037 -1574 -1725 293
2580 293 1133 1148 1845 1464 957 1050 -794 -355 -236 -2151 -1855 -1747 -2590 -484 450 842 2678 2460 2237
2599 2237 1853 -73 -640 -1226 -2648 -1645 -854 -1192 86 488 459 1805 1477 1056 1242 -99 -233 -1263
2617 -1263 -2655 -1746 -1232 -1206 996 1932 2108 2746 1822 1003 86 -1678 -1600 -1539 -2393 -919 -567 -620 785
2636 785 641 1120 1872 1349 1122 1149 -449 -347 -1230 -2316 -1072 -1005 -564 1281 1704 1452 1994 900 468
2655 468 -292 -1729 -1490 -1930 -2011 -869 -279 269 1775 1944 1872 2149 1049 449 -109 -1422 -1607 -1790 -2158
2674 -2158 -318 129 355 1795 1178 639 838 -20 -77 -284 -886 -729 -1247 -1421 -127 -80 49 1762 1927
2693 1927 1837 1984 350 -554 -1174 -2501 -2155 -2135 -1215 440 656 1075 1782 1071 1294 1097 174 103 -604 -1489
2713 -1489 -1114 -1308 -660 295 291 972 1623 937 1303 1026 -601 -1012 -1627 -2149 -1263 -818 -317 1349 1076 1614
2733 1614 1945 877 1016 676 -472 -756 -784 -1673 -1337 -1568 -1195 576 640 1455 2344 1279 882 169 -1304
2752 -1304 -1269 -1153 -1349 -206 98 426 1116 819 953 1589 408 483 336 -1271 -1487 -1716 -1996 -877 -882 305
2772 305 1662 1263 1815 1847 735 287 -249 -1424 -1031 -1228 -1203 -621 -167 647 1266 581 759 780 -137 437
2792 437 -135 -1376 -923 -1584 -1389 -302 230 1176 2143 1714 1406 861 -200 -194 -715 -1607 -910 -824 -1245 -271
2812 -271 -96 327 1217 986 1765 1345 112 64 -988 -2017 -1249 -1020 -519 947 853 1288 1428 598 627 49
2832 49 -578 -370 -1178 -1570 -619 -541 -443 231 285 817 1449 1100 1338 651 -267 -346 -1148 -1995 -962 -1072 -96
2853 -96 855 938 1369 1024 114 245 -497 -1077 -544 -732 -923 -462 -640 -7 1071 799 1727 1559 719 662 -577
2874 -577 -1385 -1443 -1835 -1505 -313 -381 367 985 607 1005 647 334 265 -108 -963 -145 -989 -1063 -387 -410 491
2895 491 1338 1167 1445 1259 314 -135 -1523 -1556 -1196 -1257 -639 641 469 1204 1405 637 899 434 -145 145
2915 145 -314 -737 -271 -1065 -795 -386 -750 595 1183 928 1267 1062 -19 -479 -1235 -1340 -638 -837 -3
2934 -3 916 490 1020 1422 721 986 200 -489 -437 -1065 -1086 -733 -1261 -556 631 208 1094 1352 430 993 95
2955 95 -368 -271 -489 -895 -283 -489 -114 365 276 1125 1229 200 289 -429 -898 -547 -1066 -1106 -725 -650 367
2976 367 1024 987 1491 1439 350 329 -253 -1139 -575 -764 -658 -347 -537 149 339 263 1180 712 219 653 -340
2997 -340 -899 -800 -1371 -955 117 380 1087 1139 520 857 181 -291 -8 -637 -947 -683 -1071 -907 -229 -294 913
3018 913 876 722 1338 688 105 22 -538 -809 -637 -1078 -301 101 148 622 547 -37 626 -200 -586 -275 -680
3039 -680 -545 -209 -626 -316 80 121 697 1073 812 1341 335 -567 -501 -1299 -1181 -837 -861 -249 250 534 782
3060 782 420 356 314 -40 -117 227 -763 -583 -314 -453 207 749 449 947 779 358 378 -191 -530 -776 -1297
3081 -1297 -934 -751 -559 363 825 801 1204 571 443 346 -185 -318 -308 -1273 -524 -390 -385 156 533 764 728 367
3103 367 105 74 -852 -524 -491 -610 -258 388 -47 485 281 539 861 761 405 445 -714 -425 -837 -1076 -381
3124 -381 -227 9 669 973 815 643 331 129 45 -687 -462 -166 -784 -92 148 294 737 551 567 651 -157
3145 -157 -230 -189 -640 -449 -480 -775 -416 108 -128 911 817 1110 769 256 -353 -174 -536 -551 -375 -498 -104
3166 -104 320 -48 556 674 449 733 -151 -501 -671 -970 -684 -205 -56 809 475 597 967 245 300 320 -224
3187 -224 -331 -356 -690 -267 -564 -699 124 60 109 899 778 607 656 -120 -164 -330 -995 -627 -195 -355 561 643
3209 643 888 579 44 -95 -189 -474 -358 -264 -477 87 -230 -75 602 270 657 1022 867 692 302 -459 -592
3230 -592 -490 -867 -258 -33 -96 555 291 193 632 -151 -37 227 -474 -328 -102 -476 -31 31 30 671 282 395
3252 395 580 -114 3 -483 -713 -614 -295 -799 -70 136 103 748 415 397 495 -158 139 189 -428 -303 -410 -281
3274 -281 127 301 99 626 384 397 377 -256 -317 -247 -555 -293 -301 -448 325 133 480 634 291 610 396 -12
3296 -12 -83 -605 -1056 -507 -531 -660 24 391 406 597 -195 -148 449 -357 -246 -142 -407 232 123 29 332 351
3318 351 293 472 422 486 -209 -470 -650 -588 -613 -382 -332 85 535 64 751 889 272 223 30 -786 -317 -130
3340 -130 -497 265 -143 -73 166 246 272 440 -69 109 237 -652 -345 -472 -737 -219 -66 -160 512 440 520 673
3362 673 21 -14 227 -596 -253 -540 -503 134 -315 192 588 161 380 275 138 133 -581 -218 49 -324 -288 347
3384 347 -51 364 434 178 180 202 -240 -70 -490 -504 -285 -385 -351 237 -71 243 705 267 373 392 203 -200
3406 -200 -469 -650 -235 -243 -350 491 69 127 563 -231 117 148 -236 -13 -577 -464 -132 -413 26 318 -25
3427 -25 339 489 -58 192 -121 -185 10 -464 -731 -671 -376 -87 111 331 421 616 360 147 -193 -344 -6
3448 -6 -205 -218 22 -285 195 195 -139 369 205 -367 -7 -79 -471 -347 -262 110 297 -237 -44 296 239 356 341
3471 341 52 474 -56 -490 -456 -461 -679 -140 -31 198 358 36 94 287 -155 -211 -40 -220 31 -155 -245 161
3493 161 14 443 346 158 681 274 -120 170 -98 -713 -372 -495 -600 200 -45 372 425 335 471 23 -157
3514 -157 -47 -123 -104 189 -281 151 123 -93 155 162 360 422 213 -365 -183 -375 -494 -329 -179 226 373 322
3536 322 547 373 202 237 87 -262 47 -614 -426 -248 -133 90 -27 201 402 40 -349 204 -153 -73 90
3557 90 -153 34 358 -381 150 284 347 377 212 -236 159 -238 -388 -235 -631 -611 -153 -390 -11 1 675 393
3579 393 255 -25 36 -187 -222 -94 -232 -101 127 -104 75 361 -30 422 -60 132 39 -318 -261 -157 -354
3600 -354 78 153 -150 172 204 81 315 52 -24 -49 -75 -539 -392 -402 -409 60 71 59 215 190 402 59 -25 168
3624 168 146 -100 -283 -317 -128 251 -76 580 309 124 40 -250 -277 -300 -371 -230 183 -56 -16 219 132 371 471
3647 471 15 209 124 204 -7 -229 -325 -141 -606 -241 374 -25 -104 200 230 66 -1 -79 103 -477 -343 -44
3669 -44 -1 343 58 135 286 70 20 70 179 -124 148 -433 -489 -217 -57 -9 -26 -13 255 -10 119 126 256 -27
3693 -27 -118 -147 251 -91 158 159 -48 -74 363 260 76 -58 -148 -280 23 -253 26 -29 -29 277 179 349 363 104
3717 104 222 34 -158 -304 -104 -427 -279 74 264 202 -29 -176 320 14 52 -140 -395 -169 -89 -282 305
3738 305 -40 -58 224 329 227 -99 -245 -199 -98 -430 -250 -65 -79 306 139 -177 446 221 130 173 14 97
3760 97 101 -114 -144 216 -255 -72 -87 -397 166 -100 141 361 -85 -3 -233 -400 -321 -282 -312 339 171 41 417
3783 417 144 -7 288 -42 -174 -373 -327 171 -234 -122 340 -249 -177 131 146 126 -3 145 -79 121 -244
3804 -244 -56 286 190 -75 79 372 223 -26 4 -349 -231 -276 -75 -38 -27 105 18 442 198 449 247 281
3826 281 153 -187 -263 -283 180 92 -10 -2 -62 351 296 -23 -34 -92 95 -224 -284 -83 1 -95 399 255 249 239 69
3851 69 46 57 50 66 16 -172 -286 -228 -456 -246 31 151 339 42 152 60 -154 33 41 -130 301 -253 -237 -51
3875 -51 19 -58 96 -12 176 79 4 66 -198 -111 -224 -211 -99 392 -7 17 141 151 164 167 119 120 -3 -167 41
3900 41 -60 152 295 67 90 123 5 32 103 -140 -59 37 -4 -65 -53 -227 408 113 -100 421 92 159 -98 -97
3924 -97 23 -150 -414 5 -51 -15 -58 106 -35 145 69 67 183 31 47 -121 -375 -6 -275 -146 297 -196 114
3947 114 51 264 -81 -8 -271 253 44 -9 -188 90 60 358 -150 158 291 40 -29 -191 -466 -84 -130 -2
3969 -2 29 14 -372 134 82 -114 -25 -138 80 -70 -60 -136 -210 -290 50 -237 319 357 -162 234 -148 -147 72 -309
3993 -309 -147 -60 98 -284 -57 -167 130 33 -57 80 25 -74 -29 -70 -22 55 -150 -129 -198 6 344 192 -260 -63
4017 -63 115 -50 -62 -213 -59 165 -21 97 86 102 362 109 -34 302 201 -180 -64 -214 -436 -94 -215
4038 -215 -87 -90 25 191 407 44 155 142 -199 -20 -266 -309 53 82 -6 357 -9 66 104 -74 51 202 -107
4061 -107 -88 112 79 103 -184 121 369 168 106 338 45 -19 71 -321 75 -345 -346 -288 -106 -33 53 -56 36 20
4085 20 57 332 -169 -148 66 177 -265 56 8 379 109 -15 74 41 44 -4 -25 -95 82 -287 -145 124 190 -17
4109 -17 315 -128 474 57 74 17 -204 -72 149 -235 -176 35 73 -121 -2 -104 17 -21 -246 -134 -92 7 123
4132 123 92 -128 17 -62 -137 230 -17 167 -111 24 -54 -117 -201 193 -12 -24 170 -182 240 122 -8 -102 -73
4155 -73 252 94 42 -61 215 45 -245 -72 159 197 223 256 453 122 -414 -387 -154 129 108 -86 115 167 415
4178 415 214 70 37 102 -94 -27 22 -179 5 -38 -172 -178 -51 179 334 -92 -71 139 69 -86 203 -317 -353
4201 -353 219 -94 343 211 -51 45 190 76 -169 122 -6 24 -156 63 67 -92 108 -85 -61 206 145 -179
4223 -179 269 -98 -178 -39 -295 -175 245 26 282 165 5 -160 250 -249 -109 -56 -106 -90 -183 -186 137 -225
4245 -225 248 231 -215 291 -23 -76 125 242 -129 161 34 133 4 124 225 157 -26 64 -50 -199 -227 66
4267 66 -163 101 -135 261 121 132 309 -58 -120 -71 120 38 -75 -128 -30 -182 -364 -208 -10 -106 -23 232 -191
4290 -191 43 246 72 -109 -18 320 135 43 108 -29 -34 290 -14 -292 -261 3 -226 -304 -79 -115 94 -243 -20
4313 -20 84 128 92 -34 -31 16 -143 106 177 -122 11 66 -276 19 -122 -48 -114 210 2 379 -215 -227 -105 -137
4337 -137 -169 -89 -22 53 -8 -46 -146 98 -111 -72 -161 -91 109 -144 -208 82 -120 20 152 -165 27 -183 -57
4360 -57 -117 -141 11 -20 -192 -301 -265 -188 72 54 137 -82 99 -193 113 22 -112 13 -72 100 135 -10 -16 5 2
4385 2 -73 10 -104 187 -87 -74 4 -100 -55 237 27 -175 -68 20 22 -164 -190 144 -103 -177 83 184 -123 44
4409 44 179 147 188 152 -185 -243 35 -57 -126 122 -54 9 21 9 261 103 -23 128 -78 -154 43 -66 20 158
4433 158 232 41 206 150 -60 -94 14 23 -67 -264 144 -261 -231 -138 13 59 142 180 59 172 -208 58 -198 -81
4457 -81 -219 85 -24 -59 192 -143 48 -5 47 43 201 35 109 -135 -238 275 10 50 -76 -168 188 -101 -162
4480 -162 -35 112 -365 -231 -5 48 -15 -106 -47 -95 -72 350 67 198 38 -40 36 248 84 -73 -308 94 102
4503 102 108 63 71 -140 20 -16 -81 -83 -46 -17 -340 -12 -19 102 60 -64 198 -144 186 228 -22 -116 -45 11 -33 -38 -55
4530 -55 -64 -136 82 -156 76 59 -104 17 -117 85 -311 -76 24 -206 2 -151 -17 2 -274 141 157 -74
4552 -74 69 -1 -64 -6 5 33 42 142 308 250 215 -48 92 83 -208 -91 -140 -9 67 -153 105 -6 208 -140 -199
4577 -199 58 15 88 -173 -9 159 159 75 58 225 -201 -52 394 113 318 -66 -71 -102 -251 -125 -150 -70 -96 -63
4601 -63 187 133 280 186 148 -93 105 259 -304 -431 60 -102 -140 -28 15 48 138 -8 -236 -128 56 -105 -176
4624 -176 173 118 162 237 65 155 53 175 -195 -385 18 -211 108 -226 73 23 -231 10 -46 77 126 218 288
4647 288 -46 87 -329 83 205 138 -18 153 -1 91 156 122 14 92 230 -9 -128 110 26 80 6 192 65
4670 65 -7 11 -25 -35 -89 16 222 205 136 134 -79 -41 -92 -72 -42 246 -147 -175 -229 -173 -118 20 129 203 -8 302
4696 302 -92 267 178 -212 146 -136 -322 -322 36 -241 75 279 132 37 299 171 273 296 -55 -325 -154 -110
4718 -110 161 -197 -90 -155 89 22 2 -57 112 -1 80 -52 -113 -346 107 21 -93 33 20 94 261 90 111
4741 111 -235 -129 -140 -315 -62 -202 -282 -16 62 251 235 -204 -164 11 -120 -1 -233 -170 -134 -98 19 -121 1
4764 1 45 -3 -172 28 -80 15 -230 5 64 -177 -147 -189 -192 162 -21 175 -115 515 42 7 -237 -223 -70 131
4788 131 -219 -164 19 -308 314 157 -101 -113 12 168 -40 -39 -200 133 215 -117 99 -98 -2 72 -150 -46
4810 -46 102 -9 -102 -3 -60 -41 -26 -88 0 -157 232 201 112 -157 -55 -186 90 149 189 240 31 88 36 3 390
4835 390 -30 -256 -128 105 -12 56 -2 -57 247 2 360 287 -76 146 196 -131 99 -78 -276 150 -35 -44
4857 -44 64 -379 152 -2 -85 115 -35 -4 -58 50 -259 11 -151 -211 78 82 86 -266 -8 130 149 34 -143
4880 -143 -3 -7 197 -38 141 -79 -86 124 50 192 -55 157 -35 -11 -60 -32 -113 78 -219 52 -295 -47 -89
4903 -89 -19 -169 40 222 98 142 50 -43 40 115 105 108 -220 8 -105 -134 67 -48 -8 20 -8 234 -46 207 -171
4928 -171 -26 -37 113 244 41 -67 130 35 8 -49 358 -43 280 282 5 388 -20 43 -167 63 -109 -60 -37
4951 -37 1 200 -209 -87 -161 21 70 -28 -128 203 212 -4 -72 -256 199 170 -25 -1 194 -30 112 212 -244
4974 -244 -170 82 -91 -188 -162 174 135 107 384 34 -131 -225 110 61 60 136 103 267 -94 91 -70 47 75 63
4998 63 -88 251 48 -55 -39 -101 26 89 124 114 178 36 229 -186 -168 192 -181 -141 -43 105 -62 -137 26 351
5022 351 -2 -178 -233 486 -187 -117 -59 -95 184 -300 96 91 136 -320 -98 146 -14 -284 -32 8 101 133 -82
5045 -82 99 76 166 23 31 61 40 63 -140 -112 -234 -280 -433 -31 -71 101 -214 -92 131 -476 45 380 41 -59
5069 -59 180 294 -85 96 -176 6 242 308 269 35 -75 -73 29 -196 -44 32 -28 -122 -19 -150 -23 252 174
5092 174 204 83 296 423 -35 167 -191 -22 75 -20 16 -140 8 -4 33 -69 48 -103 -5 -109 -7 -101 28
5115 28 -19 -30 -22 -17 108 -4 65 41 29 -40 71 -263 194 268 -128 353 144 -142 63 -91 211 -79 9 60 -135
5140 -135 -94 -17 165 -147 -162 -140 166 300 -68 -125 161 -186 -174 -25 77 -103 -125 31 -42 16 79 316 -299
5163 -299 -92 -28 134 -2 -142 -99 -250 65 -70 128 243 -51 12 351 -80 -97 -91 -113 156 -10 18 83 35
5186 35 -224 -200 9 221 35 234 161 -238 -52 -36 -277 -131 18 127 42 41 59 226 -13 45 -48 63 70 -95
5210 -95 90 -28 -75 -71 -168 -195 -33 92 -35 42 79 -195 57 -33 43 110 -94 116 -22 210 124 11 -105 -205
5234 -205 -121 -117 73 -54 -145 229 -211 -107 79 18 157 106 -91 132 67 -37 85 206 32 122 145 133 184 -81
5258 -81 -43 -138 178 202 -2 -13 62 31 -145 177 362 162 17 -82 348 -192 -83 122 -40 -133 89 239 1
5281 1 -130 -52 131 316 144 229 69 83 117 -169 -15 59 165 16 -27 111 -48 96 110 -179 -118 19 -150
5304 -150 -291 110 -96 128 -68 135 -38 -9 160 -382 -14 -203 -110 30 -130 -102 206 150 223 108 131 -213
5326 -213 96 -17 6 93 123 -21 -158 -76 -36 -376 224 148 42 -115 -62 -50 -16 194 19 98 18 235 -22 -57
5350 -57 135 215 128 61 -303 -101 -52 -63 122 225 248 -15 102 -85 298 23 -47 226 161 -97 0 -98 -98 -94 42
5375 42 138 248 194 -218 110 -87 229 82 -236 172 -287 59 228 -52 145 -44 -370 -134 300 -139 402
5396 402 -41 -37 75 74 29 64 -167 52 184 68 73 -113 -51 -92 -188 133 -34 55 -14 -297 -205 -271 -88 39 -12
5421 -12 107 -79 -143 -78 188 -11 -125 289 -28 148 60 -53 224 63 -195 27 17 -110 -162 130 127 -339 -295
5444 -295 68 102 115 -152 145 47 -246 209 17 -155 111 -3 148 116 283 -185 -132 -83 135 -124 -93 49
5466 49 68 57 96 -49 23 -28 81 340 303 238 97 -90 -177 -54 -61 -81 25 226 72 132 -55 236 -132 -128 47
5491 47 193 30 172 2 -59 -231 12 18 88 230 -100 -12 20 168 -19 -86 -39 -250 133 -123 -177 318 -46
5514 -46 -224 107 24 -298 140 24 103 132 -47 10 40 -32 213 49 -12 -81 -18 -161 82 -97 -155 -247 -60 -29
5538 -29 22 -8 -88 -115 39 -9 166 164 -116 -398 40 -67 177 -188 116 -64 66 1 -80 232 -23 -253 71
5561 71 152 146 -61 37 -125 -163 -76 60 104 85 -77 -69 257 -3 -86 -35 35 -82 124 195 -104 -127 185 82 -55
5586 -55 -72 272 72 -171 100 253 -227 -125 -254 -165 213 -50 -83 -85 -27 -24 -130 48 76 64 300 30 33 30 151
5611 151 102 -162 220 179 -299 -52 160 53 -170 -299 240 -126 85 -24 116 76 -64 -35 -55 192 -168 106
5633 106 249 -191 -62 68 -139 54 -189 307 25 38 205 44 -140 11 -73 31 -140 110 -1 -47 77
5654 77 78 -37 -176 256 12 113 94 -31 168 2 8 -126 44 -211 178 150 -151 -308 -12 -31 -82 -2 302
5677 302 138 79 -127 120 -1 -24 -110 -57 194 271 -46 -100 -43 -495 61 -74 -54 129 237 -96 -90 47 -276
5700 -276 -57 -12 132 75 218 -115 273 -10 161 3 296 66 -185 -47 4 -217 -13 -37 -67 108 250 108
5722 108 96 -62 68 -208 -240 79 -13 -61 -61 140 55 16 -205 -44 224 23 5 131 -225 184 180 259 -131 80
5746 80 -173 -184 130 -103 -61 59 153 -261 -94 54 71 -52 270 115 -165 61 31 288 -22 -7 -29 -173 -193
5769 -193 75 4 84 -18 -69 -120 284 69 36 62 65 48 3 448 67 -213 -170 53 295 23 -55 -338 -64 -123
5793 -123 -164 110 -258 -60 242 -27 -92 -169 -32 22 -90 -132 75 255 89 151 67 143 178 90 67 187 -114 -75
5817 -75 -24 -165 70 -140 -230 -86 -67 -230 60 -74 58 209 -77 -118 -327 4 77 -65 -20 54 358 132 257
5840 257 -142 48 -20 -104 294 108 -140 105 -163 -167 273 -83 52 21 125 120 408 -5 242 -85 -142 170 215
5863 215 52 -66 -38 190 -105 186 -74 201 270 496 -85 -326 38 -151 134 -168 107 -127 87 141 136 46
5885 46 91 13 -105 219 -33 -170 -97 8 86 -187 36 -216 139 -73 -220 125 -97 2 55 -51 -194 279
5907 279 215 36 31 142 0 0 -304 5 56 -12 128 22 -180 113 76 33 183 -1 -66 146 27 92 22 -17
5931 -17 -140 -264 -265 249 48 140 160 57 210 -70 115 165 -160 -13 -169 -136 82 49 120 17 21 62 -261 -68
5955 -68 -137 -199 -231 -168 72 -13 -59 129 146 -313 -163 154 -113 -24 -96 68 144 -283 12 -136 -268 -91 -68 -4
5979 -4 -166 -369 -160 -43 199 81 -241 -170 126 276 6 44 -247 -87 -13 -242 45 317 -51 -69 7 -160
6001 -160 -202 169 -84 11 -98 206 -60 -206 -156 118 -77 41 41 -205 -54 -167 -159 14 -76 131 -34 -161 139
6024 139 -42 -366 -21 53 154 73 38 -13 71 -54 -57 -50 145 51 60 -96 -65 27 101 72 -49 -18 -139 168 32 15
6050 15 -43 138 46 -357 234 125 117 115 -399 34 195 -38 148 -393 -131 10 102 40 50 -200 150 -48 -140 121
6074 121 172 -142 -8 1 -182 137 -84 -108 -66 14 45 96 -104 -9 -247 -99 -252 -106 20 172 33 175 40
6097 40 73 -128 -46 292 289 74 135 104 46 -119 -198 342 -125 -27 -26 108 -81 -61 -52 212 29 -128 204 -79 75
6122 75 -156 35 179 -36 150 28 -99 -120 227 -76 23 288 205 -33 35 122 -342 -93 244 -192 -84 -291
6144 -291 -22 15 162 -31 498 147 -152 38 -91 57 324 154 17 389 109 69 129 -129 218 199 -54
6165 -54 272 -55 -53 118 -23 -47 -178 45 -66 196 62 -18 -3 -168 36 205 29 311 228 -131 -21 -171
6187 -171 75 1 -92 231 75 171 89 0 -132 83 -27 -180 83 11 -15 152 -245 -174 100 315 227 66 -7
6210 -7 191 284 7 9 73 141 -77 -86 -52 116 16 121 -24 -255 82 109 145 127 77 125 168 135 -39 341 153 19
6236 19 3 -54 -88 -277 -73 -37 26 -37 109 -29 -26 -52 -100 196 216 -43 -209 251 -185 146 41 62 -42 46 171
6261 171 37 -193 110 -299 169 257 -161 130 183 -198 216 -90 -321 -127 232 88 147 134 54 166 -24 194
6283 194 -59 -83 419 259 -101 -310 103 37 -493 -241 -42 -109 184 -76 -71 -260 156 -69 -183 -152 35 -342
6305 -342 -309 319 -166 -39 -243 -105 12 -259 43 33 44 411 147 -113 141 52 -63 238 69 244 -10
6326 -10 -291 124 119 -119 123 -175 -109 114 -93 56 -172 -265 -57 6 28 256 218 102 -92 -39 97 -176 170
6349 170 74 -120 -244 168 169 -356 135 -289 152 -153 -206 48 165 49 224 -177 139 207 -1 311 118 206
6371 206 85 56 -28 -244 -83 -58 46 245 -148 -81 -53 89 -3 118 -21 53 -10 102 -127 155 102 -59 105
6394 105 87 119 -437 20 32 10 99 69 -243 155 -84 -282 203 230 121 120 -18 35 13 18 -1 40 -191 -148 -53 152
6420 152 -101 -229 36 -146 5 -28 -119 135 115 166 214 -58 -145 202 94 144 147 -91 105 95 -39 -18 258 124
6444 124 9 -103 128 147 24 86 146 -29 -301 16 137 55 84 -15 155 -126 28 155 148 128 425 -85 -32
6467 -32 -138 -281 235 219 -255 38 25 -166 45 -202 -99 233 268 -96 38 162 69 35 96 -280 57 134 19
6490 19 -51 -11 178 154 -318 -288 -121 -40 131 75 77 -161 250 -139 -159 -350 115 -5 52 102 -61 -132 159 -198
6514 -198 68 -181 -66 113 -56 -22 84 58 73 -41 122 55 -188 175 157 -70 -154 3 35 144 35 -64 -59
6537 -59 136 122 36 34 -35 49 316 142 -99 99 -113 -121 -1 264 -66 243 9 142 214 15 -144 -337 -91
6560 -91 126 79 113 -97 -15 171 -16 -18 -139 -79 -143 53 50 76 -65 -18 219 132 -160 31 -170 183 -144 222
6584 222 30 79 116 149 306 240 117 74 -32 194 -28 52 -231 129 113 34 321 -27 -416 111 -114 -73 330
6607 330 220 180 -94 30 -21 208 -123 78 252 -113 -10 -76 5 -161 -320 -214 -23 104 -220 -220 -51 29
6629 29 -59 -254 60 -204 46 452 -31 73 215 -50 56 160 135 206 -67 31 -138 -179 -112 -59 -97 -17 -51 50
6653 50 94 219 117 84 152 -64 -7 109 -30 -49 -179 253 113 8 -92 -112 -348 247 -51 -380 -20 -146
6675 -146 -109 47 -37 -430 49 22 -67 76 -11 97 82 -66 58 -279 30 -218 -139 -72 27 25 -116 -76 118 191
6699 191 -63 98 136 -334 216 124 28 195 -418 -63 0 243 190 89 25 21 -40 151 35 86 253 379 -50
6722 -50 96 165 -108 3 53 -168 154 148 -55 -214 81 -299 -219 -37 -173 86 -171 -32 61 -66 -204 -87
6744 -87 -173 140 130 114 41 293 -62 -201 -11 34 -217 41 -1 368 -101 -95 194 -318 -77 -166 -503 221 -55
6767 -55 -8 197 -58 -170 242 12 194 9 -20 -198 -31 -353 94 -135 151 27 -341 347 25 -85 187
6788 187 -185 75 174 80 69 43 182 172 134 -148 22 213 100 241 -109 105 -44 -90 198 131 -116 -163 136
6811 136 138 190 7 -26 91 202 1 51 185 -60 13 -132 152 -29 -131 -135 -72 -309 -63 112 -103 154 112
6834 112 -70 64 -16 -258 -17 -152 -85 -10 52 10 -75 -67 245 41 -146 115 -249 104 -202 227 66 80 -56
6857 -56 45 114 -349 548 82 193 20 -8 -278 206 -217 195 44 -175 174 87 -100 168 -98 107 -64
6878 -64 73 88 -34 -280 160 9 -234 225 -32 53 40 -165 243 187 -36 48 -102 -60 13 217 -107 14 30
6901 30 -208 -67 56 -8 160 -5 35 -25 74 -69 -350 -5 -28 -174 -243 -75 -101 15 -190 -48 -29 -53 -97 58
6925 58 -227 -29 -33 -72 2 -126 215 -54 -21 58 -281 3 -43 -29 127 -99 60 -38 97 10 101 49 -61 -105 32
6950 32 -176 105 -74 -35 44 -135 -95 81 63 -114 -244 -129 16 -4 23 168 -162 -173 -145 51 -241 -92 -24
6973 -24 75 -74 -168 146 -101 -88 -152 -217 -283 -183 20 -150 -27 -3 -11 5 -110 38 -132 0 -26 184 114 8
6997 8 -175 -191 -125 -221 -366 204 -153 101 -73 191 -142 -132 -199 215 95 15 160 266 29 -172 76 -294 352
7020 352 491 -61 -2 -40 100 -33 -150 -53 -230 351 211 40 -259 166 -2 -84 81 -100 -111 102 -112 29
7042 29 -77 -54 236 -111 84 158 72 -125 120 23 -23 150 -39 126 -65 292 94 -238 -313 68 -27 -131 96
7065 96 -99 71 -60 86 -51 -48 27 106 -43 58 267 202 10 -52 -17 -3 29 25 -134 157 199 46 -190 290
7089 290 -15 -136 -37 -177 90 -20 3 -154 -6 -257 -159 129 101 -11 219 199 30 -240 -122 -4 212 61
7111 61 313 26 -43 -233 -192 -240 -135 55 -46 -162 -109 66 7 38 177 63 -53 117 -64 101 -46 -411
7133 -411 81 35 -63 -63 -301 -173 91 152 109 134 -367 -153 271 -96 206 45 -38 192 250 13 -168 -56 -97
7156 -97 -104 -74 17 153 -163 -109 -24 -46 148 126 -90 158 -187 156 -36 -5 20 -118 52 52 -236 -197 -99 -80 -166 145
7182 145 -186 -398 -212 35 -88 35 -226 321 150 -202 60 -117 38 26 10 122 19 66 55 -62 -63 -72 -168
7205 -168 -198 30 410 -23 -56 67 -68 12 102 121 109 -63 191 47 -48 -77 -140 74 118 160 96 77 -69 -56 -68
7230 -68 69 7 239 -56 129 181 222 -26 196 165 260 253 31 -168 -8 -117 25 -209 -50 -213 79 49 30
7253 30 -25 -182 169 250 -66 -57 -42 95 349 201 94 -1 -202 -5 290 113 -24 -38 120 -153 29 66 -87
7276 -87 -130 -308 137 137 -132 35 -56 -208 171 12 -81 -86 282 -122 -249 -213 -206 152 187 188 -170 -370 -1 -36 -236
7301 -236 84 -108 20 -1 -101 89 93 8 -55 -99 -105 -123 39 -20 62 -52 69 -207 172 -74 3 -45 251 -43
7325 -43 -9 68 -56 -139 102 216 90 -38 -61 -49 -162 35 232 -7 168 309 -164 -61 308 -60 -10 -121
7347 -121 -98 123 -37 -55 -197 87 -121 7 -74 126 -29 -193 -80 -11 -146 -145 -191 -3 6 -59 -5 218 170 152
7371 152 227 29 -66 144 -212 221 118 91 -35 -100 63 232 -2 -201 128 211 104 123 -208 181 -12 -42
7393 -42 101 -30 -135 -17 -129 -51 44 23 13 -96 142 -75 -179 83 -127 -79 203 31 172 -19 78 203
7415 203 -98 17 57 52 -283 106 -83 -262 -119 173 -319 -142 55 223 198 45 -107 -71 -137 28 -81 -159
7437 -159 294 42 -64 28 38 19 228 -37 105 145 -48 308 -154 -238 -316 -84 -107 -126 -38 63 -41 -45 -14 205
7461 205 -41 48 -40 112 121 -73 -51 -33 -11 -111 133 -131 131 191 -4 -121 105 -202 121 266 93 42 -192
7484 -192 38 -22 -364 37 35 151 126 120 -63 73 -270 -110 -1 -118 62 0 35 -100 -20 -116 -79 246 179 -165
7508 -165 -58 7 71 73 -204 91 115 -213 94 270 -14 271 -47 -269 -149 77 238 -75 -91 220 -16 84
7530 84 15 -225 -144 -75 128 206 -39 -269 94 -51 87 -69 100 150 26 -43 69 129 -17 100 154 282 266
7553 266 209 -315 -78 -155 -53 126 -19 -170 -158 73 278 -91 -28 -44 -84 -288 145 -58 252 114 -55 -155
7575 -155 -79 69 103 -181 94 -29 62 7 31 -98 -76 118 -43 -92 -16 -185 166 -359 -216 120 -254 333 20
7598 20 -232 81 14 -198 -47 -55 151 1 -98 -107 231 -22 22 -84 -121 391 118 271 185 41 142 59 -186 140
7622 140 -95 -23 -81 -108 -178 -138 -63 -133 -14 218 305 -213 -12 -169 138 -33 183 -53 -95 148 253 121 172
7645 172 -33 -158 30 169 21 -16 -42 -130 -35 -99 -179 -210 -53 82 -23 208 212 68 -12 64 291 51 -193 78
7669 78 149 60 -123 123 -296 -87 151 18 -67 -40 -87 0 -89 71 54 -103 -133 212 43 151 -83 7 67 109
7693 109 82 201 317 55 -137 -65 -13 -61 -54 -89 -130 -140 126 -1 -241 -128 -194 86 -48 93 -152 244 -311
7716 -311 45 -218 -263 270 1 80 -64 99 -158 157 -25 -135 167 90 -40 -101 -42 151 191 -66 216 198
7738 198 88 -98 -1 61 72 -126 194 212 124 194 225 -114 -15 -71 -122 9 -47 -18 -52 -47 -155 -132 25 56 196 69
7764 69 -52 -29 -51 -51 71 -142 178 -142 -53 186 22 357 112 -11 -233 99 119 173 -22 -148 32 -166 35
7787 35 61 -206 115 156 34 -131 -79 149 45 -14 129 -168 219 -6 -40 -147 46 -108 -189 -85 -43 -143 361
7810 361 -281 -179 -41 -109 109 -54 150 101 107 2 -121 76 -243 257 73 192 15 -69 -255 -224 -345 -73
7832 -73 -39 46 131 174 -113 -62 -223 -66 -257 134 151 -65 157 76 199 -226 -72 80 -179 -52 -183 185 374
7855 374 -171 97 107 -3 -6 -212 361 183 33 60 57 -27 32 46 127 316 26 -198 -29 -49 -94 -85 -269 -163 -36
7880 -36 4 -282 122 148 75 -247 51 -58 190 181 -143 -128 -301 -72 -408 -8 -241 93 -254 -174 -75 -111 -42 77
7904 77 -51 389 1 80 70 211 -162 125 -2 -158 322 -217 -20 0 -143 -356 -28 -123 -12 34 29 42 117
7927 117 -236 47 254 236 159 -176 -246 188 -150 -27 -70 -241 -48 171 -45 -6 -21 -287 -116 -42 112 -88
7949 -88 -106 72 195 209 -167 63 -18 83 175 312 61 -427 219 59 62 -129 -22 -112 -28 -143 144 33 -70
7972 -70 -145 -33 250 155 121 199 -8 148 8 71 -90 -105 -77 -33 -38 196 86 109 113 113 -73 -4 45 57 11 -20 -238
7999 -238 7 23 -23 -90 3 24 -182 -130 -235 -96 102 -70 127 90 -38 12 144 373 -44 240 -151 -159 56
8022 56 -68 13 234 -160 -101 196 132 -49 -151 194 -149 22 -111 -136 10 44 65 -141 327 -220 -124 132 -21
8045 -21 -112 -154 79 157 -59 -268 -18 -220 84 10 121 -100 227 -218 136 63 -26 175 168 -5 227 121 -260
8068 -260 -115 -9 17 -135 296 -173 254 -331 5 262 -108 92 -55 172 -353 -154 119 32 -14 -213 112
8089 112 -294 -118 181 -137 -124 -89 98 299 186 2 -83 109 192 142 -3 156 -168 -34 -146 -84 61 39
8111 39 -170 261 152 35 -80 -20 48 -17 172 -141 -212 -354 170 -138 -75 200 -121 -25 -127 -96 23 0 256
8134 256 -52 0 169 -9 256 32 -180 25 55 -85 -162 12 92 -6 -182 -247 21 148 200 -21 -76 -14 -137
8157 -137 84 75 405 -63 -221 -233 -50 -62 61 -42 -52 -66 35 35 -107 -25 -194 255 -122 164 -61 -16 187
8180 187 172 -96 173 96 -244 89 -23 3 -156 -201 23
8191B3
$$ Imaginary data points
##PAGE= N=2
##DATA TABLE= (X++(I..I)), XYDATA
0 0 0 0 0 0 0 0 0 0 0 0 0 -8 8 -8 8 -16 16 -17 24 -31 33 -40 48 -57 66 -80 92 -105 121 -142 161 -184 209
33 209 -237 269 -301 337 -378 423 -472 525 -583 647 -717 792 -877 966 -1064 1174 -1292 1426
51 1426 -1572 1731 -1909 2109 -2337 2595 -2890 3236 -3642 4134 -4733 5493 -6486 7851 -9850
66 -9850 13071 -19146 34728 -169749 -290915 -50189 53553 172592 198575 215070 170527
77 170527 102280 7803 -52445 -94577 -90124 -126979 -152980 -118835 -56740 -2742 67967 107026
89 107026 143142 172158 159132 92545 -12677 -118784 -164723 -191494 -187577 -123412 -37441 55928
101 55928 148558 182293 176997 149433 88057 9851 -75548 -138083 -147059 -147350 -130996 -77739 -27856
114 -27856 36733 125481 177765 191047 162699 78945 -24003 -123923 -188681 -188770 -153258 -79023
126 -79023 16097 66705 99514 129612 120968 100118 78844 37380 -7876 -65861 -124303 -153959
138 -153959 -164528 -126891 -42062 38576 121105 184966 180933 140679 77915 -10410 -87116 -141976
150 -141976 -160516 -135924 -101041 -41684 34343 80560 116891 136958 114184 85306 47998 -13877
162 -13877 -70571 -117975 -145809 -141532 -117281 -52320 36118 101252 158601 184699 144927 79891
174 79891 108 -85155 -133204 -146637 -127489 -79508 -35192 11523 49917 65352 96606 121710
186 121710 105925 79651 32459 -43398 -109567 -156226 -162622 -118809 -53972 32662 111004 146674
198 146674 160410 133055 60532 -2730 -58531 -107029 -120989 -114980 -92356 -55884 -20195 31338
210 31338 80161 104408 126920 122231 77141 27637 -36053 -102144 -134185 -144122 -123277 -65381
222 -65381 5894 83549 134131 139315 125333 77986 5772 -42996 -79900 -103055 -95971 -87610 -69212
235 -69212 -32724 6878 56695 99567 121614 133782 102984 35043 -27876 -97748 -151917 -153170
247 -153170 -121590 -59801 18299 79321 121047 125809 96196 66007 21736 -22866 -44208 -73822
259 -73822 -97930 -91839 -79964 -53380 -5121 46119 98269 124809 120330 101336 45538 -28284
271 -28284 -84081 -132796 -147616 -112600 -63829 -2843 61002 99670 117338 105133 74130 45191
283 45191 -1562 -44931 -65327 -90225 -100356 -81832 -58894 -17941 35473 79779 116581 124857
295 124857 97830 50975 -21168 -83462 -111319 -127336 -106898 -51322 -3695 40552 76408 90739
307 90739 96780 83288 55324 25684 -20294 -61931 -88584 -116544 -111341 -70855 -26203 34336
319 34336 94525 124172 126222 92325 36572 -17100 -72200 -99576 -94332 -85340 -55061 -12592 14281
332 14281 46905 73767 79860 81578 67251 38565 1213 -50287 -87937 -105622 -116438 -88363
344 -88363 -29552 28249 88885 127290 124844 99458 47351 -14292 -62836 -97617 -99124 -79634
356 -79634 -60987 -23354 15267 32965 56852 75416 76707 73693 51902 14186 -29395 -81659
368 -81659 -110654 -111140 -92462 -35412 30809 76811 115478 120491 84754 41313 -6932 -47005 -71065
381 -71065 -85172 -75394 -57064 -44719 -14725 17971 43122 78576 95101 84325 64149 21509
393 21509 -32185 -77312 -109111 -106347 -80496 -42299 19389 71351 94504 105816 85571 41438
405 41438 2009 -37162 -62828 -70370 -72880 -61419 -45282 -26757 10841 43178 67107 96219
417 96219 96867 67507 29643 -23358 -72825 -103551 -115415 -88775 -40956 11022 65605 89556
429 89556 85767 74827 40656 3546 -14307 -33670 -49664 -60890 -70234 -60878 -39798 -7648 42732
442 42732 77645 93633 98709 68031 20895 -22690 -71913 -101383 -101544 -82815 -40385 5653 46270
455 46270 80816 81176 66144 54617 25987 -2630 -21928 -48702 -66444 -71108 -69436 -46468 -11445
468 -11445 28517 71198 88646 89808 78116 30862 -22877 -62837 -95603 -98150 -72237 -35501
480 -35501 9167 40609 56686 66696 57865 47998 41941 17164 -8031 -31730 -67032 -85224 -79969
493 -79969 -60076 -19470 25421 67430 98565 93337 68591 33870 -19117 -58132 -76837 -85506
505 -85506 -65627 -32734 -5103 23595 43057 55458 62536 52579 42511 28802 -5424 -35120
517 -35120 -59118 -83978 -83223 -60831 -27518 22013 64923 90959 96723 70864 33826 -7940 -53338
530 -53338 -70327 -68122 -63481 -38756 -10296 8722 28662 40675 50597 59515 51721 37056 11362
543 11362 -31051 -60737 -80980 -90551 -63051 -19016 22511 64027 84968 85331 67944 30269 -3536
556 -3536 -33766 -62207 -65061 -57443 -48859 -23248 -2094 12902 35687 51383 60701 63520 46666
569 46666 20145 -19561 -64296 -80670 -79870 -64301 -21864 20614 52481 76326 74558 56930 31997
582 31997 -2042 -28265 -48403 -60002 -49583 -41216 -34952 -11864 7432 26433 53915 68834
594 68834 70200 54801 17893 -21075 -58292 -82468 -76236 -58580 -30715 13428 43246 59815
606 59815 70985 58679 33943 7347 -19510 -33795 -45609 -52541 -43270 -37392 -26770 1622 26421
619 26421 51948 75569 72006 50349 18097 -22861 -54235 -75323 -77279 -52514 -26755 2206
631 2206 37214 51851 55357 54116 36007 17742 1037 -19866 -34933 -49625 -57490 -48017 -34580
644 -34580 -6336 34064 56123 69188 71926 46624 11915 -22713 -54038 -66635 -66441 -51771 -20995
657 -20995 3773 27507 46586 44434 42933 42033 26413 11662 -3975 -27161 -45755 -61177 -62191
670 -62191 -42171 -17677 18232 55630 70116 72004 57383 17390 -19308 -48231 -66772 -61594
682 -61594 -44667 -19636 6503 19210 32406 43196 38009 38609 36387 16443 -3366 -27131 -52110
695 -52110 -60661 -58999 -43121 -12681 16978 48993 69027 62055 48961 25511 -11851 -35680 -48629
708 -48629 -52715 -40464 -26941 -10407 7804 18686 33134 43394 40536 40175 27979 -1034 -23410
721 -23410 -46597 -65580 -62407 -45630 -14488 22490 48825 68632 68150 42867 17671 -10311 -36598
734 -36598 -41747 -41821 -39414 -25620 -14528 -3680 10054 22019 40317 49135 41802 33193 9934 -24158
748 -24158 -44986 -59914 -61472 -39440 -12627 17138 43741 53543 55494 42752 18862 2132 -19342
761 -19342 -37917 -39327 -40335 -38047 -23645 -11182 6881 26552 39626 52447 51815 34284 13320
774 13320 -19381 -48583 -55818 -56315 -42283 -11032 15843 36378 46825 42281 35019 18668 -1305
787 -1305 -9663 -21778 -31173 -29756 -35383 -35058 -19970 -3732 20153 46241 58651 59774 40043 8167
801 8167 -19548 -48911 -62370 -51328 -37322 -15548 11908 26450 37847 41392 32210 22897 9412
814 9412 -3835 -11064 -25445 -34079 -32080 -35397 -26989 -3669 17264 40589 55798 51873 38147
827 38147 10577 -19936 -39813 -55210 -52402 -33012 -17398 4848 26621 31905 34063 32447 24111
840 24111 18131 7434 -4070 -15045 -34590 -45870 -42509 -34952 -9716 22359 41365 55053 53008
853 53008 31661 6865 -19219 -36855 -41422 -43766 -31330 -10758 -26 15234 27258 27222 30250
866 30250 29383 20461 13826 -620 -17953 -32939 -48180 -46922 -31563 -14304 16252 42717 49611
879 49611 49638 35321 9316 -12441 -31746 -39629 -34119 -27884 -13139 619 5908 16711 23480 22550
893 22550 29998 30360 18994 4619 -17917 -37756 -48792 -51693 -34336 -7277 15976 42072 52136
906 52136 43864 33595 13075 -10785 -23253 -31886 -33149 -27268 -21628 -7741 3510 8310 22117
919 22117 28648 26247 27825 19292 2590 -12370 -31926 -43392 -41958 -32264 -7993 15411 31583
932 31583 46260 42176 25249 13662 -2917 -17644 -23054 -28992 -29144 -24629 -21290 -8232 4948
945 4948 17479 35423 39996 34754 28305 6247 -19679 -35265 -45864 -41787 -24969 -5426 17677
958 17677 29736 31074 32051 21743 9193 3966 -8307 -18263 -21412 -28684 -28675 -21028 -11608 4364 17334
973 17334 28709 41661 38418 25372 11165 -14582 -35377 -41765 -42335 -27521 -5874 10525 24991
986 24991 27585 24554 22716 12155 4448 2689 -9581 -19221 -23476 -31134 -28399 -17833 -2727 19870
1000 19870 36260 43992 43896 24757 1402 -18278 -39924 -43139 -32172 -21998 -5531 9736 17280
1013 17280 23098 21146 18530 18657 10289 3898 -1558 -15578 -22791 -25378 -30328 -21613 -5549 10827
1027 10827 30012 38759 38592 29850 5652 -14497 -28423 -41300 -36480 -22307 -10956 6331 18126
1040 18126 21288 25078 22036 18481 15250 4972 -2164 -12093 -29139 -33173 -29196 -23573 -4195 15165
1054 15165 28136 36969 31000 18924 5998 -10723 -18797 -22091 -26379 -18696 -10703 -7743 3933
1067 3933 12899 18403 26217 26244 22283 13994 -4214 -18389 -30159 -40445 -32886 -19887 -5098 17968
1081 17968 31579 34397 33570 21155 5648 -8377 -21326 -22194 -19758 -19033 -8895 -3128 -2261 5866
1095 5866 10890 15763 25231 24585 17527 5295 -13871 -26903 -36300 -37378 -20586 -3088 11976 29540
1109 29540 33603 28148 21311 7072 -3684 -11242 -19056 -19004 -19977 -20691 -11996 -6470 2123 18473 25554
1124 25554 26422 26102 14464 -295 -14572 -27450 -28391 -25831 -18127 -699 10541 18633 27365 22604
1138 22604 14975 10452 -14 -7131 -11495 -17305 -18124 -21207 -20720 -10103 -1490 11144 28830 33451
1152 33451 31811 23686 3113 -15754 -29119 -35930 -28639 -15893 -588 15563 18446 17697 17865 8866
1166 8866 4224 4968 -398 -3657 -9246 -18782 -20824 -21310 -15575 -396 11413 25363 35964 29755
1180 29755 19370 6074 -14447 -26847 -31164 -29288 -17594 -6063 5089 16342 17388 17808 18141
1193 18141 9551 5860 2825 -6571 -10856 -14735 -20201 -19023 -14981 -4385 11570 20480 28960 31537
1207 31537 16979 2601 -11505 -26064 -26912 -22357 -15769 -4340 3323 8857 13798 12949 16386 18405
1221 18405 11156 7432 577 -13048 -19600 -24297 -25254 -15443 -4083 10478 24141 25946 25203 16854
1235 16854 191 -8534 -15382 -22713 -17938 -13010 -9261 -1328 3500 10646 17287 17505 18892 15843 4668
1250 4668 -2262 -12492 -23695 -24141 -22007 -16295 -1861 10371 21095 25332 19543 13997 4094 -8429
1264 -8429 -10223 -11775 -13929 -9097 -8835 -9157 -2982 1838 9970 18896 21092 22013 13684 -2082 -11766
1279 -11766 -24245 -32331 -25819 -15543 -1250 16276 24244 27305 22725 10268 1345 -6850 -12273
1292 -12273 -9257 -10073 -12164 -7813 -9338 -7988 656 6921 15424 20276 17550 14205 3669 -9868
1306 -9868 -16625 -23728 -24328 -13522 -4047 7521 19823 21506 19183 13748 4544 -370 -7571 -12093
1320 -12093 -10819 -14702 -16413 -10830 -7409 326 12119 17357 21902 21758 12706 3103 -10180 -20047
1334 -20047 -21070 -21736 -13954 1069 8147 13796 17224 11672 7990 4560 225 -53 -4305 -9221 -11655
1349 -11655 -17643 -16599 -8005 -1799 10205 22067 23244 21863 14315 1952 -8336 -19155 -23111
1362 -23111 -17874 -13605 -4937 5704 8766 13051 14774 9545 7827 5671 138 -3358 -9631 -13962
1376 -13962 -13493 -15174 -9154 1770 7736 17338 22274 18118 12450 2703 -9761 -16386 -20145 -17942
1390 -17942 -10109 -5624 2758 8336 6975 10156 12568 10168 10696 7084 -1080 -7305 -16446 -19977 -16604
1405 -16604 -11697 652 11779 15720 20624 17787 6555 -162 -7507 -13229 -13548 -13614 -9497 -3879 -1868
1420 -1868 4070 8955 9032 14251 14251 9291 7130 -866 -10850 -15797 -19557 -17510 -10394 -3111 9235 16549
1436 16549 16717 17018 10787 195 -4133 -9483 -12248 -8766 -7828 -5400 -2849 -2279 3792 7490 10107
1451 10107 16676 15688 7614 612 -10776 -20299 -21516 -18998 -9458 2016 10290 17566 17328 11941 9377
1466 9377 1832 -5051 -4804 -7572 -9914 -7775 -8337 -6494 -2606 35 7526 11960 12905 14998 8638 -405
1482 -405 -6846 -16044 -19773 -14845 -9984 -949 8784 13538 17535 13737 7456 4704 -2028 -6829 -5934
1497 -5934 -8862 -9947 -8558 -9819 -6694 21 6119 14404 17024 15438 12050 -88 -10222 -14252
1511 -14252 -18124 -14476 -6121 172 7586 11071 10151 10080 6691 3394 2463 -3236 -5916 -6726 -12026 -12969
1527 -12969 -8504 -6311 1176 8571 13421 17670 14322 8614 2976 -7333 -13124 -13926 -15377 -9442 -1315
1542 -1315 2409 7682 9838 8776 7495 4568 3125 2274 -3543 -7316 -8887 -13913 -11489 -5616 -80
1557 -80 10106 16443 16637 14964 6942 -1695 -8250 -15096 -13841 -9743 -8299 -2195 2513 2798 5854 7368
1573 7368 7719 10130 7780 4099 -780 -8870 -12175 -12947 -13158 -5273 2702 6558 12823 14439 11228 7578
1589 7578 -235 -5817 -9685 -13647 -10580 -6175 -4117 1710 3884 3296 7388 8780 8887 10265 6559
1604 6559 655 -6196 -14801 -16039 -13684 -9914 745 9295 12515 15580 11236 3957 -701 -6363 -8436
1619 -8436 -7812 -6874 -3297 -2218 -3406 534 2534 4447 10632 11786 9753 6372 -1956 -8382 -12985
1634 -12985 -15769 -12084 -7268 -1784 7154 10583 11393 13224 8687 2080 -1669 -6432 -8066 -7073 -6977 -3666
1650 -3666 -2499 -2428 2386 4366 7075 11960 10191 5655 860 -7657 -13097 -14834 -13188 -5251 1462
1665 1462 6768 12809 11678 8086 6317 1123 -1765 -1654 -4288 -5452 -6620 -9082 -7553 -5931 -941
1680 -941 7217 10648 12052 13052 5774 -1268 -6116 -11756 -11838 -9395 -6176 215 4474 7876 11028 8177
1696 8177 5249 4078 -1729 -4045 -3913 -6196 -6962 -6887 -7097 -3812 -950 3872 10810 11821 11610 9476
1712 9476 898 -5144 -8591 -12832 -10287 -5475 -1462 3581 5267 6096 7030 3880 3223 3941 59 -1676
1728 -1676 -4703 -9709 -9946 -8501 -5514 1975 7761 12318 13819 9246 4822 149 -7385 -8964 -8415
1743 -8415 -8865 -5290 -2459 104 3359 4702 5452 6593 4718 4429 3412 -2158 -3591 -6087 -10533 -8864
1759 -8864 -5224 -800 6212 10136 11909 10630 4436 -302 -4837 -10177 -8656 -6933 -6548 -1949 566
1774 566 1785 4357 5229 6528 7833 5495 4909 1291 -5756 -8692 -10935 -11440 -5526 467 5536 10579
1790 10579 10358 7525 3402 -1913 -3196 -5078 -7187 -4309 -3626 -3654 -571 805 2622 5710 6257 7599
1806 7599 7282 3814 974 -4898 -10593 -10878 -10706 -7900 361 5163 8035 10453 7887 4995 1821 -2343
1822 -2343 -3232 -4626 -6070 -3796 -3808 -3159 693 1149 3109 6644 6978 6940 5157 -184 -3904 -9276 -12204
1839 -12204 -8371 -5437 -794 6091 7615 8195 8063 4162 2197 -140 -2826 -3148 -5008 -6157 -4306
1854 -4306 -4735 -3621 1530 3467 6630 9055 7193 4209 -261 -5904 -7644 -8572 -7327 -2287 -119
1869 -119 3170 6955 5514 5103 5390 2339 757 -995 -3597 -4541 -6757 -7509 -4927 -4328 130 5827
1885 5827 7009 9526 9403 4206 40 -3878 -7343 -7427 -7185 -4287 533 2187 4407 6022 3186 3044
1901 3044 2692 142 241 -975 -4113 -5569 -7321 -7020 -2847 52 5748 10099 8791 7719 4794 -1513
1917 -1513 -4252 -6643 -7625 -5082 -3820 -1347 1272 1124 2620 4327 3190 4826 4709 1204 -821 -3877
1933 -3877 -7063 -6713 -6259 -2784 2016 4591 7992 8968 5432 4033 56 -5251 -5886 -6827 -6901 -3597 -1837
1950 -1837 716 2750 1851 4142 5157 3597 4991 3716 -380 -1954 -5987 -8911 -7141 -4745 -44
1965 -44 5058 6669 8766 6158 1014 -650 -3607 -5717 -3821 -3549 -3221 -1483 -1591 -81 2396 3428
1981 3428 6338 6815 4772 3765 -830 -5769 -6450 -8272 -7358 -3047 -503 3652 5862 5035 5350 3297
1997 3297 136 -201 -2755 -4558 -3064 -3468 -3537 -479 -180 1837 3133 4011 6451 4969 2218 822
2013 822 -4251 -8100 -7902 -7821 -4119 1337 4001 6557 6848 3893 3080 61 -1542 232 -1870 -3174
2029 -3174 -2267 -4024 -4368 -1973 -654 2933 5797 6142 6087 2752 -1420 -3911 -7095 -7009 -3537 -2684 432
2046 432 3779 3667 5018 4718 3139 3120 249 -1687 -2376 -4864 -5458 -3379 -4410 -2044 1473 2195 4547
2063 4547 6574 5216 3913 -44 -3452 -4420 -6390 -4809 -1062 -47 2098 3938 2357 3011 2587 1455
2079 1455 1802 287 -1176 -2773 -6036 -6299 -4285 -3884 1161 5853 6886 8338 6103 1684 -1060 -4774
2095 -4774 -5587 -3897 -3414 -1085 656 -506 963 1749 1086 2868 3341 2545 2274 -860 -2867 -3689 -6262
2112 -6262 -4831 -2351 -1015 4162 6667 6678 7086 4111 -881 -3674 -6393 -6535 -4035 -3311 255 2265
2128 2265 1085 2534 2406 1426 3080 2339 1596 1192 -1425 -3085 -4104 -5431 -2538 -266 1385 5684
2144 5684 5862 3782 2792 -11 -3018 -3026 -4523 -3645 -2121 -2505 -757 832 1327 4786 5279 4139 4234 1167
2162 1167 -1790 -3163 -5419 -5177 -3974 -3075 745 2480 2997 5009 3616 980 907 -1251 -2549 -1656
2178 -1656 -2343 -2038 -1719 -1834 407 981 1961 4897 4409 3079 2840 -677 -3365 -4546 -6642 -5369 -2770
2195 -2770 -284 3284 4618 3844 4711 1712 -113 508 -1332 -1623 -1180 -2692 -2939 -2291 -1814 1079 2508
2212 2508 4029 5402 3294 787 -730 -4317 -5153 -4130 -3846 -885 1137 2128 3831 2777 2434 3325
2228 3325 1271 729 572 -2398 -2755 -2727 -4418 -3232 -1645 -235 2748 3402 4076 5207 2027 118 -1495
2245 -1495 -4794 -4529 -3347 -2342 847 2659 2795 3601 2319 1161 1299 -648 -225 -125 -2719 -2962 -3403
2262 -3403 -4000 -2174 353 2574 5362 4899 4401 2697 -1280 -2177 -2799 -4102 -2031 -723 -1539 13
2278 13 651 1316 2443 2077 2236 2098 -551 -1169 -2418 -4661 -3607 -2414 -1796 1894 3219 3960 4944 3423
2296 3423 1985 24 -2697 -3129 -3073 -4018 -1885 -256 -363 1483 1396 979 1645 1495 2006 1921 408 -536
2314 -536 -2155 -4520 -3462 -1824 -729 2922 4017 3931 4013 1295 -418 -1679 -3538 -2854 -2511 -3235 -838
2331 -838 -404 -203 2687 2938 3358 3983 2233 623 -1241 -3231 -3195 -2783 -2386 -191 364 559 2091 1658
2349 1658 1519 2100 725 -37 -694 -2574 -2037 -2374 -2531 -38 -51 960 3589 3086 3268 3335 785 -602
2367 -602 -2857 -4662 -3759 -3846 -2288 1430 2051 2475 3531 1363 491 436 -605 74 266 -1122 -1276 -2507
2385 -2507 -2983 -1062 -185 1993 4587 3627 2651 1324 -2289 -2898 -3855 -4074 -2036 -1151 349 2543 2053
2402 2053 2292 3181 1182 819 1043 -875 -1033 -2012 -2860 -2074 -2463 -1219 791 476 1676 3400 2241
2419 2241 2148 1148 -1734 -2688 -3473 -3290 -1052 463 1756 3095 1730 1526 1543 -35 462 699 -1142
2436 -1142 -1718 -2767 -3830 -2640 -1722 211 2768 3017 3834 3608 651 -276 -1259 -2828 -1908 -1661 -907
2453 -907 306 72 484 1558 1102 1923 2032 332 290 -818 -2946 -2236 -2236 -1916 -672 -136 1523 2866
2471 2866 2458 3119 2482 177 -955 -2131 -3377 -2323 -1517 -729 536 343 798 1483 692 1984 2027 385
2489 385 236 -1043 -3206 -2671 -2296 -923 1444 2226 3232 2984 1154 685 -454 -2061 -1319 -1913 -2442
2506 -2442 -1327 -1312 -1221 355 557 1659 2730 1624 2329 973 -766 -923 -2347 -2992 -1656 -1221 -466
2523 -466 1507 1412 2444 1910 853 642 -1171 -2036 -1406 -2118 -1687 -370 -465 -191 1165 1435 2360 3044 2281
2542 2281 1702 -490 -2642 -2604 -3511 -3013 -681 111 1003 2091 1628 1524 1083 21 191 -358 -1117 -287
2560 -287 -1452 -1624 -597 -715 205 2054 1783 2480 2292 428 -385 -1897 -2820 -2205 -2469 -1765 316 813
2578 813 1672 2793 1800 1312 993 -361 -259 -956 -1120 -789 -1391 -1378 -144 -514 1151 1790 1722 1857 896
2597 896 -573 -892 -1810 -2315 -1143 -1460 -109 1549 1112 1518 2274 1342 1216 719 -563 -854 -1901 -2238
2615 -2238 -1821 -2216 -981 780 881 2226 2799 1491 1106 -168 -1397 -1298 -1964 -1554 -468 -601 621
2632 621 1512 805 1306 1161 80 442 -173 -791 -933 -2062 -1624 -1233 -1526 277 1527 1646 2391 2693 1014
2651 1014 887 -905 -1396 -1583 -2012 -1743 -712 -715 578 1380 668 2000 1468 424 495 -879 -1758 -1186 -1817
2670 -1817 -1192 159 197 1420 2297 1314 1765 813 -404 -258 -1200 -1378 -1168 -1379 -997 -590 -580 766 1278
2689 1278 1224 2337 1675 467 437 -894 -2097 -1638 -2138 -665 675 962 1855 1617 601 749 -260 -1135
2707 -1135 -566 -1269 -1694 -1194 -1115 -448 423 899 2046 1673 1345 1620 695 -681 -716 -1581 -2453 -1628 -1355 -205
2727 -205 614 1059 1832 1007 786 654 -527 -778 -155 -1219 -1141 -613 -515 533 667 912 2101 1806 1056
2746 1056 1118 -772 -1553 -1524 -2341 -1796 -576 2 834 1360 1057 1426 995 523 857 -396 -605 -299 -1390
2765 -1390 -1104 -731 -657 365 1101 1128 1685 704 269 81 -1465 -1107 -1035 -1837 -767 111 274 1405 1490 1237
2785 1237 1574 333 -21 47 -1054 -971 -921 -1784 -1027 -477 -419 699 1593 1270 1498 493 -145 -492 -1690
2804 -1690 -1120 -467 -892 371 599 140 1168 994 650 1197 400 219 -418 -1886 -1508 -1292 -1826 -77
2822 -77 751 800 1970 1653 1271 1118 -27 -563 -710 -1538 -928 -700 -1076 256 307 163 858 740 522 793
2842 793 153 -48 -512 -1445 -1230 -841 -952 533 1208 1292 2187 1547 657 284 -604 -964 -926 -1518 -512 -384
2862 -384 -678 148 420 595 1268 994 751 1016 -220 -768 -977 -1506 -812 -276 109 1221 1009 1054 1008 274
2882 274 -470 -229 -912 -737 -829 -1263 -442 -563 -342 715 1076 1197 1716 1188 439 124 -817 -1254 -1373 -1523
2902 -1523 -433 -13 141 1219 658 271 698 -214 -521 20 -932 -641 -496 -729 133 -240 -50 733 659
2921 659 1025 1421 567 -57 -296 -1697 -1328 -1457 -879 -230 361 662 1674 863 998 846 -227 -205 -211 -1173
2941 -1173 -565 -286 -536 352 419 568 752 827 790 382 -718 -637 -1038 -1228 -662 -268 -306 134 363 844 1454
2962 1454 789 901 482 -428 -650 -659 -1352 -750 -702 -487 141 139 773 1144 732 653 211 -784 -889 -1196 -1219 -49
2984 -49 33 280 1097 448 807 861 442 140 119 -689 -743 -932 -1786 -1073 -509 28 806 840 1185 1024 82 -19
3006 -19 115 -727 -529 -473 -698 -146 -315 -61 732 518 613 549 -116 140 -275 -1206 -552 -862 -714 343 176
3027 176 499 1334 982 1182 1000 -30 -293 -888 -1225 -643 -211 -468 -118 -197 -74 520 61 951 923 451
3047 451 139 -369 -1384 -618 -619 -474 558 806 575 1273 699 439 184 -702 -338 -462 -903 -434 -805 -423
3067 -423 257 316 960 987 894 686 538 -235 -145 -543 -821 -292 -768 -698 688 264 812 878 351 157 -168 -885
3089 -885 -618 -638 -889 -259 -343 178 809 329 809 1099 447 511 -174 -926 -922 -1281 -692 82 -335 102 671 147
3111 147 445 636 275 460 145 -378 5 -735 -1060 -303 -70 510 765 740 641 552 -223 -322 -859 -989 -475
3132 -475 -639 -640 -3 -44 240 794 310 586 645 -162 -265 -44 -642 -581 -822 -728 -53 -278 293 858 349 679
3154 679 353 -400 -298 -781 -588 -330 -409 -117 509 290 568 1050 402 689 425 -174 -265 -715 -1162 -824 -683
3175 -683 -310 352 213 827 786 5 284 -46 -316 82 -305 -449 -61 -417 82 278 -200 581 786 55
3195 55 550 350 -579 -504 -839 -1293 -675 -388 211 1081 783 990 1012 82 321 -357 -860 -520 -564 -332 17
3216 17 -162 311 164 -65 178 674 350 425 26 -581 -549 -936 -916 -118 -142 821 696 513 1010 189 -64 1
3238 1 -614 -543 -261 -700 -497 12 -27 395 408 698 761 593 -105 380 58 -465 -556 -471 -95 141 48 110 721
3261 721 418 622 250 -129 -265 -770 -465 -307 -468 -433 335 71 661 810 317 645 37 -338 47 -707
3281 -707 -760 -436 -621 -210 -27 44 646 364 164 389 15 167 160 -451 -440 -315 -429 -100 448 358 723 439
3303 439 271 421 -249 -473 -591 -733 -497 180 -347 49 239 228 540 387 409 830 62 -157 -355 -668 -582
3324 -582 -337 -369 257 431 163 622 412 108 139 -226 -279 -377 -815 -187 -46 223 536 511 76 251 245 -164
3346 -164 234 -216 -343 -331 -743 -552 -291 -214 313 466 432 660 595 208 225 -345 -555 -128 -139 93 333 79
3368 79 372 469 358 591 296 -390 -315 -582 -307 -280 -216 -26 135 95 614 572 85 660 87 -154 81 -580
3390 -580 -392 -237 -469 -88 19 -30 231 142 357 99 231 -132 -257 -478 -541 -179 -72 439 216 439 690
3411 690 404 175 274 -327 -283 -163 -514 -429 -385 -251 -251 153 95 503 324 318 314 -29 -321 -54 -233 -131 -285 -394
3435 -394 -39 24 106 222 88 82 202 -406 -453 -550 -536 -93 66 -92 258 107 36 784 138 129 318 -257 -200 -131
3459 -131 -225 -356 -24 -128 83 24 -56 310 79 69 573 -230 -295 -274 -517 35 256 297 369 337 271 640 -303
3482 -303 96 -260 -385 -71 -242 -633 -108 -190 -148 399 594 382 572 -3 35 -82 -271 -150 -121 -151 -112 -44
3504 -44 -153 285 158 444 206 -110 -230 -373 -721 -510 -104 -223 -71 -24 37 246 9 353 435 108 -120
3525 -120 -264 -548 -441 -289 -660 90 324 230 413 41 457 116 -131 -28 -16 -265 11 -165 -46 351 89
3546 89 248 580 436 11 -45 -336 -381 -171 -407 154 -373 -313 163 25 352 420 197 176 197 -225 134 -34
3568 -34 -170 -51 -49 -239 198 45 -48 302 55 215 233 -197 -123 -420 -620 66 367 -53 370 374 218 224 -6
3591 -6 -24 -84 -353 -173 -74 -740 -110 -10 -18 335 90 50 323 -18 -142 59 -218 90 -198 -173 143 -37 127
3614 127 193 151 94 9 -101 -480 -133 -133 -64 -135 14 -36 -167 -158 494 397 418 360 78 -108 -347 -310 -80 38 40 91
3640 91 74 -111 -142 -240 -107 245 -89 58 -244 -233 59 -191 -97 163 -94 369 535 95 233 -29 69 -139
3662 -139 -362 -542 -295 -16 11 186 -53 427 249 -198 112 5 -86 -249 75 -269 53 17 -250 115 72
3683 72 290 401 284 33 -46 15 127 -296 -200 108 -43 -115 426 49 395 311 -367 96 141 -386 -301 -109 -400
3706 -400 -12 -221 68 -4 41 137 401 -116 113 -54 -428 -55 -246 -424 -50 25 265 371 -149 22 58 -212
3728 -212 73 -19 -105 -400 -139 -43 -137 134 149 363 164 448 366 105 -40 -284 -121 214 -120 -18 129 119
3750 119 283 170 -274 125 29 -29 59 -31 -108 -4 -110 -118 235 121 104 343 -110 51 155 26 2 -64 -175
3773 -175 -81 -403 -303 257 256 46 202 -26 -100 86 -61 -16 132 -91 189 -24 -149 -69 -32 105 69 28 42
3796 42 -50 -56 -177 -103 -194 188 -340 -213 308 -27 53 52 280 352 -154 -354 55 -191 57 13 -14 -27 -36 120 -35
3821 -35 281 114 -146 94 -273 -182 -264 78 272 -272 79 320 148 110 15 21 161 9 -387 -277 -132 -5
3843 -5 -83 -5 2 110 84 161 -124 9 -85 -49 21 17 -33 -209 -193 58 35 24 -17 43 352 -371 -203 -275 -250 -45 -242
3870 -242 -85 -64 257 354 103 -74 341 332 79 -1 -319 -79 -50 -8 -16 -3 -136 -218 -163 -57 -98 -158 78 259 -437
3895 -437 -220 49 -166 139 83 181 253 217 -68 32 -96 13 214 -340 -161 -560 -88 2 202 206 300 178 1
3918 1 -65 -76 45 73 -348 -167 -7 -213 21 -108 288 145 217 50 52 -5 -292 -127 -347 102 170 -57 191
3941 191 104 175 106 246 85 280 -185 -31 -23 -120 -37 -48 -223 -97 8 -46 99 147 -81 -29 -379 -3 -280 -39
3965 -39 -2 73 87 154 330 55 183 16 -123 10 -120 -18 132 -305 71 273 -86 67 489 183 218 134
3987 134 141 91 -177 181 -86 96 -118 -257 -18 63 63 -18 -128 -148 -220 -86 -137 -295 -247 -131 -62 36 109 264 154
4012 154 328 -71 12 -340 -281 -223 -149 -171 -117 81 -12 96 -125 -218 221 188 -100 -23 -61 -254 -228 4 -229 230
4036 230 11 91 264 200 48 75 -316 -29 -103 -321 213 49 -62 -9 81 125 311 165 61 -186 6 -108
4058 -108 -153 167 -179 -16 -301 58 121 -392 264 79 19 -223 -280 -310 6 106 -5 67 -63 39 -50 149
4080 149 245 15 112 -273 -223 -245 -192 -190 -18 -156 -261 320 230 -63 117 -12 -67 213 -85 -22 -89 -208 -138 -100
4104 -100 -94 -272 91 45 132 -143 -12 -90 290 -24 -186 52 101 27 -212 318 270 181 240 46 -112 125 -356
4127 -356 65 -244 -38 -251 -179 -87 43 -44 16 112 -250 162 -11 -72 -158 -54 17 179 211 -142 -36 131 -66
4150 -66 141 -306 -129 39 -199 -159 -8 167 117 8 355 -8 188 32 141 65 14 11 -78 -158 18 -82 19
4173 19 -58 230 157 195 85 135 -161 121 47 -369 -11 -107 -112 95 6 14 87 165 -226 64 -103 -354 -124 -66 131
4198 131 -5 -149 138 -67 -26 81 156 -103 152 -147 -41 -190 38 13 212 144 339 215 83 79 -13 41 -20
4221 -20 -31 19 -217 -38 189 -23 -143 289 101 148 132 -175 0 -40 -270 172 -88 240 96 229 4 -22
4243 -22 -204 -26 224 1 -56 -153 24 -63 195 3 -122 188 251 -53 -236 -178 155 -111 -52 37 -176 -301 90
4266 90 -261 71 -129 283 176 -40 59 314 91 13 88 10 139 -173 -321 263 239 -69 94 69 117 -99 -81
4289 -81 -215 -186 -242 168 -69 -241 -65 -126 45 374 144 152 134 104 -61 -147 -34 96 -228 -181 -326 -124 23
4312 23 258 -30 31 186 -165 -163 -177 49 -171 1 -114 329 43 40 -232 -221 -183 -324 29 -200 -71 -139 -129 -1
4336 -1 219 89 245 -32 128 119 165 -18 -80 250 -128 -316 124 188 -1 29 85 233 -72 -78 37 246 -101 62
4360 62 -209 -54 -4 309 99 319 115 426 90 -172 -68 11 -110 -157 -386 10 12 -286 -56 -12 139 -149
4382 -149 -335 -342 21 -128 -177 122 116 -134 -61 -225 -51 137 22 1 -64 -129 200 -308 -225 -73 -132 -10 131 -72
4406 -72 105 177 69 -21 131 59 -141 -23 -163 -108 -118 164 167 -109 288 124 -146 -97 -36 -175 4 -64 77 118
4430 118 -97 252 157 218 -47 96 56 227 58 -44 21 55 -79 86 138 193 236 140 -251 64 173 -237 -271
4453 -271 37 47 -153 -214 231 0 46 -119 -195 -21 215 -100 -184 -196 237 36 21 121 188 233 89 178 -215
4476 -215 278 104 68 28 -139 -114 47 71 36 104 -259 112 -146 -210 141 215 -226 -214 -161 -454 -108 -251 141
4499 141 -212 -299 -18 11 -372 212 207 -107 -32 -102 -60 -82 -169 -26 -84 46 90 223 -40 102 -30 -117 -27 -140
4523 -140 -204 -49 159 85 -111 30 207 91 19 10 21 -75 -42 -119 -209 298 -48 229 51 68 52 289 -17 39
4547 39 138 -201 -211 -18 -20 48 -61 12 297 -48 131 249 -112 -253 179 -7 40 78 -26 -77 213 59 297
4570 297 90 10 -108 -170 84 -273 6 13 -59 155 109 57 83 213 -29 113 160 -162 321 -211 -153 -61 148 -41
4594 -41 -229 -85 74 359 -195 -121 -41 114 -131 -147 89 226 -4 -50 381 31 30 119 6 251 40 76 273
4617 273 65 -33 -57 -55 -11 -59 131 94 -16 -27 109 -46 -223 -20 -86 230 -70 -4 107 55 -206 96 34 -7
4641 -7 -246 86 -28 -13 -46 -23 114 149 -22 200 -81 -53 -138 226 33 -72 101 143 33 -28 74 -226 -46
4664 -46 -60 -108 180 109 -85 -46 9 -243 -194 -79 -131 141 -161 42 393 -17 156 82 -148 -148 -299 -30 28 -86
4688 -86 -154 6 57 97 349 168 -47 -21 222 -3 -133 36 173 55 -93 -360 54 -132 -184 -97 182 111 -85
4711 -85 -18 -222 -208 -22 114 -60 -103 236 46 168 317 -3 -33 -234 153 -108 68 43 124 133 75 -61 -181
4734 -181 -137 -150 150 -45 -83 84 -108 -149 -390 -302 133 -47 -49 161 159 -82 54 -83 -100 -230 -65 137 185 148
4758 148 115 -100 111 71 289 -129 -207 -107 -107 88 -112 -97 185 -94 82 -269 -81 -57 -241 104 -25 -192
4780 -192 -264 147 -146 210 121 81 221 -236 168 -26 -49 -177 50 -408 104 -70 -10 106 -135 23 252 -63
4802 -63 -48 -263 -156 -71 85 -45 113 -143 21 138 -54 54 64 307 169 52 -91 42 -182 -214 -216 43
4824 43 -129 -108 -106 172 -45 134 48 79 332 -137 -172 -398 -152 -109 -203 59 -216 14 -61 9 214 215 -262 -126
4848 -126 -55 18 -47 -109 -208 52 21 -297 129 -121 152 -86 190 58 150 -147 -255 48 90 183 89 -156 213
4871 213 -9 -50 117 -469 -120 262 -124 -177 -68 41 18 -24 15 -87 81 -54 129 -43 -65 -74 18 74 -166
4894 -166 -51 57 -126 53 190 415 16 24 -11 116 -35 -103 -140 286 -181 -129 111 -121 229 -36 -226 9
4916 9 5 53 -93 85 169 3 -116 145 -39 -171 102 -190 -160 -77 -283 161 35 -82 -254 -42 -15 271 -175
4939 -175 178 67 171 135 203 -79 21 149 -357 -59 -54 -110 151 6 94 -105 -320 -36 -65 -3 -229 -253 161
4962 161 87 217 70 265 -175 -49 214 70 -17 -69 -362 -199 70 -23 165 -120 67 122 196 198 -122 0 40
4985 40 89 -57 -9 32 -415 -2 -156 279 -65 51 274 69 -56 -97 -134 -9 -73 -49 -256 269 -10 -119 138
5008 138 63 212 -100 -257 -175 8 -35 7 -55 -29 -59 85 -93 -148 -7 7 -63 -102 94 -269 119 -42 269 -21
5032 -21 161 301 175 160 18 -9 -178 -191 164 -145 -299 -286 -10 52 -26 276 15 -49 -42 77 -15 -181 416 26
5056 26 99 389 51 12 -153 -68 181 -77 76 131 43 -381 178 -156 -13 179 -90 74 154 196 -95 -198 93
5079 93 39 -58 -122 127 23 -190 152 -61 -141 21 -229 174 -39 125 41 -113 -194 -233 -4 -29 -75 -100 85 -147
5103 -147 -20 76 -43 -118 -185 -90 -150 -89 -76 -279 -68 -27 201 -6 246 376 321 20 -101 -40 -168 145 19
5126 19 48 72 -76 153 -54 -80 26 -92 56 310 -96 -251 245 6 244 85 361 84 -2 74 46 161
5148 161 219 -77 176 -144 24 21 292 58 -215 -43 37 147 88 121 -114 -26 177 74 -47 51 -149 270 106
5171 106 41 37 -132 -128 -105 -164 143 -83 -262 -1 129 -61 -157 36 347 224 19 -193 -28 300 -241 -241 -93
5194 -93 -35 116 -1 -7 -201 149 -264 -272 103 -167 -241 124 -37 26 14 100 -40 393 178 -244 78 -48 107
5217 107 1 -70 78 -131 136 -80 54 -90 200 -95 -94 116 28 451 128 186 49 -30 180 -80 -200 -61
5239 -61 188 -191 56 -44 -288 -64 0 -80 -121 150 142 123 59 47 -10 -157 -166 198 40 149 50 30 -10 119 -364
5264 -364 39 -151 247 -119 137 42 318 106 -32 -266 -6 -21 -252 263 358 173 154 -57 -105 10 6 -249
5286 -249 151 278 -194 131 -53 284 -130 75 -8 -177 44 -196 -8 -191 46 -206 137 97 35 152 39
5307 39 101 33 136 -342 194 -142 -61 26 -259 -174 -47 -147 -65 128 195 134 1 -66 363 73 207 31 -191
5330 -191 141 56 -148 -69 -7 -103 -178 -47 -8 70 -32 125 -213 -57 200 -48 120 -2 246 -169 164 -158
5352 -158 -234 42 128 112 106 -69 -14 110 -181 83 -124 49 110 -129 118 220 164 127 35 -164 -176 -43 100 279
5376 279 170 -73 -168 -42 -163 42 -77 145 -71 346 -66 146 149 -374 -106 308 -320 76 58 -80 -257
5397 -257 -232 -33 -86 91 252 20 58 -42 33 267 -47 103 160 114 45 145 -95 146 -8 -37 62 283 117
5420 117 126 -112 -159 -102 -144 198 -121 -78 126 -123 58 98 -96 -126 -120 19 -71 187 166 63 -7 147 0 -38 -49
5445 -49 -51 31 -110 48 -103 -113 -150 -49 231 -364 -28 27 -2 -151 -97 -151 -128 -81 -46 -312 134 160 160 34 -41 267
5471 267 182 90 -91 -4 -515 76 117 191 -269 48 -83 120 57 155 172 -77 -64 118 -29 -5 -68 -34 85 -124
5495 -124 -153 -9 -58 315 -41 -164 113 81 -247 191 -121 -10 120 -141 10 -50 -214 -98 19 67 -95 -185
5517 -185 180 -69 27 -69 190 -64 -44 77 108 -131 98 -80 27 -37 -138 -147 -179 99 50 -93 -64 84 -53
5540 -53 -399 43 187 -161 50 -24 59 -53 98 251 10 155 -165 -340 -81 126 -201 133 137 -6 -40 -198
5562 -198 -100 -94 134 53 105 36 17 32 -77 163 80 -122 -220 214 131 -171 -35 164 -80 -154 -14 -87 -126 61 366
5587 366 57 497 -60 -53 -76 -74 28 -193 98 -14 30 270 -144 -5 66 -14 230 124 -198 18 -123 23 -17
5610 -17 -120 18 -70 42 -507 62 -82 49 -36 -8 149 -128 -78 268 -167 -161 141 185 -3 216 -83 -196 -79
5633 -79 58 63 30 -50 -134 -82 25 -107 86 -4 -154 -155 -394 -192 136 -70 245 84 -282 -121 -52 139 76 197
5657 197 8 -16 -145 -20 228 -34 -53 -26 -70 -41 -112 -147 -108 -1 253 -285 -34 -136 162 103 276 -99 -98 73
5681 73 102 228 -185 29 141 -238 -97 -195 8 -125 -207 32 169 276 -111 10 -334 -132 226 18 -99
5702 -99 299 71 -58 345 4 -31 -147 31 241 -82 200 61 261 92 40 -7 109 -160 -62 99 -57 -209
5724 -209 -88 -64 52 125 -129 -23 -155 -398 -60 -81 48 124 -189 4 -171 -200 -114 135 82 -6 138 -54 -44
5747 -44 -164 -222 197 -205 111 -27 -164 320 261 -303 -233 43 30 -227 13 57 226 -184 10 12 -339 -258 -23
5770 -23 26 -27 281 66 146 -96 202 -156 -11 53 178 436 93 158 -490 25 224 -193 81 87 10 192 14
5793 14 -3 -24 -70 364 -124 32 62 -18 17 -21 -61 -68 -48 -94 93 -177 247 -9 75 23 -35 -28 -137 40 -206 16
5819 16 277 -206 -129 147 -85 195 -216 14 3 -84 15 -218 -49 102 46 -100 17 249 -110 139 -73 48
5841 48 89 -143 -304 144 54 -137 -43 -196 -7 190 -77 20 81 87 84 -89 -143 117 -205 13 46 -42 1 258 -247
5866 -247 -82 -58 -262 -303 -138 -19 -85 209 -73 346 -101 181 122 -147 239 -162 -78 -85 -334 55 -295 33
5888 33 159 -97 -199 223 6 -283 117 115 153 132 -96 -48 -83 118 191 -88 83 148 78 158 312 120 277 -64
5912 -64 -291 -13 179 -27 213 64 -46 24 75 271 4 -9 9 335 -189 -45 -295 -42 132 -11 159 57
5934 57 139 -308 -29 -22 128 -137 287 75 -70 -9 105 49 130 27 -45 43 367 -169 -164 106 -148 71 111 -91
5958 -91 -68 262 73 66 28 -150 -110 58 16 -101 -148 157 224 148 18 118 11 104 -10 -103 232 -40 -99 -74 -56
5983 -56 -76 137 -107 68 -31 -284 37 -113 -35 21 -110 -108 252 -44 62 49 25 -18 -94 -133 59 -18 -63 -124 101
6008 101 407 161 24 -111 193 36 -4 91 -21 -178 132 -230 62 -20 -24 -197 -232 226 11 -306 11 43
6030 43 104 0 4 -166 87 -72 -44 -37 128 58 -107 20 12 100 31 51 -44 136 181 52 -28 143 -183 210 -4
6055 -4 -111 361 -115 178 8 117 -284 66 367 107 -71 -115 -337 -128 28 52 -33 -65 62 -228 199 113
6077 113 -143 97 -48 7 311 68 -309 -229 -79 23 163 198 28 -139 -10 -12 -28 -251 -18 -45 56 132 38
6100 38 122 155 -52 9 -22 11 17 -83 -76 133 151 -114 -149 -81 -409 79 -229 35 99 -7 -14 230 -128 47 -170
6125 -170 197 10 -72 -27 -47 -136 -105 -283 -167 -104 -82 224 268 -168 187 153 16 2 -245 -261 43 -213 8 -105
6149 -105 154 -16 -146 4 170 -121 269 260 -37 -227 35 -71 239 -2 178 -156 39 36 -24 353 137 95
6171 95 73 188 69 53 101 184 -138 -147 141 -90 -99 82 -280 10 -267 -30 113 67 124 -55 -142 -293 -17 -163
6195 -163 241 222 166 12 153 -40 -165 -146 -8 -110 -92 177 -285 -151 101 49 -602 46 -23 240 96 -147
6217 -147 238 172 51 -53 13 -182 78 -17 -170 -17 -143 82 28 -164 11 -187 -100 112 185 -105 -135 -268
6239 -268 -4 6 -113 -16 223 -71 -147 64 -118 27 -234 -41 -75 -171 -20 -112 -133 17 303 72 231 223 -61
6262 -61 2 180 -149 -107 66 -47 109 -141 -81 -40 -47 34 -17 -177 135 -92 126 -30 184 -5 -140 -93 313
6285 313 151 -105 -115 165 37 -143 -193 -203 149 24 -296 -64 -110 -10 237 101 44 12 103 440 17 -108
6307 -108 -7 65 5 40 83 149 -16 -18 -83 -202 -51 -169 62 185 124 -110 -24 -29 -350 296 -76 -100 -34 34 300
6332 300 -202 -88 168 18 119 166 605 28 113 -78 -96 -218 97 169 -201 -171 -49 -135 -1 -9 33 -284 80
6355 80 129 -82 154 70 -225 111 -311 -231 336 245 296 -51 -195 -113 184 -67 -60 46 -96 -24 -7 6 166 39
6379 39 -123 -29 222 149 85 -91 48 -251 -95 -72 159 257 124 284 -214 274 -102 -253 -161 -54 72 235
6401 235 -226 -316 79 -11 238 59 -56 -75 -27 35 -64 92 66 -349 -44 110 -59 39 -104 -68 -46 -38 -120 -16
6425 -16 -55 182 -79 -86 90 186 103 -141 -108 -24 110 211 -166 -91 -132 -139 158 -129 135 -118 -91 17 61 -135 -109
6450 -109 105 71 28 122 -70 98 -84 7 19 -162 49 -138 -84 -139 -10 -119 125 -235 -359 25 -260 108
6472 108 -36 146 -138 -15 -221 -249 -76 -75 121 -14 103 -3 97 312 74 -163 -6 83 167 174 209 -210 -4
6495 -4 -97 -130 -141 -155 -3 -1 25 -41 19 -159 -96 200 -120 73 -251 -12 229 128 -157 -261 132 67 -143 -31
6519 -31 -38 13 -5 240 -17 -83 108 11 -148 -95 -184 135 48 75 234 104 -50 -124 -276 -210 -10 -71 312 -14 -24
6544 -24 256 75 97 -191 -123 -55 -84 106 -140 160 92 -189 120 100 -24 -109 -198 93 77 -189 130 115 84 136
6568 136 40 133 67 -3 70 143 -175 -6 -135 32 -162 39 -52 0 124 62 63 62 286 -69 -118 16 -30 -145 62
6593 62 -155 254 58 26 10 116 -21 -43 -53 126 49 -168 -15 175 -150 -21 -214 -325 34 -42 -60 135 -145
6616 -145 -1 55 -334 -46 186 238 191 -49 -48 -135 10 167 120 266 63 -204 -34 -45 14 -96 174 -124 -93
6639 -93 136 259 -119 -160 -96 217 153 64 40 77 61 259 -35 -16 -36 -97 337 -15 163 132 58 160 -99 15
6663 15 63 -81 101 48 -13 103 -168 19 -174 13 -329 -196 77 -189 -112 -78 31 189 398 72 443 -19
6685 -19 -82 306 252 215 405 126 -41 -11 106 -54 94 -72 -149 -234 -325 -122 174 -83 182 -113 -155 -228 -206 -206
6709 -206 256 -169 -68 0 113 -293 -330 -59 72 24 -187 -67 -63 -155 33 -173 151 96 -23 -64 -58 -67 185 72
6733 72 -139 -11 -21 -150 157 61 236 61 -95 -13 254 14 185 196 -219 71 12 73 260 104 138 128 -31
6756 -31 -112 -136 -60 -473 415 -157 96 52 127 116 -179 158 9 -75 55 137 113 165 43 -163 -241 -29 191 68
6780 68 -9 221 145 87 173 -146 84 -161 -444 -3 200 -61 9 -161 -148 -93 156 -230 476 127 -160 294 276
6803 276 8 111 -4 -124 50 194 134 -79 -284 -24 -2 211 -44 -179 -125 114 14 -114 -53 49 -103
6824 -103 -7 -191 30 -102 -70 -92 -270 -28 21 -365 -253 -308 11 169 -219 -20 -107 234 261 158 78 -19 -227
6847 -227 -15 35 -80 -68 -96 -16 100 -27 -325 -249 -119 -15 238 5 366 204 -137 -182 -47 -77 118 120 100
6870 100 -50 80 -46 -92 -88 -232 -40 -129 54 102 -66 -86 -101 -438 48 143 100 88 113 4 -42 256 -55 10
6894 10 35 -115 -240 -215 -82 -142 211 -238 58 61 249 68 85 -90 -24 -139 -173 199 106 15 54 -158 -74 -270
6918 -270 23 306 -88 -72 157 -37 143 -75 -167 -168 58 147 24 234 -331 -118 90 37 -116 -70 -44 200 385
6941 385 10 104 43 -121 -160 236 -138 134 227 -198 182 281 -84 -73 6 109 46 -32 -74 -284 18 -207 -49
6964 -49 -154 19 138 -118 122 -98 105 115 -28 65 102 80 68 -21 -74 184 -167 -40 221 -177 -80 287 74
6987 74 -3 -17 11 8 -271 -58 22 -237 74 -28 -8 44 -72 75 322 249 41 192 -57 10 -162 75 -22 49
7011 49 -47 -130 96 -351 -263 -36 -39 32 313 91 191 25 -101 76 -144 -31 87 -168 67 95 -30 -130 21
7034 21 191 69 53 -39 97 -191 5 123 -1 22 -208 256 227 -67 2 -118 -417 -86 110 12 -186 62
7056 62 -31 287 -171 -79 92 -74 44 244 204 -13 -87 21 134 149 -9 172 19 -21 39 -101 -150 127 -130
7079 -130 -134 175 -48 -11 -8 60 -169 -226 -37 143 -158 -102 -26 -15 -115 231 3 -195 222 33 494 59 78 -349
7103 -349 -220 27 169 138 76 101 94 135 -145 -133 131 174 151 -1 -366 -147 -8 -176 -13 -73 -258 -37 -124 -326
7127 -326 127 -26 -210 -158 5 169 -83 -150 168 -288 -240 -6 70 -105 28 -197 117 288 -171 -310 -16
7148 -16 253 -57 -141 167 177 21 -207 -1 318 30 67 179 -61 147 -100 -100 -198 -139 64 -148 39 81 207
7171 207 12 247 -36 -79 228 -77 -178 -81 -238 27 154 198 -118 -68 140 350 -1 -35 31 -148 -101 0
7193 0 -87 143 -158 -36 218 -119 107 6 42 -127 -251 -135 157 -47 -166 -98 -307 -16 -32 88 56 -47
7215 -47 16 203 12 283 -124 2 8 73 -148 -211 75 224 58 -214 159 -153 -115 77 214 184 25 -129 -217
7238 -217 -114 368 83 194 8 38 -5 72 23 -25 -194 -103 55 -62 -29 37 -187 -44 211 34 -197 101 -89
7261 -89 -304 -46 -192 208 -45 96 -106 -212 -113 -25 221 14 -205 40 341 120 -123 123 74 80 -34 -76
7283 -76 256 186 -148 361 76 -34 132 -212 -9 61 -32 236 165 5 -200 85 64 -19 57 -205 -134 -103 20
7306 20 64 205 43 56 -33 354 48 17 121 24 -15 -201 43 505 -59 -70 60 54 -302 17 224 76 136 -51
7330 -51 66 190 39 -3 -38 -67 32 25 -143 -41 -46 112 -121 -70 -10 -28 -65 137 123 -36 -157 61 146 -148 -77
7355 -77 -167 308 10 -322 65 47 113 -132 -76 -172 27 -338 -15 -212 -91 189 15 174 -128 -84 -176 27 -144
7378 -144 -96 -136 11 209 282 -106 -129 -31 239 -31 -256 142 -51 100 -12 -215 -294 -217 118 -26 -139 365
7400 365 -35 13 -105 113 -40 -151 -104 -32 7 180 72 -215 124 -65 -27 109 -55 -21 -52 160 -22 -287
7422 -287 -148 -121 3 41 189 -29 -168 232 -134 -123 -116 -97 -123 228 -13 -111 65 19 9 -59 67 -49 -104 140
7446 140 67 101 27 -61 333 -23 -78 64 -70 -233 -335 -50 42 -33 -143 129 -22 -182 19 -330 -62 311
7468 311 -110 26 319 36 86 44 -5 -363 47 30 -32 268 -104 -93 -101 -104 -135 34 -89 -132 174 217 293 -89 -22
7493 -22 77 -27 171 146 111 -34 109 13 -57 -24 -233 -145 11 54 128 -10 58 -60 -23 24 290 -20 -20 -138 -210
7518 -210 -322 290 53 -124 32 121 1 45 216 5 50 107 10 192 109 255 213 -138 -252 266 214 254 -130
7541 -130 -38 54 178 5 -79 -85 -183 96 78 102 5 -47 -142 177 24 -38 183 207 22 39 -26 -110 -90 -133 109 12
7567 12 -188 158 147 220 -15 -140 -73 -14 233 80 15 3 89 397 -105 -28 -278 -67 231 144 107 -216 11 33
7591 33 -336 -306 19 162 -248 -20 -213 -75 -103 71 76 -50 -118 180 16 -125 73 -21 -44 82 294 -36 169
7614 169 -267 310 -83 -137 102 -227 -44 -88 -142 212 23 38 -103 126 24 129 -146 21 -128 -225 67 339
7636 339 -100 -49 -110 -173 133 -47 -145 -195 -163 -57 46 -216 90 166 -29 253 -95 160 170 91 -118 41 -207
7659 -207 81 -78 -43 129 217 -25 366 -231 -177 62 -283 135 193 143 114 222 -87 -75 -137 -89 44 236 2
7682 2 1 95 47 295 58 -173 26 -101 60 60 330 247 354 -28 -158 -143 -21 196 100 -38 46 -155 -285 -80
7706 -80 -59 -107 -50 146 108 -157 -114 0 -142 -159 -9 -183 -74 -2 -270 24 233 -202 62 5 106 255 55
7729 55 -18 341 -33 -101 68 164 107 102 -73 59 71 105 228 -182 34 61 -46 -276 205 135 -9 -241 -183 160
7753 160 -93 -68 -55 -89 62 -75 -22 130 -178 3 -45 57 25 133 141 -279 -87 208 138 -57 48 58 156 -82
7777 -82 76 -126 -10 287 5 -36 27 10 -30 60 40 -167 57 -326 -11 162 -380 -27 69 2 242 -101 -224
7800 -224 -14 -308 -105 13 62 143 31 -181 91 -165 165 -95 -221 340 -193 84 7 -6 -118 -47 -125 29
7822 29 -92 -253 -11 184 126 21 101 -247 -4 241 -31 36 118 152 -108 103 -284 69 -39 249 148 101
7844 101 -74 -213 -59 41 104 38 -8 -114 53 -59 -96 -57 -242 -105 123 217 -239 -126 159 -157 68 110
7866 110 31 66 -87 40 -139 203 72 4 -14 217 -14 -65 -127 -361 -78 -49 -236 -328 -135 100 112 51 -99
7889 -99 -3 -174 -246 -204 -33 130 157 70 90 218 -199 -146 -49 21 -21 -140 242 -105 -145 5 -143 -74 230 -103
7913 -103 87 -73 -161 -172 -43 92 -85 -213 108 163 48 43 99 -67 -197 -24 101 -60 -175 140 23 -167
7935 -167 -310 -273 195 -74 168 -34 208 115 -310 37 176 -233 -37 -87 -361 124 26 -23 -9 198 29 204
7957 204 -11 145 18 -61 58 254 285 430 239 -68 -19 -69 -311 135 -333 134 65 -38 46 29 57 184 -13
7980 -13 -225 -12 -1 -16 -174 195 133 153 -201 290 291 16 214 173 77 87 -100 321 317 124 153 154 -164 62 -22
8005 -22 -134 75 -60 -187 -146 -24 173 -42 -203 -34 -263 15 6 -68 -12 -64 293 43 -123 -136 -14 153 -3
8028 -3 252 -23 48 57 120 103 197 -82 43 -140 125 176 88 -68 182 68 148 197 300 -85 -62 -39 102 230 50
8053 50 -149 40 97 174 -177 -158 168 -10 378 -54 36 130 -88 -23 93 -81 231 56 -63 144 61 85 7
8076 7 28 -66 251 191 8 -74 -214 17 -129 -170 -5 191 -31 61 173 -160 -6 187 23 -43 -34 100 320 -42
8100 -42 -8 166 -1 243 -53 -151 -18 -162 -314 16 -290 160 -248 -76 156 92 -74 79 299 34 -376
8121 -376 -178 30 -136 294 81 101 25 -91 -18 -364 44 346 73 -61 -22 60 376 -295 -66 183 -96 -303
8143 -303 50 52 -260 -154 -167 30 -19 18 133 119 -66 -78 -151 119 8 -22 -30 -96 -380 -60 -81 96 176 97 -13
8168 -13 -143 135 -255 -133 -169 2 -113 114 135 -14 -278 -65 -34 95 114 -111 -136 82 100 14 -178 97 -94
8191i4
##END NTUPLES=NMR FID
##END=
