##TITLE=1H_Ser DHA-N-Cr
 200.13MHz,CDCl3.
 8 sc
 
 19.12.2025
##JCAMPDX= 6.0         $$ Bruker NMR JCAMP-DX V2.0
##DATA TYPE= NMR FID
##DATA CLASS= NTUPLES
##ORIGIN= UXNMR, Bruker Analytische Messtechnik GmbH
##OWNER= pz
$$ XWIN-NMR		Version 3.5
$$ Fri Dec 19 15:45:31 2025 Russian Standard Time (UT+4h)  she@DPX200
##.OBSERVE FREQUENCY= 200.1313
##.OBSERVE NUCLEUS= ^1H
##.DELAY= (6, 6)
##.ACQUISITION MODE= SIMULTANEOUS
##.ACQUISITION SCHEME= undefined
##.AVERAGES= 8
##.DIGITISER RES= 18
##SPECTROMETER/DATA SYSTEM= spect
##.PULSE SEQUENCE= zg30
##.SOLVENT NAME= DMSO
##.SHIFT REFERENCE= (INTERNAL, DMSO, 0, 14.3821)
##AUDIT TRAIL= $$ (NUMBER, WHEN, WHO, WHERE, WHAT)
$$ ##TITLE= Audit trail, XWIN-NMR		Version 3.5
$$ ##JCAMPDX= 5.01
$$ ##ORIGIN= Bruker BioSpin GmbH
$$ ##OWNER= she
$$ F:/spectra/data/she/nmr/H-C/1/audita.txt
$$ ##AUDIT TRAIL=  $$ (NUMBER, WHEN, WHO, WHERE, WHAT)
(   1,<2025-12-19 15:44:00.73 +0400>,<she>,<DPX200>,
      <created by zg, POWCHK disabled, PULCHK disabled
       configuration hash MD5:
       00 E9 B6 7A A2 85 ED C7 34 08 36 98 17 FE 4E 26
       data hash MD5: 16K
       C5 FF A2 34 64 49 FA AC EE 4F 63 C7 49 34 6B 15>)
$$ ##END=
$$ 
$$ hash MD5
$$ B8 9E 4F 24 79 D0 B2 CD 5F 08 C9 56 04 40 D1 62
##$RELAX= 
##$RELAX= 
##$RELAX= 
##$RELAX= 
##$RELAX= 
##$RELAX= 
$$ Bruker specific parameters
$$ --------------------------
##$DU= <F:/spectra>
##$EXPNO= 1
##$NAME= <H-C>
##$PROCNO= 1
##$TYPE= <nmr>
##$USER= <she>
##$AMP= (0..31)
100 100 100 100 100 100 100 100 100 100 100 100 100 100 100 100 100 100 
100 100 100 100 100 100 100 100 100 100 100 100 100 100 
##$AQSEQ= 0
##$AQ_mod= 1
##$AUNM= <au_zg>
##$AUTOPOS= <>
##$BF1= 200.13
##$BF2= 200.13
##$BF3= 200.13
##$BF4= 200.13
##$BF5= 200.13
##$BF6= 200.13
##$BF7= 200.13
##$BF8= 200.13
##$BYTORDA= 1
##$CFDGTYP= 0
##$CFRGTYP= 5
##$CHEMSTR= <none>
##$CNST= (0..31)
1 1 145 1 1 1 1 1 1 1 1 1 1 1 1 1 1 1 1 1 1 1 1 1 1 1 1 1 1 1 1 1 
##$CPDPRG= <>
##$CPDPRG1= <>
##$CPDPRG2= <>
##$CPDPRG3= <>
##$CPDPRG4= <mlev>
##$CPDPRG5= <mlev>
##$CPDPRG6= <mlev>
##$CPDPRG7= <mlev>
##$CPDPRG8= <mlev>
##$CPDPRGB= <>
##$CPDPRGT= <>
##$D= (0..31)
0 0.7 0 0 0 0 0 0 0 0 0 0.03 0 0 0 0 0 0 0 0 0 0 0 0 0 0 0 0 0 0 0 0 
##$DATE= 1766144640
##$DBL= (0..7)
120 120 120 120 120 120 120 120 
##$DBP= (0..7)
150 150 150 150 150 150 150 150 
##$DBP07= 0
##$DBPNAM0= <>
##$DBPNAM1= <>
##$DBPNAM2= <>
##$DBPNAM3= <>
##$DBPNAM4= <>
##$DBPNAM5= <>
##$DBPNAM6= <>
##$DBPNAM7= <>
##$DBPOAL= (0..7)
0.5 0.5 0.5 0.5 0.5 0.5 0.5 0.5 
##$DBPOFFS= (0..7)
0 0 0 0 0 0 0 0 
##$DE= 6
##$DECBNUC= <off>
##$DECIM= 32
##$DECNUC= <off>
##$DECSTAT= 4
##$DIGMOD= 1
##$DIGTYP= 9
##$DL= (0..7)
0 120 120 120 120 120 120 120 
##$DP= (0..7)
150 150 150 150 150 150 150 150 
##$DP07= 0
##$DPNAME0= <>
##$DPNAME1= <>
##$DPNAME2= <>
##$DPNAME3= <>
##$DPNAME4= <>
##$DPNAME5= <>
##$DPNAME6= <>
##$DPNAME7= <>
##$DPOAL= (0..7)
0.5 0.5 0.5 0.5 0.5 0.5 0.5 0.5 
##$DPOFFS= (0..7)
0 0 0 0 0 0 0 0 
##$DQDMODE= 0
##$DR= 18
##$DS= 0
##$DSLIST= <SSSSSSSSSSSSSSS>
$$ [...]
##$SUBNAM0= <"">
##$SUBNAM1= <"">
##$SUBNAM2= <"">
##$SUBNAM3= <"">
##$SUBNAM4= <"">
##$SUBNAM5= <"">
##$SUBNAM6= <"">
##$SUBNAM7= <"">
##$SUBNAM8= <"">
##$SUBNAM9= <"">
##$SW= 18.0517328524113
##$SWIBOX= (0..15)
0 0 2 0 0 0 0 0 0 0 0 0 0 0 0 0 
##$SW_h= 3612.71676300578
##$TD= 16384
##$TD0= 1
##$TE= 0
##$TE2= 300
##$TE3= 300
##$TEG= 300
##$TL= (0..7)
0 120 120 120 120 120 120 120 
##$TP= (0..7)
150 150 150 150 150 150 150 150 
##$TP07= 0
##$TPNAME0= <>
##$TPNAME1= <>
##$TPNAME2= <>
##$TPNAME3= <>
##$TPNAME4= <>
##$TPNAME5= <>
##$TPNAME6= <>
##$TPNAME7= <>
##$TPOAL= (0..7)
0.5 0.5 0.5 0.5 0.5 0.5 0.5 0.5 
##$TPOFFS= (0..7)
0 0 0 0 0 0 0 0 
##$TUNHIN= 0
##$TUNHOUT= 0
##$TUNXOUT= 0
##$USERA1= <user>
##$USERA2= <user>
##$USERA3= <user>
##$USERA4= <user>
##$USERA5= <user>
##$V9= 5
##$VALIST= <valist>
##$VCLIST= <CCCCCCCCCCCCCCC>
##$VD= 0
##$VDLIST= <DDDDDDDDDDDDDDD>
##$VPLIST= <PPPPPPPPPPPPPPP>
##$VTLIST= <TTTTTTTTTTTTTTT>
##$WBST= 1024
##$WBSW= 4
##$XGAIN= (0..3)
0 0 0 0 
##$XL= 0
##$YL= 0
##$YMAX_a= 276034
##$YMIN_a= -325394
##$ZGOPTNS= <>
##$ZL1= 120
##$ZL2= 120
##$ZL3= 120
##$ZL4= 120
##$ABSF1= 10
##$ABSF2= 0
##$ABSG= 5
##$ABSL= 3
##$ALPHA= 0
##$AQORDER= 0
##$ASSFAC= 0
##$ASSFACI= 0
##$ASSFACX= 0
##$ASSWID= 0
##$AUNMP= <proc_1d>
##$AZFE= 0.1
##$AZFW= 0.1
##$BCFW= 1
##$BC_mod= 2
##$BYTORDP= 1
##$COROFFS= 0
##$CY= -3
##$DATMOD= 1
##$DC= 2
##$DFILT= <>
##$DTYPP= 0
##$F1P= 0
##$F2P= 0
##$FCOR= 0.5
##$FTSIZE= 0
##$FT_mod= 4
##$GAMMA= 1
##$GB= 0.15
##$INTBC= 1
##$INTSCL= 1
##$ISEN= 128
##$LB= 0.25
##$LEV0= 0
##$LPBIN= 0
##$MAXI= 10000
##$MC2= 0
##$MEAN= 0
##$ME_mod= 0
##$MI= 1.114404
##$NCOEF= 0
##$NC_proc= 0
##$NLEV= 6
##$NOISF1= 3.799351
##$NOISF2= 2.8
##$NSP= 1
##$NTH_PI= 0
##$NZP= 0
##$OFFSET= 14.38212
##$PC= 1
##$PHC0= -3707.747
##$PHC1= 12.19231
##$PH_mod= 1
##$PKNL= yes
##$PPARMOD= 0
##$PSCAL= 0
##$PSIGN= 0
##$REVERSE= no
##$SF= 200.129724274929
##$SI= 16384
##$SIGF1= 3
##$SIGF2= 2
##$SINO= 400
##$SIOLD= 16384
##$SREGLST= <1H.CDCl3>
##$SSB= 0
##$STSI= 0
##$STSR= 0
##$SW_p= 3205.1282051282
##$SYMM= 0
##$S_DEV= 0
##$TDeff= 0
##$TDoff= 0
##$TI= <>
##$TILT= no
##$TM1= 0
##$TM2= 0
##$TOPLEV= 0
##$USERP1= <user>
##$USERP2= <user>
##$USERP3= <user>
##$USERP4= <user>
##$USERP5= <user>
##$WDW= 1
##$XDIM= 8192
##$YMAX_p= 0
##$YMIN_p= 0
$$ End of Bruker specific parameters
$$ ---------------------------------
##NTUPLES= NMR FID
##VAR_NAME=  TIME,          FID/REAL,        FID/IMAG
##SYMBOL=    X,             R,               I
##VAR_TYPE=  INDEPENDENT,   DEPENDENT,       DEPENDENT
##VAR_FORM=  AFFN,          ASDF,            ASDF
##VAR_DIM=   8192,          8192,            8192
##UNITS=     SECONDS,       ARBITRARY UNITS, ARBITRARY UNITS
##FACTOR=    0.0002768,     1,               1
##FIRST=     0,             0,               0
##LAST=      2.2672688,     0,               0
##MIN=       0,             -325394,         0
##MAX=       2.2672688,     276034,          0
$$ Real data points
##PAGE= N=1
##DATA TABLE= (X++(R..R)), XYDATA
0 0 0 0 0 0 0 0 0 0 0 0 0 0 0 0 0 0 0 0 8 -5 8 -8 8 -8 8 -10 16 -16 16 -21 24 -26 30 -34 37 -42 50 -53 59 -66
40 -66 73 -80 88 -99 109 -120 131 -145 160 -176 194 -215 237 -261 289 -322 359 -405 456 -518 598
61 598 -696 828 -1008 1276 -1697 2450 -4075 9058 -56351 -325394 -309473 -63671 166498
74 166498 157370 -57659 -207152 -128903 102363 276034 201109 -28868 -178426 -126588 76463
85 76463 201610 87518 -140776 -275482 -189903 42687 178080 119624 -25262 -99592 -1541
96 -1541 155633 188679 72628 -107889 -196236 -110087 28706 84841 14353 -117774 -143326
107 -143326 -23268 125781 188995 104367 -30025 -65057 -8239 62929 61402 -45716 -141419
118 -141419 -140706 -56471 55104 86990 26980 -32240 -36414 40540 130426 120020 29729 -66010
130 -66010 -102971 -51948 -1593 -12850 -52414 -82171 -45876 44181 99610 100000 47817 -19184
142 -19184 -24207 12700 40294 30896 -36052 -94319 -85912 -41654 9173 21852 -4282 -156 33412
155 33412 71798 95142 58590 -6057 -49555 -67605 -42111 -9467 -14367 -31434 -46546 -31539
167 -31539 23802 55838 53618 37487 14965 22830 36936 17862 -13677 -55227 -81565 -63047
179 -63047 -30888 4961 30108 19109 13964 26938 39352 53522 35508 -4084 -20391 -26037
191 -26037 -22809 -21133 -42454 -50065 -36536 -14909 28005 57197 58406 49779 21406 2966 6016
204 6016 -5354 -20722 -38886 -53260 -34805 -14246 -7846 1419 1328 13132 39763 49690 54112 42399
218 42399 5000 -22836 -42868 -48451 -33860 -32354 -30624 -12758 3853 29121 42028 28858 25004
231 25004 22239 17551 20493 5295 -15333 -31281 -54323 -53335 -32965 -14058 11592 22931 27092
244 27092 44299 45795 34354 17809 -10179 -19963 -18918 -25942 -23507 -27852 -33573 -22275 -12636 8376
258 8376 37633 43946 43358 36139 19412 11775 -7338 -34566 -42861 -44840 -31834 -10022 -5525 3878
272 3878 13488 13502 25412 33112 33000 33733 13221 -9611 -19443 -33712 -37665 -38386 -38830 -14964 10443
287 10443 25348 38515 32625 24136 21522 8588 3628 202 -13935 -21069 -31946 -38635 -24939
300 -24939 -17197 -7840 11170 23822 42257 49410 32612 17020 -3109 -21625 -23849 -30427 -29059
313 -29059 -17877 -19179 -12018 -118 6872 22382 27482 25084 31926 26586 14920 -575 -27782
326 -27782 -38636 -37515 -35866 -18708 -3643 6726 22635 23234 22800 27264 19332 13706 5952 -7271
340 -7271 -7989 -16666 -31586 -33036 -32877 -20052 4182 16142 30130 38814 31196 25284 10862 -5432
354 -5432 -9565 -20277 -26407 -20974 -21560 -14519 -8360 -10002 3474 18043 27012 37803 30424 19946
368 19946 9721 -12224 -24852 -30197 -35096 -23820 -14622 -7088 10354 16193 17302 20259 15579 19245
382 19245 21035 9398 1347 -11916 -26225 -28224 -32994 -27739 -9274 2286 17748 29062 28135
395 28135 29156 19396 3162 -1553 -9679 -13567 -12521 -22179 -22683 -17884 -16757 -3791 7602 16959
409 16959 32195 31727 26080 19479 846 -12201 -22140 -32048 -24519 -16617 -11780 -1259 1645 7252
423 7252 17318 16579 20388 23207 15430 11737 -961 -17535 -22856 -30903 -30771 -18682 -8888 8840
437 8840 21329 20688 23554 19596 11944 10346 -78 -6292 -7388 -17038 -20402 -21260 -23679 -12732 -2396
452 -2396 7366 24644 29348 29153 24486 7371 -3141 -10582 -21169 -20304 -18902 -17326 -7516 -5646 -1946
467 -1946 8008 10123 18500 23909 19908 19630 8969 -7617 -16520 -26581 -28002 -19641 -15355 -2721
481 -2721 9401 12836 19415 17653 12708 14625 8306 2771 825 -9981 -15619 -19915 -26724 -19296 -10325
496 -10325 -358 15813 21268 24684 26370 14148 5355 -2084 -13016 -12899 -14866 -17683 -11628 -12530 -9646
511 -9646 -1057 2565 13564 22359 21579 23271 14984 1354 -5979 -19326 -24989 -20587 -18779 -8646
525 -8646 872 2862 11552 12938 11529 16316 13436 11463 9759 -2646 -9773 -16119 -25133 -22137 -17560
540 -17560 -9869 6412 13619 19273 23661 15966 11891 6311 -3155 -4977 -8430 -13572 -12297 -16254 -15551
555 -15551 -8261 -5613 5185 15956 19428 24881 19923 8842 2288 -10265 -17287 -16868 -18778 -12239
569 -12239 -5357 -4707 2835 5939 6924 14404 13830 14204 15816 6019 -717 -9412 -20220 -20728 -19490 -15022
585 -15022 -1500 5020 11501 17629 13229 12397 10313 2775 2564 -1516 -7378 -7852 -14645 -17209 -13070
600 -13070 -12151 -2274 8685 13083 20930 19876 12540 8261 -2440 -9517 -10044 -14335 -11587 -7828 -8823
615 -8823 -3049 -1043 440 8931 11019 14139 17624 10842 5505 -1769 -13820 -16351 -17817 -16796 -6362
630 -6362 -1650 4412 11357 9367 10552 10615 5886 7329 4507 -1460 -2786 -10925 -15875 -14583 -15849 -7828
646 -7828 1868 7276 16572 17968 13783 12060 2755 -3304 -4873 -10437 -9211 -8201 -10680 -7304 -5798
661 -5798 -3985 4306 7068 12551 18398 13119 10440 3549 -6553 -10344 -14947 -16623 -9106 -6240 -1596
676 -1596 4933 4066 8035 9876 7729 10703 8630 3883 2244 -6847 -13125 -13904 -17579 -11950 -3455 1072
692 1072 10958 14007 12416 13123 6492 2129 840 -4829 -5222 -6101 -10703 -9232 -9646 -8902 -1362 2331
708 2331 8720 16054 13976 13193 8411 -1633 -4974 -9985 -13491 -9017 -8507 -5261 99 -826 2586 5914
724 5914 5783 10890 11325 8145 7406 -1249 -7644 -10010 -16540 -12687 -7336 -3972 4614 8324 8343 11162
740 11162 7260 4709 5569 427 -85 -1600 -7805 -8076 -10530 -12410 -5749 -2586 3593 11566 11802 13050
756 13050 10656 2965 80 -4951 -9110 -6220 -8141 -6657 -3323 -5174 -1625 1872 2406 9122 10916
771 10916 9813 10549 3507 -2628 -6172 -12915 -12063 -9113 -7531 -50 3117 4402 8274 5790 5380 7471
787 7471 3952 4348 2562 -4070 -5592 -10276 -13035 -8915 -6626 -1157 6871 8411 11658 11108 5123 3884
803 3884 -335 -4696 -2993 -5880 -6085 -4839 -7933 -5210 -2277 -1328 5990 9200 9660 12087 6425 1605
819 1605 -1775 -8568 -9448 -8169 -8535 -2767 -1004 -118 4197 3038 4195 7443 5544 7210 5813 -310
835 -310 -2310 -7413 -11650 -9139 -8941 -4463 2731 4176 8264 9253 5205 5527 2329 -924 907 -2720
851 -2720 -4063 -3956 -8169 -6921 -5491 -4786 2200 5705 7562 11650 7832 4405 2055 -5033 -5611 -5823
867 -5823 -7603 -3243 -2594 -2913 571 -205 1408 5503 4938 7944 7974 2847 1571 -3678 -8921 -8021 -9362
884 -9362 -6182 -592 734 5018 6556 3935 5513 3600 1768 3666 275 -1092 -1863 -6936 -7053 -6787
900 -6787 -6944 -748 2938 5415 9908 7626 5554 3983 -1810 -2598 -3392 -5525 -3161 -3877 -4687 -1618
916 -1618 -3047 -731 3492 3937 7674 8630 4849 4096 -1251 -6007 -6311 -8873 -6868 -2226 -2044 2180
932 2180 3862 1929 4582 3895 2734 5644 2622 1341 -114 -5376 -6433 -7075 -8364 -3082 -538 2233
948 2233 7492 6297 5768 5520 457 385 -841 -3295 -1382 -3278 -5287 -3455 -5042 -3766 1030 1372
964 1372 6294 8493 6371 6140 1809 -2768 -3278 -6828 -6170 -3049 -3799 -806 459 -801 2721 2753 2937
981 2937 6275 4527 3952 2886 -2777 -4361 -6115 -8437 -4803 -2986 -557 4372 4030 4385 5251 2078
997 2078 2336 1901 -781 470 -1735 -3882 -3598 -6303 -5136 -1740 -1329 3804 6464 5659 7054 3654
1013 3654 85 -201 -4041 -4089 -2597 -4173 -1833 -1632 -2796 -115 743 1859 5725 5222 5256 5098 77
1030 77 -1541 -4345 -7395 -4735 -4261 -2705 2003 1380 2405 3954 1716 3222 3100 1276 2649 159
1046 159 -2480 -2482 -5937 -6167 -3208 -3136 1559 4166 4096 6070 3889 1545 1517 -1503 -1895 -752 -3229 -2014
1064 -2014 -2472 -4048 -1725 -1335 -100 4252 4184 5531 5545 1629 288 -1993 -5494 -4080 -3974 -3180 170
1081 170 -825 671 2338 514 2750 3501 2336 4331 2053 -718 -1184 -4906 -5532 -4032 -4238 -410
1097 -410 2181 2305 4681 3308 1684 2468 -366 -166 586 -2056 -1419 -2564 -5060 -3094 -3111 -1796 2647
1114 2647 2947 4821 5919 2436 2099 -249 -3559 -2051 -3334 -3062 -955 -2095 -863 352 -1058 1446
1130 1446 3254 2703 5195 3247 1188 442 -3865 -4585 -3878 -4930 -1835 553 473 3170 2357 1710 3226
1147 3226 1211 1343 2150 -513 -234 -1448 -4230 -3238 -4334 -3026 662 1193 3666 5140 3065 2953
1163 2953 1127 -1791 -761 -2217 -2689 -871 -2693 -2304 -1111 -2220 413 1902 2146 5083 3942 2402
1179 2402 1930 -1907 -3112 -3069 -4974 -2055 -792 -1253 1607 764 768 2700 1163 2321 3402 1126 1587
1196 1587 -340 -3566 -2979 -4203 -4190 -633 -699 2159 3966 2349 3359 2304 -158 854 -706 -1296
1212 -1296 19 -2520 -2665 -2027 -3618 -1455 346 1050 4126 4039 3162 3422 17 -1060 -1438 -3791 -2259
1229 -2259 -1587 -2078 -12 -363 -670 1397 885 2051 3828 2216 2915 1320 -1966 -2087 -4221 -4390 -1812
1246 -1812 -1938 106 2006 1242 2410 2291 879 2433 963 152 894 -1443 -2115 -2415 -4696 -2444 -1422
1263 -1422 -462 2754 3152 3257 4192 1484 281 -118 -2376 -1261 -1605 -2350 -867 -1828 -1755 208 -430 1372
1281 1372 3650 2878 3833 2626 95 -595 -2938 -3919 -2009 -2860 -1312 667 -250 1511 1725 922 2693
1298 2693 1871 1387 2241 -612 -1071 -1550 -4316 -2967 -2301 -1799 1221 1551 2273 3587 1747 1376 1182 -810
1316 -810 -126 -587 -2184 -886 -2610 -2708 -1206 -1545 459 2225 2347 3662 3144 805 910 -1502 -2574
1333 -2574 -1440 -2886 -1615 -408 -1260 240 608 -114 2181 1953 1710 2664 737 -92 -791 -3549 -2708
1350 -2708 -2735 -2616 139 662 841 2702 1480 1487 1922 171 1149 331 -1334 -636 -2076 -3112 -1735 -2469
1368 -2469 -498 1525 1597 3493 3285 1546 1645 -585 -1468 -1043 -1991 -1716 -921 -1754 -707 -255 -635 1679
1386 1679 1521 2135 3236 1497 983 126 -2502 -2099 -2750 -3074 -767 -656 247 2069 1063 1293 1857 738
1404 738 1756 1183 -333 -117 -1879 -3027 -2191 -3015 -1616 679 490 2625 3019 1562 2398 800 -306
1421 -306 19 -1468 -1148 -882 -2499 -1458 -1432 -1660 789 1090 2033 3588 2384 1824 1171 -1285 -1388 -2100
1439 -2100 -3000 -993 -1313 -780 793 -79 801 1601 1071 2219 2169 848 1163 -802 -2214 -1931 -3437 -2329
1457 -2329 -480 -552 1669 2158 1474 2419 1054 494 1010 -142 -612 -464 -2236 -1472 -1773 -2529 -460 -354
1475 -354 1227 2695 2323 2524 2054 -233 -162 -1102 -2144 -1131 -1546 -1652 -377 -951 58 1056 319 2314
1493 2314 2427 1691 1870 -53 -1205 -1303 -3126 -2356 -1283 -1539 512 911 788 1962 1307 1063 1757 630
1511 630 258 327 -1555 -1435 -2190 -2515 -1283 -985 61 2020 1447 2265 2331 843 950 -266 -1422 -806
1529 -806 -1449 -1675 -818 -1794 -716 83 62 1448 2330 2038 2465 647 -313 -320 -2128 -1705 -1477 -1923 -337
1548 -337 33 4 1129 1020 989 2154 972 1169 922 -874 -961 -1966 -2684 -1753 -1627 -641 757 960 1903
1567 1903 2279 907 1192 687 -497 82 -955 -1601 -1140 -2020 -1639 -601 -782 1010 1714 1571 2658 1321
1585 1321 771 386 -1324 -1235 -1567 -2051 -936 -695 -710 655 229 309 1978 998 1545 1784 109 121 -988
1604 -988 -2223 -1645 -1936 -1160 337 206 1158 1871 626 1236 1002 133 837 -78 -1028 -817 -1924 -1437 -1479
1623 -1479 -1208 484 1198 965 2617 1543 1217 1041 -442 -962 -872 -1663 -535 -1361 -1613 -159 -399 302
1641 302 1378 963 1713 1959 384 651 -272 -1831 -1345 -2248 -1767 -243 -578 383 1155 854 1431 1296 725
1660 725 1492 458 -278 -177 -1852 -1773 -1412 -1765 -566 314 646 2042 1430 1393 1454 298 206 -14 -1412
1679 -1412 -710 -1189 -1593 -654 -959 -481 744 612 1593 1930 1372 1247 251 -923 -842 -1626 -1990 -789 -1233
1698 -1233 -451 274 -145 1000 1304 1111 1659 918 732 300 -874 -1394 -1321 -2228 -1109 -799 -437 1228 1307
1717 1307 1045 1634 522 587 595 -639 -310 -901 -1583 -1014 -1594 -1141 -60 88 1096 1710 1205 1842 990
1736 990 -170 -311 -1047 -1350 -1002 -1553 -810 21 -563 396 625 524 1554 1023 745 989 -191 -544 -894
1755 -894 -2022 -1032 -1085 -863 340 739 715 1354 686 805 1117 339 73 -345 -1018 -846 -1416 -1574 -468 -478
1775 -478 525 1190 806 1388 1509 325 734 -634 -993 -420 -1152 -939 -473 -1145 10 79 -27 1269 1040
1794 1040 1062 1395 162 -41 -552 -1269 -1283 -1292 -1289 -45 -37 138 1056 763 1106 1169 375 1015 440 -942 -714 -1411
1816 -1411 -1588 -934 -1168 -240 843 754 1138 878 690 1105 266 -198 -204 -1292 -1043 -785 -1376 -730 -318 -238
1836 -238 779 830 1055 1892 598 214 140 -1027 -604 -1276 -1496 -329 -490 95 539 316 858 1048 782
1855 782 1107 639 61 67 -1203 -1472 -533 -1297 -663 91 -27 1010 1271 463 1205 554 283 240 -384 -717
1875 -717 -621 -1131 -978 -905 -766 614 579 906 1268 1018 815 681 -427 -101 -795 -1298 -526 -902 -646 135
1895 135 -249 703 1125 826 1231 764 150 465 -403 -1230 -1210 -1646 -964 -531 -600 167 913 971 1066 534 380
1916 380 1039 109 -498 -542 -1056 -672 -1080 -1378 -66 101 415 992 802 1075 1081 -9 -10 -656 -998 -333 -1056
1937 -1056 -1114 -414 -714 50 569 381 1240 1323 531 791 -65 -472 -501 -1291 -1222 -538 -846 -49 -118 239 841
1958 841 937 527 1041 307 63 -179 -867 -630 -645 -1267 -623 -461 -181 696 427 892 1091 542 578 168 -459
1979 -459 -695 -789 -999 -603 -721 -408 307 176 928 1145 841 1188 364 -166 23 -788 -1052 -857 -1000 -359
1999 -359 -115 -131 492 449 938 1027 422 896 534 -315 -404 -872 -1185 -673 -908 -836 96 280 935 1122 322 725
2021 725 457 47 -16 -387 -944 -637 -906 -778 -169 -228 528 647 912 1155 790 362 533 -593 -666 -380 -1425
2042 -1425 -663 -448 -272 402 43 577 1276 469 709 778 -202 294 -639 -1018 -744 -815 -665 245 -3 248
2062 248 1046 417 925 509 113 793 -212 -754 -302 -970 -770 -384 -860 364 388 625 1096 615 706 749
2082 749 -251 -471 -311 -815 -414 -826 -991 33 208 209 769 336 869 1014 212 308 -191 -699 -538 -782
2102 -782 -786 -317 -539 194 335 393 870 715 484 413 43 -407 -269 -976 -730 -205 -578 -116 121 -111 878
2123 878 844 464 1105 295 165 -134 -520 -186 -502 -887 -438 -561 -210 330 324 881 1281 487 815 131 -506
2144 -506 -99 -744 -721 -580 -921 -432 159 53 777 580 819 691 226 276 81 -560 -837 -633 -1220 -338 -314
2165 -314 -373 425 576 747 819 608 687 492 -476 -103 -459 -703 -409 -614 -477 123 2 233 718 526 1040
2186 1040 514 -35 153 -527 -788 -463 -954 -661 -74 -360 305 363 467 690 534 387 627 88 -238 -519
2206 -519 -659 -660 -294 -352 312 196 717 734 420 643 569 -238 220 -262 -526 -659 -1118 -889 -339 -253 435 654
2228 654 659 668 861 413 62 -342 -360 -84 -642 -424 -345 -469 35 332 356 690 544 301 684 119 -31 -257
2250 -257 -888 -641 -699 -629 -316 -188 -2 689 100 610 692 208 354 245 -629 -539 -736 -1070 -404 -568 155
2271 155 466 231 892 800 292 637 159 -334 -245 -489 -606 -475 -607 7 202 27 359 664 611 557 188
2292 188 315 150 -681 -422 -420 -676 -375 -138 146 278 65 623 532 67 332 104 -66 40 -462 -899 -405
2313 -405 -545 -359 105 16 543 441 407 662 398 6 -232 -346 -434 -592 -764 -239 -225 -471 363 433 423 869
2335 869 225 524 237 -186 -182 -496 -558 -132 -343 -320 41 95 326 755 620 827 624 -49 55 -301 -600 -606
2357 -606 -868 -506 -201 -58 511 367 380 438 395 455 226 -274 -267 -327 -706 -589 -486 -278 -29 -82 503 770 865
2380 865 613 287 -115 -291 -358 -601 -188 -777 -729 23 -251 352 389 410 800 546 217 478 459 -486 -571 -829
2402 -829 -354 -290 -386 9 221 70 723 549 265 551 -35 -77 -217 -490 -487 -593 -657 -29 -240 85 773 294
2424 294 457 371 198 -46 -188 -600 -197 -404 -431 -267 -627 94 220 323 622 622 335 530 295 -7 -89 -584
2446 -584 -676 -249 -532 30 -38 103 357 199 319 592 -103 421 -53 -394 -384 -517 -483 -658 -377 -216 491
2467 491 377 641 377 352 420 -20 -309 -263 -400 -222 -301 -368 -179 -32 6 567 444 356 261 6 -83 -6 -476
2490 -476 -622 -342 -518 -234 -315 25 331 106 336 596 363 150 161 55 -111 -273 -650 -621 -763 -360 108
2511 108 198 371 457 147 517 262 -142 46 -334 -265 -320 -610 -330 131 -507 359 634 225 543 314 492
2532 492 106 -403 -29 -200 -533 -394 -116 -274 -19 172 219 626 544 166 437 16 29 -206 -631 -513 -339
2553 -339 -389 288 32 432 468 392 228 427 220 399 -77 -279 42 -350 -529 -171 -234 -23 232 314 636 588
2575 588 248 180 294 -191 -110 -426 -327 -471 -429 -15 -256 -8 188 380 645 179 206 83 -213 -325 -407 -301
2597 -301 -144 -77 -74 10 615 516 671 406 40 161 294 -174 -146 -245 -488 -601 -213 -177 95 95 410 499 129 280
2621 280 30 -120 -41 -260 -374 -160 -463 -190 -199 1 275 155 447 487 171 168 278 -204 -395 -263 -519 -71
2643 -71 -52 -4 343 -156 216 131 103 513 -29 -106 52 -181 -26 -410 -586 -166 85 57 134 433 217 45 -143
2666 -143 131 306 -330 -33 -206 -295 -30 -124 -158 -4 45 199 285 76 465 70 -162 -52 -434 -315 -106 -206
2688 -206 -417 -142 -284 -82 131 189 506 399 -128 291 50 -412 -373 -372 -37 -120 21 317 -104 316 396 104
2710 104 394 97 34 29 -244 -318 124 -400 -439 -16 66 305 419 435 322 302 -87 35 -2 -354 -64 -89 2 -152
2734 -152 -125 266 229 161 7 362 138 400 92 65 -229 -484 -337 -180 -203 170 7 169 320 266 74 145
2756 145 -13 31 -111 -400 -153 -277 -262 -50 -144 -138 448 277 368 125 6 88 -134 -412 -113 -39 -145 105 -90
2779 -90 134 179 -8 285 322 302 384 -28 -144 13 -233 -327 -304 -397 -114 280 -36 500 417 286 116 27 262
2802 262 -171 30 -283 -257 -216 -194 -265 -100 21 126 280 391 -172 305 -147 -136 -133 -152 -238 -187 -309 -144 35
2825 35 370 238 348 716 235 349 -297 -171 -151 -279 -244 -358 -260 47 34 378 -67 370 110 195 364 43
2847 43 45 -99 -379 -410 -332 -371 -160 -14 81 458 331 53 341 120 -35 -94 -198 -331 -1 -244 -74 -174 119
2870 119 -111 359 292 349 357 82 61 -161 -91 -55 -237 -35 -139 -356 -139 -184 164 266 81 290 -80 -168 -320
2893 -320 -263 -329 -231 -336 -338 128 110 43 230 223 365 75 40 84 -140 -107 -201 -284 -117 -54 -130 210 296 144 352 383
2919 383 206 228 5 1 -242 -249 -196 -123 -351 57 137 36 167 400 214 480 -67 -1 -105 -169 -235 -127 -132 -175 63
2944 63 68 336 177 381 275 159 55 220 -214 -35 -152 -530 -363 -428 -130 62 13 411 326 324 26 43 -106
2967 -106 -41 -239 -385 -10 -350 1 -160 -320 -20 329 237 126 212 186 -149 -415 -107 -325 -174 -136 -136 262
2989 262 -34 -8 383 181 295 297 175 -12 -11 -76 -317 -277 -228 -195 45 40 623 65 28 73 76 -245 -268 -237 -41 -168
3015 -168 -327 -59 -311 -170 -22 165 311 274 370 51 123 -288 -375 -272 -115 -78 -336 -51 -14 -19 214 425 116
3038 116 253 355 218 138 -272 -234 -214 -289 42 61 11 181 129 267 109 -42 62 87 325 96 -238 -34 123
3061 123 -294 -341 -97 79 159 220 322 203 170 54 15 -306 -210 78 -252 -4 139 11 233 46 28 223
3083 223 278 57 210 -96 -160 -36 -214 -355 -232 -167 228 128 15 394 129 -145 86 320 -195 -176 -433
3104 -433 -199 -245 -337 -159 -42 147 287 155 338 160 69 185 -19 -289 -182 -199 88 -67 -310 -54 85
3125 85 -188 126 340 112 221 159 -47 -370 -317 -140 -29 -373 178 258 64 32 -71 269 155 -265 52 -120
3147 -120 133 -99 -292 -406 -28 114 -52 355 291 467 114 -239 31 -348 -6 -18 -102 -266 -56 -98 -180 284
3169 284 32 129 7 128 334 135 -123 -422 -147 -374 -64 -28 20 -322 -128 -211 -193 550 -229 -75 103 81
3191 81 -62 -101 -298 -82 -134 -178 85 141 220 243 104 93 290 13 -191 84 -358 111 51 -389 -138 229 36
3214 36 39 78 30 -24 56 87 -8 -235 -149 -95 -78 -7 -145 -22 168 -15 -145 413 325 230 -5 145 -61 -101 -198 -179
3240 -179 -248 107 25 -26 365 -99 44 71 -92 85 101 -168 -236 -250 -26 -244 275 -266 -165 139 341 231
3262 231 293 103 212 -39 -80 -113 -98 -25 -214 25 -68 316 162 298 214 400 243 292 -61 -206 -252 -178 -403
3285 -403 -146 167 38 229 371 46 -135 39 121 102 174 -112 -345 -31 -224 -195 -171 -141 32 104 11 339 31
3308 31 -103 77 -126 -188 -186 -84 -112 -236 -156 -127 188 -36 150 277 332 87 2 -95 188 -294 -299 -171 -37 8
3332 8 -65 145 -75 192 200 164 -14 68 -24 114 -634 -182 -160 -285 -91 -34 -102 187 38 16 -229 118 -168 136
3356 136 -141 -53 38 -30 -186 -78 -45 -92 13 66 129 134 317 275 49 -240 -187 -109 -223 -92 156 -96 -132 62
3380 62 218 248 409 -35 -28 54 -213 41 -225 -447 -352 -171 198 -79 109 160 218 -75 -88 437 55 -71 209
3403 209 -205 -51 -82 61 67 13 260 369 229 271 114 -26 -241 -36 -17 116 -110 -13 14 -205 218 27 251
3426 251 67 39 126 223 -338 -146 -97 28 -46 190 -37 -194 73 305 74 -135 53 26 -277 -213 -111 29
3448 29 120 -254 119 -155 -325 22 480 300 366 102 41 171 -71 30 124 -398 -202 264 -12 4 310 105
3470 105 415 -112 -52 248 -331 156 -164 -307 -337 265 -304 27 198 -84 58 -35 -142 -81 -181 375 42
3491 42 -190 -58 -274 -491 -380 -49 -155 143 1 29 162 -70 359 127 -120 -18 -67 -19 79 -63 14 32
3513 32 -73 170 60 -4 173 -67 49 -70 -224 -113 -365 -165 -79 86 151 224 14 -120 43 302 70 402
3535 402 -33 -91 -92 -306 -128 -154 -111 193 368 325 370 54 333 -56 218 -12 -45 -174 -116 67 -83 -175 142
3558 142 60 198 265 -64 -80 -174 -133 -79 -13 -226 -243 -101 -79 160 -85 -71 86 461 83 381 131 -259 184
3581 184 -84 -199 207 -157 -176 246 -168 190 331 47 190 -102 387 9 -310 9 118 -39 -2 -184 -154
3602 -154 -50 206 392 263 171 -7 7 -201 -174 -93 -203 -261 80 -33 -30 -84 -293 -266 80 258 353 11 -100
3625 -100 189 -44 173 158 -272 -138 1 -228 119 -419 107 75 -2 33 234 -161 11 -122 80 -162 -395
3646 -395 78 30 -129 -187 368 117 -63 -3 127 -167 -121 243 -76 -165 -168 -230 82 -101 49 123 100 -26 -39 99
3670 99 -3 -9 -181 -16 51 -226 15 -37 14 347 218 51 169 91 256 87 33 -114 -145 97 -129 79 -128
3693 -128 30 265 -136 215 208 9 67 -182 73 -11 -353 -58 -12 -78 -14 39 -23 236 304 169 -43 -80 -10 -259
3717 -259 41 219 -193 -69 68 -326 -50 -10 -81 229 225 81 176 -67 116 -269 -295 -28 155 -270 174 202
3739 202 -106 202 90 -213 35 398 336 159 -215 -214 -214 -2 -24 87 102 313 294 65 101 32 51 -95 19 -148
3763 -148 -182 -177 163 112 -152 -169 74 202 318 118 -113 -173 -39 42 -226 31 -123 -39 199 -85 -56 -72 -102 356
3787 356 129 -164 54 -242 71 -158 -276 -129 6 -315 31 -156 -97 278 63 -131 152 -106 -147 -172 -136
3808 -136 131 -104 -148 40 -77 42 270 99 182 154 -164 -31 -114 -66 33 232 60 48 -49 -294 -181 305 319
3831 319 -198 263 203 43 -22 211 -327 -164 -29 -56 -96 -10 -50 65 42 -125 81 62 3 -244 -14 45 -229
3854 -229 -37 31 -81 185 -32 508 183 32 -137 1 -6 -335 128 171 -133 -147 -163 -345 -69 -1 169 44
3876 44 158 122 78 -75 12 -149 -82 -198 -115 312 -189 292 -65 -47 -313 36 182 169 224 84 -227 -591 18
3899 18 -132 -215 203 240 -24 -210 -56 47 152 -115 -418 116 -132 27 -62 -48 -202 -233 -200 203 -83 23
3921 23 146 71 62 5 -17 -142 46 -124 -136 90 -91 -34 -112 -268 419 148 189 220 -1 249 -6 -262 -41 -326
3945 -326 112 194 -66 146 -123 -76 300 170 51 -75 303 -93 -175 153 -135 3 -218 -199 -112 108 113 57 235
3968 235 82 -3 162 40 -1 174 -240 -228 299 -47 -380 134 104 188 185 253 181 -264 -217 -161 -5 241 317 147
3992 147 168 -94 201 -272 -18 -291 246 15 75 269 193 -52 3 -90 -28 203 -92 158 78 226 50 -365
4014 -365 241 176 -131 -7 -91 -263 54 28 -98 -79 114 -50 138 266 196 116 97 -10 -416 -314 -34 -9 87
4037 87 -10 -68 -269 45 -99 45 157 -111 279 18 -68 -492 -81 110 -130 144 -18 299 158 180 -15 65
4059 65 277 -35 310 -18 -10 245 -177 131 -50 -140 -98 75 -31 245 -14 25 -9 54 -1 147 -153 -24 -99
4082 -99 346 -36 11 39 410 87 185 205 162 -94 78 -154 64 2 -123 76 30 147 198 -24 -158 128 69
4105 69 1 -59 -9 8 -328 -234 -165 -195 260 123 59 278 143 -40 -86 -99 -129 160 -186 27 44 -526 -177 180
4129 180 35 127 99 -73 590 -52 290 -115 105 -181 -143 121 -113 152 85 -8 -88 144 298 -45 -24 193
4151 193 141 -96 -84 -97 -100 68 -58 195 11 219 -120 23 363 -133 -66 205 -32 -77 32 -47 144 8 77
4174 77 77 -44 207 382 37 131 201 -110 264 -350 -114 -400 64 -119 -63 -274 5 60 -155 -60 358 -32 134
4197 134 14 -291 -205 -135 -27 72 -95 -203 170 188 200 335 20 112 -153 119 0 40 -74 -142 25 107 154
4220 154 -86 203 25 77 115 -101 33 76 -91 29 42 -109 -150 -146 6 -26 294 138 -53 284 -13 -137 -61
4243 -61 208 58 -129 240 -44 11 120 73 92 -52 135 27 -224 114 93 -200 -93 -21 -55 223 -98 24
4265 24 47 17 283 202 -44 64 110 187 -32 86 86 28 -127 -83 120 -63 394 38 -117 88 -129 108 13 39
4289 39 35 -146 -235 -340 95 -115 -17 -4 -58 190 -77 -50 315 -30 164 -27 -29 14 -117 101 89 -234 159 186
4313 186 -7 249 120 -348 -1 -182 -201 -61 -172 95 30 -182 50 6 -71 70 151 277 197 199 122 -75 29
4336 29 -125 -76 132 109 30 102 166 -34 12 -181 31 -23 -68 -14 48 -140 -49 87 -79 149 327 33 87 70 135
4361 135 295 105 -305 86 -96 -149 -67 109 3 -115 -4 165 196 55 -161 153 73 5 45 151 168 -210
4383 -210 187 -226 4 293 -130 306 18 -10 -52 325 40 -30 125 5 55 -114 -127 -2 -141 119 218 -112
4405 -112 138 109 -4 29 51 233 10 -271 -144 331 -146 33 31 -43 70 -258 51 11 -285 93 -50 -124 -13
4428 -13 -133 -105 38 -154 181 307 142 127 -26 -169 -60 -125 -62 149 160 -129 -56 -65 -23 363 4 75 -94 -145
4452 -145 270 -6 -62 -143 -45 -86 210 -173 101 236 60 204 35 109 215 -125 42 85 -74 -24 214 53
4474 53 61 120 -6 -4 191 98 -40 -126 122 -157 47 -97 -30 -42 -81 -189 -150 178 126 34 -10 -40 -26 -142 116 -170
4500 -170 -84 -212 -146 85 62 79 93 -5 261 -56 10 142 235 233 -173 55 -58 -84 192 -205 282 31 210 143
4524 143 249 89 86 230 -167 -195 -219 214 -296 29 -72 55 38 217 75 65 74 -122 82 54 -124 293 -25
4547 -25 -314 125 -93 222 156 81 53 34 -111 -212 87 -167 7 -131 -227 -239 36 111 399 76 -20 178 -116
4570 -116 89 317 234 -73 -92 -98 -41 -199 -378 -183 -32 80 6 97 -128 51 -110 -97 -90 17 66 -159 -80 5
4594 5 -77 -69 -50 138 143 353 170 -22 -76 14 -458 -6 109 -28 -127 34 227 68 28 -36 -16 -72 41 93 8 -52
4620 -52 -283 -267 -144 -174 -206 -116 44 93 -14 209 116 -51 -178 -18 122 -196 -200 -16 -5 30 -82 271 354 13
4644 13 35 -120 -122 31 -90 120 -47 -229 -285 -189 -2 -119 -58 103 58 32 127 181 -24 60 -194 -74 -396 -300
4668 -300 -151 -289 21 -172 -58 -111 50 83 -90 -157 -161 -23 11 -165 149 -310 277 -79 -179 -86 60 163
4690 163 -106 0 -100 -142 187 -159 102 19 113 -16 64 -164 -124 92 -2 28 -240 -140 -79 -400 -186 -91 -212
4713 -212 25 162 109 166 54 150 -10 41 -85 326 -65 31 -48 -147 201 -24 -25 63 -108 161 171 -143 285 -83
4737 -83 48 -37 3 -152 -64 -269 -145 42 -262 113 -353 -144 45 25 -13 98 -143 -174 -13 -285 -43 14 -200
4760 -200 153 14 -7 42 -276 136 26 201 193 158 41 69 -170 -169 -303 183 86 50 190 79 -173 295 119
4783 119 -287 3 43 48 -317 -119 120 183 206 179 396 -4 132 -98 -285 340 213 -137 281 -79 6 193
4805 193 -32 241 123 -65 -10 169 191 34 -115 215 93 147 -130 53 168 -25 -8 -408 343 -16 111
4826 111 -125 99 -93 19 -58 73 -5 -238 205 27 -32 135 40 205 -29 -64 116 -88 -255 142 117 -124
4848 -124 141 4 60 118 -26 97 333 -184 -38 -97 38 21 40 85 218 -33 -155 -48 -176 -127 -125 -131 -64 -71 -1
4873 -1 177 -77 -185 -53 -105 -116 63 35 10 19 -105 73 -14 -93 -42 -9 160 -58 366 25 1 254 -122 -74 274
4898 274 -196 10 -135 -44 -46 85 -353 140 -12 5 -82 -67 52 62 -30 205 284 -144 -13 -179 -204 82 -157
4921 -157 -57 -193 152 227 114 50 -58 175 205 124 130 127 -296 79 -16 154 -248 -51 34 -214 -16 20 -36 333
4945 333 3 -42 220 -189 -153 51 -23 -48 -182 -124 70 -179 200 213 -155 71 -108 29 -18 -36 -8 -56 169
4968 169 -296 -129 -127 102 6 -186 181 -272 -92 -78 -129 -77 19 118 129 -92 -112 106 122 1 198 143 41 280
4992 280 6 317 378 110 -54 71 -44 -258 28 206 113 -29 150 -115 -8 181 -33 84 22 -281 -138
5013 -138 28 51 95 -124 -12 -131 87 148 65 -165 343 352 52 185 5 -220 -192 -159 -157 260 155 65 106 -164
5037 -164 24 -89 90 -154 -75 16 63 -244 -241 242 -45 4 156 137 70 -112 2 263 -18 -247 88 -338 -56
5060 -56 -278 -83 -183 52 -188 117 334 -62 227 -70 -121 -71 182 39 -9 -26 70 -92 -50 38 150 136 -240
5083 -240 325 -59 -235 77 192 -155 -46 238 -32 -44 -123 94 31 114 38 67 59 39 75 78 122 18 -173 263
5107 263 178 -120 -48 279 60 -84 -144 61 66 -162 -84 76 0 81 -90 110 76 -7 126 98 -187 -91 -28 -339
5131 -339 132 -59 61 -53 131 -101 -149 -107 64 232 196 -222 0 48 -17 -66 -53 -60 -221 3 177 69 70 53
5155 53 82 116 -387 18 -309 52 -14 -109 -90 6 -76 90 -29 103 -203 -84 78 -139 107 -90 51 -95 333
5178 333 259 -224 -142 -56 60 58 -75 391 251 69 6 34 75 72 110 0 -186 134 -143 -30 -58 -61 101 -168 197
5203 197 -81 208 142 119 -64 56 -151 5 -272 38 -65 -38 -110 191 276 12 78 -10 -175 163 -104 -104 -83
5226 -83 79 181 80 30 75 -220 -32 -278 94 -16 -87 -101 -29 64 -119 204 -27 36 -51 -36 -120 -59 -220 121
5250 121 -340 -98 -55 60 -140 -77 -109 73 -110 32 -170 183 161 -90 -29 -123 -75 -27 24 190 79 46 -92
5273 -92 -54 39 29 -76 308 -165 12 -60 -25 238 -75 -46 -107 -25 -22 -190 102 -9 -72 -90 -60 10 -87 74 -35
5298 -35 -102 16 327 179 217 379 72 204 -25 260 -235 146 205 -215 -34 63 65 162 190 122 364 95 -132
5321 -132 -163 -333 -371 -40 192 28 -34 -170 215 41 22 -252 -199 19 11 69 117 -100 -135 -126 -82 141 -164 -205 41
5346 41 -60 -215 -146 128 64 -244 -159 -136 -7 184 128 107 -156 112 -207 -127 47 44 255 -89 -155 88 179 -70
5370 -70 78 -65 -42 -74 -302 59 142 -17 104 -27 -18 -2 134 24 240 251 -18 138 -353 -71 -56 -218 5
5393 5 -146 190 229 66 124 287 -56 78 94 112 305 75 -71 -70 90 1 274 229 100 -401 66 146 36 83
5417 83 370 61 10 318 48 -268 -12 -326 -27 229 4 107 -260 -45 222 68 99 97 109 70 -128 20
5439 20 52 -342 -163 -26 97 -132 106 -143 -75 -6 238 71 43 50 -98 -14 -166 -6 -138 169 -181 131 -119
5462 -119 -190 -58 -213 39 -220 199 56 102 75 114 240 -159 0 21 282 13 159 22 179 79 -97 146
5484 146 -219 130 410 -251 -50 49 -292 109 -168 76 196 32 13 54 -98 123 -59 62 135 23 -160
5505 -160 -61 -87 -153 -170 96 87 -70 -27 98 124 92 135 20 96 -268 220 -97 -256 -26 -105 -183 -333 378 -121
5529 -121 -137 286 -17 160 22 -186 98 -128 -76 20 191 29 63 3 358 -74 -130 139 -71 -18 -20 -172 64
5552 64 -38 -124 139 200 9 -189 -208 -16 53 87 425 -273 -212 146 -44 -405 -152 29 -30 -94 311 -42 -87
5575 -87 321 -155 37 117 349 79 -25 200 -55 -59 72 -2 39 27 134 52 -92 -142 -284 -168 82 115 -89
5598 -89 -111 -212 -125 63 46 -50 31 -64 178 69 -120 129 221 160 36 -165 -151 -75 127 141 114 0 56 18 -10
5623 -10 198 -262 19 -132 172 433 -69 113 -231 53 -5 195 138 -113 39 -156 89 -62 -7 55 -4 -148
5645 -148 -3 -26 35 24 -92 65 132 -62 61 -55 179 -147 313 184 170 184 -120 84 -37 36 307 67
5667 67 -45 108 82 244 -196 -159 86 3 -161 61 -211 -75 -45 -149 -27 112 126 -71 -146 -31 -331 88
5689 88 254 89 -58 127 139 -6 182 -29 145 -39 6 202 37 123 210 -21 -134 -46 67 -25 104 36 -171
5712 -171 -187 -60 -151 16 23 74 32 -78 179 139 38 -170 -97 134 58 -206 96 -125 -97 72 -34 -116 -126 -91
5736 -91 -104 11 332 -85 82 -125 214 -33 26 70 -145 -88 269 -85 20 -37 44 124 42 77 27 -95 -48 -41 126
5761 126 116 -315 -1 -193 -67 -124 153 98 -31 -16 -383 -26 -22 133 -39 -142 75 -139 130 154 115 -21 53
5784 53 -90 93 -122 59 63 64 221 127 10 -22 -174 35 19 -127 144 -118 -98 171 88 -53 46 65 -75 -38
5808 -38 -123 37 -2 -134 108 61 -288 -59 53 -195 -155 117 159 192 -62 -143 12 88 162 -137 -8 169 293
5831 293 283 -33 -124 106 -105 -218 2 124 -276 -184 -156 72 423 -244 85 230 54 230 -218 175 160 -53
5853 -53 139 6 174 -74 -226 -167 -58 137 302 196 141 105 -61 352 -3 127 -75 -123 311 350 -26 62
5875 62 -86 39 215 84 99 70 123 -375 101 177 109 110 -19 114 426 31 155 86 -257 -56 -23 -52 -12 -55
5899 -55 -44 139 127 126 297 -463 4 -320 127 -14 276 36 175 421 -61 61 -161 -73 39 -158 362 -144
5921 -144 -13 -22 93 147 -287 115 -108 292 6 -76 5 -62 -103 -93 -36 108 -94 7 31 -27 -131 67 -164 -2
5945 -2 -160 156 197 35 46 -262 87 109 -10 154 -176 173 135 122 185 212 139 222 5 -46 -233 49 203 2
5969 2 -21 -29 -150 -93 240 -170 176 218 61 -218 195 -167 -165 -179 -82 -309 71 -104 -192 0 110 -104 -14 0 -21
5994 -21 175 -32 49 302 120 -111 198 43 -224 -19 -77 123 7 20 435 57 179 148 -282 23 -251 -48
6016 -48 94 -333 -183 -28 -37 12 178 -331 246 152 68 -115 128 -166 150 -93 -260 -236 -25 100 -39 -101 -275
6039 -275 124 -101 -50 -9 -124 196 -67 74 106 77 -79 -95 -11 -232 -268 -31 -234 206 108 19 8 -166 -43
6062 -43 -226 56 80 4 20 -73 -337 32 6 -212 -50 -54 -84 -155 -125 213 -131 -37 57 -37 -82 -20 -154 64 -131
6087 -131 -20 60 304 48 65 94 -193 -120 344 78 -64 34 -43 167 -108 -219 212 238 -89 8 -12 -68 -60 105
6111 105 112 -26 109 109 -84 54 36 -32 -85 11 -263 -342 79 -10 -50 -211 35 1 304 25 -29 -23 -147 82 188
6136 188 -72 16 129 -173 70 -63 -30 -80 -99 279 182 -77 -211 -125 113 13 47 14 -18 -219 171 111 -146
6159 -146 -15 -25 118 -79 -200 7 1 -96 -12 196 77 121 221 -10 56 50 180 -349 87 154 -213 -6 -298
6182 -298 86 41 32 -92 43 74 -345 -147 37 -64 8 -141 91 -145 -184 179 374 -266 -42 -25 -129 -46 275
6205 275 -109 -250 148 13 -29 -30 366 -110 68 47 188 44 -165 -194 -87 78 -65 68 71 -152 188 115 149
6228 149 -58 -245 26 -135 -11 67 -16 -226 -198 -213 -314 106 -31 -73 -17 -63 36 -128 250 83 -56 -82 121
6251 121 -260 -195 41 -43 -274 -158 243 130 -37 -131 249 288 64 -71 -253 -179 -198 -86 1 19 -120 -20 213
6274 213 -49 271 -247 -141 11 -103 179 201 7 82 113 52 -103 -34 -80 -134 144 217 28 -200 -17 128 18
6297 18 -83 -21 -190 -46 -313 353 -38 165 -109 -265 29 55 51 -366 90 90 -9 102 -116 -45 -44 -140 -43 62
6321 62 -185 -11 -189 114 16 13 -206 113 25 -106 18 -19 39 -96 109 262 216 -190 85 -238 -140 32 -72
6344 -72 78 10 -33 -103 0 -45 -106 -69 179 -139 93 112 32 43 -241 -80 -223 146 34 -280 -35 29 -24 1
6368 1 -18 157 80 -53 33 -24 44 214 -39 -327 -231 92 -100 32 5 183 142 107 -24 89 24 -127 -144 -108 69
6393 69 77 79 29 107 93 121 211 167 -231 49 324 -146 -358 -12 -35 -111 -99 -153 -145 -178 39 150 238 25 -172 108
6419 108 -136 140 -29 213 -126 176 156 -341 -22 -83 -132 26 -185 -216 -135 -75 224 49 -81 -165 -110 -19 -8
6442 -8 328 32 -120 -183 -133 183 -26 -78 115 196 -94 96 -121 192 155 285 -144 30 -32 94 -86 51 192
6465 192 131 27 19 150 -7 -6 107 -142 119 -362 -170 39 169 195 85 -28 -4 -80 -32 -78 70 49 -153 -49
6489 -49 -58 146 53 -65 84 138 19 -5 285 -36 102 243 38 26 104 247 170 12 125 -296 105 167 -101
6512 -101 -97 12 198 60 -85 136 237 -49 79 200 -230 -124 -172 -39 -241 54 95 -89 -13 -425 -141 92
6534 92 -105 53 109 -246 51 -138 -185 38 -121 -65 42 174 309 -51 -71 120 38 -77 -106 173 70 113 -7
6557 -7 148 78 39 211 95 -74 71 -106 -11 105 -143 -262 153 162 -240 131 13 -42 198 59 -270 -190 -173
6580 -173 -19 -130 115 -5 -104 24 23 71 5 91 57 -154 196 -332 116 111 -51 -54 -251 -103 -61 43 -87 -83 5
6605 5 -87 -50 -76 -79 -32 80 75 33 118 42 -144 -88 -94 153 -317 36 -8 -56 38 -192 60 -68 83 -106 -209 -228 32
6632 32 146 316 75 178 70 23 41 -15 84 86 -332 315 -47 -136 -35 -93 197 -133 114 202 -12 -284 -87
6655 -87 -215 111 140 -192 84 -3 -52 42 119 -148 -82 205 114 -142 -115 210 -135 241 -34 75 -146 -154 -94 3
6679 3 291 160 -62 66 -25 -63 48 -210 85 118 -81 -161 -170 30 -265 -76 -59 58 -148 133 -21 -68 -106 123
6703 123 109 165 -14 -290 21 57 101 8 111 82 66 -304 -40 -20 161 192 -237 -93 97 -129 -28 233 72
6726 72 202 46 137 133 68 -89 42 14 24 75 -182 -19 -121 -230 -205 -242 144 -162 44 -126 -217 -104 -29 90
6750 90 329 185 -8 -201 179 -123 100 72 -236 205 -115 84 193 134 69 -74 -66 -79 -160 179 115 -22 54
6773 54 -74 23 -65 -102 -88 -126 -157 39 -308 -206 -137 -135 92 348 -192 211 1 -198 87 -87 -24 -39 -74 -478
6797 -478 257 307 161 42 99 185 -108 147 2 0 217 134 -189 91 -342 129 9 45 50 0 229 -156 265
6820 265 36 68 -40 -68 143 -82 136 -78 64 75 -67 160 -14 153 -15 47 32 92 35 126 -245 36 -76
6843 -76 -55 184 238 76 58 80 106 116 -183 -46 -5 83 285 35 37 -60 68 -156 77 -282 114 194 53 136 -17
6868 -17 94 4 71 263 169 195 -108 -15 -294 -231 24 57 50 -126 175 162 -73 241 -217 33 57 -241 108 239
6892 239 -264 -62 -305 -20 125 22 10 89 -12 62 -2 -127 249 -130 -152 111 -136 -109 39 -119 68 -203
6914 -203 33 -41 -126 231 -142 129 266 -331 -98 19 285 41 -6 -2 137 -84 -96 54 -157 1 65 -140
6936 -140 -166 -251 -1 47 229 -192 -109 126 103 165 -131 326 -12 224 -529 92 -16 -149 80 -81 55 161
6958 161 40 -16 -306 -110 202 -284 321 -51 -95 -73 -130 -307 -57 100 4 169 -69 -44 -3 -134 236 23
6980 23 170 84 28 -77 3 78 53 90 -91 87 -72 -39 90 35 -6 -80 -56 54 175 -88 -49 45 65 53 -50
7005 -50 71 358 -171 73 81 -75 34 62 24 -180 187 2 -20 -39 86 95 -75 -279 29 25 -1 -68 -159 -44 145
7030 145 66 76 229 28 222 199 159 -159 154 201 35 13 -23 -269 -194 -226 252 -81 259 38 3 -49 76 157
7054 157 155 143 -100 126 198 84 50 244 -79 -84 -311 94 42 105 -57 -119 88 -148 187 207 7 44 119 -134
7078 -134 -100 -28 1 31 -475 43 4 -58 -165 -205 -99 -27 -135 -285 -263 -100 300 -2 119 24 80 51 -42 15 264
7103 264 297 59 125 -43 88 -93 156 70 -116 -61 -46 -202 141 -239 -113 167 -187 168 369 -38 -97 38
7125 38 -43 259 -101 15 47 -24 159 -148 -54 -20 -40 4 77 242 56 -9 14 -55 -123 -171 2 302 199 -310 128
7150 128 -188 -187 153 -111 137 -156 -160 -171 -88 56 57 64 -89 98 157 -197 177 217 -243 -122 -59 13 -119 38 1
7175 1 -337 -245 -214 -105 -12 16 -117 81 -153 -310 275 50 -81 -42 -188 45 269 -105 67 76 98 -74 -86 9
7199 9 -93 -57 -69 125 30 253 183 -115 201 61 63 69 286 114 217 211 -55 -100 17 -215 -62 -44 -64 -58 69 -35
7225 -35 -121 195 113 71 299 -18 -11 -1 -95 -33 -19 175 -164 50 -254 179 -34 -47 -41 -121 65 59 -69 256 14
7250 14 -111 9 83 38 52 22 80 113 -17 100 -267 232 -65 -136 -219 112 134 -21 202 -23 7 -17 -118 60
7274 60 -270 -65 222 -262 109 -184 -199 -45 77 148 114 98 176 -39 107 -152 -62 147 160 -186 -12 -195 20
7297 20 -122 -324 135 98 -279 113 137 264 151 64 131 -136 249 -117 -85 99 16 97 -165 -229 165 -146 -120
7320 -120 95 106 187 61 57 -65 -3 177 190 -7 5 -123 303 385 44 113 -64 122 256 88 -126 -7 59
7343 59 20 213 -102 47 75 101 137 -104 -223 70 -53 115 -10 223 85 -145 168 -186 99 105 98 22 80 -42
7367 -42 -191 142 13 -67 38 -57 -281 -69 78 -88 -12 -138 232 -203 -60 -204 -70 -59 102 -130 -113 2
7389 2 179 42 -5 4 287 37 -7 22 129 35 200 -338 -363 -252 -227 30 -23 48 -79 129 -138 -27 -2 153
7413 153 38 -168 -229 18 -37 -287 -152 40 69 -146 -4 -16 -71 28 -87 -110 59 -10 -41 -6 281 307 89 28
7437 28 -21 -7 -23 -115 -198 102 171 172 -341 18 66 64 -92 -279 128 -167 78 -57 75 69 130 164 -105 33 -108
7462 -108 -115 237 33 154 -210 -358 106 33 170 257 40 60 -49 103 -32 26 34 -91 12 -231 105 201 -73
7485 -73 12 124 139 152 181 -55 -197 439 90 -88 -198 97 -129 -93 221 -34 113 -210 99 119 142 19 83
7508 83 212 -233 244 -84 5 -87 225 -144 -133 11 103 -12 -44 187 104 150 39 135 -49 -118 -41 -12 -60 150
7532 150 -133 59 131 53 18 -145 -115 11 47 149 115 -181 -123 -20 59 107 -37 -37 18 180 197 95 4 -205 -72
7557 -72 171 42 107 123 206 130 -197 -249 85 -57 287 -42 38 -107 -117 61 11 137 -118 -3 -41 -145 -38
7580 -38 157 159 -134 -137 98 -185 -43 141 22 94 -196 45 177 72 -78 -26 38 -82 15 -113 93 65 -58
7603 -58 221 -32 95 -152 36 166 193 -360 110 -11 268 118 -21 156 -108 66 173 -22 -155 -170 133
7624 133 1 -137 -1 64 134 -280 -213 -331 -105 64 -233 -225 -87 63 -153 -410 -31 -1 -233 -15 148 -8
7646 -8 -151 -382 161 48 80 -64 118 101 32 -78 123 -67 94 351 -178 -14 196 45 -107 77 -173 -58
7668 -58 66 -138 197 -84 168 -62 -136 -156 -164 -3 30 228 205 -1 79 -19 -92 34 -20 49 31 176 -136 -10
7692 -10 -9 45 -23 174 -47 73 229 214 118 -67 149 48 -151 118 -28 72 143 -64 227 15 133 -170 21
7715 21 -282 2 11 -70 57 -108 -198 -93 270 127 93 -148 131 -141 -127 204 -6 11 187 -4 -63 225 -157
7738 -157 -98 -74 -115 69 -287 62 41 -48 53 -8 -151 -194 105 -198 246 177 54 4 34 -24 24 6 94 3 106
7763 106 47 -66 69 115 -407 -131 -141 -136 -166 35 46 15 -168 -86 -139 -224 121 43 -73 121 35 94 -112 -172 -177 213
7789 213 201 -54 280 -47 13 249 -240 -246 -11 -134 -92 -118 -126 -163 -207 193 -24 -79 28 17 4 9 -146 -174 -138 90
7815 90 290 -175 -170 219 217 -120 -36 -36 190 -171 283 61 -95 -35 -119 44 -120 -267 113 180 -184 195 -62 99
7839 99 6 144 -10 15 249 33 16 -197 -16 407 164 322 131 -123 -123 165 134 -71 -68 -2 36 216 160 -332
7863 -332 226 37 17 -180 101 -123 -54 126 116 -132 119 24 142 0 -219 55 -147 -95 -338 117 -96 -212
7885 -212 123 -125 147 37 -15 30 -30 35 -144 355 -244 -35 -305 76 67 -69 -19 -143 -183 -122 138 74 76 -55
7909 -55 33 -98 90 -77 130 -9 34 -221 -30 24 266 -80 46 18 450 115 -136 -293 -95 62 -154 139
7931 139 -64 -260 166 -197 90 128 98 -23 25 10 -17 -176 346 -66 -147 -51 -33 118 -252 -213 -191 167 -21
7954 -21 -75 8 229 244 -161 -104 92 -152 4 106 -211 -79 -152 129 -29 97 -49 35 2 138 35 50 111
7977 111 142 17 68 231 131 31 -243 -194 -142 -61 -17 62 33 -162 -140 -15 215 22 115 -73 164 -27 -183
8000 -183 -38 -117 283 35 17 305 120 10 215 135 -206 152 -58 -23 -119 195 147 -184 122 -62 -80 -33 -170
8023 -170 -16 -38 246 51 7 9 268 -108 184 19 166 5 -57 102 -258 -115 -166 113 65 -218 -25 -112 -66
8046 -66 258 -69 258 -346 -9 332 -196 -92 -253 -59 -34 -20 2 42 18 -184 48 11 -110 9 215 54
8068 54 224 -36 -110 265 -10 54 -8 38 68 86 186 86 247 23 -164 10 86 -22 -182 38 104 97 -119 -228
8092 -228 -268 14 143 -23 105 286 70 -6 -8 144 145 -186 -231 238 41 154 -119 131 -72 -138 -62 -196 51
8115 51 188 -185 -114 -307 87 -153 128 27 -172 226 55 146 -45 -139 -159 300 257 114 52 -55 -159 276
8137 276 -61 45 65 -26 113 23 -59 43 -36 -184 -21 -14 101 134 168 -182 39 284 -85 142 -151 73 -58
8160 -58 -78 8 -121 93 150 -98 6 -15 118 -53 -130 178 -123 148 224 -146 83 -157 -55 -149 125 59 -108
8183 -108 -53 -135 -75 -93 24 -116 101 269
8191B69
$$ Imaginary data points
##PAGE= N=2
##DATA TABLE= (X++(I..I)), XYDATA
0 0 0 0 0 0 0 0 0 0 0 0 8 -8 8 -8 8 -16 16 -24 24 -32 40 -48 56 -64 77 -88 104 -120 136 -158 181 -206 233
33 233 -263 298 -335 377 -423 471 -527 586 -650 722 -800 884 -977 1078 -1189 1310 -1443
50 -1443 1589 -1751 1932 -2131 2354 -2608 2894 -3226 3608 -4063 4607 -5276 6121 -7224 8739
65 8739 -10952 14510 -21181 38096 -178511 -242883 141644 251663 157414 -102138 -161258 -8206
77 -8206 213504 251577 75206 -177921 -225864 -82151 117273 152207 -24097 -224195 -221859
88 -221859 -32341 198821 241761 86928 -75138 -93605 26653 146734 93553 -72490 -202638
99 -202638 -188519 -31219 110900 105195 -683 -98965 -65421 83683 183403 146819 5150
110 5150 -123658 -110274 -13306 41674 10691 -86042 -132317 -59051 55383 130139 108433 10880
122 10880 -43526 -17152 51867 96472 35579 -77820 -132953 -106833 -19610 42095 18994 -17941
134 -17941 -17818 30636 101450 108175 47337 -24615 -75924 -57067 -1975 13407 -11656 -62327 -84943
147 -84943 -32846 35070 69865 62072 21460 14804 41916 49716 31726 -23701 -84587 -92304 -63640
160 -63640 -16443 24645 17183 -1312 678 22405 64465 72480 34386 -233 -22842 -21332 -9064
173 -9064 -30538 -57439 -65554 -55033 -7569 39749 59266 61852 35253 13507 20289 19688 11077
186 11077 -13932 -52177 -54437 -36191 -23458 -11001 -15948 -11478 19614 43278 64421 67507 35260
199 35260 3210 -24992 -41483 -30017 -29196 -37969 -35618 -28574 -428 28300 28302 28643 27383 27282 39842
214 39842 31503 8449 -13859 -47863 -62034 -51330 -35129 -6280 8684 10729 28306 39685
226 39685 43467 39199 12024 -4143 -5005 -13152 -14787 -24618 -40782 -38922 -34979 -16837 18005 36053
240 36053 45883 44481 28311 25475 14867 -11515 -27807 -42648 -40577 -21466 -16719 -10281 -2119
253 -2119 -1312 14388 28955 36874 48087 34730 9644 -6254 -25526 -32637 -36697 -47275 -34829
266 -34829 -12697 7127 29238 29782 25241 28410 19788 17448 17102 2479 -8342 -25768 -43503 -37746
280 -37746 -31115 -21399 -3792 7005 28807 48618 42768 33425 14731 -6575 -10888 -20214 -25212
293 -25212 -20410 -26628 -26144 -18794 -12948 8729 23718 26746 37370 37192 31086 20622 -9449 -30799
307 -30799 -38200 -42735 -29822 -17604 -9381 8168 12372 15033 26305 26593 27855 24040 7860 2250
321 2250 -6926 -24661 -33661 -43729 -38115 -14837 358 18365 32807 31287 32023 23795 8931 5951
335 5951 -5001 -16425 -18635 -26053 -23541 -18358 -23132 -12389 3181 17708 37570 39313 31615 25116
349 25116 4101 -11634 -21472 -32637 -27412 -22912 -20863 -5745 2186 8129 16680 14717 21481 30612
363 30612 24513 17718 2107 -17846 -25313 -35187 -36840 -22559 -12679 3487 18834 21165 28136 26377
377 26377 14543 10507 2527 -2203 -2298 -16152 -23884 -25507 -29083 -17895 -5727 4387 24485 31685
391 31685 31340 29661 14259 2236 -9007 -24589 -23523 -20117 -18661 -10547 -10818 -7103 6394 10946
405 10946 19819 27933 25161 24474 13474 -5358 -14749 -27805 -33850 -26618 -21595 -5897 10288 13232
419 13232 18892 19715 16140 19417 12818 5848 3510 -8690 -16593 -21794 -30419 -23857 -14637 -5567 13046
434 13046 23773 29027 31076 17414 7631 911 -10789 -12875 -16456 -20624 -14650 -14940 -13557 -3633
448 -3633 1509 13405 24373 24932 28307 21685 5115 -6200 -21615 -28816 -23209 -22472 -13742 -1962
462 -1962 2600 12054 15304 13436 19063 16743 13455 12296 -527 -8741 -16548 -28931 -27632 -21116 -12939
477 -12939 4534 13562 20013 27011 20526 14998 8876 -2996 -4283 -8737 -15772 -14124 -17996 -18837 -11969
492 -11969 -8574 3954 17990 22520 28277 24233 11987 5333 -9310 -19680 -19868 -22445 -16187 -8069
506 -8069 -6598 1762 6443 7452 16041 17209 18631 20293 9032 -606 -9388 -22685 -24111 -23386 -19936
521 -19936 -5040 4214 11429 19589 16348 15695 13877 5295 4514 624 -7230 -8937 -17280 -21518 -16701
536 -16701 -15073 -4643 7845 14577 24323 24573 16309 11805 -661 -9808 -11911 -17052 -13705 -10086
550 -10086 -11396 -5788 -1985 1026 10929 14118 17511 22218 15146 7926 -814 -15480 -19353 -21507 -21227
565 -21227 -10065 -3505 3636 12203 10832 12630 13734 8800 9703 6562 -693 -3067 -11810 -18709 -18154
580 -18154 -19606 -10789 579 7107 18126 21289 16957 14965 5057 -2545 -4180 -11090 -11419 -9812 -13225
595 -13225 -9874 -7927 -6358 3363 8573 14617 22016 17409 12908 6249 -7493 -12574 -17130 -19327 -12020
610 -12020 -8370 -3579 4382 4496 8026 11398 9265 13104 12060 6300 3839 -5776 -13914 -15968 -20538
625 -20538 -14929 -6147 -630 10368 15165 14020 15393 8934 3585 2322 -3909 -5267 -5753 -11579 -11381
640 -11381 -11784 -12263 -3679 1854 8951 18124 17124 16133 11750 116 -5067 -11158 -15557 -11283 -10036
655 -10036 -7439 -969 -1629 1963 6906 6934 12169 12837 10196 9508 -150 -7938 -11869 -17559 -15655 -9523
671 -9523 -5353 4835 8866 9131 12897 8718 6240 6592 1174 120 -1679 -8774 -9781 -12556 -14579
686 -14579 -7640 -3504 3464 13178 14209 15706 13250 3986 -199 -5630 -10953 -8407 -9759 -8644 -4260
701 -4260 -6003 -2131 2621 3422 10571 13314 11996 12475 5033 -2817 -7278 -14877 -14965 -11202 -9464 -1008
717 -1008 3667 4500 9341 7925 6735 8872 5020 4694 3086 -4288 -6737 -11377 -14902 -9955 -7675 -2053
733 -2053 6606 9302 13104 13743 7442 5472 -177 -4964 -3873 -7041 -8145 -5913 -9443 -7181 -2814
748 -2814 -1605 6244 11388 11664 14475 9179 2673 -1357 -9749 -11445 -10207 -10761 -4780 -1569 -637 4505
764 4505 4213 5051 9103 7217 8222 7737 850 -1859 -7648 -13522 -11512 -10972 -6682 1949 4549 8840
780 8840 11335 7097 7156 4019 68 1205 -2759 -5291 -4676 -9798 -9373 -6599 -6175 1589 6911 9190
796 9190 13831 10538 5991 3121 -4906 -6764 -7103 -9473 -5174 -4034 -4278 487 35 1542 6776 6437
812 6437 9242 10138 4376 2143 -3947 -10340 -9567 -10794 -8083 -1290 436 5173 7544 4836 6646 5051
828 5051 2480 4285 667 -1738 -2681 -8093 -9356 -8026 -8265 -1931 2822 5891 11181 9366 6966 5432
844 5432 -1123 -2934 -4004 -6716 -4123 -4348 -5820 -2442 -3386 -1740 3703 4436 8606 10397 6341 5228
860 5228 -304 -6560 -6936 -9740 -8457 -3433 -2444 1705 4397 2234 4948 4966 3190 6404 3632 1509
876 1509 870 -6003 -7626 -8367 -10014 -4639 -771 2051 8049 7518 6917 6922 1477 534 -91 -3800 -2368
893 -2368 -3945 -6099 -4314 -5723 -4303 612 1894 6787 9904 7374 7422 3095 -2938 -3954 -7247 -7330
909 -7330 -3690 -4652 -1232 733 -644 2929 3341 3219 7224 5616 4410 3490 -2919 -4829 -7048 -10223
925 -10223 -6105 -3293 -876 4928 4730 5558 6671 2332 2604 2311 -1066 436 -2020 -5219 -4426 -6863
941 -6863 -6153 -2002 -988 4042 7981 6898 7769 4406 -152 -724 -4423 -5476 -2996 -4422 -2429 -1455
957 -1455 -3497 -45 787 1910 6331 5904 5932 5667 220 -2596 -4746 -8569 -6123 -4845 -3111 1868
973 1868 2275 2883 4729 2348 3221 3888 1179 2582 551 -3199 -3069 -6942 -7263 -3862 -3453 1315 5071
990 5071 5059 7406 5232 1791 1765 -1641 -2622 -1807 -4230 -3002 -2357 -4812 -2303 -1426 -299 4818 4787 6179
1008 6179 6823 2596 534 -1948 -6315 -4864 -4940 -4322 -376 -700 624 3084 1089 2977 4585 2968
1024 2968 4933 2749 -807 -1274 -5662 -6979 -5236 -5419 -1049 2549 2344 5871 4824 2595 3524 215
1040 215 7 712 -2180 -2141 -2552 -5456 -3521 -3515 -2447 2492 3340 5487 7088 3484 2623 340 -4084 -2950
1058 -2950 -3785 -3925 -1495 -2246 -1711 421 -683 1540 3428 3011 5807 4305 1069 966 -3327 -5206
1074 -5206 -4435 -5540 -2624 36 603 3789 3261 2184 3522 1535 1167 2666 -330 -362 -1645 -5017
1090 -5017 -3918 -4398 -3859 530 1462 3647 5995 3759 3151 1781 -1875 -931 -2137 -3173 -870 -2696
1106 -2696 -2557 -1063 -2917 92 2136 2492 5425 4517 2437 2521 -1869 -3761 -3434 -5335 -2930 -1028
1122 -1028 -1159 1872 1170 490 3089 1518 2248 3530 1172 1232 -439 -3949 -3570 -4961 -4703 -962 -386
1139 -386 2280 4549 3043 3628 2424 -481 729 -422 -1878 -458 -2612 -2716 -2340 -3759 -1569 873
1155 873 1256 4809 4664 3685 3699 -61 -1896 -2091 -4301 -2574 -1788 -2489 250 60 -448 1808 1214 2628
1173 2628 4569 2724 2794 1149 -2457 -2319 -4233 -5380 -1904 -1767 409 3036 1664 3179 2879 598
1189 598 2077 769 -165 782 -1665 -2574 -2441 -4464 -2931 -915 -284 3296 3941 3723 4496 1163 -53
1206 -53 -229 -2757 -1778 -1280 -2866 -804 -1758 -1993 192 -40 1528 4366 3099 3656 2875 -469 -790 -3253
1224 -3253 -4443 -2631 -2796 -1326 1304 280 1566 2040 802 3073 1854 1450 2440 -234 -1347 -1766
1240 -1766 -4473 -3449 -2411 -2152 1297 2383 2642 4242 2158 1404 1067 -1189 -562 -560 -2301 -963 -2453
1257 -2453 -2798 -1384 -1530 457 2811 2627 4255 3641 1023 1031 -1607 -3162 -2057 -2862 -1883 -120 -1010
1274 -1010 504 807 50 2167 2192 2167 3550 1056 69 -800 -3741 -3298 -2829 -3051 224 768 1265 3373
1292 3373 1747 1521 1951 192 948 608 -1115 -389 -2098 -3427 -1786 -2587 -1223 1579 1482 3690 3536
1309 3536 1822 1855 -508 -1739 -1152 -2684 -1912 -727 -2294 -857 -279 -831 1205 1835 2282 3749 2110
1326 2110 1290 511 -2666 -2474 -2528 -3240 -787 -436 -187 2048 1016 1620 2180 428 1766 1809 -140 399
1344 399 -1628 -3140 -2354 -3324 -1838 582 609 2544 3425 1925 2417 841 -470 224 -1427 -1469 -900 -2580
1362 -2580 -1476 -1269 -2232 729 1218 1701 3749 2590 2001 1500 -1202 -1478 -2160 -3273 -1146 -1123 -657 1099
1380 1099 141 412 1870 749 2563 2230 1233 1139 -631 -2258 -1868 -3361 -2590 -570 -707 1435 2228
1397 2228 1732 2161 1577 551 1028 -280 -437 -135 -2089 -1840 -1988 -2816 -318 82 1077 3331 2537 2652
1415 2652 2181 -183 -789 -1357 -2556 -1674 -1843 -1958 161 -841 -324 927 715 2301 2417 1529 1932 460
1433 460 -1488 -1271 -3356 -2690 -1313 -1657 536 1266 784 2294 1585 973 1893 623 432 192 -1771 -1768
1451 -1768 -2279 -3269 -1497 -905 455 2480 2143 2617 2682 752 659 -430 -1806 -561 -1653 -1867 -714
1468 -714 -1817 -1131 371 78 2016 2972 2160 2741 1414 -240 -458 -2460 -2238 -1979 -2223 -452 101 -85
1486 -85 1371 1012 1204 2171 1208 1341 1305 -887 -855 -1934 -3219 -1794 -1774 -1102 861 1066 1967 2610 1073
1505 1073 1362 824 -665 27 -919 -1494 -1161 -2147 -1701 -915 -899 784 2032 1626 2970 2024 651 688 -1353
1524 -1353 -1605 -1363 -2225 -833 -604 -835 695 93 477 2217 1454 1720 2154 308 105 -1286 -2566 -1998
1542 -1998 -2116 -1822 217 262 1222 1970 909 1731 1160 410 1045 -102 -989 -670 -2002 -1951 -1641 -1528 79
1561 79 1015 985 2485 2135 1161 1355 -421 -749 -864 -1788 -1059 -996 -1544 -83 -415 -194 1586 1469 1948 2390
1581 2390 851 991 -79 -2006 -1407 -2123 -1730 -222 -610 362 1299 1074 1466 1265 532 1337 601 -406
1599 -406 56 -1678 -2061 -1461 -2092 -774 294 606 1921 1825 1241 2116 238 -69 79 -1438 -542 -1330
1617 -1330 -2116 -547 -1020 -583 826 698 1775 2638 1371 1552 383 -961 -606 -2118 -1970 -921 -1186
1634 -1186 -466 373 200 1091 1408 783 1651 1221 667 414 -963 -1787 -1515 -2202 -1355 -614 -295 1327 1260
1653 1260 1335 1696 959 640 751 -438 -332 -745 -1517 -1228 -1742 -1671 -63 20 1342 1991 1537 1696 897 -47
1673 -47 -15 -1017 -1564 -819 -1578 -893 -43 -723 238 922 663 2157 1497 1020 1243 -70 -780 -1205 -1860 -1306
1693 -1306 -1195 -1119 311 600 797 1621 691 843 1316 211 135 -202 -1467 -944 -1678 -1768 -658 -478 533
1712 533 1463 1107 1769 1433 309 460 -550 -1091 -473 -1319 -1197 -638 -1029 -311 343 164 1608 1490 1156
1731 1156 1620 724 -137 -395 -1813 -1167 -1121 -1017 -198 -229 396 1147 674 1014 1379 714 1115 397 -664 -853
1751 -853 -1413 -1661 -1017 -1554 -390 811 650 1434 1639 1076 1431 190 -565 30 -995 -1193 -854 -1722 -737
1770 -737 -341 -601 1143 1220 1359 2066 812 520 253 -974 -1022 -1264 -1493 -119 -576 -447 610 368 855
1789 855 1079 753 1278 979 -382 65 -803 -1638 -1039 -1334 -1068 -61 174 1092 1043 561 1306 936 172 318
1809 318 -708 -688 -765 -1580 -1094 -846 -830 591 281 816 1791 1166 924 510 -473 -230 -740 -1800 -794 -921
1829 -921 -672 -16 -433 409 1141 987 1160 889 336 475 -332 -1367 -1087 -1456 -893 -327 -662 572 935
1848 935 590 993 682 773 974 -25 -329 -187 -1210 -999 -1275 -1207 -67 468 559 1500 847 1317 1056 92
1868 92 -18 -365 -914 -884 -1003 -906 -307 -551 -278 761 567 1391 1248 488 973 18 -622 -564 -1303 -971 -387
1889 -387 -942 -207 243 153 1169 741 584 1027 409 394 -168 -1217 -1080 -700 -1402 -638 -228 -49 998 794
1909 794 798 1209 616 703 305 -508 -11 -909 -1461 -1095 -1095 -562 136 -18 794 1099 915 1166 607 -40 24 -1131
1931 -1131 -1051 -978 -1126 -168 -413 -637 684 707 532 1030 641 909 785 -570 -413 -898 -1245 -630 -881 -558
1951 -558 498 301 901 1049 385 860 701 -183 100 -632 -781 -882 -1117 -955 -492 -222 674 910 1076 1385
1971 1385 686 176 254 -488 -547 -442 -988 -562 -502 -772 -128 296 579 1176 467 947 690 98 -53 -722 -1085
1992 -1085 -909 -958 -802 -152 154 353 1096 226 907 798 454 501 -6 -664 -138 -1070 -960 -435 -733 72
2012 72 226 660 1214 974 598 975 31 -70 -400 -934 -745 -668 -748 -152 -225 -128 779 809 1012 1047 155 541
2034 541 260 -738 -581 -955 -888 -701 -607 -146 793 563 856 798 720 960 132 -526 -269 -966 -667 -879 -1235
2055 -1235 -171 187 451 942 668 666 1022 120 116 167 -290 -279 -643 -914 -357 -463 -302 210 473 668 1183
2076 1183 503 727 635 -134 -276 -869 -1328 -444 -483 -308 145 128 787 736 372 957 559 378 457 -706 -478
2097 -478 -367 -948 -679 -406 -482 649 645 634 827 412 579 580 -306 -120 -524 -790 -650 -700 -631 -24 -163 352
2119 352 841 483 763 596 73 240 -521 -893 -669 -704 -381 -98 -355 361 569 408 758 698 521 681 -92
2140 -92 -309 -357 -1024 -643 -490 -698 302 261 387 797 305 879 470 20 177 -309 -774 -645 -715 -835 -199
2161 -199 -474 87 536 546 1071 809 109 265 -246 -353 -312 -837 -566 -617 -682 26 199 143 624 810 581 739
2183 739 335 -212 -92 -717 -849 -501 -601 -309 -226 158 717 231 665 719 438 368 254 -323 -378 -731 -734 -584
2205 -584 -572 -130 339 317 860 649 448 718 50 -126 80 -427 -548 -312 -718 -517 -418 -39 240 609 742
2226 742 939 353 305 131 -558 -499 -563 -972 -220 -425 -284 251 73 332 777 422 506 220 -26 109 -562
2247 -562 -849 -729 -468 -315 -10 305 669 425 238 794 331 337 568 -178 -318 -264 -794 -764 -352 -340 -63 -12
2269 -12 765 983 369 165 418 -316 -379 -255 -653 -334 -659 -385 -96 -198 100 405 286 417 465 160 177
2290 177 -315 -466 -85 -762 -492 20 -285 411 587 470 443 424 422 321 -81 -313 -228 -753 -382 -331 -592 -76
2312 -76 121 479 1011 358 604 474 -130 283 -362 -604 -405 -438 -127 -94 -443 -217 289 165 764 819 343
2333 343 404 -411 -501 -231 -642 -637 -260 -494 345 486 9 400 656 445 600 247 73 -39 -592 -530 -497 -636
2355 -636 -62 -427 69 634 318 560 686 275 331 17 -370 -225 -334 -755 -185 -706 -271 16 -35 940 683
2376 683 577 507 139 26 -256 -789 -530 -579 -708 -146 144 -116 64 344 467 529 275 284 336 -118 -294 -475
2398 -475 -784 -215 -235 -580 299 308 333 888 258 439 325 -261 -253 112 -700 -465 -694 -345 97 34 374 316 510
2421 510 367 71 213 213 -525 -435 -704 -808 -203 39 -229 248 138 316 712 228 357 185 75 45 -313
2442 -313 -606 -496 -451 -326 -8 28 345 456 481 601 431 -42 -54 -333 -159 -250 -509 -623 -413 -81 22 508
2464 508 583 643 560 289 412 -272 -280 -195 -691 -134 -79 -513 -178 95 246 611 573 322 257 84 -138 -64 -500
2487 -500 -599 -536 -411 87 -74 216 418 -15 382 325 -115 444 227 -71 14 -457 -840 -291 -504 -148 173
2508 173 185 574 419 455 523 -24 -74 83 -460 -146 -312 -153 -293 -308 -68 440 459 529 717 365 228 -12
2530 -12 -558 -133 -163 -758 -180 -165 249 -36 45 357 287 163 337 274 -26 -92 -262 -101 -343 -546 -71 -292
2552 -292 208 307 464 49 307 86 150 -151 -332 -78 -277 -582 -8 -325 -239 216 216 233 320 263 16 336 -36
2575 -36 -305 -297 -214 -192 -275 -110 -75 12 119 373 419 315 148 55 -248 -122 -546 -271 -707 -444 -86 170 322
2598 322 399 458 702 114 -1 357 -68 -4 -117 -420 -497 -117 -96 -2 163 116 563 586 365 72 -124 66 -48
2621 -48 -219 -212 -313 -190 -22 -336 241 302 438 267 409 262 306 158 -133 -273 -374 -239 -91 -186 126 292
2643 292 138 811 253 25 501 -71 54 121 -265 -568 -467 -384 -145 160 20 325 251 156 237 -198 120 -290
2665 -290 -383 -243 -314 -491 -137 -342 -54 262 34 293 275 119 279 -69 -100 -65 -626 -297 -22 -57 33 -101
2687 -101 72 246 32 143 438 168 4 -112 -270 -156 -416 -439 -103 -129 -163 329 498 458 34 -259 90
2708 90 -98 -161 -126 -147 -222 -133 -390 106 95 -213 300 428 338 497 312 -49 255 -557 -280 -354 -484 -91 -139
2731 -139 -10 69 121 345 279 337 33 154 -369 -367 -226 -409 27 -288 -159 -45 118 375 131 -37 298 74
2753 74 -17 -56 -114 -303 -56 -450 -205 69 -318 228 308 259 550 443 71 -171 -126 -465 -311 -348 -184 -130 61
2776 61 -63 -166 298 513 456 242 203 -38 -152 -315 -606 -254 -432 -135 113 149 155 237 233 577 134 77 -10 -304
2800 -304 -32 -68 -419 -107 -109 46 -59 -56 270 459 23 125 201 164 55 -455 -217 -6 -184 -387 -135 -112 279
2823 279 422 226 276 247 74 531 -216 -355 -383 -124 -187 -132 253 -223 343 109 143 -227 55 -201 -38 -36 142
2846 142 -467 -185 -202 -128 -36 398 -57 355 317 204 319 -200 -116 -182 -169 -167 -116 54 39 -86 -77 252 93 177 261
2871 261 194 255 14 -180 -81 -242 90 -278 -63 117 -531 120 252 248 9 299 120 198 121 -385 -342 -542 -144
2894 -144 -66 -297 139 416 248 547 195 29 -73 -142 -83 159 -236 -83 -256 155 -229 5 302 109 465
2915 465 84 430 110 -26 -182 -261 -294 -154 -347 -62 112 -23 41 87 442 231 40 169 85 -256 -92 -157
2937 -157 -695 -188 27 -125 326 226 109 430 -129 214 64 -63 232 205 -379 -305 53 -83 -90 -221 463
2958 463 522 520 257 58 -101 -107 -433 -331 -88 -380 -32 135 -291 -82 0 -1 -43 199 249 274 -148 -221 -359 -330
2982 -330 -228 -304 183 257 93 361 133 -140 165 158 -129 -109 116 -235 -33 -356 -152 -169 -210 -81 556 387
3004 387 179 335 151 110 -221 -18 -51 -114 -133 -396 49 -117 -4 -98 240 254 6 200 8 -40 -81 -145 -88
3027 -88 -96 -346 175 61 126 383 166 204 50 -168 -63 188 -207 59 6 -405 -189 -116 148 196 138 374 421
3050 421 -33 247 180 154 -54 -132 -94 -289 -105 -144 -8 79 561 356 213 236 -53 -84 93 12 -327 -128 -288
3073 -288 -260 128 -217 210 102 287 168 81 127 356 2 -93 -156 2 -169 -234 97 221 286 132 -68 -42 225
3096 225 -67 37 121 141 114 278 -276 -233 94 246 262 55 320 271 -47 15 -62 -131 175 -191 149 59 152 -64
3120 -64 176 121 222 186 133 131 173 -408 75 -284 -454 -221 -90 -46 25 43 -51 251 272 93 304 14 59 -99
3144 -99 11 102 -281 22 -152 -35 -43 84 157 477 424 31 -124 -420 -102 -376 -98 -145 118 -12 231 69
3166 69 152 311 25 271 253 206 183 -188 -129 -225 -113 147 -45 10 300 -42 148 121 249 -309 1 -14 -28 76
3190 76 48 -197 -163 220 -63 -158 344 335 102 130 -255 -329 94 -45 50 -41 -83 -50 16 -259 270 280 -27 304 271
3215 271 -75 -170 47 -360 -220 -97 -127 53 -289 -149 135 363 22 -7 95 205 274 -110 -116 -215 -217 -100 -67
3238 -67 41 -3 83 -55 363 394 282 -110 104 -146 -114 -8 135 -62 78 38 -66 457 46 303 238 382
3260 382 -80 -270 -215 -36 -339 -76 -3 -254 194 61 111 145 82 193 321 282 150 -64 -99 -125 -60 -321 -120
3283 -120 122 -124 225 7 345 67 -112 -6 -77 -100 8 -108 -661 -3 -60 -154 -1 80 381 133 278 86
3305 86 32 -93 -156 -176 -144 -121 -302 -110 77 -62 -14 208 -155 526 213 346 118 -153 -209 -221 -344 -54 121
3328 121 -26 194 -34 351 -277 -16 321 214 -192 -90 38 -228 0 -292 -179 -22 -144 148 74 160 263
3349 263 278 -386 -40 200 -263 -22 -108 -41 -103 -115 49 276 -214 -38 110 145 35 -161 -178 -97 -206 -152 48
3372 48 -217 -173 -72 160 99 -47 -36 79 45 -118 -6 -159 -116 -377 -167 89 -160 287 239 64 237 -67
3394 -67 -61 160 -6 -70 -64 -118 152 -87 -224 -1 -26 145 245 48 296 33 109 -25 -433 -202 -193 59 -259 370
3418 370 29 61 -35 212 197 463 163 214 178 -212 -106 -50 14 -14 36 1 60 -159 76 327 111 -121 99 100
3442 100 -124 30 -89 -218 131 -153 -116 -185 309 85 373 340 -10 96 39 -170 -112 -41 -210 74 -46 -11
3464 -11 18 -185 21 127 197 92 177 4 -176 55 -98 -143 -286 -76 -107 -150 55 254 -32 22 -6 7 21 -33
3488 -33 -242 -88 55 -178 -221 -130 412 262 150 104 109 267 13 -46 -213 -341 -191 8 -203 9 -52 42 -37
3511 -37 215 489 332 79 79 133 -298 -141 -356 -75 -80 134 15 141 3 268 221 206 -36 184 -38 11 -126
3534 -126 -506 97 -249 -179 -87 150 66 486 77 203 97 84 -21 157 -20 -155 -9 -53 1 166 88 231
3556 231 201 131 159 332 -24 5 -60 -79 -394 27 53 -13 185 -171 -62 -82 342 -51 279 81 -92 102 -141
3579 -141 -232 -71 -28 91 -83 133 -164 -123 135 -91 231 -85 11 -125 -18 39 265 -63 -106 210 -357 -292
3601 -292 71 -25 -223 195 294 -115 -280 0 -81 -117 174 165 3 -40 4 -111 -47 244 -6 167 -28 -24 -201 -188
3625 -188 -266 126 95 172 362 -1 265 170 152 26 51 -88 90 -106 -350 -146 -174 -8 -4 -72 -102 147 312 117
3649 117 386 94 86 -83 -157 135 -242 -203 -210 89 200 164 116 314 -19 190 14 -33 30 -289 -294 -14 -29 14 273
3674 273 270 -56 245 33 -87 48 29 54 -187 231 86 -356 -205 101 -250 -101 101 -34 96 334 -203
3695 -203 -65 -166 -119 179 253 37 165 -45 183 -167 310 177 68 117 182 151 151 173 -165 -90 178 -157 60
3718 60 -274 32 -139 219 209 259 5 251 17 264 144 -127 -121 278 -92 100 45 31 66 -88 71 97 -64
3741 -64 -276 173 -95 154 19 -117 59 -97 -38 47 246 52 37 -207 152 96 -245 -64 -140 -341 0 -185
3763 -185 100 329 -168 114 77 -55 282 -130 -141 -145 -140 -173 -209 41 17 86 41 -187 -64 20 22 36 21 182 28
3788 28 72 -84 91 -123 14 -138 116 103 72 -15 282 267 -142 -121 -40 -44 -81 174 -10 -55 130 -254 38 199
3812 199 150 64 -34 129 162 -260 -72 151 -169 -343 -102 170 99 -70 -157 -19 -5 -72 -2 85 -15 146 -5
3835 -5 -82 -56 -70 110 29 93 114 79 403 29 12 200 -25 -86 -18 92 -41 -47 143 65 -34 -229 293 223 116 -73
3861 -73 6 -138 1 -319 10 285 55 218 -36 -52 262 -26 -52 197 34 235 45 -103 -373 -112 -116 -53
3883 -53 55 -23 52 -42 364 179 -198 131 -34 -5 9 -4 -339 -20 -300 130 -7 -40 -47 407 254 11 -221
3906 -221 71 -23 -271 155 19 -267 -314 282 -305 -65 -129 65 341 76 -21 356 -179 -236 -540 -162 -202 -88
3928 -88 -326 -215 24 116 44 86 43 32 83 137 -64 -43 111 -109 165 -111 -233 141 385 -68 116 107 89 -4
3952 -4 -97 21 -140 -235 -51 47 -134 41 87 192 4 317 320 -101 90 -79 149 -77 210 -15 -121 -117 87
3975 87 163 234 44 16 172 270 -133 268 58 210 -72 -37 -214 115 413 177 34 329 -52 79 -29 -78
3997 -78 -48 99 14 -72 -74 -272 -411 135 -79 120 -50 152 109 -18 359 -321 22 -10 271 165 -83 140 69
4020 69 83 76 -14 176 -64 578 -132 91 -201 -335 -248 -234 -382 -138 -95 -119 -125 -95 68 39 -67 163 148 -120 180
4045 180 81 -8 134 -338 -342 -41 61 -157 104 -103 125 259 -47 25 -518 -29 88 -84 103 -96 -143 -63
4067 -63 14 121 237 -127 -109 58 45 388 144 -67 41 -88 213 406 122 -132 -157 -5 192 226 183 163 -3
4090 -3 -181 -117 -328 26 90 -241 113 257 -249 236 16 -135 109 -169 67 322 -158 -176 -91 125 36 13 186
4113 186 118 54 32 132 52 93 363 46 -117 10 139 -57 -221 146 -49 236 182 364 -46 192 -147 -366
4135 -366 138 -231 -98 -164 139 198 -93 -96 77 -42 -53 220 -16 112 39 77 92 -212 -114 21 78 66 298 7
4159 7 -14 332 -56 2 34 77 212 75 -114 65 78 -67 118 91 74 -48 11 57 -2 -57 -55 -295 -138 -116 -255
4184 -255 -46 44 40 332 -225 -45 180 12 -36 110 -90 -40 -207 -3 -65 69 257 13 -195 70 -172 -269
4206 -269 221 106 207 -85 111 38 33 -40 146 151 30 71 247 -32 61 110 20 203 -251 -138 -216 -62 -172 69
4230 69 -309 67 -56 100 50 -168 27 -106 -86 -150 9 -299 -8 -26 102 337 163 -127 74 45 -81 124
4252 124 177 363 125 169 -60 -170 12 -28 -22 -27 17 -67 -25 -19 155 87 -135 20 -186 -3 205 76 296 -220
4276 -220 -15 100 38 -55 54 -4 -303 -211 1 20 130 29 136 23 43 -147 45 226 230 185 -293 96 -51
4299 -51 -201 46 -148 43 -135 -83 172 -121 -86 195 -43 -188 -37 70 -17 -29 -39 -206 104 -47 -149 7
4321 7 -106 25 255 -239 -149 -149 3 -146 -134 -159 4 50 315 -36 -12 64 128 -175 -29 52 209 0 -85 72
4345 72 -209 -239 -66 111 88 151 0 164 69 295 404 -55 -154 308 -34 -102 -215 -34 285 -293 -6 107
4367 107 248 38 54 257 33 -319 -147 62 -128 82 197 -84 -67 -143 -112 98 76 -9 322 52 1 59 180
4390 180 -154 71 -56 92 239 -182 177 149 -91 -14 -170 -172 19 118 155 -132 -111 119 -37 -312 -3 46 24
4413 24 151 19 338 83 -302 33 -159 -194 19 -198 42 -136 53 57 302 -81 -62 98 323 228 -227 -15
4435 -15 76 -104 -84 194 15 132 5 40 -121 -62 -138 -91 154 170 -5 -319 -155 -72 -192 -9 -240 -14 -170
4458 -170 26 -33 -112 -127 147 123 -38 -62 -274 -94 -199 -51 -107 -293 -41 57 28 243 1 -125 103 172 -139
4481 -139 -123 61 -291 -105 201 -93 -174 -6 131 234 56 474 98 -190 -117 -224 -242 52 -244 -208 -109 106
4503 106 280 -154 -206 45 -103 -163 17 -101 -266 300 -103 -40 67 -137 111 70 50 169 -183 90 8 -119
4525 -119 -250 -232 -188 -163 288 -167 -85 -21 12 144 -218 72 -268 21 20 -330 19 -238 -243 -217 144 33 12 -50
4549 -50 -48 248 -130 -6 249 73 -207 -111 73 -17 85 -107 32 -142 125 47 -271 -65 -47 -245 39 22 39
4572 39 -96 -247 -104 -174 -70 56 52 -49 270 232 -542 -139 69 -91 -225 -16 -149 2 -308 -161 41 45
4594 45 161 -53 -224 127 70 -246 126 300 11 -42 -19 21 135 -78 165 -26 52 -78 -48 254 99 -133
4616 -133 -73 -57 -266 138 110 113 38 -147 322 62 -279 -162 0 70 -51 85 175 143 -79 -119 33 -22 -105 39
4640 39 -19 79 -18 -31 -6 -205 -54 -132 -73 -74 -17 -301 173 -87 128 -36 111 106 167 27 488 1 -123 -89 130
4665 130 153 142 183 -34 237 168 -83 -138 108 -155 -89 -240 -17 -222 -143 -68 -155 1 -197 -77 114 -3 -164
4688 -164 105 -14 259 96 17 -130 -59 -24 -82 2 76 46 148 -43 -53 -69 180 72 40 221 174 27 -82 24
4712 24 -197 -107 -129 141 33 -191 273 43 -8 164 62 -72 3 -217 179 -172 -147 -47 175 123 -66 -34 1
4735 1 55 151 182 44 34 28 -47 -28 153 55 -68 402 -47 -34 -21 -141 -8 -4 71 -372 -158 7 224 190 -92 42
4761 42 156 30 -59 -192 128 142 -57 41 101 -38 86 -167 128 90 258 90 -190 -6 -27 -343 -244 -113 -36
4784 -36 -38 -32 155 76 -140 115 -119 -2 300 -152 -48 -153 -309 -97 -135 -119 -14 128 171 130 -91 -248 69
4807 69 -133 109 70 152 51 167 20 218 -51 -71 307 24 -75 79 -86 -7 72 -157 175 -22 -74 120 108
4830 108 17 100 -74 303 -48 139 246 4 -121 105 25 -31 21 2 -85 -61 49 -8 156 -159 -70 -168 198 256
4854 256 -89 230 27 113 -205 130 166 156 -60 125 26 -42 -62 -87 -53 104 220 -131 104 -329 161 -4 41
4877 41 -155 -41 95 21 98 27 170 -118 -51 -59 -86 -316 6 -120 163 -335 -32 31 -245 344 62 -138 33
4900 33 -96 -243 -144 132 -61 258 -156 33 173 98 -24 -60 -121 -1 -48 1 117 -184 -104 79 -225 456 362
4923 362 368 96 44 -6 -38 101 -36 -2 -457 -70 7 19 -6 -122 47 -117 -79 -69 16 57 117 47 -165 8 -173
4948 -173 -162 -475 -3 -188 54 289 -92 -56 27 -207 92 158 -240 -220 173 375 -210 29 215 9 102 247
4970 247 206 -22 -20 58 -51 35 1 -76 -143 94 6 173 55 -64 -61 40 56 143 -117 -241 63 -111 -258 84
4994 84 -134 -39 159 -44 -104 66 -185 295 397 -126 -222 280 104 47 100 -1 6 -219 22 -150 321 -196 56
5017 56 103 -20 126 -107 -85 15 14 145 -118 -119 -68 -486 -45 520 207 129 103 -35 72 -218 76 3 -229 38
5041 38 181 -1 -12 -370 261 -137 342 114 -366 -58 378 -73 345 -79 78 385 -414 164 -3 -87 -57
5062 -57 197 89 145 -121 37 -182 -220 10 37 -6 98 31 16 152 38 -532 180 84 -131 -61 -43 151 252
5085 252 -247 3 -4 73 116 78 -118 -207 268 -148 -143 -71 110 -9 -120 205 -63 143 87 -19 -112 92 -17 368
5109 368 70 -153 18 -211 45 -33 12 4 21 -133 286 159 -134 222 -190 -64 -13 4 161 7 25 -17 46
5132 46 -86 43 209 130 -72 -143 -238 -13 -170 365 53 84 -77 59 117 -1 -231 35 -22 21 -165 23 -14
5155 -14 264 -35 204 -137 -7 -116 58 -122 52 -188 -11 181 -90 187 49 96 -124 125 -223 161 -38
5176 -38 -108 -71 128 -125 12 139 88 35 -147 133 -101 -140 -127 24 -75 39 -98 -224 -166 -27 -31 183 -341 -55
5200 -55 -142 119 206 -112 323 -193 -38 -67 -111 -162 72 -300 -111 12 146 0 -103 -188 -21 -105 106 -9 132
5223 132 -60 16 -309 72 -237 -56 -147 -60 -179 28 322 -231 25 98 -230 -7 -9 193 74 -237 14 50
5245 50 139 21 93 -110 -16 -73 116 138 -73 147 -198 -36 164 17 139 -29 -70 294 189 -54 15 63 -72
5268 -72 -143 213 34 -6 -198 -224 86 -295 -214 -276 -122 17 215 179 144 -85 -140 187 105 26 51 180 149 -75
5292 -75 57 -122 168 183 -247 205 -2 -44 40 143 94 100 34 -103 82 -132 -124 134 24 24 -34 -82 -45 -107 41
5317 41 7 -109 110 24 228 25 53 -84 70 7 -72 99 -180 -168 -133 -246 -223 -196 -368 40 -118 -121 -269 262
5341 262 -382 44 28 -76 -108 126 5 161 20 119 281 -197 -64 155 191 96 -238 -207 -24 75 158 65 72 -26
5365 -26 76 -42 137 -225 51 20 130 130 69 -160 233 41 -35 -167 -262 18 -50 -222 181 1 170 -193 11
5388 11 76 117 48 19 -58 202 -43 348 -108 -325 212 -39 85 -30 47 -67 91 -71 -191 196 79 -38
5410 -38 -46 168 -54 3 -141 -84 -186 89 -77 130 -61 35 149 -245 -72 -242 127 141 121 -45 31 -128 -76
5433 -76 -84 66 -33 8 -298 -44 -304 -227 83 249 93 -124 6 171 25 81 63 -303 -282 169 64 -9 -27 4
5457 4 -120 -117 -104 -175 54 -129 -10 174 180 193 -142 5 -78 -130 297 -21 145 248 -24 -162 -146 -66 -195 138
5481 138 -52 -15 89 37 -71 -131 177 -14 -110 135 5 -7 43 -66 -92 40 69 49 95 74 191 138 68 -94
5505 -94 184 347 38 -201 -22 -189 -99 91 76 209 -11 84 -165 -203 33 -143 46 194 19 32 46 -98
5527 -98 -170 46 67 -33 79 54 27 66 19 -228 9 262 66 177 47 -164 156 -86 98 22 5 75 -140
5550 -140 -61 101 -166 -49 164 -34 313 -114 65 124 24 80 86 35 43 -114 91 -99 38 -69 -85 -154 163
5573 163 84 9 126 92 -52 -36 97 231 62 -300 -72 139 -94 198 -189 77 276 72 34 189 25 -22
5595 -22 174 -140 -40 180 -100 -50 -186 -54 124 85 107 107 87 -66 -118 -21 -54 -107 105 72 -118 94 -114 -163
5619 -163 12 32 113 -49 204 -181 -182 22 182 -44 -254 118 -78 -182 182 365 99 -124 -17 -197 77
5640 77 122 28 -146 -153 -56 41 33 439 29 -182 -84 -12 405 -143 -121 325 -235 -243 7 -61 169 204 -45 -79 -214 60
5666 60 -41 -169 69 125 -216 88 87 -121 -189 -110 -113 49 -117 -232 176 -164 60 30 -3 -144 1 156 326
5689 326 91 -134 113 59 11 135 -194 0 184 -33 -13 -130 90 -102 145 -227 -278 -101 -259 -207 -107 -39
5711 -39 -19 172 -79 131 -157 -146 40 143 -8 28 319 -103 189 40 -86 134 217 -77 72 -51 -27 151
5733 151 -53 74 329 -46 -103 -41 -51 -144 -92 -333 -150 231 -39 65 -51 43 55 -197 -154 78 -146 -183 77
5756 77 152 35 -112 -216 -85 -20 -53 150 0 -140 24 -127 121 -35 166 13 -199 46 -62 40 533
5777 533 144 -135 59 -75 100 52 150 121 40 72 302 35 -220 42 -51 -20 257 -114 33 18 -230 -75 -77
5800 -77 -222 -29 -105 -26 8 -39 -159 237 -120 -160 27 -34 29 -104 -131 173 270 156 349 -31 -142 -232 152 187
5824 187 -28 -197 -64 -229 -105 173 -10 8 34 -343 0 156 14 -6 -239 -73 225 -94 212 46 -337
5845 -337 129 -121 -85 21 -227 -73 49 -52 -172 161 126 -13 -181 -225 240 -111 -204 10 -107 82 32 152
5867 152 -33 -117 97 23 -174 -149 69 -2 -9 77 206 62 68 73 -107 4 81 -10 -109 90 -312 47 -74 -159 153
5892 153 112 156 -20 -141 -155 -62 -170 96 -237 -180 -136 88 8 -347 -135 209 -83 -107 22 -99 -331 -50 -52
5915 -52 34 53 -5 -142 -130 -146 -178 -65 63 -58 -277 17 34 160 -112 -228 -15 429 131 160 7 60 86 56
5939 56 -9 -284 -206 9 -93 76 210 -70 144 83 52 134 -99 -3 -213 -79 47 160 -146 82 9 200 109
5962 109 9 -109 18 198 72 -22 7 -141 52 -122 10 -98 -75 32 -236 79 -99 157 23 99 -322
5983 -322 -140 -77 -60 -46 12 0 113 131 58 204 279 -40 5 -65 46 107 172 -106 217 198 -155 -309 42 232
6007 232 -74 202 -17 20 12 -132 -76 -95 191 71 119 -272 204 65 -5 -365 136 146 -101 -57 41 -59 -98 20
6031 20 -16 285 153 10 101 0 205 75 -122 -94 -58 188 169 338 -285 199 110 176 -42 41 -73 -19 -87 258
6055 258 155 -11 146 -37 97 126 -86 59 -7 157 50 -26 -15 109 292 103 -249 209 -31 -275 -156
6076 -156 230 89 -39 84 -5 -2 -72 99 -189 7 62 152 59 -45 75 -65 60 -173 60 -19 177 -149 150
6099 150 -144 -105 -133 17 -265 120 159 -12 4 -116 -122 -8 -32 -178 115 25 136 105 -134 -33 -126 -299 118
6122 118 -154 -192 -107 196 -54 -134 -1 -43 -140 -100 -309 196 138 -100 -176 62 -192 -174 -136 -112 -326 -86 -389 -68
6146 -68 0 -46 159 -174 -5 147 28 111 57 52 -20 -180 46 -244 68 -123 65 217 216 -233 -31 -133 -2
6169 -2 43 88 -258 -69 -145 -263 333 266 -82 109 -102 -10 -49 149 123 147 -88 -43 -41 30 46 -157 32 -124 -17
6194 -17 -20 118 411 -34 -25 30 93 274 -87 53 24 -144 174 53 -81 -139 -178 47 -125 93 -148 152 -49
6217 -49 171 -10 98 30 -237 361 -33 48 3 267 -100 -144 180 -111 -93 -3 12 23 134 -199 71 -82 -131
6240 -131 20 40 115 -16 332 -69 188 -199 245 115 88 150 -396 15 90 41 225 -34 -51 87 145 -108 -36
6263 -36 53 50 -44 55 -176 153 -103 -60 253 -106 31 -328 -25 -82 8 -257 -121 50 268 -6 74 -126 -3
6286 -3 -276 84 -108 105 185 207 70 -96 44 203 89 120 -126 -120 -80 78 -113 175 168 85 168 -96 69 -104
6310 -104 17 -94 107 -96 -56 34 23 203 -123 -72 -174 184 -38 -148 78 -17 -106 -96 1 -113 259 44 95
6333 95 73 11 -119 -103 26 173 -119 -41 -44 -300 -150 208 134 -76 -241 34 -148 -78 -61 -80 -250 111 481 -40
6357 -40 175 15 41 -46 -120 24 -240 -174 -132 16 225 115 -176 50 -58 302 -238 -243 24 186 -26 141 -180
6380 -180 -9 120 -236 -258 20 290 139 48 158 88 85 101 -89 128 179 142 -132 9 -123 36 125 153 -50
6403 -50 -221 265 138 -163 -25 152 173 49 -4 -149 -92 71 225 32 187 73 356 -74 -183 163 139 -128
6425 -128 39 -6 159 -120 -6 126 -285 -30 224 -103 -180 77 -88 4 -84 -66 174 -34 116 138 75 -92
6447 -92 6 -352 51 -82 221 165 65 76 134 198 439 155 94 -97 80 85 -144 31 -41 -85 19 -60 120 -100
6471 -100 22 -9 -89 -51 -72 -61 309 148 -6 104 -45 -154 307 -35 -14 165 -3 164 -200 -175 -38 55 28
6494 28 -125 214 -30 -7 8 36 212 -108 47 35 43 194 -9 118 -44 41 -75 -8 321 34 -123 176 67
6517 67 -82 -219 -91 -15 51 4 -82 -244 -126 212 -16 117 124 -41 60 -35 112 17 261 40 40 213 138 -33
6541 -33 14 -41 -22 153 -119 26 149 121 -22 127 -156 -15 21 13 139 -66 238 -3 -44 -92 11 78 -80 39
6565 39 -159 80 154 -68 -50 105 -71 -128 -39 110 132 -292 -22 146 -172 -198 -231 -12 147 -276 -44 104 -281
6588 -281 -84 99 -201 -110 -17 -80 131 139 -114 -125 23 4 70 -259 16 194 252 -60 113 140 150 28 36 156
6612 156 -7 -55 7 -304 -28 -200 172 227 -33 177 41 -131 28 -231 286 115 175 232 64 -117 26 -83
6634 -83 -46 179 -40 -137 -212 -54 392 59 22 204 42 117 -333 71 79 -51 -117 83 128 -165 -184 -108 95 -138
6658 -138 -66 89 -100 29 -79 -85 236 -85 71 -41 29 -196 -208 102 -110 -102 -54 72 -88 -50 14 -41 50 114
6682 114 28 -6 199 439 -50 -182 103 64 131 37 286 147 32 131 -163 30 61 -139 -203 -70 -194 250 -42
6705 -42 -82 -46 -154 -10 103 -22 -167 -71 11 115 180 -188 -45 -46 -208 -371 -15 -26 -21 255 35 -75 -37 141
6729 141 -52 -297 108 -77 -103 -3 40 301 48 157 146 -138 -152 -28 110 77 -1 -268 -8 307 137 80
6751 80 62 -71 -106 0 100 30 82 -247 59 89 95 -300 -37 59 64 -5 -221 15 -18 -25 48 272 -273 20 93 1
6777 1 -87 -218 77 -55 61 -124 -88 -57 -4 -219 -40 18 101 97 -170 -64 87 -186 -71 174 163 -38 -151 -79
6801 -79 63 80 2 -58 151 14 -37 18 414 113 337 268 -99 302 -115 91 -84 -2 -28 -66 -61 -294 -60 -52 85
6826 85 -17 276 43 70 -229 -121 19 209 214 0 -22 108 242 -33 -24 -26 2 120 47 224 19 -13 83 -41
6850 -41 83 -227 -194 67 165 283 275 182 -147 40 244 113 -182 -255 3 167 167 54 -59 81 264 -20 -110
6873 -110 169 -30 -17 -37 221 -64 102 142 -45 40 -47 163 232 106 56 -84 -31 101 -24 -56 -50 -54 193 -126
6897 -126 -105 171 91 -30 -104 -29 303 -38 131 -44 52 41 -70 -50 -127 110 -28 219 62 -462 16 -42 160
6920 160 -14 -60 118 114 15 -117 227 64 32 63 177 50 -132 187 -22 -148 225 112 72 142 1 8 24 -155
6944 -155 -73 -135 -104 -197 -62 -16 -153 -41 -194 46 170 -142 186 -277 -341 272 41 163 471 -213 145 90
6966 90 -25 53 -187 74 47 48 -252 206 -183 55 39 -84 209 -61 -206 43 -357 272 168 -286 -86 31
6988 31 90 48 -295 -66 -103 3 249 -123 -5 197 -117 136 88 108 -119 -14 122 193 83 1 187 109 53
7011 53 69 156 3 186 106 -89 146 -23 8 158 -104 209 103 -48 2 -101 2 243 -95 113 190 46
7033 46 -40 2 -32 53 190 -32 43 77 -154 -181 146 -154 104 202 -210 -342 -9 179 164 -5 -173 -200 100 -63
7057 -63 -297 -128 -142 -131 12 -72 -50 -28 -14 -67 -139 122 -50 -149 178 474 -145 31 -102 33 39 -68 -136 -69 92
7082 92 107 263 51 3 15 -18 127 -50 402 -321 32 -97 -54 22 -4 -37 -74 84 -164 -43 112 -152 25
7105 25 -24 -164 142 36 -58 172 32 -53 -88 183 -36 -21 -68 -172 200 -85 7 -204 -163 -161 51 18 35 -290
7129 -290 -144 186 56 27 30 192 -125 -165 184 37 184 -129 -74 -156 -46 218 53 -91 213 55 -1 -416
7151 -416 -36 -72 -81 -104 28 -3 191 -281 -103 -134 166 7 -83 -28 25 138 -54 -198 69 -169 32 -45 -138 81
7175 81 9 25 84 66 -98 118 -130 122 152 83 172 -1 158 27 -33 141 -16 96 -245 -44 42 129 -119 -18
7199 -18 -24 58 93 -121 -194 19 -80 -269 16 -352 -89 -128 103 -150 -128 74 124 267 -144 19 158 -25 -104 -46
7223 -46 3 -69 111 36 254 27 198 31 -26 53 -100 -25 -86 -237 -17 -39 21 -157 -94 -189 115 -126 72 -2
7247 -2 197 70 -167 77 11 59 45 -155 -23 -216 -7 172 -31 -46 -50 -10 243 134 18 -10 -253 126 82 104
7271 104 -59 164 -188 173 -42 314 31 -114 -112 -133 66 39 67 99 -1 177 58 105 112 -133 210 -1 -45
7294 -45 178 158 50 -116 -128 204 117 138 210 -121 145 -212 -165 18 72 -211 -156 -56 -123 -50 172 220 -74 -308
7318 -308 -45 99 -51 0 -131 -26 197 161 106 67 305 166 2 -142 252 -207 67 168 42 263 163
7339 163 165 25 -22 -184 -40 83 58 -108 -96 133 -62 245 224 -70 84 -27 22 251 94 -145 11 55 7
7362 7 -35 -39 20 -272 16 68 -43 -15 -146 181 -41 14 142 190 54 5 -245 -21 262 131 25 24 -146 238
7386 238 249 -141 131 143 -243 27 199 -32 72 -25 57 -44 34 442 -142 -5 -29 -17 267 -66 -23 -38 385
7409 385 27 231 -285 107 -151 -159 -36 19 98 128 15 176 -210 -13 -61 53 -137 -20 115 -63 -80 165
7431 165 250 -12 211 -174 -391 -52 65 81 -121 27 -304 43 -291 16 -80 36 44 -226 -124 -39 -107 -115 53
7454 53 172 -153 42 -10 -199 77 138 39 -149 -9 134 68 -159 -151 96 -187 -52 287 -65 137 64 -35 -61
7477 -61 229 26 -17 -161 -34 55 106 -159 -120 40 -223 -9 -171 14 184 139 -206 135 61 0 -51 174 -334
7500 -334 -85 108 -139 -107 -97 -147 119 95 -202 -234 -87 179 144 -77 50 -132 94 -181 -195 28 111 -466 231
7523 231 47 65 91 -93 -19 -248 51 -266 -231 76 141 34 49 38 -306 -145 -23 -15 -62 -358 -203 8 -106
7546 -106 -132 -141 -43 -42 -51 -130 -161 9 73 -635 38 77 -115 -72 -120 49 10 -226 115 -81 -179 137 -36 -222 42
7571 42 -27 -37 154 119 -11 -254 -9 -212 -79 45 -21 -136 205 149 -309 -69 30 142 -125 -122 63 44 -44 113
7595 113 75 -26 -227 20 22 -241 -76 -1 -151 -242 -209 215 140 -98 -20 138 -50 44 -19 -289 88 142 91 40
7619 40 32 102 246 38 -256 95 -23 1 111 44 57 -125 80 -159 21 47 158 -164 -163 -146 -179 131 -177 112
7643 112 -53 -81 211 44 -85 179 50 304 -46 27 -119 -35 71 -13 -118 15 96 44 31 11 45 -178 92
7666 92 -385 -36 -83 50 -50 -86 -157 -152 234 -151 174 156 -106 -100 85 -3 35 200 182 -104 201 163 111 147 35
7691 35 -56 -247 309 181 -67 -123 -92 98 -348 -109 1 97 30 -41 102 -156 -148 -67 1 -79 84 180 -60 -13 -73
7716 -73 1 131 -84 21 -203 -37 -2 458 6 62 145 -59 -31 26 82 -61 53 -63 6 27 -71 -177 22 -93
7740 -93 -419 -50 -296 65 -63 82 -101 60 -11 -183 24 -55 177 -16 -64 -21 100 31 23 -203 -48 -53 -114 168
7764 168 -6 -130 -235 68 -240 -120 -115 -7 53 37 89 180 165 -2 -50 99 69 129 70 249 143 200 17 -118
7788 -118 261 206 192 110 -326 61 -252 -251 -384 -135 -216 -47 -27 -29 -19 -74 11 241 -117 -21 311 -77 180 -175
7812 -175 0 -4 -119 -46 154 101 210 7 -194 96 105 -37 -193 -35 -221 89 -55 142 -29 41 116 52 -26
7835 -26 -42 170 -376 70 98 -15 -86 -60 -181 95 219 159 21 -4 20 -156 436 -128 -186 248 59 -67 58
7858 58 373 116 119 353 -377 200 -193 -367 46 30 102 195 47 113 8 -115 3 -19 3 92 126 284 -77 76
7882 76 -17 326 -87 -185 38 -119 36 183 42 261 -81 -156 -147 -29 -125 30 -85 203 109 5 86 -46 -1
7905 -1 -104 79 -99 203 168 136 89 -99 21 -92 -4 -40 -85 37 273 19 -219 56 -171 32 -236 156 216
7928 216 -193 135 57 -98 -202 -4 50 -41 -82 78 -21 200 -221 -305 -225 80 120 98 -67 82 7 -61 -12 193
7952 193 198 -92 83 3 -58 203 107 -44 -27 174 73 168 -9 20 66 351 -217 -42 90 32 186 70 62 100
7976 100 -263 -84 -163 -78 -37 232 -59 -10 33 -96 40 64 137 -5 54 81 -148 -255 32 -143 11 -15 -242
7999 -242 -61 -205 196 254 16 218 51 7 210 -3 -23 136 55 -23 179 155 -25 -95 207 18 -174 -66
8021 -66 -413 -85 65 113 -83 -38 -57 127 171 -97 136 -8 31 -129 -160 -24 -157 48 19 86 156 -129 -135 -125
8045 -125 -146 -5 -183 -161 -49 343 -80 -61 -167 277 116 138 -51 -56 183 99 82 -251 -65 -78 -126 110 -32
8068 -32 52 288 0 -84 -167 -48 -166 -67 -93 120 107 97 18 249 -177 305 99 32 -129 212 -100 177 -62
8091 -62 -79 292 150 175 24 -77 37 -40 -197 -26 182 -105 100 4 94 -117 -6 -4 -27 22 -4 -115 33 187
8115 187 8 62 74 -179 90 226 125 136 5 -29 -267 -49 -204 230 -184 235 -20 131 -73 -108 77 261
8137 261 -52 72 -124 -121 57 -64 85 -31 -22 -242 82 -66 158 152 -106 -81 32 280 15 119 -16 -119
8159 -119 144 205 -93 -209 75 -58 -267 -89 211 128 -82 -194 229 -35 -146 -88 -7 -155 -119 -107 39 -198
8181 -198 -41 -35 239 -109 -43 -199 -105 -158 -22 -9
8191i
##END NTUPLES=NMR FID
##END=
