##TITLE=1H_Pr Q-18-4
 200.13MHz,CDCl3.
 8 sc
 
 18.12.2025
##JCAMPDX= 6.0         $$ Bruker NMR JCAMP-DX V2.0
##DATA TYPE= NMR FID
##DATA CLASS= NTUPLES
##ORIGIN= UXNMR, Bruker Analytische Messtechnik GmbH
##OWNER= pz
$$ XWIN-NMR		Version 3.5
$$ Thu Dec 18 16:09:15 2025 Russian Standard Time (UT+4h)  she@DPX200
##.OBSERVE FREQUENCY= 200.1313
##.OBSERVE NUCLEUS= ^1H
##.DELAY= (6, 6)
##.ACQUISITION MODE= SIMULTANEOUS
##.ACQUISITION SCHEME= undefined
##.AVERAGES= 8
##.DIGITISER RES= 18
##SPECTROMETER/DATA SYSTEM= spect
##.PULSE SEQUENCE= zg30
##.SOLVENT NAME= CDCl3
##.SHIFT REFERENCE= (INTERNAL, CDCl3, 0, 14.3821)
##AUDIT TRAIL= $$ (NUMBER, WHEN, WHO, WHERE, WHAT)
$$ ##TITLE= Audit trail, XWIN-NMR		Version 3.5
$$ ##JCAMPDX= 5.01
$$ ##ORIGIN= Bruker BioSpin GmbH
$$ ##OWNER= she
$$ F:/spectra/data/she/nmr/H-C/1/audita.txt
$$ ##AUDIT TRAIL=  $$ (NUMBER, WHEN, WHO, WHERE, WHAT)
(   1,<2025-12-18 16:07:54.56 +0400>,<she>,<DPX200>,
      <created by zg, POWCHK disabled, PULCHK disabled
       configuration hash MD5:
       00 E9 B6 7A A2 85 ED C7 34 08 36 98 17 FE 4E 26
       data hash MD5: 16K
       C3 AA 08 4A B9 6E A1 88 21 4A 93 AF 3A 02 A3 FF>)
$$ ##END=
$$ 
$$ hash MD5
$$ CC EF 79 EE D7 2E 0E 65 9E 36 6F 3D 83 BA 99 2D
##$RELAX= 
##$RELAX= 
##$RELAX= 
##$RELAX= 
##$RELAX= 
##$RELAX= 
$$ Bruker specific parameters
$$ --------------------------
##$DU= <F:/spectra>
##$EXPNO= 1
##$NAME= <H-C>
##$PROCNO= 1
##$TYPE= <nmr>
##$USER= <she>
##$AMP= (0..31)
100 100 100 100 100 100 100 100 100 100 100 100 100 100 100 100 100 100 
100 100 100 100 100 100 100 100 100 100 100 100 100 100 
##$AQSEQ= 0
##$AQ_mod= 1
##$AUNM= <au_zg>
##$AUTOPOS= <>
##$BF1= 200.13
##$BF2= 200.13
##$BF3= 200.13
##$BF4= 200.13
##$BF5= 200.13
##$BF6= 200.13
##$BF7= 200.13
##$BF8= 200.13
##$BYTORDA= 1
##$CFDGTYP= 0
##$CFRGTYP= 5
##$CHEMSTR= <none>
##$CNST= (0..31)
1 1 145 1 1 1 1 1 1 1 1 1 1 1 1 1 1 1 1 1 1 1 1 1 1 1 1 1 1 1 1 1 
##$CPDPRG= <>
##$CPDPRG1= <>
##$CPDPRG2= <>
##$CPDPRG3= <>
##$CPDPRG4= <mlev>
##$CPDPRG5= <mlev>
##$CPDPRG6= <mlev>
##$CPDPRG7= <mlev>
##$CPDPRG8= <mlev>
##$CPDPRGB= <>
##$CPDPRGT= <>
##$D= (0..31)
0 0.7 0 0 0 0 0 0 0 0 0 0.03 0 0 0 0 0 0 0 0 0 0 0 0 0 0 0 0 0 0 0 0 
##$DATE= 1766059673
##$DBL= (0..7)
120 120 120 120 120 120 120 120 
##$DBP= (0..7)
150 150 150 150 150 150 150 150 
##$DBP07= 0
##$DBPNAM0= <>
##$DBPNAM1= <>
##$DBPNAM2= <>
##$DBPNAM3= <>
##$DBPNAM4= <>
##$DBPNAM5= <>
##$DBPNAM6= <>
##$DBPNAM7= <>
##$DBPOAL= (0..7)
0.5 0.5 0.5 0.5 0.5 0.5 0.5 0.5 
##$DBPOFFS= (0..7)
0 0 0 0 0 0 0 0 
##$DE= 6
##$DECBNUC= <off>
##$DECIM= 32
##$DECNUC= <off>
##$DECSTAT= 4
##$DIGMOD= 1
##$DIGTYP= 9
##$DL= (0..7)
0 120 120 120 120 120 120 120 
##$DP= (0..7)
150 150 150 150 150 150 150 150 
##$DP07= 0
##$DPNAME0= <>
##$DPNAME1= <>
##$DPNAME2= <>
##$DPNAME3= <>
##$DPNAME4= <>
##$DPNAME5= <>
##$DPNAME6= <>
##$DPNAME7= <>
##$DPOAL= (0..7)
0.5 0.5 0.5 0.5 0.5 0.5 0.5 0.5 
##$DPOFFS= (0..7)
0 0 0 0 0 0 0 0 
##$DQDMODE= 0
##$DR= 18
##$DS= 0
##$DSLIST= <SSSSSSSSSSSSSSS>
$$ [...]
##$SUBNAM0= <"">
##$SUBNAM1= <"">
##$SUBNAM2= <"">
##$SUBNAM3= <"">
##$SUBNAM4= <"">
##$SUBNAM5= <"">
##$SUBNAM6= <"">
##$SUBNAM7= <"">
##$SUBNAM8= <"">
##$SUBNAM9= <"">
##$SW= 18.0517328524113
##$SWIBOX= (0..15)
0 0 2 0 0 0 0 0 0 0 0 0 0 0 0 0 
##$SW_h= 3612.71676300578
##$TD= 16384
##$TD0= 1
##$TE= 0
##$TE2= 300
##$TE3= 300
##$TEG= 300
##$TL= (0..7)
0 120 120 120 120 120 120 120 
##$TP= (0..7)
150 150 150 150 150 150 150 150 
##$TP07= 0
##$TPNAME0= <>
##$TPNAME1= <>
##$TPNAME2= <>
##$TPNAME3= <>
##$TPNAME4= <>
##$TPNAME5= <>
##$TPNAME6= <>
##$TPNAME7= <>
##$TPOAL= (0..7)
0.5 0.5 0.5 0.5 0.5 0.5 0.5 0.5 
##$TPOFFS= (0..7)
0 0 0 0 0 0 0 0 
##$TUNHIN= 0
##$TUNHOUT= 0
##$TUNXOUT= 0
##$USERA1= <user>
##$USERA2= <user>
##$USERA3= <user>
##$USERA4= <user>
##$USERA5= <user>
##$V9= 5
##$VALIST= <valist>
##$VCLIST= <CCCCCCCCCCCCCCC>
##$VD= 0
##$VDLIST= <DDDDDDDDDDDDDDD>
##$VPLIST= <PPPPPPPPPPPPPPP>
##$VTLIST= <TTTTTTTTTTTTTTT>
##$WBST= 1024
##$WBSW= 4
##$XGAIN= (0..3)
0 0 0 0 
##$XL= 0
##$YL= 0
##$YMAX_a= 728906
##$YMIN_a= -722966
##$ZGOPTNS= <>
##$ZL1= 120
##$ZL2= 120
##$ZL3= 120
##$ZL4= 120
##$ABSF1= 10
##$ABSF2= 0
##$ABSG= 5
##$ABSL= 3
##$ALPHA= 0
##$AQORDER= 0
##$ASSFAC= 0
##$ASSFACI= 0
##$ASSFACX= 0
##$ASSWID= 0
##$AUNMP= <proc_1d>
##$AZFE= 0.1
##$AZFW= 0.1
##$BCFW= 1
##$BC_mod= 2
##$BYTORDP= 1
##$COROFFS= 0
##$CY= -3
##$DATMOD= 1
##$DC= 2
##$DFILT= <>
##$DTYPP= 0
##$F1P= 0
##$F2P= 0
##$FCOR= 0.5
##$FTSIZE= 0
##$FT_mod= 4
##$GAMMA= 1
##$GB= 0.15
##$INTBC= 1
##$INTSCL= 1
##$ISEN= 128
##$LB= 0.25
##$LEV0= 0
##$LPBIN= 0
##$MAXI= 10000
##$MC2= 0
##$MEAN= 0
##$ME_mod= 0
##$MI= 1.114404
##$NCOEF= 0
##$NC_proc= 0
##$NLEV= 6
##$NOISF1= 3.799351
##$NOISF2= 2.8
##$NSP= 1
##$NTH_PI= 0
##$NZP= 0
##$OFFSET= 14.38212
##$PC= 1
##$PHC0= -3702.722
##$PHC1= 6.592313
##$PH_mod= 1
##$PKNL= yes
##$PPARMOD= 0
##$PSCAL= 0
##$PSIGN= 0
##$REVERSE= no
##$SF= 200.129724274929
##$SI= 16384
##$SIGF1= 3
##$SIGF2= 2
##$SINO= 400
##$SIOLD= 16384
##$SREGLST= <1H.CDCl3>
##$SSB= 0
##$STSI= 0
##$STSR= 0
##$SW_p= 3205.1282051282
##$SYMM= 0
##$S_DEV= 0
##$TDeff= 0
##$TDoff= 0
##$TI= <>
##$TILT= no
##$TM1= 0
##$TM2= 0
##$TOPLEV= 0
##$USERP1= <user>
##$USERP2= <user>
##$USERP3= <user>
##$USERP4= <user>
##$USERP5= <user>
##$WDW= 1
##$XDIM= 8192
##$YMAX_p= 0
##$YMIN_p= 0
$$ End of Bruker specific parameters
$$ ---------------------------------
##NTUPLES= NMR FID
##VAR_NAME=  TIME,          FID/REAL,        FID/IMAG
##SYMBOL=    X,             R,               I
##VAR_TYPE=  INDEPENDENT,   DEPENDENT,       DEPENDENT
##VAR_FORM=  AFFN,          ASDF,            ASDF
##VAR_DIM=   8192,          8192,            8192
##UNITS=     SECONDS,       ARBITRARY UNITS, ARBITRARY UNITS
##FACTOR=    0.0002768,     1,               1
##FIRST=     0,             0,               0
##LAST=      2.2672688,     0,               0
##MIN=       0,             -722966,         0
##MAX=       2.2672688,     728906,          0
$$ Real data points
##PAGE= N=1
##DATA TABLE= (X++(R..R)), XYDATA
0@%%%%%%%%%%%%%%%qJ6j6J6j6K1k2K5l2L8m6N2o0O6p6Q8j00J13j28J44j60J81
$$ 0 0 0 0 0 0 0 0 0 0 0 0 0 0 0 0 -8 8 -8 8 -8 13 -9 16 -16 22 -24 28 -32 34 -42 46 -54 59 -69 75 -85 96
37I6k02K25k51K80l11L43l78M20m64N10n62O18o82P51q27R13j009J116j236J373
$$ 96 -106 119 -132 148 -163 180 -198 222 -242 268 -294 324 -358 393 -434 479 -530 586 -650 723
57G23j533J722j944K215k549K978l551M347n540P516j1355K1454r7219k69763
$$ 723 -810 912 -1032 1183 -1366 1612 -1939 2408 -3132 4384 -6971 14483 -82736 -352499
71c52499K08495M97257L75653j3579k77818k44212q5835Q368N4759j5078j55136
$$ -352499 -144004 353253 728906 715327 437509 193297 107462 115830 170589 155511 375
82C75k76330k81772o6478K16152K40691M0870j30531o0791K01390L10434J50928
$$ 375 -275955 -557727 -624205 -408053 -167362 -126492 -257023 -317814 -116424 194010 344938
93C44938r497l3058L7238N9860m6941j25173r9605r3873j07874j10723r0943k5076
$$ 344938 335441 302383 339621 399481 352540 227367 127762 33889 -73985 -184708 -275651 -300727
105c00727j6710o5753j7898J04710J92678J61964J2180m2038Q2233J78930J42559
$$ -300727 -317437 -383190 -401088 -296378 -103700 58264 70444 28406 110639 289569 432128
116D32128J538j32672j21708n7105m8435n0500o6248r2348r9927j17080n9357
$$ 432128 433666 300994 179286 122181 73746 23246 -43002 -135350 -235277 -352357 -411714
127d11714Q8405J54790R9050n033m9317O8641J97944J63580M0078o6348p8762
$$ -411714 -323309 -168519 -69469 -74502 -123819 -55178 142766 306346 346424 280076 201314
138B01314r866l177m5287n6785q4718j14178j13649p9407K9867J03150L3983n2140
$$ 201314 191448 188271 142984 86199 1481 -112697 -226346 -305753 -275886 -172736 -138753 -190893
150a90893m3669P3179K02326J61381R793n3677j7821N3734O7253j8110p6878q2769
$$ -190893 -234562 -161383 40943 202324 212117 158440 140619 194353 261606 243496 166618 83849
162H3849j01166r0863m8552k684K6601k7742q6313j8955R0625J39723R1448j1910
$$ 83849 -17317 -108180 -156732 -159416 -132815 -160557 -246870 -265825 -175200 -35477 55971 44061
174D4061j3717P4187R3688L9198l4362o4656j7574q584n7568o9940o4091n0232
$$ 44061 30344 104531 198219 237417 203055 138399 120825 112241 54673 -15267 -79358 -129590
186a29590k9174l2257K923N4725L2027m245N895N6442J23969R5456j1242m7625
$$ -129590 -158764 -191021 -188098 -133373 -101346 -105591 -99696 -43254 80715 176171 164929 117304
198A17304j3609L7003M6205l5563r7124p5409m7159k0916j1284k7532j3796p334
$$ 117304 103695 140698 186903 151340 54216 -21193 -68352 -89268 -100552 -128084 -141880 -149214
210a49214j3328L0482P2837P4467M8771q381j0855N7681P3369K4456m7801r1736
$$ -149214 -162542 -132060 -59223 15244 64015 55634 44779 102460 175829 200285 152484 60748
222F0748m2458J2898q623m4481o9949n8464k350J4479J4003L6094L0938K0361
$$ 60748 18290 31188 22565 -21916 -91865 -150329 -152679 -138200 -124197 -88103 -57165 -36804
234c6804K4979K8775O2888O7965L511l6853l1667j239K7906k0669q5008p2957
$$ -36804 -11825 16950 79838 147803 151314 114461 82794 81555 109461 88792 3784 -69173
246f9173l2074N059J3582k3256k3278R220J8897M2200N8619N0214M1196l005l0321
$$ -69173 -101247 -96188 -82606 -105862 -129140 -119920 -101023 -58823 -204 50010 91206 88201 57880
259E7880J7144N2494L5418k4688r9104q7428j2132J9954J2347k7689o3171l2712
$$ 57880 75024 127518 162936 138248 39144 -48284 -60416 -40462 -28115 -55804 -118975 -151687
271a51687P243L6975P6345O3338J4039j6738k4684L0009Q9790N5115k1486q0980
$$ -151687 -144444 -107469 -31124 32214 46253 29515 4831 34840 124630 179745 158259 77279
283G7279q4322j2705L0297J402l2573o3022n5457j372K7542M2980M5922P377n772
$$ 77279 -7043 -19748 10549 11951 -20622 -83644 -139101 -140473 -112931 -69951 -24029 -16652 -22424
296b2424J5927L8596O5221L9102k4837l7300j6337N986J1972l9463p5842m5200
$$ -22424 -6497 32099 97320 136422 111585 74285 57948 63934 75906 36443 -39399 -84599
308h4599o536K4303J6179l1669l2536M325L8889P6559O3349Q000j9469l0469M157
$$ -84599 -91135 -66832 -50653 -82322 -114858 -110533 -71644 4915 68264 76264 56795 26326 30483
321C0483O5167N6629q933q1587j14006m3171M9336N7013L723p4217r7271j7363
$$ 30483 95650 152279 143346 61759 -52247 -95418 -46082 10931 14654 -59563 -156834 -174197
333a74197O5963R4481P2835j354m8342k8646J4940P7313Q8426P418p2755j02038
$$ -174197 -108234 -13753 59082 57728 9386 -19260 -4320 72993 161419 168837 96082 -5956
345e956n9072L6835O1601J564o0296q7502m3195L5895N8862N1220K6138j5633
$$ -5956 -65028 -28193 33408 34972 -25324 -112826 -156021 -120126 -61264 -10044 16094 461
357D61j6094Q284L3142O6074M2949k2323n1237m8430r876K5155n412l9348l9125
$$ 461 -15633 -7349 25793 91867 134816 112493 61256 12826 2950 28105 22693 -16655 -55780
370e5780l0058n84J0978j336J8292L1101J7355J7386J0052J5742L3945J1928o030
$$ -55780 -85838 -86422 -75444 -76780 -58488 -27387 -10032 7354 17406 33148 67093 79021 72991
383G2991J690n683j4807l3151n3565j5506K1567O605k1724m8619k9433L4528N4484
$$ 72991 74681 68998 54191 21040 -32525 -48031 -26464 -19859 -41583 -90202 -119635 -85107 -30623
396c0623L8865J9336q475p333J0763J7774M3972L8512k0155o2869o6829j9475
$$ -30623 8242 27578 19103 11770 22533 40307 84279 122791 102636 39767 -27062 -46537
408d6537M4748L0659l2763o2850n3243M917N2308M0710K3879P623j5255l259K0808
$$ -46537 -1789 28870 -3893 -66743 -119986 -115069 -62761 -22051 1828 9451 -5804 -9063 11745
421A1745M3031N5903O926n3539n3211j9842K3141K6223k9365n4211l4233j2449
$$ 11745 54776 110679 117605 64066 10855 -8987 14154 40377 11012 -43199 -77432 -89881
433h9881J5346J8813Q772K1826J2438l563J3690K7943L9131K8323j8494k9374
$$ -89881 -74535 -55722 -46950 -25124 -12686 -16249 -2559 25384 64515 92838 74344 44970
445D4970l858K808L01k2469m3074j8072m540j4465j0056p757R616K8702J0247
$$ 44970 41112 43920 44221 21752 -21322 -39394 -43934 -58399 -68455 -76212 -66596 -37894 -27647
458b7647N636K3805K4795K5125J1394q461Q812J1620j3214k5030l1209j5870L839
$$ -27647 -22011 1794 26589 51714 63108 54647 63459 75079 61865 36835 5626 -10244 -6405
471f405j8617l4359j7965j935J8607J8408j788J2737K6206J7976J9783J4547J6637
$$ -6405 -25022 -59381 -77346 -79281 -60674 -42266 -44054 -31317 -5111 12865 32648 47195 63832
484F3832K3129q688l0796j5152m278J879j7031n1459l4173m72Q245J0963k981
$$ 63832 86961 78273 47477 32325 28047 29926 12895 -38564 -72737 -73209 -64964 -54001 -56982
497e6982m744K0196J9534J6626L2167K8673K0571J494k6783q990J6676N016j5821
$$ -56982 -61726 -41530 -21996 -5370 26797 55470 76041 77535 50752 41762 58438 63454 47633
510D7633m4218m7363j1337L20m391M27m034K653J0190K994K2987M7320L5971J5863
$$ 47633 3415 -43948 -55285 -54965 -59356 -58929 -62963 -60310 -50120 -47126 -24139 23181 59152 75015
524G5015j3352k2905Q281J9099L774j1271l7636m2032k6184k2802J593K3586P008
$$ 75015 61663 38758 47039 66138 69912 58641 21005 -21027 -47211 -70013 -68420 -44834 -37826
537c7826j0763k5483j2359M4526P0071M2489M653l3022k3799J9333K9615K1376
$$ -37826 -48589 -74072 -86431 -41905 28166 70655 75308 42286 18487 37820 67435 88811
549H8811l186m7088n8337m2296j2606L3362L0599j7351m3670l7503J5296P2236
$$ 88811 85625 38537 -19800 -62096 -74702 -41340 -10741 -28092 -71762 -109265 -93969 -21733
561b1733N9174J5942j1460k1679M865K7820J9615J3709j2426m5948m2456k5361
$$ -21733 37441 53383 41923 20244 25109 52929 72544 86253 73827 27879 -14577 -39938
573c9938J820J9423r510l2972j7869L529K7927K9492O330J3975K4595J7147J4195
$$ -39938 -38118 -18695 -28205 -61177 -79046 -75517 -47590 -18098 -11768 2207 26802 43949 58144
586E8144k213q651N126j868j1353j0485k7444l1576k3052j3047J6993K4735n007
$$ 58144 55931 47280 52406 50538 39185 28700 1256 -30320 -53372 -66419 -49426 -24691 -29698
599b9698k0051j7169J2377N7688N1802J3073j6517l4542r462L1423L2468R518
$$ -29698 -49749 -66918 -54541 3147 54949 68022 51505 16963 7501 38924 71392 80910
611H0910l3850o9394m2097N799L3044L1873j6395n1572k8844J1996N5315O6293
$$ 80910 47060 -22334 -64431 -58632 -25588 6285 -10110 -61682 -90526 -78530 -23215 43078
623D3078J7069k6879l5455j0981M4073N6348Q136m0064o6413l9033K1099L3693
$$ 43078 60147 33268 -2187 -13168 30905 87253 95389 55325 -11088 -50121 -29022 4671
635D671Q387k4354n1379k7466J9494M3158M5938J2833k9470k0964J2793M2889
$$ 4671 13058 -11296 -62675 -90141 -70647 -27489 18449 31282 1812 -19152 -6359 36530
647C6530M6245m438m6437l3191n100K1416J5363k6304l8393k4030m517K4773K4568
$$ 36530 82775 78337 31900 -1291 -6391 15025 30388 4084 -34309 -58339 -62856 -38083 -13515
660a3515Q07q879j4827P139M6789M1913O010k8027m0580K097M2045K4560j4876
$$ -13515 -12708 -21587 -36414 -29275 17514 59427 65437 37410 -3170 -1073 40972 65532 50656
673E0656n3333n3741k805K7957K6216Q687k8203l6867n945K7688N7297M6089j1929
$$ 50656 -2677 -56418 -59223 -31266 -5050 3637 -24566 -61433 -67378 -39690 17607 63696 51767
686E1767m1615k6748J5127N6160L1121k9055n2272m1708j926K9933J2109j1229
$$ 51767 10152 -16596 -1469 54691 85812 56757 4485 -37223 -39149 -9216 2893 -8336
698h336k2397k7882k056K4996K9869K7124l01k3723j3K5461L1158J2784k9788
$$ -8336 -30733 -58615 -60671 -35675 -5806 21318 21017 -2706 -2719 22742 53900 66684 36896
711C6896l3541j336J0449N701j6856l5376j3234O955P242J1630K181n133K489
$$ 36896 3355 2019 12468 18169 1313 -34063 -47297 -40342 -33100 -21470 -19289 -24422 -21933
724b1933L021K0653L8754J4871j4771k5911j3939K6201K9465j3509l8601l7921
$$ -21933 -18912 1741 40495 55366 40595 14684 745 26946 56411 42902 4301 -33620
736c3620j0337K0518J0288p727p951j4167k770J5514K3668L3882J5088k2625j8013
$$ -33620 -43957 -23439 -13151 -20878 -28829 -42996 -45766 -30252 -6584 27298 42386 19761 1748
749A748R247L0165K6814j8704m4658k0122K073J0641N18k1960j3894k149n995
$$ 1748 10995 41160 67974 49270 4612 -15510 -13437 -2796 -2278 -24238 -38132 -40281 -46276
762d6276Q138K0142J9224J4610j0016j2436K0898K9184J2932j1125k9561q028
$$ -46276 -38138 -17996 1228 15838 5822 -6614 14284 43468 56400 45275 15714 7686
774G686J1008n353j4952j6288j1110L707o704j3159Q153J6597J3109O668n609
$$ 7686 18694 13341 -1611 -17899 -29009 -25302 -32006 -45165 -37012 -20415 -7306 -638 -6247
787f247R127K3628P304O04o28k249J697j4951k5175k112Q814j50j6291l2549r736
$$ -6247 2880 26508 33812 34416 33788 31539 33236 18285 -6890 -9002 -188 -338 -16629 -49178 -58914
802e8914K5583K3381R853n548j2505R585J9603J5363K0911N497j7711k4704k2357
$$ -58914 -33331 -9950 -97 -5645 -18150 -8565 11038 26401 47312 52809 35098 10394 -11963
815a1963R972L3638J878l5766m6369k2538K8607M0250P864j2754j9923p598J9565
$$ -11963 -1991 31647 33525 -2241 -48610 -71148 -42541 -2291 5573 -7181 -27104 -34702 -15137
828a5137K5164K8907K2485j6610l7043k1320R618L9749J7166l6434m6882k1363
$$ -15137 10027 38934 61419 44809 7766 -13554 -3936 35813 52979 16545 -30337 -51700
840e1700J0820K7564N113r485O81k467r44Q302J4961K8812J5366j8973j7720l46
$$ -51700 -40880 -13316 -8203 -17688 -17007 -19474 -20418 -12116 2845 31657 47023 28050 10330 9984
854I984R179P157j5679j7336N617r27j8413k2173q288K8268L4692l001k0963j3521
$$ 9984 19163 26320 10641 -6695 -1078 -2005 -20418 -42591 -50879 -22611 12081 9080 -11883 -25404
868b5404P397L0822K2207O457K422k0306l1075j1728J4356L6734J3640m4722n6649
$$ -25404 -18007 12815 35022 41479 43901 23595 -7480 -19208 -4852 31882 45522 800 -55849
881e5849j6742L1304N3238J6277k7706k7062r992J6437L7859K7680R910j7114
$$ -55849 -72591 -41287 11951 28228 522 -26540 -36532 -20095 17764 45444 55354 38240
893C8240m3537k0966K2839L6139J6146l4599n6603j5866K3613L1446J4065j8617
$$ 38240 -5297 -26263 -3424 32715 48861 14262 -42341 -58207 -34594 -3148 10917 -7700
905g700j9292J997Q899K0266K3172O442m961j7948j3854J7021J9686n543k4374
$$ -7700 -26992 -24995 -16096 4170 27342 33784 28823 10875 -2979 14042 33728 28185 3811
918C811l0535l352K2521M769j3796j4476m239J9024J8015J176M121K534p88P273
$$ 3811 -26724 -30076 -7555 -2786 -16582 -31058 -35297 -16273 1742 2918 7039 9573 8785 16058
932A6058O513J0121O188k2878k7533m674J2623J7860q841l6925j7957J1192K3633
$$ 16058 22571 32692 38880 16002 -11531 -16205 -3582 14278 5437 -31488 -49445 -38253 -14620
945a4620K0492l751j1776K059L902J2408K2857J0480l831k1132k7091M354K2890
$$ -14620 5872 2121 -9655 -7596 -3694 8714 31571 42051 38220 17088 -10003 -5649 17241
958A7241O969j6337l5516k1278J4920J9383Q073p87j0817n5J0942R623J9792J4974
$$ 17241 24210 7873 -27643 -48921 -34001 -14618 -6545 -7332 -18149 -18204 -7262 2361 22153 37127
972C7127o709j2423j1764K376J9434n33k2474k1378j2942P444J1359p496p609
$$ 37127 30418 17995 6231 8607 28041 27508 5034 -16344 -29286 -21842 -10483 -17979 -25588
985b5588L56J467J2438J0488P219J2777J76o125N103O780P067k190k2732j4686
$$ -25588 -25232 -23765 -11327 -839 6380 19157 19333 13208 18311 25091 32158 29968 7236 -7450
999g450N72R95K65j1479j5919K187O931N035R938L693N300Q479n13P149J3557
$$ -7450 -6878 -5883 -5618 -17097 -33016 -30829 -23898 -18863 -8925 -5232 68 8547 8034 15183 28740
1014B8740K996k644j1121j3214L136O86j0546r607j1724l528O502k938j26P756
$$ 28740 31736 29092 17971 4757 7893 8579 -1967 -11574 -23298 -26826 -20324 -23262 -23388 -15632
1028a5632M082Q141O244K581J3518P477l771o82l220n42J975j3011j3538l634
$$ -15632 -11550 -3409 2835 5416 18934 26411 22640 21958 18738 18196 20171 7160 -6378 -10012
1042a0012m867j252k982p912M703N813n9O738P275R141J2946j534l665N768J600
$$ -10012 -14879 -16131 -19113 -27025 -22322 -16509 -16568 -9830 -2555 6586 19532 17998 14333 20101 21701
1057B1701J477k711j3203n310n167j1485k517n53Q13L293q740o058J1937J4753
$$ 21701 23178 20467 7264 1954 -3213 -14698 -17215 -17768 -16955 -13662 -22402 -28460 -16523 -1770
1071a770J4251N428r352q41O779M197P754k99j0403j0169j6369r168J0309P323
$$ -1770 12481 17909 8557 7716 14495 18692 26446 26147 15744 5575 -10794 -19962 -9653 -2330
1085b330k022j2739j8986K921K1712J5730R171m509j0604M005P166Q983J4172
$$ -2330 -4352 -17091 -36077 -33156 -11444 4286 13457 8948 -1656 2349 9515 18498 32670
1098C2670k326j4901j6703j4604P397J6159l446j4869j7376p142J6307J4534K574
$$ 32670 30344 15443 -1260 -15864 -8467 7692 4246 -10623 -27999 -35141 -18834 -4300 -1726
1111a726K791k750N38P381L027Q979R454p138j0084p536l629O710l096j3828m211
$$ -1726 1065 -1685 -1147 6234 9261 18240 27694 20556 10472 2936 -693 6017 2921 -10907 -15118
1126a5118J69K132K010q255L81J3706Q050N931m67n746N112N816Q18P190j854
$$ -15118 -14949 -12817 -10807 -19062 -18681 -4975 3075 9006 8539 2793 7905 13721 14539 21729 19875
1141A9875j1570j2069j3126M066J7443J585j3021j8275j0044J6165K2601Q421
$$ 19875 8305 -3764 -16890 -12824 4619 6204 -6817 -25092 -35136 -18971 3630 12051
1153A2051j99j1463j0154P360J2280J4852R460j6506k2573j0844M019K0715R274
$$ 12051 11852 389 -9765 -2405 9875 24727 34187 17681 -4892 -15736 -11717 8998 18272
1166A8272j7312j9986j1898M633K1436J0698j159l981r634n05J3237J0959J0296
$$ 18272 960 -19026 -30924 -26291 -4855 5843 4684 703 -8931 -9436 3801 14760 25056
1179B5056l223j8238p185L091P025O517j0832j5919j450K159N645L192o982P05
$$ 25056 21833 3595 -3590 -499 6526 13043 2211 -13708 -15158 -12999 -7354 -4162 -11144 -10439
1193a0439P377K277N987J064l007L819J084J247P394l529j0694q277o938Q839
$$ -10439 -3062 -785 5202 6266 3259 7078 8162 9409 16803 13274 2580 -5697 -12635 -3796
1207c796J2460m945j3688j3074k065J8791J6100K20o432j2506k945J3658J2341
$$ -3796 8664 3719 -9969 -23043 -25108 -6317 9783 10003 3571 -8935 -11880 1778 14119
1220A4119J0061l30k0281j5355n64J0698J9139J6k2491j8302m956J4081K2306
$$ 14119 24180 23850 3569 -11786 -12350 -1652 17487 17503 -4988 -23290 -28246 -14165 8141
1233H141L526j0023j0407q627R098J7721R640L028j1964j8656n70J0480J2337
$$ 8141 11667 1644 -8763 -17390 -8292 9429 19069 22097 10133 -8523 -9093 1387 13724
1246A3724N200j6085j8354k253N349J2065O534q628n687j831L15J0976P746Q56
$$ 13724 18924 2839 -15515 -17768 -12419 -354 6180 -2448 -8135 -9966 -9651 1325 9071 9927
1260I927k30q679m273P874M872J357m627j2690j117N540k4K86m728l857O089J934
$$ 9927 9697 1018 -3255 4619 9491 10848 6221 -6469 -7586 -2046 -2070 -1784 -6512 -10369 -4280 -2346
1276b346j594L450M50K804L693m451K179M865l143j946l072k455N698k724q361
$$ -2346 -3940 -490 -40 2764 6457 2006 4185 9050 5907 3961 889 -1566 4132 1408 -6953
1291f953j021N39N366M215q355k641O087L952N204j478n248M412J198k584K515
$$ -6953 -7974 -7435 -2069 2146 -6209 -8850 -2763 1189 6393 4915 -333 4079 5277 2693 5208
1306E208K26j012k132j0594j604R862L875r42q872r086O837R829L211K274m170
$$ 5208 5434 4422 2290 -8304 -9908 -46 3829 2887 -5985 -15071 -8234 1595 4806 7080 2910
1321B910m281J434k308M856J0926j025q272j2151q078J0931J2487k82n712j0690
$$ 2910 -1371 63 -2245 2611 13537 12512 4240 -7911 -15989 -5058 7429 7147 1435 -9255
1335i255n476O891M963P543Q448n143r649p721l07J7021J3581n799j4051j4699
$$ -9255 -14731 -7840 -2877 4666 13114 7971 -1678 -9399 -9706 7315 20896 15097 1046 -13653
1349a3653k061J3894Q720L36l259j1916p448K141P589J6848P818j2357j4574o427
$$ -13653 -15714 -1820 6900 7236 3977 -7939 -15387 -13246 -5657 11191 19009 6652 -7922 -14349
1363a4349Q747K0711M667j1345j1598r126L200R661K282J910k956j1127m532M314
$$ -14349 -5602 15109 19776 8431 -3167 -12293 -9093 568 2850 4760 1804 -9323 -13855 -9541
1377i541R719J2946l681j3726l389N059J1105N886r353o840J023j24K218j589
$$ -9541 178 13124 9443 -4283 -7672 -2613 8492 14378 5025 -1815 -792 -916 1302 -287
1391b87l763K769k074n481L443L889L863Q42q208O87J0209L636j574p402n150
$$ -287 -4050 -1281 -3355 -8836 -5393 -1504 2359 3201 -5007 -4320 5889 9525 7951 549 -4601
1406d601Q552N009o045n503m306J897N634m130k082L702j479n71l00K001J0971
$$ -4601 3951 8960 2915 -2588 -6894 -4997 637 -3493 -5575 -1873 -3352 -3923 -4223 -2222 8749
1421H749K104j0741m682L152J0488P639j1290j3668j56M657O704R7q033l94l25
$$ 8749 10853 112 -4570 -1418 9070 16709 5419 -8249 -8405 -3748 2956 3053 -4980 -5374 -5699
1436e699m011L407P869P020J849j2987q388J0191J2636N134r118j5352M34Q719
$$ -5699 -9710 -6303 1566 8586 10435 -2552 -10940 -749 11887 17021 7903 -7449 -7015 1704
1450A704J044j470m868j614L276n077l006P966O726O62o421p157R230J2099k944
$$ 1704 2748 1278 -3590 -5204 -1928 -7005 -10011 -2045 4681 5343 -1078 -8235 995 13094 10150
1465A0150q925o516M175J1854k882j2172l595J475M481J356n227L267M477n680
$$ 10150 1225 -5291 -1116 10738 7856 -4316 -7911 -6436 -1955 -599 -5826 -2559 1918 -3762
1479c762m350K571J1053J2320p373j7126k800R029J2389K237j3005p562P41r25
$$ -3762 -8112 -5541 5512 17832 10459 -6667 -9467 -438 11951 14188 1183 -6379 -5638 -6563
1493f563J451K851L932N006q676j3686L297J4219J3584k77j6519q066P261P051
$$ -6563 -5112 -2261 1671 6677 -1999 -15685 -12388 1831 15415 15138 -1381 -9447 -2186 4865
1507D865L825k403n131P84n132q584L714R134O833l124j5250m733J2280J0365
$$ 4865 8690 6287 1156 1940 -3192 -11776 -8062 1072 7905 4781 -10469 -15202 -2922 7443
1521G443K530o232p463M537L510l640O75K364J800k128j0721l581R564O307j729
$$ 7443 9973 3741 -3722 815 4325 685 1360 3724 5524 3396 -7325 -10906 -1342 4965 3236
1536C236p714o287P614Q253k643k870m13L165M738n650m532N376K348j315m999
$$ 3236 -4478 -10765 -3151 5102 2459 -411 -824 2341 7079 1429 -3103 2273 4621 3306 -1693
1551a693n512N540N772n159m152k1M282O127n229m988M384N292J300k962o980
$$ -1693 -7205 -1665 4107 -1052 -5204 -5225 -943 5184 -45 -5033 -649 4643 5943 2981 -3999
1566c999L340O040k679l500k197L04L615k732m136N302K954r41l691m518O284
$$ -3999 -659 5381 2702 -798 -2995 -2691 924 -1808 -5944 -642 2312 1371 -2320 -6838 -554
1581e54R633j676n857n399m64Q123K176m463j293l736k326J993K27N954M199p061
$$ -554 9079 7403 1546 -3853 -4317 3806 5982 1519 226 -3510 -5836 -3843 -3616 2338 6537 -524
1597e24o666r30O797J2398J253j0049o937j935N405R045q97l928n170p647Q21
$$ -524 -7190 -8120 -1323 11075 12328 2279 -4658 -6593 -1188 7857 6960 3032 -2138 -9785 -8964
1612h964O652N630M292o252j1572p70P573J0790O668p543r599j805J645P867N091
$$ -8964 -2312 3318 7610 1358 -10214 -10984 -3411 7379 14047 6504 -3095 -4900 -3255 4612 9703
1627I703m008n043o678n356N702P170K407j446r002m147O335O315N631N16o393
$$ 9703 5695 652 -6026 -11382 -5680 1490 3897 2451 -6551 -10698 -4363 1952 7583 8099 1706
1642A706j759N02j65M863J324k968k335o025k578M545J318N71n21l958Q77K719
$$ 1706 -53 449 284 5147 6471 3503 1168 -4857 -7435 -2890 -1572 -1001 -1522 -5480 -4603 -1884
1658a884m30L757K988J01J425l320k733L011R70R76m44o471k985n84j331M203
$$ -1884 -2314 1443 4431 4532 5957 2637 -96 2915 3885 4861 4417 -2054 -5039 -5623 -6954 -2751
1674b751K629j634p65l213q02O969M717K030j15n550j795K532R87L505m73o607
$$ -2751 -122 -1756 -2521 -5734 -6536 433 5150 7180 7065 1515 -280 2252 3239 6744 6271 -336
1690c36m330k861J16O316J570k352j935l689J449O116L563L948k71o050j642J384
$$ -336 -4666 -7527 -7411 -1095 475 -1877 -3812 -7501 -6052 64 3627 7575 7304 1254 -388 996
1706I96K482N393l436o835k644k892J762M445o38M2j981m363K235N027M362L605
$$ 996 3478 8871 5435 -1400 -4044 -6936 -5174 -729 -1367 -1325 -3306 -7669 -5434 -407 3955 7560
1722G560l684m870K011K040K589J067n191k522p65k996J612K152j514K25l237
$$ 7560 3876 -994 1017 3057 5646 6713 1522 -1000 -1765 -4761 -3149 -997 -2511 -2286 -5523
1737e523j096O223L029k57p49k945K995N054j947k234j766j676K684p78l352N61
$$ -5523 -6619 -396 2633 2376 1627 -1318 1677 6731 4784 2550 784 -892 1792 1014 -2338 -1777
1753a777j496k457J362J123L578L323n027k505K875M402N616j834p678j222J210
$$ -1777 -3273 -5730 -4368 -3245 333 3656 -1371 -3876 -1001 3401 9017 7183 -495 -1717 -507
1768e07K443K470l722l250r67l683J305N347K078J502m340o074N266P858L253
$$ -507 1936 4406 684 -2566 -3533 -7216 -5911 -564 1514 3016 -1324 -7398 -2132 5726 8979
1783H979j849p839l017N052K712q3k117n525o54m29j034M561K938k243k927k959
$$ 8979 7130 -709 -3726 1326 4038 3955 1838 -3687 -4341 -4770 -5804 -1243 1695 -548 -3475 -6434
1799f434M053R960R44n226l830j419O113L890m850l505k368j746J742o33L01K983
$$ -6434 -2381 7579 8523 3297 -533 -1952 4161 8051 3201 -304 -2672 -4418 -2676 -3309 -3008 -25
1815b5l231m121J850L992P641J501p589k035M241M434L077m729o089Q94o98j082
$$ -25 -3256 -7377 -5527 -1535 6106 7607 18 -2017 2224 6658 9735 5006 -1083 -189 -887 -1969
1831a969L23j946J063j031n370J096O080L629J459m087j971O801M356j441j769
$$ -1969 -1646 -3592 -2529 -3560 -8930 -7834 -1754 1875 3334 -753 -2724 4077 8433 6992 5223
1846E223l003J070K140n244k593j09j087R8k606k869M446K175j554P87Q66N425
$$ 5223 2220 3290 5430 186 -2407 -2516 -3603 -3505 -6111 -8980 -4534 -2359 -3913 -3126 -2260 3165
1862C165N222l293k510J668K085K884k841o707r02J74k433n37k724K49K545l464
$$ 3165 8387 5094 2584 4252 6337 9221 6380 -327 -1229 -1055 -3488 -4025 -6749 -6500 -3955 -7419
1878g419p83L825L991M993K2m460L322M250J890o20m418k367J891l404m099j340
$$ -7419 -8202 -4377 -386 4607 4629 169 3491 7741 9631 9011 4593 2226 4117 713 -3386 -4726
1894d726j348J717j619n066J623N318L242K988k360L81O426J285n26O23j188J669
$$ -4726 -6074 -4357 -5976 -11042 -9419 -4101 -859 2129 -231 150 6576 7861 7335 7958 6770 8439
1910H439k407p409j457J741m40k354o364k888N990L026M33L36k02N027M519r64
$$ 8439 6032 -1377 -2834 -1093 -1533 -3887 -10251 -13139 -7149 -4123 -3690 -3354 -3556 1471 5990 5026
1926E026J927K992n02j566m395k869L915j189o736n496k515M191M424m032k699
$$ 5026 6953 9945 9443 7877 3482 613 4528 3339 -3397 -8893 -11408 -7217 -2793 -6825 -9524
1941i524J969L372O669K411k27L043m65j717J457J155J808k006j0374o422J709
$$ -9524 -7555 -4183 2486 4897 4670 7713 7248 5531 6988 8143 9951 7945 -2429 -8851 -7142
1956g142M336K933n663q821Q65O219O239N267r97q39J033j065L503O588J587l652
$$ -7142 -2806 127 -5536 -14357 -13492 -7273 -1034 4233 3236 2397 3430 2365 5868 12456 14043 10391
1972A0391r486q590L676O184j09n506r317l074O706M929K950J629j165J579J489
$$ 10391 905 -7685 -4009 2175 2066 -3440 -12757 -15831 -9125 -4196 -1246 383 -782 797 2286
1987B286J068O118L981k825m513o116l34M424k431o086m157k141L873J962l732
$$ 2286 3354 9472 13453 10628 6115 -1 -335 4089 1658 -4428 -8585 -10726 -6853 -4891 -8623
2002h623R15M559L593L969n99o81L775J181K5O88k273j860m009o830j97L937O68
$$ -8623 -7708 -3149 444 4413 3814 3133 6908 8089 8114 8802 6529 4669 660 -6170 -6367 -2430 -1762
2019a762k912p237l184Q194P994L591n63m917M42N708L352L590k47o858n132m556
$$ -1762 -4674 -11911 -15095 -6901 1093 4684 4121 -796 -354 5354 8706 12296 12049 5191 59 -4497
2035d497R6O232P81p341p191m333O467J0450K114k271l200n27O927N603J427J24
$$ -4497 -4401 1831 2612 -4729 -11920 -16253 -9786 664 2778 507 -2693 -3220 3707 9310 10737 10861
2051A0861l967n626q78k37K270J351p309p038j463K461P151K169m309O1J837M281
$$ 10861 6894 1268 390 153 2423 3774 -3535 -10573 -12036 -9575 -2424 -255 -4564 -4503 -2666 1615
2067A615N816j66o17J584k327j632p06j474K05k622n995j230N12N08J759j633
$$ 1615 7431 7265 6648 8232 5905 4273 3567 2093 2298 -324 -6319 -7549 -7037 -6529 -4770 -6403
2083f403J08M970K286L45J380M88M944K819l959l337j839n0K020k761n009j669
$$ -6403 -6295 -1325 961 1306 2686 3174 8118 10937 6978 3641 1802 1752 3772 1011 -3998 -5667
2099e667k710k88K623J116L562J030l644J61N513N857M721m012o994J5K187K902
$$ -5667 -8377 -8665 -6042 -4926 -1364 -334 -3978 -3817 1696 7553 12274 8262 1268 1283 3470 6372
2115F372J23o323n159j483k305K293L438L27q8l230j790P062O813K549j522n232
$$ 6372 6495 172 -4987 -6470 -8775 -6482 -3044 -2717 -2805 -6035 -7825 -763 6050 8599 7077 1845
2131A845n29M682J143j241l200m722m40j441k404J634O78r77R8j575L102N449
$$ 1845 1316 5998 7141 5900 2700 -2022 -2462 -3903 -6307 -4673 -3995 -4972 -4874 -6449 -3347 2102
2147B102N42j95O70J305L203j53n397m37J026M31r93o001l460J680Q54J400O89
$$ 2102 2644 2449 3119 4424 7627 7474 2077 1640 2666 3097 2104 -3897 -7357 -5677 -4823 -3423 -2734
2164b734j521J174P23J50N100M386K42j950n674p31O664J874l088o588o083K015
$$ -2734 -4255 -3081 -2358 -2208 2892 7278 7520 5570 -104 -835 5829 7703 4615 -1973 -8056 -6041
2180f041L999K66q5k114k828J539K284M424N590r97m307k476J102O974L774o543
$$ -6041 -2042 -1776 -1861 -3975 -6803 -5264 -2980 1444 7034 6037 1730 -746 356 7330 11104 4561
2196D561o776l816J181N640P0l900j981k290P48M655L208K664K02n497l0M537
$$ 4561 -2215 -6031 -4850 790 860 -3040 -5021 -7311 -6563 -1908 1300 3964 4166 -1331 -1361 3176
2212C176M516K201n400p317j42K800K237q71n374k885J294M09K978K816p25J025
$$ 3176 7692 9893 4493 -2824 -2966 -166 2071 1200 -4174 -7059 -5765 -5356 -2378 438 -287 738
2228G38j544l79N443L813j134l531n152J077M838j033l844l822j939K898J197
$$ 738 -806 -1185 4258 8071 6937 3406 -1746 -669 4169 3136 -708 -4530 -6469 -3571 -2374
2243b374j814J074R22M13J760j23K671L673j579k644J48J097L030k301o855j474
$$ -2374 -4188 -3114 -2192 -1779 -19 -142 2529 6202 4623 1979 2127 3224 6254 3953 -2902 -4376
2259d376J977J478M19m914k329L971K056J614R53q36J927O91j211K775L025j029
$$ -4376 -2399 -921 -502 -5416 -7745 -3774 -1718 -104 849 13 1940 2631 1420 4195 7220 6191
2275F191l228n622q76N566Q26l580m888l440L197M559J23N82l93n53J985R01K137
$$ 6191 2963 -2659 -3535 2031 2857 -723 -5611 -9051 -5854 -1295 -1172 -590 -983 -1536 449 1350 3487
2292C487M936j358m738l044n70M092K308n270m412j815P42L721n41j136J693N59
$$ 3487 8423 7065 2327 -717 -1287 2805 5113 -157 -4569 -6384 -5642 -1921 -2462 -3598 -1905 -1346
2308a346m42J662N71M245K150l569j603P78Q31R63k685m074Q28M35j889j298j019
$$ -1346 -1788 -126 445 4690 6840 3271 1668 2446 3277 4240 1555 -2519 -1691 -1256 -3145 -4443 -5462
2325e462K057L442j689j452J129K167L912Q16k624J162K01j165O8j535R84M87
$$ -5462 -3405 37 -1652 -3104 -1975 192 4104 4920 2296 3458 3659 2494 2562 1027 2011 2498
2341B498m560l631N60J874L444j358m543J084K861K649K555j267o19J658j139
$$ 2498 -2062 -5693 -5133 -3259 185 -1173 -5716 -4632 -1771 878 3433 2166 1547 3205 2066
2356B066L03J731O0o79l552m053J254K865m48j470l835l77M191J387O44L22j077
$$ 2066 2369 4100 4160 3481 -71 -4124 -2870 -5 -453 -1923 -5758 -6135 -1944 -557 87 409 -668
2373f68J624J812o05K410L56j994j556j687J32K212j776l444q93l75J818J648
$$ -668 956 2768 2163 4573 4929 2935 1379 -308 -176 2036 260 -3184 -4077 -4452 -2634 -986
2389i86j989J29J355P27K343N75m97J881o31p16R11o55l12j427l101K35J156l92
$$ -986 -2975 -2846 -1491 -764 1579 2154 1657 3538 2907 2191 3102 2447 2135 708 -2393 -2158 -1002 -1394
2407a394o62k200j164L467J683O39K92j460R06K696J96J468N8k806j249p39p8
$$ -1394 -2056 -4256 -5420 -1953 -270 369 661 -799 107 2803 2999 4467 4525 1719 470 -269 -347
2424c47J955o15l400j693j544K642L119m60j177j68l81K786K533Q5Q84j599j989
$$ -347 1608 993 -2407 -4100 -5644 -3002 117 -343 -1520 -1688 -2069 717 3250 3335 4219 2620 631
2441F31O62J48N56J44l487k090L0K72K127J43j946L33Q54O87K578M28J40Q08j137
$$ 631 1293 1441 1997 2141 -1346 -3436 -3406 -3134 -1007 -864 -2810 -2477 -1623 -936 1642 2070 2210 3018 1881
2460A881P5J105r17m10q34k668N83J94j642M88j010K7K212l28L01J437K33J087
$$ 1881 1956 3061 2144 1734 900 -1768 -1185 -991 -2633 -2145 -3155 -3128 -916 -1244 -943 494 727 1814
2478A814J539p83L46l61k026J040p54o41q9k109j499O76l51J315Q36n94M85J058
$$ 1814 3353 2570 2916 2555 529 1569 815 174 85 -2024 -3523 -2847 -3198 -1883 -1047 -1641 -1156 -98
2496i8J70K247J170q37M31j432p67J121j127n09l43k689M8j37p92J505Q58n71
$$ -98 72 2319 3489 2652 3083 1651 884 2005 878 369 26 -2663 -2615 -2752 -3544 -2039 -1181 -1752
2514a752J017j57O13K654J073K1K93j892l08L51j068L19r50k567q37j080R73K085
$$ -1752 -735 -892 -279 2375 3448 3469 3762 1870 1562 1913 845 1164 214 -2353 -3190 -4270 -3297 -1212
2532a212k79q55R88j98K093L134M4l83o51j175J170O6p83j72k776k289K78m58
$$ -1212 -1491 -2346 -1358 -1556 537 3671 3715 3332 2681 1506 2676 2742 1959 1787 -989 -3278 -3000 -3458
2550c458J100R02k012l54J352J633K715Q74q56N54N25L28J207j476j127j008k428
$$ -3458 -2358 -1456 -3468 -3822 -2470 -837 1878 2752 1896 2450 2975 3303 4510 3034 1907 899 -1529
2567a529n59O37j156q6j459j380K382J981R47O83n44R06K861N80N26o50j530n37
$$ -1529 -2088 -1451 -2607 -2693 -4152 -5532 -3150 -1169 -222 461 -83 823 3684 4264 4790 4140 2610 2073
2585B073o00j605J15j715k279l52k21J014J885p55o11J584J835K813J169j642
$$ 2073 1473 -132 -17 -1732 -4011 -4363 -4584 -3570 -1685 -2440 -3051 -1467 368 3181 4350 2708
2601B708M99M00k07Q67j444k180j548k079n32J124m27l64j453j363K633L928J306
$$ 2708 3207 3607 3400 4267 2823 643 -905 -2984 -3516 -2392 -2819 -3183 -4636 -5999 -3366 562 1868
2618A868R11j450n94K593J406P14m03l086k197r41p16J480o6l579j497n41J799
$$ 1868 2779 1329 735 3328 4734 5448 5045 1959 -238 -1179 -1895 -415 -481 -4060 -5557 -6098 -4299
2635d299L644R06o78r0oK434L156j25k42j466k362L62o7q93j03k638k468Q87K66
$$ -4299 -655 251 -427 -517 -523 1911 5067 4942 4700 3234 872 1234 1167 274 171 -2467 -4935 -4048 -3782
2654c782J380J153j126N33J686J041J938L76l41N10j60p24J61j568j290l92j633
$$ -3782 -2402 -1249 -2375 -1842 -156 885 2823 3199 2858 3368 3208 2484 2645 1077 -213 -605 -2238
2671b238l34J69j271L99K60O35K038O37l28J010O18J412J633j265j432p92j169
$$ -2238 -2572 -2403 -3674 -3275 -3015 -2380 -342 295 -33 977 1595 3007 4640 3375 1943 1151 -18
2688a8Q83J46j783j202j477p50J714J278L05K15j417M42K601J463J804o12k976
$$ -18 865 1011 -772 -1974 -3451 -4201 -2487 -1209 -904 -689 -2106 -1664 937 2400 4204 3592 616
2705F16k06Q88O28P15j804k663r64n63J252K120j267q26l06L50K514K101j94l35
$$ 616 410 1298 1926 2641 837 -1826 -2790 -3353 -2101 19 -1248 -2074 -2380 -2030 484 2585 2391 2056
2723B056j430k11J913L82o96r34k590m10Q02k76N93k70j857P41P01J085J604m09
$$ 2056 626 415 2328 2710 2014 1080 -1510 -1920 -1118 -1394 -801 -1071 -2928 -2187 -1486 -401 1203 794
2741G94n88R22K86P61N77k114l20J30p56L45r56j486N15L07M39R30n90m23N57
$$ 794 206 1128 1414 2175 2752 638 318 448 -308 37 -919 -2405 -1890 -1583 -1144 -214 -804 -1227 -670
2760f70Q15J475J431j443r35r91K07K372J11j757j699k079K40K417P52k03j231
$$ -670 145 1620 3051 1608 673 -318 -111 2261 2372 615 -1084 -3163 -2923 -506 246 43 -1188
2777a188j894O49K691J904J518j492k973l74J158K499J621k599k945j133k47K576
$$ -1188 -3082 -2433 258 2162 3680 2188 -785 -1159 -1 2498 4119 1520 -1425 -2558 -2805 -229
2793b29J908j689j303j800M8K616K374J93j24k120q39J894J238R73j095k781r62
$$ -229 1679 -10 -1313 -3113 -3065 -449 1925 2118 1994 -126 -965 929 2167 3140 2045 -736 -1698
2810a698N81N89J250r50k091J73j85J196K037n02n26K62o7J637N77r18j97k22
$$ -1698 -1117 -528 722 -228 -2319 -2146 -2331 -1135 902 400 -126 136 69 1706 2283 1365 1168 946
2828I46o63P47o68j098q7q61J93R22p68l72P41m94J742J151n39k2m95j22J653
$$ 946 283 1030 362 -736 -823 -1684 -1491 -569 -1337 -1709 -968 -1462 280 1431 892 870 375 253 1906
2847A906J21l58q17j878l74J139K3N88r55k142K53J055J687J318j151j343J48
$$ 1906 2027 1669 852 -1026 -1400 -261 -238 350 -605 -2747 -2494 -1439 248 1566 415 -928 -780
2864g80L87K423J210j416j075j260n57J720Q82r57r92k498j24J837J059P46p94
$$ -780 -393 2030 3240 1824 749 -511 -1068 652 1534 577 -415 -2913 -3037 -1200 -141 605 -189
2881a89j647L25J914J046Q82k43j763j89r1O67J153r44j357r16p68J040J369o79
$$ -189 -1836 -1511 403 1449 2331 2088 325 136 45 712 1865 921 -436 -1352 -2120 -1080 289 -390
2899c90l46n61l17J510P44j55O51q2k41L72q16K13N97j004k29k1p85L73m79m93
$$ -390 -736 -1297 -1614 -104 640 485 1136 1054 813 1185 369 582 1179 175 -54 -75 -860 -487 -966 -1459
2919a459J226j13m85L77l15N29J603k06m2o12r64J089P20o11K36j428j073M20
$$ -1459 -233 -346 -831 -454 -769 -240 1363 1157 1115 503 -461 628 1348 737 973 -455 -1528 -1108
2937a108j84J298Q83j636o47K93K56K134M69j321n59k67L22J641j64q71o61r84
$$ -1108 -1292 6 889 -747 -1394 -1101 -845 1289 1758 437 -122 -389 -67 1574 1410 539 -122 -1106
2955a106j77J161O15K04q20j818O91Q61J157O64j037j091O61J91P18N80j072m02
$$ -1106 -1283 -122 493 697 -123 -1941 -1250 -389 768 1432 395 -696 -35 156 874 1454 382 -20
2973b0j0q19J034M98p49n48n66O8J212J67m11L94q76Q37O46o76O5Qm45J026k36
$$ -20 -30 -849 185 683 -66 -614 -1180 -1112 100 267 -144 250 -626 211 857 181 246 254 -191 835 599
2994E99m65K60p22l22N81n1k35K81q29M30N79M9N86r05n74Q98L16K80m1r40j90
$$ 599 134 394 -328 -650 -69 -120 -355 -74 -903 -473 106 155 741 -164 -738 160 476 756 715 -225 -415
3015d15O27n91Q00j43n50l39n97L54J585k10o49j99n62L60J682j44k70l75j383
$$ -415 212 -379 421 278 -272 -611 -1208 -854 731 521 -128 -327 -889 -529 1153 1009 739 364 -1019
3034a019Q83N98OM45j087j376N11K98Q44P81j144r25O00J82J349L08q97M9k52
$$ -1019 -136 462 468 913 -174 -1550 -1039 -741 103 884 -260 -1185 -585 -403 946 1254 357 406 154
3053A54n31J193o7k91j34j181m47R11M4O88l51j033J4R45K4O57m01j4K08j98J54
$$ 154 -377 816 749 458 324 -857 -1304 -393 -349 339 -12 -1045 -1031 -86 -62 595 194 180 388 190 344
3074C44O34m37k91m01q44P33J29l69k2n00k25R85j93M87J98L3L14J00m47L58K75
$$ 344 978 541 250 -151 -995 -262 -133 -502 -524 -1024 -1249 -264 -457 30 228 261 575 675 228 586 861
3095H61r04K88n8k31K21q31o34R25k72J32M2n35N25N64K9M94R1o59L64J0j25Q79
$$ 861 -43 245 187 -44 177 -654 -1288 -363 -635 -503 -461 -996 -471 93 122 616 707 48 412 422 297 1176
3117A176o99k72n70m08K52P33m65j04l09k90Q46J15J72P75m95l05J82l78P49K78
$$ 1176 477 205 -365 -773 -521 212 -253 -357 -666 -956 -110 5 177 952 457 152 334 -44 705 983
3137I83o88p27J84l46O72j97n74K66l39M52N96m64O54K50q47Q7N89k50N67j12
$$ 983 295 -432 -248 -594 78 -119 -693 -427 -766 -314 282 -182 472 722 -125 -38 551 301 868 756
3157G56j302L66K60P9m9p79L29M08l96M59J18k92N02m7o09O55L0m22J56r65L63
$$ 756 -546 -180 80 159 110 -669 -340 68 -328 131 249 -43 459 412 -197 458 488 66 222 -743 -380
3178c80O70m13k11k5k74P36No62R43k93K6O33p96j00R51q39l48L25k23N84j81
$$ -380 290 -123 -334 -359 -633 103 108 -554 389 96 122 755 -41 -141 810 -29 -377 -52 -275 309 128
3199A28j358J38O95M13K33l55n30R50j55J41M27k05L62o22o10K23N85j02l46r56
$$ 128 -1230 -1092 -397 16 249 -106 -636 314 159 300 727 522 884 262 -348 -125 460 358 12 -944
3219i44m15J125J85j61L93n55M18K79j0L29J84m39J65o13j66R95l99m04l64p91
$$ -944 -1359 -234 -49 -210 183 -372 46 325 315 644 828 389 554 -59 -225 770 371 -33 -397 -1188
3239a188L55Q80m93J00l7K4N27j42j97J008k11j66J69m06K28K76q96j91J54k49
$$ -1188 -833 47 -446 -346 -383 -359 168 26 -171 837 626 460 629 223 451 727 -169 -360 -206 -455
3259d55J33n72m11P87P76l56k07J8J85R29n7J11l38n91L30J33l56O61n43p25l74
$$ -455 -322 -894 -1305 -518 258 -98 -305 -287 -102 827 770 881 543 -48 282 415 59 720 177 -548 -922
3280i22l02Q09J134j007p00K67k5J035P00k64m95ok09N36L08j75K19j185q93O71
$$ -922 -1224 -415 719 -288 -988 -721 -746 289 989 725 230 224 15 551 859 684 903 -282 -1175 -504
3300e04J5O06j28j315M88M74K09P58o86j51L75N0n3Q54k69R1n50o67M52k22J08
$$ -504 -489 117 -11 -1326 -838 -364 -155 603 -83 -234 141 191 138 992 723 814 264 -403 49 -173 -65
3321f5j76n58o8M49J75j53J40n56O63Q01n14M1K35k18O62j73m36M09m49o77L37
$$ -65 -241 -799 -867 -418 -243 -396 -256 -812 -149 652 138 179 414 196 858 685 249 658 209 -468 -131
3342a31j72n9M48j281K01P80L38P4k32q10O64O52L23K37o10l87Kl50L72N75n31
$$ -131 -303 -362 86 -1195 -994 -214 124 198 -34 -844 -180 472 795 1032 422 35 37 -313 59 634 103
3363A03n70n00l94J153O36n50k83n58K14J507Q7p8k23n21O9K80j77N02o7j103
$$ 103 -467 -967 -1361 -208 428 -122 -405 -963 -749 758 845 767 544 23 92 372 195 697 630 -473
3383d73m31m9P09Q21q60k75l29N4J103L29l19N16n06k50M39j57J50J73o87n21
$$ -473 -904 -953 -244 577 -283 -558 -887 -833 270 599 280 796 290 40 479 322 472 645 -42 -563
3403e63K26P7K39M4n65j12M66J10K63l38k23P73O9m93K35k3K09R5m53%l62J86
$$ -563 -337 -260 -21 23 -542 -654 -188 -78 185 -153 -376 397 466 -27 208 185 394 489 36 36 -326 -140
3425a40j98J6m45J115k71o06L44Q1N69N26n34l67K14l23O41J05p65k00r7o06P57
$$ -140 -338 -322 -767 348 77 -529 -185 -104 465 991 457 90 304 -19 622 727 -38 -238 -335 -941 -184
3446a84q2L33j6r00K09N45M57O06m63n63k33N46K13M63q54n4m07j00J56N76k22
$$ -184 -266 67 51 -849 -640 -95 362 968 505 -58 -291 255 468 931 77 23 -384 -484 -328 248 26
3467B6j9m90m06N65P23L19m0n40o73P60N68p4l43n57k89K57l34N29R5n06ml11
$$ 26 7 -483 -889 -324 399 718 678 138 -535 225 793 719 376 -181 -470 -213 -547 -18 77 -429 -433 -744
3489g44j73J268k26L00%l91N4Q48p42L28j6l14n7l65m04O19k22j98l7k41L26L24
$$ -744 -917 351 125 425 425 34 88 936 194 522 506 192 135 -230 -634 -15 -237 -435 -472 -713 -387 -63
3511f3j32K46J85O3l1l3l40Q85J62o58k78m80m4P69m60q6j91m86M85K60j07N41
$$ -63 -195 51 236 299 268 235 -105 780 942 284 6 -474 -518 251 -209 -295 -486 -972 -487 -227 -334 207
3533B07M9l40J60j16N85O67j98p72l83k90M73Lk27l48j99j77L44P1L39K34n62
$$ 207 256 -84 76 -40 545 1212 1014 242 -141 -431 42 45 -182 -530 -729 -906 -562 -491 -152 82 -480
3554d80l2M99M04N77J10p64m22LM7P28o27n85J96m65p5Q02l65K08j75k45O52M10
$$ -480 -512 -13 391 968 1078 314 -108 -105 -58 670 43 -542 -346 -811 -886 -84 -449 -241 -416 -661 -9 401
3576D01J48L56l36l85L52J60n33K56o06J63J99j096K77l3K01K96l70K84L36j1
$$ 401 549 905 569 184 536 696 163 419 -187 -24 175 -921 -644 -677 -476 -180 -550 -266 70 59
3596E9K33K57j59j8R3l28Q9K29k43J52k93p05P9N3J6M70m03k49J16J81O88J45
$$ 59 292 549 390 372 465 137 226 455 212 364 71 -634 -555 -502 -486 -16 -419 -668 -552 -371 317 462
3618D62J05O2k50l52M09K33k25j85o57k92M68J2j73M55q91M83j80J18P55K39n21
$$ 462 567 629 379 27 436 669 444 259 -398 -690 -222 -210 -383 72 -819 -336 -516 -398 357 596 75
3639G5j12J27m2Q10k51m60j80n95K81L08K15m71j90n15M18M46J31L55l04k18Q0
$$ 75 -37 90 48 858 607 147 -33 -628 -347 -39 176 -295 -485 -1000 -582 -136 -5 350 46 -172 -92
3660i2L82M12L7o82Nj91o3M00j30o38K94m72K54L82mJ37o0k46N82K57j29L7l98
$$ -92 290 702 739 57 62 -129 -192 208 78 -560 -266 -738 -484 -102 -106 31 -29 -275 307 564 435 472 74
3683G4m26P68k93m07J39j92k02M17J00k82J00j43L87K29l20P04m32n21L91n7P03
$$ 74 -352 416 123 -284 -145 -337 -539 -122 -22 -304 -204 -347 40 269 -51 653 221 -300 91 34 737
3704G37k55m83m84L7L54J18L36q56J47j02O6O89J68k74L2n41M01K38K94J5l58
$$ 737 482 -1 -485 -448 -94 24 360 -496 -349 -451 -385 304 472 198 230 -311 90 328 622 637 279
3725B79n76K14l3J52N7k46j72j32M90p9J18k9k4o6j53L46O59n73p6l44J91L92
$$ 279 -297 -83 -116 36 93 -153 -325 -457 33 -46 72 43 19 -47 -200 146 805 232 156 -188 3 395
3747C95k14j02j40l53l8J91NK60L00l83Jl1K69L72n10Q6J77q9j5J33m85j42J53
$$ 395 181 79 -61 -414 -452 -261 -256 4 304 -79 -78 -109 160 532 22 108 285 196 181 314 -171 -313 -160
3770a60J1J66m16j57N46r2K36J39k83l36K40K70k54O05l88j66j36M7K96q7k43
$$ -160 -149 17 -399 -556 -10 -102 134 273 -10 -346 -106 164 -90 515 127 -39 -175 -128 168 81 -162
3791a62J58n24o9O12j41M04l01m59K56P73j73n9Ql18l22M20R6J09k88l79K81l00
$$ -162 -4 -528 -597 15 -126 278 -23 -482 -226 547 374 315 323 5 -317 103 199 308 20 -359 -78 -378
3813c78N55k93k50J62j32J01K58K90k23J92j30k86M61ORr5n84J71M83n36J57k60
$$ -378 177 -116 -366 -204 -336 -235 23 313 90 282 152 -134 327 333 342 247 -337 -166 317 -219 -62 -322
3835c22r6M18k26P6J37k55K9J99K53N5K3k64m7K00k65N14m67j00j35LK9L41k62
$$ -322 -418 0 -226 -150 -13 -268 -239 -40 213 268 291 27 -20 180 -85 429 -38 -138 -273 -270 -241 100 -162
3858a62j46j68Q6N35M9Q9k03j97K29K02J66k98K54n88j3J52n5J81M6m17l01K71
$$ -162 -308 -476 -390 145 194 283 80 -117 112 314 480 182 436 -152 -165 -13 -68 113 159 -258 -559 -288
3880b88m1P31l92l7j43K16L35n9M7m35j75o7N09j16k21O5l21j41M45M00j54j98
$$ -288 -329 402 10 -27 -170 46 381 322 369 -66 -241 -308 201 85 -136 -71 -392 -533 -88 312 158 -40
3902d0J2K28p0j9R3K0l85L42o3q5L0l56P4L17l85L67j18l00k7J38M9M53j73k42
$$ -40 -28 200 130 111 204 224 -161 181 118 33 63 -293 -219 98 -287 80 -38 -338 -365 -227 -178 275 102 -140
3926a40N9J1K23K73l04l52K99k74M23Q7k64K8k32l01M11K74k3J38o33l30N94P4
$$ -140 -81 -70 153 426 122 -230 69 -205 218 305 41 69 -163 -464 -53 221 198 336 -297 -627 -33 41
3948D1N24j45n42L4%j10O80m12k01K1j82J96K92j20j03j88P4K55L88k69m8k34
$$ 41 565 420 -122 -88 -88 -198 482 70 -131 -110 -292 -96 196 76 -27 -215 -141 114 502 233 185 -49
3970d9J41j56O1K98k11k71l76M00k18L18L93n24k16L28k56P47m25k35J28NJ70
$$ -49 92 -64 -3 295 84 -187 -563 -163 -381 -63 330 -194 -410 -82 -338 409 -16 -251 -123 -118 52
3991E2J34j44M4O3m17M01j75j99K10J05k91K54o2l91O05l56L89J27N1q2l23l05
$$ 52 186 42 86 149 -268 133 -42 -241 -31 74 -217 37 -25 -416 189 -167 222 349 400 318 -5 -310
4013c10M98n3m22M3J97j62K00M7l19M12m75j12K89J71L00J88p90J79lL46L46m37
$$ -310 188 135 -287 -244 -47 -209 -9 38 -281 131 -344 -456 -167 4 304 492 -298 -119 -122 224 570 133
4035A33j82L01q79M26K95k83J69K3m79K03K68M50l23k06J15K21o7L25k5l65l09
$$ 133 -49 252 -627 -201 94 -189 -20 3 -476 -273 -5 445 122 -84 31 252 185 510 485 120 -189
4056a89J54q3J82Q8l22J40n71K39J85J42j76L08q5j28M92l14Q4K30l47J43j56
$$ -189 -35 -118 64 152 -170 -30 -601 -362 -177 -35 -211 97 12 -116 376 62 146 376 29 172 16
4077A6j29M14n02J5K08l42r1N23q2L1J92m84L48m38K5O15L1j32q4l37J24K65j23
$$ 16 -113 301 -201 -186 22 -320 -411 112 30 61 253 -231 117 -321 -296 319 350 218 134 -203 -79 186 63
4100F3qk75j83P0K48NQj29m8M85l64rM45J31O1o46K23j8K14j80J31n07k81L62
$$ 63 55 -220 -403 -333 -85 -80 -72 -201 -249 236 -128 -137 308 439 500 -146 77 59 273 93 224 -283 -564 -202
4124b02J08K15K86o62n5J97l1M25K43m27k10K77j61M36n14L99m47k45K26K42l04
$$ -202 -94 121 407 -255 -310 -113 -144 281 524 97 -113 164 3 439 -75 324 -123 -368 -142 100 -204
4145b04K26K03n70N3K54J20L08k30l19L15j35j47K02K77j97j98j83O5L4L68Rr
$$ -204 22 225 -345 -292 -38 82 390 160 -159 156 21 -126 76 353 156 -42 -225 -160 -126 242 251 242
4167B42p18L69k10J88K35n8j04L48l12J14J59q1ok11J09k14J46J80L9j26L5M3
$$ 242 -476 -107 -317 -129 106 48 -56 292 -20 94 253 172 166 -45 64 -150 -4 176 215 89 124 167
4189A67n40K23M77n13L99mk87r6J75J61j72k65L20j34M0J71j18l11J00J40j10
$$ 167 -373 -150 327 -186 213 209 -78 -174 1 162 -10 -275 45 -89 -49 122 4 -307 -207 -67 -177
4210a77O83j78k55j78l43L9M79J18k88J92m14K68k91J6O64l09j67p0J30N3N07
$$ -177 506 328 73 -105 -448 -409 70 188 -100 92 -322 -54 -345 -329 335 26 -141 -211 -81 -28 479
4231D79k04k55k73j03N26K1n0r9j54l98N42r0L07P8k52j21R0K8K20M86r18J8m6
$$ 479 275 20 -253 -356 170 191 141 42 -112 -510 32 -58 249 327 75 -46 44 72 292 778 -140 -122 -168
4254a68r6O07k4o76K02r7l2L24k48M6j8l08K50L18l4K28l54m5K85k49Q9J03k52
$$ -168 -264 343 319 -357 -155 -252 -284 40 -208 -162 -180 -488 -238 80 46 274 -80 -125 160 -89 0 103 -149
4277a49K6L91l30k21Q4m8M29j85q4J79k76L58j44k70O25k48q9k38K33m2L83k14
$$ -149 -123 268 -62 -283 -199 -247 182 -3 -87 92 -184 174 30 -240 385 137 48 -190 43 1 384 170
4299A70m86L8k42M93M01m04j59K50l87J47N22k02j89J16l63M70M30m39k01o6l07
$$ 170 -316 -278 -520 -27 374 -30 -189 61 -326 -179 343 141 -48 68 -295 175 605 166 -35 -101 -408
4320d08J82K52L8n3m12R8J47K59j00J50l81Q5J03N7J21K20j96k27n28N55K03k04
$$ -408 -226 26 64 11 -401 -303 -156 103 3 153 -228 -143 -40 17 138 358 162 -65 -593 -38 165 -39
4342c9K09n01j72M73M3j1r3q4r0K10N5n5J94l27P5J29J78O6k02j40K50k33OO3
$$ -39 170 -331 -503 -30 13 2 -91 -175 -265 -55 0 -55 139 -188 -113 16 194 260 58 -82 168 -65 -59 4
4366Dl79K03K94N3j04J3l00K96l47j66Q31k00l01O6j40L38P0o8k28j71j63M97
$$ 4 -375 -172 122 175 71 84 -216 80 -267 -433 398 198 -103 -37 -177 161 231 163 -65 -236 -399 98
4388I8K83m30K92n42K10K34O1j83L94m54j63J46K98J57k04n05j29K39J61M43k21
$$ 98 381 -49 243 -299 -89 145 206 23 417 -37 -200 -54 244 401 197 -308 -437 -198 -37 406 185
4409A85j69k93K37J44K36k94K8m12p2N23K25j96K9n70n7P19q3k68J1l40K88J50
$$ 185 16 -277 -40 104 340 46 74 -338 -410 113 338 142 171 -399 -456 263 180 -88 -77 -417 -129 21
4431B1n8J99j96j04L06j46qp9M8j66P9K50j00q5j75J22j60J9N18k27k13O9k0M07
$$ 21 -37 162 -34 -138 168 22 14 -65 -17 -183 -104 146 46 -39 -214 -92 -252 -233 285 58 -155 -86 -106 301
4455C01M26o04j06k01k9K75K51k10j64k07ll8L86k55J78l75j36N58J41L84j20
$$ 301 727 123 17 -184 -213 62 313 103 -61 -268 -271 -309 77 -178 0 -375 -511 47 188 572 452
4476D52p43K76J16J48K44o15k98K06LO4L13m57R5R4n48O29M86l52J34j57k55M25
$$ 452 -291 -15 101 249 493 -122 -420 -214 -211 -147 166 -291 -196 -102 -650 -21 465 113 247 90 -165 260
4498B60L4l94J60j41k04J89O3n1J39p22L03K28L50j55j41J22r4J84J14L77n87
$$ 260 294 -100 60 -81 -285 -96 -33 -84 55 -667 -364 -136 214 59 -82 40 -54 130 244 621 34
4519C4k06K59j38K01j75m08J77j38K21L41k44k5k93K41O6M47l36K48k88j67N29
$$ 34 -172 87 -51 150 -25 -433 -256 -394 -173 168 -76 -101 -394 -153 -87 360 24 272 -16 -183 346
4540C46Mj98n7m10R0j26J21O69l52m96K83P8K72m8j89j05J04kj0N76l98k40n6
$$ 346 350 152 95 -315 -225 -351 -230 439 87 -409 -126 -48 224 176 -13 -118 -14 -16 -26 550 152 -88 -144
4563a44l10L56L08j61k45n84O1O34Q1q4M1k4n4J68K00n6K10l88r5J30n3J78k54
$$ -144 -454 -98 210 49 -196 -780 -719 -85 -4 -88 -47 -71 -125 43 243 187 397 9 -86 44 -9 169 -85
4586h5j52j52k6L19K13j79JJ96j40J17J03k30m3J76m6k7Q7k27K41k1l58N46l21
$$ -85 -237 -389 -415 -96 117 -62 -61 135 -5 112 215 -15 -58 118 72 45 132 -95 146 125 -233 313 -8
4609hk77L00l87J20N54n32Q3L8k36L80O3k1L80o32J48p3K0L99j05l79q8L8J69
$$ -8 -285 15 -372 -252 302 -230 -147 -109 -345 35 98 77 457 -175 -27 -100 -80 319 214 -165 -253 -215 -46
4632d6L76j75o18K15j77K69Q1J67l3k8j21k4RJ71J35m44n9M75j86l4O7L5k66N14
$$ -46 330 155 -463 -248 -425 -156 -75 92 59 31 -90 -114 -105 66 201 -243 -302 173 -13 -47 20 55 -211 303
4656C03l79J21K4L5j21K1P3j41o6p6L01J3k90K06j88K19j2j00M59m44l8K63r2
$$ 303 -76 45 69 104 -17 4 77 -64 -130 -206 95 108 -182 24 -164 55 43 -57 402 -42 -80 183 91
4679I1m2J91j88Q9l1m11M46j5l01K55m97N36jlJ12k22k49J61K35n3k0l0k32J68
$$ 91 49 240 52 141 110 -301 145 130 -171 84 -413 123 122 119 231 9 -240 -79 156 103 83 53 -179 -11
4703a1k0p0J64l34K1j3K9Q7K55j44j16R8k22L73J49j41o8M5j50K96k17k64L23
$$ -11 -31 -101 63 -271 -250 -263 -234 -147 108 -36 -152 -54 -276 97 246 105 37 82 -68 228 11 -253 70
4726G0j63j74jj27N67k58j29Q9K63l93N29m92K76rk64L74k78J63o0j41L51m81
$$ 70 -93 -267 -268 -395 172 -86 -215 -126 137 -256 273 -219 57 48 -216 158 -120 43 -17 -158 193 -288
4748b88r9J33K96k61L33l19q6N4K25J81k45K78k40J71l11L5L62k19q8M7Q5m34
$$ -288 -387 -254 42 -219 114 -205 -291 -237 -12 169 -76 202 -38 133 -178 -143 219 0 -88 -41 44 -390
4770c90K89J09K2l17q6K23PM0M34l25k25K22n5M67j05k94p5j43n9L02J4L5k25
$$ -390 -101 8 30 -287 -373 -150 -143 -103 331 6 -219 3 -52 415 310 16 -59 -202 -261 41 55 90 -135
4793a35J92k86L88n4k92M50m25J46L76k54K59j43l06M27j82l36K37N5q4L70n07
$$ -135 57 -229 159 105 -187 263 -162 -16 360 106 365 222 -84 343 161 -175 62 117 33 403 -104
4814a04l45N67j12j0P8k89J44K79k38L10O8k41L0l56K73k5J48K8l52q2J5N6l36
$$ -104 -449 118 6 -4 74 -215 -71 208 -30 280 348 107 137 -219 54 29 177 205 -147 -229 -214 -158 -494
4837d94N86n7k70L4k01M91K52l69q3L0j53L84J45m70P1j1k69L86K13l64J67j61
$$ -494 92 35 -235 -201 -402 89 341 -28 -111 -81 -234 150 295 -175 -104 -115 -384 2 215 -149 18 -143
4859a43j86K69K83m01L84j58j36J28j45L24n5j64k3Po9K22l10k44K38m2j80K57
$$ -143 -329 -60 223 -178 206 48 -88 40 -105 219 164 0 -23 -16 -85 137 -173 -417 -179 -221 -401 -144
4881a44l69L92k21L79J09J14k80J09OO8K37m91r0J97r0J14K34n40J83l6J15K16
$$ -144 -513 -121 -342 37 146 260 -20 89 95 163 400 -91 -181 16 -74 40 274 -266 -83 -119 -4 212
4903B12J6k45R7j95L09M03k67P4j34o41J59K24j8j98%q4J29R5R2j05q6J16k11
$$ 212 228 -17 80 -115 194 597 330 404 270 -371 -212 12 -6 -204 -204 -288 -159 -64 28 -77 -163 -47 -258
4926b58P62j71J3k56J17k62q1M02k33n7J79j70l88J41j61L10K41l06N14m5k29
$$ -258 504 333 346 90 207 -55 -136 266 33 -24 155 -15 -403 -262 -423 -113 128 -178 336 291 62
4947F2J89m2k58L88m77K03l55J89K32k11j13J03j72K51J33k58J36K54k12r5M11
$$ 62 251 209 -49 339 -138 65 -290 -101 131 -80 -193 -90 -262 -11 122 -136 0 254 42 -53 358
4968C58Nj19p5j68l6l7o1L15n17l13J38K64j2M74j09J91o70J49M14L22k33K28
$$ 358 363 244 169 1 -35 -72 -133 182 -335 -648 -510 -246 -258 216 107 298 -372 -223 191 513 280 508
4990E08m13m01N05r7j5k45p9Mj61j15N92j70k54N49j53O8M17J26m74K87n17J73
$$ 508 95 -306 199 102 87 -158 -237 -233 -394 -509 83 -87 -341 208 55 123 540 666 192 479 -38 135
5012A35n5jk29J50m59kj5j94N06J13j86K82j4j34P16n52J93K70k71jl02q0J32
$$ 135 80 79 -150 0 -459 -461 -476 -670 -164 -51 -237 45 31 -103 613 61 254 524 253 252 -50 -130 2
5035Bj12kj0l99O3O01l42J74K4l8r6L72j20K62N2m85K1K66Q9Kj77m99R8p6L26
$$ 2 -110 -112 -122 -521 -458 143 -199 -25 -1 -39 -135 237 117 379 431 -54 -33 233 322 324 147 -352 -254 -330 -4
5060dJ49l11K51k32K9O4L92j92L22j63l26J62L38o4j10o27K54L1k66L85j56l36
$$ -4 145 -166 85 -147 -118 -54 338 146 468 305 -21 141 479 415 305 -322 -68 -37 -303 82 -74 -410
5082d10L37k39J81K42J42j99j51n1L02j23n3M0L9k67L96o5p6o2j60m3J41N6J89
$$ -410 -73 -312 -131 111 253 54 -97 -148 154 31 -22 18 57 -210 186 121 45 -17 -177 -220 -79 -23 166
5105A66j28j30K54k51L68j70Q3k78J35J90m1j43j75K12k67j9L01n7m06K93J50
$$ 166 38 -92 162 -89 279 109 192 -86 49 239 198 55 -120 92 -175 -194 107 50 -356 -63 87
5126H7Kr1q1j71K67j37L92l04K75p0k79p7J25K93k25k44L53m29L30L2p3M01k86
$$ 87 89 -2 -83 -254 13 -124 268 -36 239 169 -110 -187 -62 231 6 -238 115 -314 16 48 -25 376 90
5149I0l76N09j65l8J80j08r2j60J28J79O6k30o0j92J89K45p6Q6J4j02J69l2k72
$$ 90 -286 223 58 20 200 92 0 -160 -32 147 213 -17 -77 -269 -80 165 89 175 189 87 256 224 -48
5172d8J28j76p7L31k11M6j2k29K02k6r6N7J0j61N11J42j26l9j69j85n1J61J55
$$ -48 80 -96 -173 158 -53 -7 -19 -248 -46 -72 -168 -111 -101 -262 249 391 265 226 57 -128 -179 -18 137
5195A37Qm62J74j75J57K35j41J14j52j97J99N96m67l2L24l76M40j12j88j29k59
$$ 137 145 -317 -143 -318 -161 74 -67 47 -105 -302 -103 493 26 -6 318 -58 382 270 82 -47 -306
5216c06L04M7o2j07K40n38L9N55j79K92k85N7j14J96j25K65j30M0k08j73L13m0
$$ -306 -2 45 -17 -124 116 -422 -383 172 -7 285 0 57 -57 139 14 279 149 189 -19 -192 121 81
5238H1j57j08j58N9L19L0j10M57k84m8K00O0k79M76n19K1o3J22j50P3j77K96j5
$$ 81 -76 -184 -342 -283 36 66 -44 413 129 81 281 341 62 538 19 40 -23 99 -51 22 -155 141 126
5261A26j12j6k15K88j04L4K25m7Q6l59J30J25J6K70m06K87n36jJ49j01NK52l24
$$ 126 14 -2 -217 71 -33 1 226 179 265 -94 36 161 177 447 41 328 -208 -209 -60 -161 -156 96 -228
5284b28L70K03m73J57q5J61k07P7K80or6K0Q0l67r3K45j24N3J27k26K72k72J59
$$ -228 142 345 -128 29 -56 105 -102 -25 255 249 153 173 253 -114 -207 38 -86 -33 94 -132 140 -132 27
5307B7k41J63J28Rk94o6M10k16K06m3j95k2K68k10J53l65M20J25n27J90K22l23
$$ 27 -214 -51 77 86 -208 -274 136 -80 126 83 -112 -134 134 -76 77 -288 132 257 -270 -80 142 -181
5329a81%J01J01q6Q1J5K40m25k0K87o8J28j87m12M05K76m71K76j26k12R2J67K35
$$ -181 -181 -80 21 -65 16 31 271 -154 -174 113 45 173 -14 -426 -21 255 -216 60 -66 -278 -186 -19 216
5352B16j90P0k08J92j61j25M10k84J29j29pP5p7r9L41l8j20J05j50K6J84n9k37
$$ 216 26 96 -112 80 -81 -206 204 -80 49 -80 -87 -12 -89 -188 153 115 -5 100 -50 -24 160 101 -136
5375a36J44J01J84l86L3Q3l36M56o7M7j68n7J31r9Q0P1l5K35l81J41pl7L49l67
$$ -136 8 109 293 -93 -60 23 -313 143 76 123 -45 -102 29 -70 10 81 46 281 -100 41 34 -3 346 -21
5399b1l88K25J31k69L48J92k04j50j18K66j24oJ93p0k43K66k16K26j49q0L96l92
$$ -21 -409 -184 -53 -322 26 218 14 -136 -254 12 -112 -118 75 5 -238 28 -188 38 -111 -191 205 -187
5421a87L1M2m9K38p8j61j4M11p6K6k41Q0K6r2N7L15k35Nj5k80Q5J34q7J35r8l49
$$ -187 -156 -114 -163 75 -3 -164 -178 233 157 183 -58 22 48 -44 13 328 93 98 83 -197 -112 22 -65 70 -28 -377
5447c77M30Ml08K85j70Q1J48k05J18L35J65o45L00k38J14M0r2k1j7k21K62r4R8
$$ -377 53 57 -251 34 -136 -55 93 -112 6 341 506 -139 161 -77 37 77 -15 -36 -53 -274 -12 -106 -8
5470hR0L2Q0j90o0J79j7o9K6m4j43J14l4O2N3l31m6K45R2M6Pl93J77L27k98L58
$$ -8 82 114 194 4 -56 123 106 37 63 19 -124 -10 -44 18 71 -260 -306 -61 31 77 84 -309 -132 195 -103 255
5496B55k66l49M12j63L49j56M1k04Q6o6m0rj48J56O8p2J1l2J30L0M14m21j42R2
$$ 255 -11 -360 52 -111 238 82 123 -81 5 -61 -101 -110 -258 -102 -34 -106 -95 -127 3 33 447 26 -116 -24
5520b4J63l3k1L22k33l97L4K17k59M14k06m45L79J30NK89p24N69L3k10J1J83k69
$$ -24 139 106 85 407 174 -223 -189 28 -231 183 -23 -468 -89 41 46 335 -389 180 213 3 14 197 -72
5543g2L15j4m62J19J98K9k09q8j25L75m28N82j78m33R2J07K38j48K37r8J23l38
$$ -72 243 229 -233 -114 84 113 -96 -184 -309 66 -362 220 42 -391 -299 -192 46 -102 135 37 160 -178
5565a78LL92L2k57J20k11j95K94m3J06k7K4j98K7K21j92L6m1N3j4R9R5j74k8k32
$$ -178 -175 217 249 -8 112 -99 -294 0 -43 63 36 60 -138 -111 110 -82 -46 -87 -34 -48 51 146 -28 -56 -288
5590b88L00j03K37j59P6k97J83J51n11K42K69j13Q1k63L0L41n4J35n6l04L3n0
$$ -288 12 -91 146 -13 63 -234 -51 100 -411 -169 100 -13 68 -195 -165 176 122 257 201 -103 -70 -120
5612a20J52QN5j86L1L20k04L4M7m07N95n24j6J83Q9J80q1k15K19L1k2M0r6l12
$$ -120 32 40 95 -91 -60 260 56 90 137 -270 325 -199 -215 -32 57 237 156 -59 160 191 169 209 113 -199
5636a99M34l74N9L9j06m0r0m2K19K13j09L62m19j51L43k38K51J98m47J96j47j05
$$ -199 235 -139 -80 -41 -147 -187 -277 -319 -100 113 4 366 -53 -204 139 -99 152 350 -97 99 -48 -153
5658a53K76l32K72Qm36j6K28P3J49Q9l88J51p3J04K30l4l5k92mk0L91l73K51M5
$$ -153 123 -209 63 71 -365 -381 -153 -80 69 158 -230 -79 -152 -48 182 148 113 -179 -183 -203 188 -185 66 111
5682A11l13J61J22j8J30k72k60N39l31J11L1K7l07M49j01Lm3k33L18k06j09J76
$$ 111 -202 -41 81 63 193 -79 -339 200 -131 -20 11 38 -269 180 79 82 39 -194 124 -82 -191 -15
5704a5k76J98K52j42P6q1J8j05K94j93j80L42l95M12n5o0J17l31j19j17L63J31
$$ -15 -291 -93 159 17 93 12 30 -75 219 26 -154 188 -207 205 150 90 207 -124 -243 -360 3 134
5726A34J5k02n5L89l81j3J26J08J3n46M16P8l8O3j98q7M7n6J45L86l19k30J50
$$ 134 149 -53 -108 281 -100 -113 13 121 134 -412 4 82 44 107 -91 -178 -131 -187 -42 344 25 -205 -55
5749e5L02m74K08L35k91M8k49j9N17l34j12K49l43J03J58J59Q4m10J47Q6r8J83
$$ -55 247 -227 -19 316 25 73 -176 -195 322 -12 -124 125 -218 -115 43 202 286 -124 23 109 11 194
5771A94P0k73j15J03j28J22m8N3q3R9l67L83j44J53N9p0j07K3L6r3L28k51mK62
$$ 194 264 -9 -124 -21 -149 -27 -75 -22 -105 -6 -373 10 -134 19 78 8 -99 -76 -40 -133 195 -56 -60 202
5795B02l58J62j22J64J47k70L3M2k7RJ75j04L15k60j29j0M59m26j55%N8J55%o3
$$ 202 -156 6 -116 48 195 -75 -42 0 -27 -18 157 53 368 108 -21 -31 428 2 -153 -153 -95 60 60 -3
5819cJ82l98O5J69N0j20n0K4J10lJ80k5l12M6K62k76J86K50l73J44l33m8L09k22
$$ -3 179 -219 -154 15 65 -55 -105 -81 29 26 206 181 -131 -85 177 -99 87 337 -36 108 -225 -273 36 -186
5843a86ML34nm0j70l0J73r6k56L79j71j29L77k71O7m1m7K81k91k2K15k20j79Q
$$ -186 -182 152 147 107 -63 -93 80 -16 -272 107 -64 -193 184 -87 -20 -61 -108 173 -118 -140 75 -145 -324 -316
5867c16M47m20O9K85n4J39l66M38j11k46J81L00m79O4R7k8j26q7K55k15M50m51
$$ -316 131 -289 -220 65 11 150 -216 222 111 -135 46 346 -133 -69 28 0 -126 -213 42 -173 277 -174
5889a74K99j90J20j98o2K22J55r3p7M6k63L40p8K42j56M6j06J15l55K16j03k30
$$ -174 125 -65 55 -143 -205 17 172 79 2 48 -215 125 47 289 133 179 73 188 -167 49 -54 -284
5911b84L60j00l27J05q5J58J48QK0J46k45K8L00m29k1K26J98k6m7Mo4m37L68J2
$$ -284 76 -24 -351 -246 -331 -173 -25 -17 3 149 -96 -68 232 -197 -218 8 206 180 133 137 73 -364 4 16
5935A6j61j16K34j08M4L48o28P52l04j19O9k42R2L08m9j03j96R9M3K9j03l6J63
$$ 16 -145 -261 -27 -135 -91 257 -371 381 77 -42 27 -215 -123 185 136 33 -163 -64 -21 8 -95 -131 32
5958C2m64K86J46j31K69o2j4k01K95j77L08j86J7J01m02R7l6l5k15N87j38k03
$$ 32 -432 -146 0 -131 138 76 62 -139 156 -21 287 101 118 219 -183 -86 -122 -157 -372 215 77 -126
5980a26jJ43J06l85M76o0k80M69k56J41Pk55J37j6n73N08k30J25p4M5k43M80k40
$$ -126 -127 16 122 -263 213 153 -127 342 86 227 234 -21 116 100 -473 35 -195 -70 -144 -99 -342 138 -102
6003a02J32K93m49r2O29k72J00j29k18kK48j62j52L04k56K8J54l8kL35m24K2K8
$$ -102 30 323 -126 -218 411 139 239 110 -108 -110 138 -24 -176 128 -128 -100 54 16 14 349 -75 -53 -25
6026b5J14K85l50K08j92j31J80j81J00j23K64j88J16k6j12j5J04o8J29o5nK8k48
$$ -25 89 374 24 232 40 -91 89 -92 8 -115 149 -39 77 51 -61 -76 28 -40 89 24 19 47 -201
6049b01K28j25l39L93r8J11J67k03J85l8K3j32L38j42J31j13k31n6R9j27K71j97
$$ -201 27 -98 -437 -44 -142 -31 136 -67 118 80 103 -29 309 167 298 185 -46 -102 -3 -130 141 -56
6071e6L6L2k4K94k26j26J7K20k57M03l39J48K9J75l37K39j44j68L08m12K11q5
$$ -56 -20 12 -12 282 56 -70 -53 167 -90 313 -26 122 151 326 -11 228 84 -84 224 -188 23 -62
6093f2k65j7K80r6Q8o5J50K49m17J66J77l09L25n4mj83J77m60J68m3k08O99o06
$$ -62 -327 -344 -64 -160 -72 -137 13 262 -155 11 188 -121 204 150 146 -37 140 -320 -152 -195 -403 296 -310
6116c10K11o0j21L47q6j4J36k5J06o8k66K25J60m27J41l0L9j65L70k65J05j51
$$ -310 -99 -159 -280 67 -19 -33 103 78 184 116 -150 75 235 -192 -51 -81 -42 -207 163 -102 3 -148
6138a48r0L91k12K8J34j03J75J28k58o8K18l35J12Kk79M68k44j19J32m3q5J70
$$ -148 -238 153 -59 -31 103 0 175 303 45 -23 195 -140 -28 -26 -305 163 -81 -200 -68 -111 -196 -26
6160b6r9M31J64n87K57N8j80M80m41K65k54l6r2l1l03n2K78j23M2L76r8K3k7k46
$$ -26 -125 306 470 -117 140 198 18 498 57 322 68 32 -60 -91 -394 -446 -168 -291 -249 127 29 52 25 -221
6184b21L98k38N83j66l79q3L03m48P9P4M3O8m0n41O67q0J17j4K1j59J53j64K88
$$ -221 177 -61 522 356 -23 -106 197 -251 -172 -98 -55 13 -27 -568 99 19 136 122 143 -16 137 -27 261
6207B61Pj26o9P1j84J12k18J04O2k3N3N7j98J20K9l00L41k23J8L98k3n06L40J28
$$ 261 268 142 73 144 -40 72 -146 -42 20 -3 50 107 -91 29 58 -242 99 -124 -106 292 269 -237 103 231
6231B31k67M0m1q1J43j88K61K25o44N80j95k05K95j89J17N3Ll05L26P6k80M3j65
$$ 231 -36 4 -37 -118 25 -163 98 323 -321 259 64 -141 154 -35 82 135 138 -167 159 235 -45 -2 -167
6254a67O1o2J27j49J7J1Q4K66%Q8r9n4m9n3j81L20k48J43j8j73J80k87J92J71
$$ -167 -106 -168 -41 -190 -173 -162 -78 188 188 276 177 123 74 21 -160 160 -88 55 37 -136 44 -243 -51 120
6278A20k2l7J81m58J00K12j87J90q3n3K65l43J08K18k71k7l9j82K27P2P3J13k53
$$ 120 98 61 242 -216 -116 96 -91 99 16 -37 228 -115 -7 211 -60 -87 -126 -308 -81 -9 64 177 -76
6301g6j22L59k10p5K93k6j96L93m53J70O9l48O7J82j55J41k24q4M79j95K5L6j06
$$ -76 -198 161 -49 -124 169 143 -53 340 -113 57 126 -222 -155 27 -128 13 -211 -295 184 -11 14 50 -56
6324e6J27m1m3jK75m23J17J60j1l9j27l34N78j66OJ77k19l06L68j17K15l65L55
$$ -56 71 30 -13 -14 261 -162 -45 115 104 65 -62 -396 182 16 22 199 -20 -326 42 -75 140 -225 130
6347A30M08o43L7K82Ml37J05j87J04J39j85K61j44k82L73k07K9K51j46J23J42
$$ 130 538 -105 -68 214 218 -119 -14 -201 -97 42 -143 118 -26 -308 65 -142 -113 138 -8 115 257
6368B57q9L0J35k08n9O7k99K04K07l78J82J4Op0j72N6q2K04J05L5j56K47j94k5
$$ 257 168 198 333 125 66 133 -166 38 245 -133 49 63 69 -1 -173 -117 -199 5 110 145 -11 236 42 17
6392A7J11m8J28r7l24M19k7k48k25J83N3PR3k58M50j53K71l01J90l88M73k67j2
$$ 17 128 80 208 111 -213 206 179 -69 -294 -111 -58 -51 42 -216 234 81 352 51 241 -147 326 59 47
6415D7J07N8M1m3j19j12K34m23J43J2J9l8O1r4R9n5J88j4j70M4j50R2K52j68K0
$$ 47 154 212 253 210 91 -21 213 -210 -67 -55 -36 -74 -13 -107 -8 -63 125 111 -59 -15 -165 -73 179 11 31
6440C1j17m3o4M68n54J20M89n95K02pJ77n2j88Q0M53l23J3j97J50K8j6n32L44
$$ 31 -86 -129 -193 275 -279 -159 330 -265 -63 -70 107 55 -133 -53 400 77 90 -107 43 71 55 -477 -133
6463a33L27l38L57k64m7k2j39K0K35k26J53M0K61jO6m34L03n1j15K10l72J06P6
$$ -133 194 -144 213 -51 -98 -120 -259 -239 -4 -230 -77 -37 224 223 289 -145 158 107 -8 202 -170 -64 12
6486A2j20j83N36m34J54J95j83rj27k8M24k85N2J94j91lJ78m17L55k4m22L18J44
$$ 12 -108 -291 245 -189 -35 160 -23 -32 -159 -187 237 -48 4 198 7 4 182 -235 120 96 -326 -8 136
6509A36l44K73j51k68K47j3J49J19k09n3J54j14J41L38l85j00O3j1R8k7J52K58
$$ 136 -208 65 -86 -354 -107 -120 29 148 -61 -114 40 -74 67 405 20 -80 -17 -28 70 43 195 453
6531D53o60J91k07L22j11J42k04pJ77o1kM27o99K02J12L2Q5l20K28J10k86j07
$$ 453 -207 -16 -223 99 -12 130 -74 -81 96 35 33 460 -239 -37 75 107 192 -128 100 210 -76 -183
6553a83O16m66J26N3j94K34r0q6M4p7k7qL7j1k08J17J80k10K55L2j02O9J21n78
$$ -183 433 -33 93 146 -48 186 96 10 54 -23 -50 -58 -21 -32 -240 -123 57 -153 102 134 32 101 222 -356
6577c56N25j29k10K38j15j14J45k30k9K84l00M33k5k87N3J85j52K23j2j60R4m7
$$ -356 169 40 -170 68 -47 -161 -16 -246 -275 9 -291 142 117 -170 -117 68 -84 139 127 -33 61 14
6599A4j59K26P7n1K19m31L6M51p50M56r8k97L05K35m5p4m9J15l7j65K23k14J82
$$ 14 -145 81 158 107 326 -105 -69 382 -368 88 -10 -307 -2 233 188 114 65 180 143 -22 201 -13 169
6622A69m57J06rK44k02j52N31m27K75o0N6o7J28l50P9L51j5j09K4J06j17l23M0
$$ 169 -288 -182 -191 53 -149 -301 230 -197 78 18 74 7 135 -215 -136 215 200 91 115 221 104 -219 -179
6645a79J27k57J19K81J6k45jP3K27J28l13L27J11m73J87j21q3J05J14j98J20l83
$$ -179 -52 -309 -190 91 107 -138 -139 -66 161 289 -24 303 414 -59 128 7 -76 29 143 -55 65 -318
6667c18L47j69J73j18J44l44J40M2O3J73j7M0q2J82n9j88K15j81K12l80M28j53
$$ -318 29 -140 33 -85 59 -285 -145 -103 -40 133 116 156 74 256 197 9 224 43 255 -125 303 150
6689A50m83J93J14L16j60k91q8K85k06P7M47k82l39M35l48J20O7m19L60N9J29
$$ 150 -333 -140 -26 290 130 -161 -249 36 -170 -93 354 72 -267 168 -180 -60 7 -412 -52 7 136
6710A36k63J60J43j56k22K05R5q3J88P3o76L83K31n3j64k49P2J01L32k70J25l67
$$ 136 -127 33 176 20 -202 3 98 15 203 276 -400 -17 214 161 -3 -252 -180 -79 253 -17 108 -259
6732b59O16k19p4j90Q4p7J16L3l9Lm9O4j45Q3K22K96m49q4p3K50J05m52J46M08
$$ -259 357 138 64 -126 -42 -119 -3 30 -9 -6 -55 9 -136 -53 169 465 16 -68 -141 109 214 -238 -92 316
6756C16m42J92r4j39N00l15k63L27j56q5L18k45k15M89j61j63N25n0k72k42L6
$$ 316 -126 66 -28 -167 333 18 -245 82 -74 -159 159 -86 -301 188 27 -136 389 339 67 -175 -139
6777a39K80J0L4j47l9j38J81p9K0J06pj96K74j43N6J9j92K19L6RJ32j40j33J24
$$ -139 141 151 185 38 -1 -139 42 -37 -17 89 82 -114 160 17 73 92 -100 119 155 164 296 156 23 147
6801A47k09K88k43k60J72K16l18L2Q2j00K79n6J62n0l12L38M5k64Q1j4n5K06l73
$$ 147 -62 226 -17 -277 -105 111 -207 -175 -93 -193 86 30 192 142 -170 168 213 -51 30 16 -39 167 -206
6824b06L8o8M38m09J81l01K66J87m75K40p4j01J60K85k4k52K77n9p3q2J3Q7k68
$$ -206 -168 -236 202 -207 -26 -327 -61 126 -349 -109 -183 -284 -124 161 137 -115 162 103 30 -52 -39 48 -220
6847b20j1R7l51L49J91j38L4k57K33M21l05l4N2j93L79l29J89j45j93L5K58Qk93
$$ -220 -231 -134 -485 -136 55 -83 -49 -306 -73 348 43 9 61 -132 247 -82 107 -38 -231 -196 62 70 -223
6870b23l5Q5J03K51k08j90K26rR3o3p6rj09R9J04o8j07K26k29Q2K0j06L5J19n2
$$ -223 -258 -173 -70 181 -27 -217 9 0 93 30 -46 -55 -164 -65 39 -29 -136 90 -139 -57 -37 -143 -108 11 -41
6895d1L9q5p8K37k56K31Q9o6N1m6j58L16k20O1j48K78m18K95Pj09R4J1j32N1j37
$$ -41 -2 -87 -165 72 -184 47 136 70 121 75 -83 233 13 74 -74 204 -214 81 88 -21 73 84 -48 3 -134
6920a34J71K56k48J95k92j24N01k53l5J86l44M8P0l20O5J74J72J50j2m72K08N0
$$ -134 37 293 45 240 -52 -176 325 72 37 223 -121 -73 -3 -323 -258 -84 88 238 226 -246 -38 12
6942A2r1L56j73K0o8M8m0q7P6k2j43J46j36j15J95j7k17J01K29k3o1R2r0J22r9
$$ 12 -79 277 104 124 56 104 64 -23 53 31 -112 34 -102 -217 -22 -39 -256 -155 74 51 -10 82 -8 114 15
6967A5j01K3L6K8p6L9k29N96k43K74l30R9k33J03j2J16k4k03J02K3j6q0J37j58
$$ 15 -86 -63 -27 1 -75 -36 -265 331 88 362 32 131 -102 1 -11 105 81 -122 -20 3 -13 -93 44 -114
6991a14J45j71MJ23J21k09K18j31K43k70N5j24J95m1K41n46J77J15p1p1K75m82
$$ -114 31 -140 -136 -13 108 -101 117 -14 229 -41 14 -110 85 44 285 -261 -84 31 -40 -111 164 -318
7013c18J83K07l87N55l61ML66n17R1M80j44mj37r0j66K45j46L28k02m40L52J10
$$ -318 -135 72 -315 240 -121 -117 249 -268 -177 303 159 155 18 -72 -238 7 -139 189 -13 -453 -101 9
7035Irk7J90n20L18j25M47J8k09K48j97k75J11j16O1K18l93J49K14l05Q1P1j00
$$ 9 0 -27 163 -357 -39 -164 283 301 92 340 143 -132 -21 -137 -76 142 -251 -102 112 -193 -112 -41 -141
7058a41J94k02K4M9j18J98l87M15l7k7k01K8N6J07j10j76L53j32p9J02K83l06
$$ -141 53 -149 -125 -76 -194 4 -383 32 -5 -32 -233 -205 -149 -42 -152 -328 25 -107 -186 -84 199 -107
7080a07J77p0L7l4K48m51N85j54k14P1q6L9j27j49L3M45l88J51Lp0M9j33R7Q1
$$ -107 70 0 37 3 251 -200 385 231 17 88 2 41 -86 -235 -202 243 -145 6 9 -61 -12 -145 -48 33
7104C3j10l7K15j50J60K02j56k33L22j07l44M12n10K64j09J08k6K07k54J40L9
$$ 33 -77 -114 101 -49 111 313 157 -76 246 139 -205 207 -303 -39 -148 -40 -66 141 -113 27 66
7125F6j95K18o7j50Q7o7M28l0o2l86M02l43J89Ol30N48o10K09j16J49J27j72R8
$$ 66 -129 89 22 -128 -41 -108 320 290 228 -158 244 -99 90 96 -234 314 -296 -87 -203 -54 73 -99 -1
7148aj6O8kn4j0l9J44l27K01r1J20l44M67k74J55m6J1K94j29j56Pk9J07J61l21
$$ -1 -17 51 49 -5 -15 -54 90 -237 -36 -127 -7 -351 116 -158 -3 -49 -38 256 127 -29 -22 -51 56 217 -104
7173a04J28o9nk5K79k76OL55l46J71m28L31lk73M70k16k77J77K89l03J73j19k22
$$ -104 24 -45 -50 -75 204 -72 -66 289 -57 114 -314 17 14 -259 211 -5 -282 -105 184 -119 54 -65 -287
7196b87M04J43k28J16p1k3o6j49L13l74J31O7J95m16L19J61k88K65k67j54K61
$$ -287 117 260 32 148 77 54 -12 -161 152 -222 -91 -24 171 -245 74 235 -53 212 -55 -209 52
7217E2R7N0k74Q0o0R2m20N42k12m32N52j55j96L45j1k09J15k49L47K54m85K9R7
$$ 52 149 199 -75 5 -55 37 -383 159 -53 -485 67 -88 -284 61 50 -159 -44 -293 54 308 -177 -148 -51
7240e1O2K95n54K02J61k5m1J15l5q5J43m46M8O4Q4J30j54l27J94N32l61L8j63
$$ -51 11 306 -248 -46 115 90 49 164 129 44 187 -259 -211 -147 -63 67 -87 -414 -220 312 -49 -11 -174
7263a74J87j11L11O3l25O6J35k89qK48L4j98l15J74J22O7p7J27k12L07k50K73
$$ -174 13 -98 213 276 -49 17 152 -137 -145 103 137 -61 -376 -202 -80 -13 -90 37 -175 132 -118 155
7285A55o7M7j57mL13k01K14m72K5J05j86J67O2j82j66L17j7k07J51j1Q8kj20L44
$$ 155 88 135 -22 -26 287 86 300 -172 -147 -42 -228 -61 1 -181 -347 -30 -47 -254 -103 -114 -26 -28 -148 196
7309A96j77p0J10j95j11J70j7j04J80k37r2N60k94j69L46k09J23J32k02L17l09
$$ 196 19 -51 59 -136 -247 -77 -94 -198 -18 -255 -347 213 -81 -250 96 -113 10 142 -60 257 -52
7330e2j30K92J02l31J43O4n30M84l42N07m7m25L79r0O6q5K75j34l26M08m2j48
$$ -52 -182 110 212 -119 24 88 -442 42 -300 207 160 -265 114 24 90 5 280 146 -180 228 186 38
7352C8O0k14J75k8j60L7K79k07k07K30M1p3K06l23P3r4K69j34mL6k75J38J02l05
$$ 38 98 -116 59 31 -129 -92 187 -20 -227 3 44 -29 177 -146 -73 -167 102 -32 -36 0 -275 -137 -35 -340
7376c40O03J46l82j0j12Q1l6O1l5r3k4J56K98k82km0o6N3J03j18M4k37K67M6j15
$$ -340 263 409 27 17 -95 -14 -50 11 -24 -117 -141 15 313 31 29 -11 -77 -24 79 -39 5 -232 35 81 -34
7401c4K94l01q4J38k37L42l37J83k8K51k64M25q5l48j94J06L80J02k24j37oM9
$$ -34 260 -41 -125 13 -224 118 -219 -36 -64 187 -77 348 263 -85 -279 -173 207 309 85 -52 -58 -9
7423iJ67k37P1o6J31j10o8n6O6o1P4L7J73Rl67K61j5L3p4J55j70J07o3l5M6J30
$$ -9 158 -79 -8 -74 57 -53 -121 -177 -111 -172 -98 -61 112 121 -246 15 0 33 -41 114 -56 51 -12 -47 -1 129
7449A29J3k59K54l2Q7k81J05l57pL42l27K17M84l84J08Q2j49l35K17J81nJ3l1
$$ 129 142 -117 137 105 192 -89 16 -341 -348 -6 -333 -116 368 -16 92 174 25 -310 -93 88 83 96 65
7472F5j24q7J64p7k8qk9N4n7J28n6R9M7P6k08j5K74k13j00J88K47n98L63p1K2
$$ 65 -59 -146 18 -59 -87 -95 -124 -70 -127 1 -55 44 91 167 -41 -56 218 5 -95 93 340 -258 105 34 56
7497E6j15l05M24o3j34K10k5k02L6K51m74M18j8K5o3k69L70N4k69N0Q4l15K05
$$ 56 -59 -364 60 -3 -137 73 48 -154 -118 133 -341 77 59 84 21 -248 122 176 -93 -43 41 -274 -69
7520f9J48l64M04J39l18N3K4k78K30l44M75J00l38L01j79n1K28q5j64j48J58p1
$$ -69 79 -285 119 258 -60 -7 17 -261 -31 -375 100 200 -138 163 -16 -67 161 76 -88 -236 -78 -149
7542a49J44j57M4J48j10lL71m64K85k7j77K18j06L31j75k38J62J23m74M70n9k52
$$ -149 -5 -162 -118 30 -80 -83 288 -176 109 82 -95 123 17 348 173 -65 97 220 -254 216 157 -95
7564i5K61l00j50M29j70j40J35J11J21l36K86k64R9O0K6p1p7P5J74j15J53l07
$$ -95 166 -134 -284 145 -25 -165 -30 81 202 -134 152 -112 -13 47 73 2 -75 0 174 59 212 -95
7586i5kmr3n8L00k75J46J05j96K06K3m0L92k88l33M91k24J57k1k48l7N6P8j13
$$ -95 -97 -101 -194 -252 48 -227 -81 24 -172 34 57 17 409 121 -212 279 55 212 191 -57 -94 -38 40 -73
7610g3L53k66J30p4%O6P5j81N2p4L16j98j6j57J17m38M08j62qL16l48J02j37j1
$$ -73 280 14 144 70 70 136 211 30 82 8 324 126 110 -47 70 -368 40 -122 -130 186 -162 -60 -197 -208
7634b08N5J86k73O5QJ05K03q3k24R4mM72k74j23K37n2o9o9Ko8J56j58k66Q1J69
$$ -208 -153 33 -240 -175 -167 -62 141 58 -166 -72 -76 396 122 -1 236 184 115 46 48 -20 136 -22 -288 -207 -38
7659c8k20N02j95k46J49J04L8k46L53O1k07l7J76l16L9K95l28k41L77j77Q2M4
$$ -38 -258 244 49 -197 -48 56 94 -152 201 262 55 18 194 -122 -83 212 -116 -357 20 -157 -75 -31
7681c1O9J79o6Q1o2j61j0K57J8j92j5j00J32N1m6l27L78k06J33jJ0j27K3j30M19
$$ -31 38 217 151 232 170 9 -1 256 274 82 67 -33 99 150 104 -223 155 -51 82 81 91 -36 -13 -143 276
7706B76j75j79M55l00K39p5l55L86l92J64LJ9k37K41k53j17L79l94L30j40m9o
$$ 276 101 -78 377 77 316 241 -114 272 -120 44 47 66 -171 70 -183 -300 79 -315 15 -125 -174 -180
7728a80L84l23L15k85K62k0k07q7J25R9r3L8j53J7j00j37J82L41j91r3J47l2J8
$$ -180 204 -119 196 -89 173 153 -54 -141 -16 83 -10 28 -125 -108 -208 -345 -163 178 -13 -106 41 9 27
7751B7n4J28J01m8j24Q7k58nJ72J4J07j87J0%o4j9K60k37P2J71n43O51j37o7j43
$$ 27 -27 101 202 154 30 117 -141 -146 26 40 147 -40 -30 -30 -94 -113 147 -90 -18 153 -390 261 124 57 -86
7776h6K86k80R7J28j46K4P4k35K54j95K3J31k17j4J69j23R7L12r7m4n67L89K29
$$ -86 200 -80 17 145 -1 23 97 -138 116 -79 -56 75 -142 -156 13 -110 -13 299 202 158 -409 -20 209
7799B09l24K52J4l96J42L93j37j78R7j54q6J17k80L08j32O5O4O4p8l47L09K02
$$ 209 -115 137 151 -245 -103 290 153 -25 72 -82 -168 -51 -331 -23 -155 -90 -26 38 -40 -387 -78 124
7821A24k8K0q2k1K34l77O8L51K9n69L63j97j62L02j1m1L2J7j19J57o1Q0rl29J8
$$ 124 96 116 34 13 247 -130 -62 289 318 -251 112 -85 -247 55 44 3 35 52 -67 90 29 109 100 -229 -211
7846b11L50M6k77M41n03J74m9J37j9m19L31j7J34N1K4m39K68J56J21k95j52M16
$$ -211 139 185 -92 349 -154 20 -29 108 89 -330 1 -16 118 169 193 -246 22 178 299 4 -148 268
7868B68l15l84P99j37m27K88P8l10J14J30Q3Mm32K2N3R4O1N8L6M1n0j2N9j0R4
$$ 268 -47 -431 368 231 -196 92 170 -140 -26 104 187 191 -241 -219 -166 -72 -11 47 83 124 74 62 121 111 205
7893B05k30R9p9L25l85J59k63L9j33J83J02J37k09j20oJ56l5RJ75j70l4j1J42
$$ 205 -25 74 -5 320 -65 94 -169 -130 -263 -80 22 159 -50 -170 -176 -20 -55 -46 129 -41 -75 -86 56
7916E6J87k14j48K56k6l8j90K13k49Q0p5Q9l1j38K84j50j7J64Q0L9q4p3k2k2k25
$$ 56 243 29 -119 137 111 73 -117 96 -153 -73 -148 -59 -90 -228 56 -94 -111 53 133 172 88 15 -7 -29 -254
7941b54K20k29L79O3l41j4K61k29j52J61m0K01R8k19R6K36j43j12l0K15j65R3
$$ -254 -34 -263 116 179 -162 -176 85 -144 -296 -135 -175 26 124 -95 1 237 94 -18 -48 167 2 95
7963I5k12l6Q1j7M2o8K78k17K0J03p9o5L48l03J13j45K66j93R1J5j0p7j89MJ86
$$ 95 -117 -153 -72 -89 -47 -115 163 -54 -34 69 -10 -75 273 -30 83 -62 204 11 102 117 107 30 -159 -155 31
7988C1k27J72J2O4q1l79O30P4j46n4j5k35J09j1J87o9O5k39J62K8j72J73J3j36
$$ 31 -196 -24 -12 52 -29 -408 222 296 150 96 81 -154 -45 -56 131 62 127 -112 50 78 -94 79 92 -44
8012d4J47l45J38j90k2N96l12K6J38O2L9j33Rk9j56L1j07K19j46L59k75r1j5J57
$$ -44 103 -242 -104 -294 -316 280 -32 -6 132 194 233 100 109 80 -76 -45 -152 67 -79 280 5 -86 -101 56
8036E6n4O7j52N2MP1K08j74N7k15p7j24L91j15J1L2j99q7M23l63K26Mo8j20K32
$$ 56 2 69 -83 -31 -27 44 252 78 135 -80 -157 -281 110 -5 6 38 -161 -248 175 -188 38 42 -26 -146 86
8061H6k70J46J8J02m57J34J90J84k8j03k26k56L79L0m5J44J86m94M87l03K91k63
$$ 86 -184 -38 -20 82 -375 -241 -51 133 105 2 -224 -480 -101 -71 -116 28 214 -280 207 -96 195 -68
8083f8M2J53J51l33J7J78j44L6Qn9K62k65n8P1L19j18q6r4l10L56k33J41oM2p2
$$ -68 -26 127 278 -55 -38 140 -4 32 40 -19 243 -22 -80 -9 310 192 106 12 -298 58 -175 -34 -40 2 -70
8108g0J43M7k60J67j10L70l58J5J67j64Q0L3l11J02J58J99j53l23K77JP4L04m60
$$ -70 73 120 -140 27 -83 287 -71 -56 111 -53 27 60 -251 -149 9 208 55 -268 9 10 84 388 -72
8131g2k8K25j66P7K72l50n7J41J63N7j17l37J91J42m1l06K45o6O2k47J90R0k0
$$ -72 -100 125 -41 36 308 -42 -99 42 205 262 145 -192 -1 141 100 -206 39 -27 35 -212 -22 68 48
8154D8jk1n3J63j39K65k14R6n4k28L01l32n3j06J80l2J23J10M6K30k84k44P8l2
$$ 48 47 26 -27 136 -3 262 48 144 90 -138 163 -169 -222 -328 -148 -180 -57 53 99 329 45 -199 -121 -153
8178a53L42r8l1J23r0J7P0m13K45j14p0J67q0
$$ -153 189 91 60 183 93 110 180 -233 12 -102 -172 -5 -85
8191h5
$$ Imaginary data points
##PAGE= N=2
##DATA TABLE= (X++(I..I)), XYDATA
0@%%%%%%QqQj6J6j6K4m0M8n6P2q8J05j29J58j90K24k63L12l62M20m90N66o48P43
$$ 0 0 0 0 0 0 0 8 0 8 -8 8 -8 16 -24 24 -32 40 -48 57 -72 86 -104 120 -143 169 -193 227 -263 303 -345 398
31C98q50R64j095J239j396J567j759J970k197K449k724L024l352L709m097M525
$$ 398 -452 512 -583 656 -740 827 -932 1038 -1159 1290 -1434 1590 -1762 1947 -2150 2375
47B375m992N504o065O680p360Q112q949R880j0930J2123j3486J5061j6908J9114
$$ 2375 -2617 2887 -3178 3502 -3858 4254 -4695 5185 -5745 6378 -7108 7953 -8955 10159
61A0159k1796K5142k9459L5264m3542N6405p9324J32729m93299l15245O37133
$$ 10159 -11637 13505 -15954 19310 -24232 32173 -47151 85578 -407721 -722966 -85833
72h5833J47254p3348k56593N7586K42262L29435J87074O6937j49781j95442j78922
$$ -85833 61421 -11927 -268520 -210934 31328 360763 547837 614774 464993 269551 90629
83I0629P225J21562J7493k69523l41897j82129J14698J84181J8184r6666J1828
$$ 90629 97854 219416 236909 -32614 -374511 -556640 -441942 -257761 -239577 -336243 -324415
94c24415J46329K03726J10654M5930Q1050R0865K6311j2908m9173n2511q9160
$$ -324415 -178086 25640 136294 182224 263274 354139 380450 367542 318369 265858 176698
105A76698j61078j39237l5796n717n7483j45919j11449Q2894K02774J42992L3236
$$ 176698 15620 -123617 -159413 -165130 -222613 -368532 -479981 -397087 -194313 -51321 -18085
116a8085k0307N5041J53415J32197O4582O418n9028r0014j06360q4054p75l578
$$ -18085 -38392 16649 170064 302261 366843 373261 314233 224219 117859 33805 33030 29452
128B9452j10913j80531j41240J8611J54272J03391q287k8579L9467J41270J51751
$$ 29452 -81461 -261992 -403232 -384621 -230349 -126958 -135245 -163824 -124357 16913 168664
139A68664P3432L3586K030m2282m9899l7977k302J402j07326j88368j26643N880
$$ 168664 242096 275682 277712 235430 185531 147554 145252 146654 39328 -149040 -275683 -269803
151b69803R9889M3943q3336o9127N4892J46959J49270O0356J085K3143K2665J2754
$$ -269803 -169914 -125971 -209307 -278434 -223542 -76583 72687 133043 134128 157271 179936 192690
163A92690K3744R467k4270r5586j51337q0901J8573K1057m0822j00398n3223P5931
$$ 192690 216434 225901 201631 106045 -45292 -126193 -107620 -86563 -127385 -227783 -281006 -205075
175b05075J08875N1514J2515K1258P8731R1788K4484o844l051j4830k1124m3523
$$ -205075 -96200 -44686 -32171 -10913 67818 159606 184090 177246 174195 159365 138241 94718
187I4718m9797k7350n9872r5611n6873P855N7477L4644m2454k8104O2109J13301
$$ 94718 44921 17571 -42301 -137912 -194785 -186930 -129453 -94809 -137263 -165367 -103258 10043
199A0043J00566K1726l2470O774L7241K2598k631m5860n9200n2170o3258l5313
$$ 10043 110609 132335 99865 106639 143880 166478 163847 117987 58787 6617 -56641 -91954
211i1954J929j1921l1306m3533j1977P5737R6703L7696o452q120N0060R4237L9240
$$ -91954 -90025 -101946 -133252 -176785 -188762 -113025 -16322 21374 14922 6802 56862 151099 190339
224A90339l0040n0529m2929q225r812m5486m1751m0357m7442k2820Q41L1841M8651
$$ 190339 160299 109770 66841 58616 48804 3318 -38433 -78790 -126232 -149052 -148211 -116370 -67719
237f7719N917q109L5083P0456P8839K7704l8547k0576K1162J9987o961n9557p3062
$$ -67719 -61802 -69911 -34828 35628 114467 142171 103624 83048 104210 124197 117236 57679 -15383
250a5383l4675k4520j6258n22j0096j0523j2105n708N7366R5419N5712J426l7093
$$ -15383 -50058 -74578 -90836 -91358 -101454 -111977 -124082 -129790 -72424 22995 78707 80133 43040
263D3040p887O4566O0625k86n3553q4433n1982o620j538M078j4560n7371n0111
$$ 43040 35153 99719 160344 160058 106505 22072 -29910 -36530 -38068 -33990 -48550 -105921 -156032
276a56032q346N4027J02204N5339k0565l3700J999O9106Q6435J5224m3383n8821
$$ -156032 -164378 -110351 -8147 47192 26627 -7073 -5074 64032 150467 165691 122308 63487
288F3487m8628n458N987j6278k7469n2571n2014k412L1053M5907L0496j4023j747
$$ 63487 14859 9401 15388 -890 -28359 -80930 -132944 -135356 -104303 -58396 -27900 -41923 -43670
301d3670M6223O0502M7774k884l9522l986K4272J2248k0969p2011o9142j5692
$$ -43670 2553 63055 110829 107945 68423 64437 88709 100957 79988 7977 -61165 -76857
313g6857J0361J9342R5m3349l6769K437M8480R4645O8063r187m7315l5818L7283
$$ -76857 -66496 -47154 -47059 -90408 -127177 -124740 -76260 18385 86448 77261 29946 -5872 31411
326C1411R8564M8826m6949j05886r5793n022O0547L5220j9484p4465q1101r761
$$ 31411 129975 178801 131852 25966 -69827 -74849 -14302 20918 1434 -73031 -154132 -163893
338a63893N8410R1776P5718p439o0051l1431L4468R7696P8968k3676q4557p7838
$$ -163893 -105483 -13707 62011 54572 -5479 -36910 -2442 95254 174222 150546 65989 -11849
350a1849k4731L8040K9025j9607m5743o1904l7472J6850M3951N6561L3278k0781
$$ -11849 -36580 1460 30485 10878 -34865 -96769 -134241 -117391 -73440 -16879 16399 -4382
362d382k1341J7262M9522O2456J5422l5049k9533j6473p256n672k9363k5192r091
$$ -4382 -25723 -8461 41061 103517 118939 83890 54357 37884 30628 24956 -4407 -29599 -38690
375c8690k3534k0066n708O197L0622K2377O942K5378K7699J5721O701o882J6707
$$ -38690 -62224 -82290 -87998 -81801 -51179 -28802 -21860 3518 31217 46938 53639 46757 63464
388F3464L7495m245m7513n8292l4600J8746K2525j9148l5360l6715j4437K5403
$$ 63464 100959 96714 49201 -9091 -43691 -24945 -2420 -21568 -56928 -93643 -108080 -82677
400h2677L7929M5777L9493j0992l1682j537M1301P2793K8676n4373p2541l8254
$$ -82677 -44748 1029 40522 29530 -2152 -3689 37612 110405 139081 84708 12167 -26087
412b6087J0052L5024l383l9878l9593l6760p072L2841M3736M1546L910l5211n604
$$ -26087 -16035 18989 15606 -24272 -63865 -100625 -107697 -74856 -31120 10426 14336 -20875 -26479
425b6479M3614O1241L9808k5212n1787j9352m4M021n529k9467k5508k0782k8490
$$ -26479 17135 78376 118184 92972 41185 21833 21789 25810 20281 -9186 -34694 -55476 -83966
438h3966j974K3301K4834J8333q663n261L6085M1915K3496K911j6362P66J1367
$$ -83966 -85940 -62639 -37805 -19472 -28135 -33396 2689 44604 68100 71011 54649 55415 66782
451F6782j5450k3533k0574j7911o449k2956l0780j721Q081O071Q323K597K4844
$$ 66782 51332 27799 7225 -10686 -17135 -40091 -70871 -72592 -64511 -58440 -50117 -47520 -22676
464b2676L9102J4436M808J0461J5883K2974n729l5229j8558p038p155j4736l6760
$$ -22676 16426 30862 35670 46131 62014 84988 79259 44030 25472 18434 11279 -3457 -40217
477d0217k5265Q05l998j68R601J4277K7308J3775j245K4900L7744K4767K868k8562
$$ -40217 -65482 -64677 -68675 -68843 -59242 -44965 -17657 -3882 -5127 19773 57517 82284 85152 56590
491E6590j8704J2084P11j9469l4708l9355j3613n448j1167O905J1893N187O306
$$ 56590 37886 49970 50681 31212 -3496 -42851 -56464 -61912 -73079 -66174 -54281 -49094 -42788
504d2788J191K4338N3280L2930K273j3134j4271J4112J5129j4722k2839k9828
$$ -42788 -41597 -17259 36021 68951 71224 58090 43819 57931 73060 58338 35499 5671
516E671l1788j9373k0286o554J9259O650r510r779K669M1181N4194K5779O744
$$ 5671 -26117 -45490 -65776 -72330 -53071 -46421 -55931 -65710 -63041 -21860 32334 58113 64857
529F4857p438j1268P448M680K272M283k6237n1542m6845k4075K3733L6746n267
$$ 64857 57419 46151 53599 58279 60551 64834 38597 -12945 -59790 -83865 -60132 -23386 -28653
542b8653l2889l1162L708N7583O1505L0786O178k2047k0608R307K5013L3834N291
$$ -28653 -61542 -92704 -88996 -31413 30092 60878 67056 45009 24401 33708 58721 92555 97846
555I7846n6430p1844m0132Q119M3420J2070l8879l9554j4914K6460N4925L7893
$$ 97846 41416 -30428 -70560 -62441 -19021 -6951 -45830 -85384 -100298 -73838 -18913 18980
567A8980J9949N314j5577k204K0721K4703J8352k1127n1679l0276p969k88m260
$$ 18980 38929 44243 28666 26462 47183 71886 90238 69111 17432 -12844 -20813 -21101 -25361
580b5361k5945j7228P546O325Q420J0458J1310K9774K8998J1294J1020k008j1727
$$ -25361 -51306 -68534 -60988 -54663 -46243 -35785 -24475 5299 34297 45591 56611 54603 42876
593D2876p47P6N252r58l9421m9371k5301M173L4185J8772k3613k9633j1504K4301
$$ 42876 42129 42205 47457 46499 7078 -42293 -67594 -63421 -29236 -10464 -34077 -63710 -75214 -50913
607e0913O2165M6763O792k2862l6209m42M2603L5765P32m8298p1545k9101J8380
$$ -50913 11252 58015 64807 41945 5736 5294 47897 83662 84394 36096 -35449 -64550 -46170
620d6170L4751K1531k8298n4571k2354K2977O4699N9311j165l7811k7549J0750
$$ -46170 -11419 10112 -18186 -72757 -95111 -72134 -7435 51876 50711 12900 -14649 -3899
632c899N5828M2685j3282m5435n1832k2453K3378K4292J156k8239n1684k0763
$$ -3899 51929 94614 81332 35897 -15935 -38388 -15010 9282 10438 -17801 -69485 -90248
644i0248L1077M7188L4255r610l5359Q96L7870M2413J9314k6217l5731q461N283
$$ -90248 -59171 -11983 22272 12662 -22697 -21801 16069 58482 77796 51579 15848 7387 12670
657A2670J1999Kl1243l4057j9463L097L4101K2534j6247k6879j1211L4183O4393
$$ 12670 24669 24671 -6572 -40629 -60092 -56995 -22894 -360 -16607 -43486 -54697 -20514 43879
670D3879K6576k1409l8013k1171K6639M2366O819k6367m9705m3973j96K7680K8844
$$ 43879 70455 49046 11033 -10138 16501 58867 65686 39319 -10386 -54359 -54555 -26875 1969
683A969O469m0034m4641L553M5936O3201K6105l4274l6164o33L1090M2789N303
$$ 1969 8438 -31596 -76237 -72684 -26748 36453 62558 28284 -7880 -8513 22577 65366 70669
696G0669l2937l4094k6577m089J8012O717q054k3476l0419N467L6437K8750P156
$$ 70669 37732 3638 -22939 -27028 -9016 -2299 -10353 -33829 -64248 -58781 -22344 6406 13562
709A3562j8205j1169K8573L3906J0112j2424k6622o048J2843k629j1700j7567
$$ 13562 -4643 -15812 12761 46667 56779 44355 17733 11685 24528 21899 10199 -7368
721g368k4418j0876p34Q412K2185J421k0753r283J5500M5288L8251j1074l0866
$$ -7368 -31786 -42662 -43396 -34984 -12799 -11378 -32131 -41414 -25914 19374 57625 46551 15685
734A5685j0015J3719K9034M232k8383k5688k0600j1459P361P105M188o513k8790
$$ 15685 5670 19389 48423 52655 24272 -1416 -22016 -33475 -26114 -19009 -14821 -21334 -50124
747e0124r623L0349L9968K5163j2232k7660Q549L1312J9412p36k5566k1259l370
$$ -50124 -59747 -29398 10570 35733 23501 -4159 4390 35702 55114 54378 28812 7553 4183
760D183j0277o455L200o051j2126j8944j2356K3628L2265P210o633r490J3613
$$ 4183 -6094 -12549 -9349 -15400 -27526 -46470 -58826 -35198 -2933 4277 -2356 -11846 1767
773A767L3787R420q606n447m073P80q511k2119m941K505j0345j4004j4962M76
$$ 1767 35554 44974 36368 30921 26848 27628 19117 -3002 -7943 -5438 -15783 -29787 -44749 -44273
787d4273J9996O655j332R694J0359J3230O015n116J4134K0526l240k0264k8259
$$ -44273 -24277 -17622 -18954 -9260 1099 14329 20344 15228 29362 49888 46648 26384 -1875
800a875q304K0415N268k1530k6527k0639O604K1287J0160R981L975j1672l515
$$ -1875 -10179 10236 15504 -6026 -32553 -53192 -46588 -25301 -15141 -5160 -1185 -12857 -16372
813a6372J1787L0650L8688k444m1220l1651r72L3043K5352k3771m3034k8742o520
$$ -16372 -4585 26065 64753 62309 21089 -10562 -11534 21509 46861 23090 -19944 -48686 -55206
826e5206K0994K2397R526K773j9024k2198J1492L9629M4702J1868l9309l6575
$$ -55206 -34212 -11815 -2289 484 -18540 -40738 -29246 10383 55085 66953 27644 -8931
838h931L583K5052K1345j0751l2192j6563q766q774M802R971J3335M991j9772
$$ -8931 -5348 19704 41049 30298 -1894 -18457 -27223 -35997 -31195 -21224 -7889 -2898 -22670
851b2670q585K1616K4701J5204l590r258J1627M387j9704j6841j716J7483J3262
$$ -22670 -31255 -9639 15062 30266 26676 17418 29045 33432 13728 -3113 -4829 12654 25916
864B5916k8644l9206j0306J4213K8237J5513o914m772p482r024J7650L5162L1121
$$ 25916 -2728 -41934 -52240 -38027 -9790 5723 -1191 -5963 -13445 -22469 -4819 30343 61464
877F1464p57m9755m4242J0183M1698L1803j7015n6912l4148L763K4647L2141J2400
$$ 61464 60707 10952 -33290 -23107 18591 50394 33379 -23533 -57681 -53918 -29271 2870 15270
890A5270j2258j9128k1850Q766M8256L9243P21l8177m3137N454L8798K0140j2019
$$ 15270 3012 -16116 -37966 -29200 19056 58299 59020 20843 -22294 -16840 21958 42098 30079
903C0079l8525l0372L136J1297J1077J0973o260j0957n247M783K9650K7345o092
$$ 30079 -8446 -38818 -35682 -24385 -13308 -2335 -8595 -19552 -24799 -20016 9634 36979 30887
916C0887j8670j1907J0389K5756j674k7528j9383n542Q617O061j4504j0157O97
$$ 30887 12217 310 10699 36455 34781 7253 -12130 -17672 -9055 -2994 -17498 -27655 -26958
929b6958o06J0549J3685R686Q681r757j0730J7010K5708J1400j5509l7700j3071
$$ -26958 -27564 -17015 -3330 6356 15037 5280 -5450 11560 37268 48668 33159 -4541 -17612
942a7612J8097J3579l259k2869k6032n48R163J0241J7230N498o789p554k776K3213
$$ -17612 485 14064 10805 -12064 -38096 -38644 -29481 -19240 -2010 3488 -3301 -10855 -13631 9582
956I582L4850M882k1161k7073r469K0929J4712j3088k0701k1260q034R432N584
$$ 9582 44432 49314 28153 1080 -8389 12540 27252 14164 -6537 -27797 -35831 -26399 -20815
969b0815P173P358r201o201P905J8185K7126O241j8638r568L613J1170P794j6164
$$ -20815 -13642 -6284 -15485 -21686 -13781 4404 31530 37771 19133 9565 13178 24348 32142 15978
983A5978k0987o501o252l47P86n955J107o28m681J2501J7091J0114N208r002m19
$$ 15978 -5009 -11510 -17762 -18109 -17323 -23278 -22171 -22799 -27480 -14979 2112 12226 17434 8432 8013
998H013J7405R021k770j1941j7103j723K360r061o313p651p913J446j519L863
$$ 8013 25418 34439 31669 19728 2625 902 3262 -5799 -12112 -19763 -27676 -26230 -27749 -23886
1012b3886J6518N893M87K320L022J5832J3341n847o031m532m039K561r668j3787
$$ -23886 -7368 -1475 -988 1332 4354 20186 33527 27680 21649 17117 13078 15639 5971 -7816
1026g816l422o134n897m29l510O494R044k157N174R743Q728J1468m50m778O481
$$ -7816 -11238 -17372 -23269 -23698 -27208 -20714 -11670 -13827 -8653 1090 9818 21286 20836 16058 22539
1041B2539K038l405m749j2615o071j576j1167n411K73j766M078k012l173J2952
$$ 22539 24577 21172 16423 3808 -2263 -3839 -15006 -20417 -20144 -21910 -17832 -19844 -23017 -10065
1055a0065J1178O733P112j731L069O728l592m60J522o887o750j4305j3367N236
$$ -10065 1113 7846 14958 13227 16296 23024 19432 18972 20494 13607 6857 -7448 -20815 -15579
1069a5579O162k053n911j2072J114J6669J0364R919O243m378m54N38K291J4871
$$ -15579 -9417 -11470 -17381 -29453 -28339 -11670 -1306 8613 14856 10478 10024 10562 12853 27724
1083B7724N595j3986j9016j7947N98J7491J570j0988j4240j1930Q428J5747J0259
$$ 27724 33319 19333 317 -17630 -17032 459 2029 -8959 -23199 -35129 -26701 -10954 -695
1096f95J1604Q8j0469j594M984J6448J8268q936k1560j4442l672J2231O894j3284
$$ -695 10909 10997 528 -1066 3918 20366 38634 29698 8138 -6304 -9976 2255 9149 -4135
1110d135j1460p345k933Q351N476O423R748l442m187O639P688J0996K525j2183
$$ -4135 -15595 -22940 -25873 -17522 -12046 -5623 4125 683 -3504 3135 10823 21819 24344 12161
1124A2161k809K392l332m724j1759o770P983K39o445m106m993P003J2190L969
$$ 12161 9352 11744 8412 3688 -8071 -14841 -6858 -6619 -13064 -17170 -22163 -15160 -2970 999
1138I99P172L278o881j970K612R868J5953n890k2237j6233m259J4379J5293q756
$$ 999 8171 11449 4568 2598 5210 15078 31031 25141 2904 -13329 -17588 -3209 12084 3328
1152C328j6219j2561n559J4689J7564R352K855j3336j3946P281J8632J9619L334
$$ 3328 -12891 -25452 -31011 -16322 1242 10594 13449 113 -13833 -6552 12080 31699 35033
1165C5033k4567k0887j606R434J5313n61j7406j2159p497K050J6202R302J658
$$ 35033 10466 -10421 -12027 -2593 12720 12159 -5247 -17406 -24903 -22853 -6651 2651 4309
1178D309l471j2099J929J6385J1236M711r307j4624K891O432O8k524j0864o335
$$ 4309 838 -11261 -9332 7053 18289 23000 13693 -931 1960 8392 8460 5936 -4928 -11263
1192a1263M698j165j859J62l899M085O654K781P129J79p428P80L984R905R712
$$ -11263 -6565 -7730 -9589 -9427 -13326 -9241 -2587 194 7323 7502 74 854 4838 14743 24455
1207B4455j1220j7971o932K536J4964P354j3846j4413q603K176J7701J2030R44
$$ 24455 13235 -4736 -11668 -9132 5832 13186 -660 -15073 -23676 -21500 -3799 8231 9175
1220I175m654j4803n397J5098J8047J1944o804k5796j2560P859J4667J3669r030
$$ 9175 4521 -10282 -15679 -581 17466 29410 22606 -3190 -15750 -7891 6776 20445 11415
1233A1415k2077j0901r32J1765J7116J984p115r817j0112R685K0488R823j055
$$ 11415 -10662 -21563 -22495 -10730 6386 8370 1255 -8562 -18674 -8989 11499 21322 20267
1246B0267j6574j4734O630J2005O692j102j5884r717J255J713P135N067n593l482
$$ 20267 3693 -11041 -4411 7594 14286 13184 -2700 -12417 -11162 -9449 -2314 2753 -2840 -6322
1260f322l503n44J2333Q117j497l139p112J678J0201k95m011m440n653L744O39
$$ -6322 -9825 -10369 1964 10081 8584 5445 -1667 11 10212 9917 5906 1466 -4187 -443 196
1275A96n965J77l34j013L673k158Q38P031q71j313K616K97N231L51q246K55L299
$$ 196 -5769 -5592 -5926 -6939 -3266 -5424 -4586 2445 1574 261 2877 3174 8405 8756 510 765 4064
1292D064Q86k21r237n934P074K358q22k029n036M135N603j656L387K838j566l7
$$ 4064 4950 4729 -4508 -10442 -3368 -1010 -1832 -3861 -8897 -4762 841 -815 2572 5410 3844 3807
1308C807n030O14J0874J622q072q907o505P221R978l404m659m564l829M605L349
$$ 3807 -1223 -609 10265 11887 3815 -5092 -11597 -4376 5602 2198 -2461 -7025 -10854 -6249 -2900
1323b900M230R765k863j0195n015Q06J3864J1186p876j1886q184k428R321O125
$$ -2900 1330 11095 8232 -1963 -6978 -6172 7692 18878 11002 -884 -9068 -11496 -2175 3950
1337C950k49O52q871j0116O99P329J6202R426j1899j5048m309O628J7558O919
$$ 3950 3701 4353 -4518 -14634 -13935 -6606 9596 19022 7123 -7925 -12234 -5606 11952 18871
1351A8871r344q371j0577m552Q578Q113P454r67j7506j2393N452J4423J7295k76
$$ 18871 9527 1156 -9421 -13973 -5395 2718 10172 9205 -8301 -20694 -15242 -819 16476 16200
1365A6200j6917q717J489Q618J2199j73o078n118j0234j983Q442O703L828q286
$$ 16200 -717 -9434 -7945 673 12872 12699 6621 1503 -8731 -10714 -2272 4431 8259 -27
1379b7j5068R40J1227R077L255r252o369O757L883J736J74m230J206n65o409J517
$$ -27 -15095 -14155 -2928 6149 9404 152 -6217 540 4423 6159 6333 2103 3309 2744 -3665 -2148
1395b148L660j332k630p461p4J1378K238n505l879l01J0681P188p466n128P77
$$ -2148 1512 180 -2450 -9911 -9985 1393 3631 -1874 -5753 -6054 4627 11815 4349 -779 -2
1410bL309N056m248o185K284j638m049J25R49M926R20j0941j806R429R984M844
$$ -2 3307 8363 4115 -2070 214 -1424 -5473 -5348 -4399 527 1447 -9494 -11300 -1871 8113 12957
1426A2957j0927j0813O745J0000L989k830r954l185K577l886J969N737m2l981
$$ 12957 2030 -8783 -2038 7962 11951 9121 -833 -4018 -1441 -5327 -3358 2379 2337 -1644
1440a644j0592m425J4801J2883j192r435j0427N724J4528J199n257l696k678K478
$$ -1644 -12236 -16661 -1860 11023 9831 396 -10031 -4307 10221 11420 6163 2467 -211 2267
1454B267l132n176O237L618n722p102l677Q328J2652n931r280L31Q247J1495k426
$$ 2267 -865 -6041 196 3814 -1908 -9010 -12687 -4359 8293 2362 -6918 -6587 1660 13155 10729
1469A0729j3556n2O429L334n42p255j578L370o622m923N098P963N481r179j4988
$$ 10729 -2827 -2879 3550 6884 6342 -913 -2491 879 -5743 -10666 -5568 2395 7876 -1303 -16291
1484a6291M479J5865J0399j352j3517o302P145L496J028J756j409j827q680j1393
$$ -16291 -11812 4053 14452 13100 -417 -6719 426 3922 4950 6706 5297 3470 -5210 -16603
1498a6603O939J4885N118p326j5627m243J4367J0792P06l184n698M62L88m455
$$ -16603 -9664 5221 10339 3013 -12614 -16857 -2490 8302 9008 5824 126 588 976 -3479
1512c479N334Q835o88q841j3316k083J4605P411m728q493n170N885P660k269N56
$$ -3479 1855 10690 10002 1161 -12155 -14238 367 7778 3050 -5443 -10613 -4728 2932 663 1219
1527A219M075L73k525o736j262J1824L750p830q397l792P447P265n840n681J573
$$ 1219 5294 5667 3142 -3594 -4856 6968 10718 2888 -5509 -9301 -1854 5411 -429 -6110 -4537
1542d537L150L939l650l916P096M608l129m165k358N465N953p011n987J878L231
$$ -4537 -1387 2552 -1098 -5014 2082 6690 3561 -604 -2962 2503 8456 1445 -4542 -2664 567
1557E67K967n228o557N437N833j464l057m047M072Q303k704m573N68O53L228j835
$$ 567 3534 -1694 -8251 -2814 3019 1555 -1502 -5549 -1477 6826 4122 -451 117 770 3998 2163
1573B163m825L196J968l858l529j956N251P983l983p734p99L335Q484K875o664
$$ 2163 -2662 534 2502 -1356 -4885 -6841 -1590 6393 2410 -5324 -6123 -2788 5696 8571 1907
1588A907j974p65j099L501J193P55O78q801o259M280P093P501k375j1879l563
$$ 1907 -67 -832 -1931 1570 2763 3518 4196 -4605 -10864 -6584 509 8010 5635 -6244 -9807
1603i807N434P461Q255l219p854k730k509K783Q454J987l001p955j0440K577J1357
$$ -9807 -4373 3088 11343 8124 270 -2460 -4969 -2186 6268 8255 5254 -2701 -13141 -10564 793
1618G93O178j57j0144q975M498Q104O892L824o256o023j831l26P055O574l317
$$ 793 6971 6814 -3330 -12305 -7807 297 7189 11013 4757 -1266 -3097 -3423 3632 10206 6889
1633F889o458q228l885Q728N944n10l355o582p62O112K796L740K704l968j221
$$ 6889 431 -7797 -11682 -2954 2990 2480 -875 -7457 -8219 -2107 689 4429 7133 3165 1944
1648A944j881m82N668J271l049k700m973j167K988j360O95J770k380P33l40j162
$$ 1944 63 -419 5249 6520 3471 771 -4202 -5369 -2381 -3741 -3046 -1276 -3656 -2923 -3263 -4425
1664d425N919M000r4M97l946j797L066q7J621M65n819m066j892j106N537L055
$$ -4425 1494 5494 5400 5897 1951 154 3220 3133 4754 5219 -600 -4666 -6558 -7664 -2127 928
1680I28k863j602k938M43P032L529K339N45n849j724J650J961M430j290p118m048
$$ 928 -1935 -3537 -6475 -6032 1000 4529 6868 7413 1564 -160 1490 3451 7881 6591 -527 -4575
1696d575k610J46N869N29j016r93m915J194O546L693M268k102o138M79J733J968
$$ -4575 -7185 -7039 -1170 -641 -1657 -2650 -7565 -6371 175 3868 8136 6034 -104 375 2108 4076
1712D076L716l039m856k543m369J335N116L77q76l788m098M956N780K063J357
$$ 4076 7792 4753 -103 -2646 -7015 -5680 -564 -187 -1063 -4851 -8949 -3993 1787 3850 5207
1727E207k807k158L117m41J121J868l654k370k734k354M060J991l965k003j120
$$ 5207 2400 242 3359 2918 4039 5907 2253 -117 -2851 -5205 -1145 846 -3119 -5122 -6242
1742f242K889N740j174k686J886J294K931J442m059J96j95k801J046J39n07J43
$$ -6242 -3353 2387 1213 -1473 413 1707 4638 6080 2021 2217 2022 -779 267 406 -101 42
1758D2n479l399N055M307K765k245o223J203O787K784J857l095m735O22p52M07
$$ 42 -5437 -8836 -3781 526 3291 1046 -5177 -3974 2813 5597 7454 4359 -376 246 -506 -99
1774i9L626j090l664m741l886N406Q137n09m198n073J82Q959M331j937j904l511
$$ -99 3527 2437 -1227 -5968 -9854 -4448 3689 3180 -1018 -6091 -5909 3050 7381 5444 3540 29
1790B9j70K674j222J617P22o385l989q54L631P113j185p931j140L536P081M945
$$ 29 -141 2533 1311 2928 3650 -2735 -6724 -7578 -3947 3166 1981 -5950 -7090 -3554 3527 8472
1806H472n334k716J625M28J923Nk358P59l633o086J710L478K793j525q134j528
$$ 8472 3138 422 2047 2475 4398 4403 2045 2804 -829 -6915 -5205 -1727 1066 -459 -8593 -10121
1822a0121P840N546K051l427l934M222L855p70Q84j633j662r42n489n36M243m90
$$ -10121 -2281 3265 5316 1889 -2045 2177 6032 5262 6146 4513 2851 1909 -3580 -4116 127 -363
1838c63l439m152k200O701N008k908p45O90L668M959k208j416K593l1j188k123
$$ -363 -3802 -7954 -10154 -3453 1555 -1353 -2098 -1408 2260 7219 5011 3595 6188 6157 4969 2846
$$ [...]
8191I3
##END NTUPLES=NMR FID
##END=
