##TITLE=1H_Pr Q-18-3
 200.13MHz,CDCl3.
 8 sc
 
 18.12.2025
##JCAMPDX= 6.0         $$ Bruker NMR JCAMP-DX V2.0
##DATA TYPE= NMR FID
##DATA CLASS= NTUPLES
##ORIGIN= UXNMR, Bruker Analytische Messtechnik GmbH
##OWNER= pz
$$ XWIN-NMR		Version 3.5
$$ Thu Dec 18 16:23:35 2025 Russian Standard Time (UT+4h)  she@DPX200
##.OBSERVE FREQUENCY= 200.1313
##.OBSERVE NUCLEUS= ^1H
##.DELAY= (6, 6)
##.ACQUISITION MODE= SIMULTANEOUS
##.ACQUISITION SCHEME= undefined
##.AVERAGES= 8
##.DIGITISER RES= 18
##SPECTROMETER/DATA SYSTEM= spect
##.PULSE SEQUENCE= zg30
##.SOLVENT NAME= CDCl3
##.SHIFT REFERENCE= (INTERNAL, CDCl3, 0, 14.3821)
##AUDIT TRAIL= $$ (NUMBER, WHEN, WHO, WHERE, WHAT)
$$ ##TITLE= Audit trail, XWIN-NMR		Version 3.5
$$ ##JCAMPDX= 5.01
$$ ##ORIGIN= Bruker BioSpin GmbH
$$ ##OWNER= she
$$ F:/spectra/data/she/nmr/H-C/1/audita.txt
$$ ##AUDIT TRAIL=  $$ (NUMBER, WHEN, WHO, WHERE, WHAT)
(   1,<2025-12-18 16:22:23.03 +0400>,<she>,<DPX200>,
      <created by zg, POWCHK disabled, PULCHK disabled
       configuration hash MD5:
       00 E9 B6 7A A2 85 ED C7 34 08 36 98 17 FE 4E 26
       data hash MD5: 16K
       3E E9 66 AB C5 14 7F 4A 04 F6 88 94 71 84 7B 21>)
$$ ##END=
$$ 
$$ hash MD5
$$ 20 9C 43 D4 8B BB 5D 51 BC 20 AE 80 1D 88 A3 0E
##$RELAX= 
##$RELAX= 
##$RELAX= 
##$RELAX= 
##$RELAX= 
##$RELAX= 
$$ Bruker specific parameters
$$ --------------------------
##$DU= <F:/spectra>
##$EXPNO= 1
##$NAME= <H-C>
##$PROCNO= 1
##$TYPE= <nmr>
##$USER= <she>
##$AMP= (0..31)
100 100 100 100 100 100 100 100 100 100 100 100 100 100 100 100 100 100 
100 100 100 100 100 100 100 100 100 100 100 100 100 100 
##$AQSEQ= 0
##$AQ_mod= 1
##$AUNM= <au_zg>
##$AUTOPOS= <>
##$BF1= 200.13
##$BF2= 200.13
##$BF3= 200.13
##$BF4= 200.13
##$BF5= 200.13
##$BF6= 200.13
##$BF7= 200.13
##$BF8= 200.13
##$BYTORDA= 1
##$CFDGTYP= 0
##$CFRGTYP= 5
##$CHEMSTR= <none>
##$CNST= (0..31)
1 1 145 1 1 1 1 1 1 1 1 1 1 1 1 1 1 1 1 1 1 1 1 1 1 1 1 1 1 1 1 1 
##$CPDPRG= <>
##$CPDPRG1= <>
##$CPDPRG2= <>
##$CPDPRG3= <>
##$CPDPRG4= <mlev>
##$CPDPRG5= <mlev>
##$CPDPRG6= <mlev>
##$CPDPRG7= <mlev>
##$CPDPRG8= <mlev>
##$CPDPRGB= <>
##$CPDPRGT= <>
##$D= (0..31)
0 0.7 0 0 0 0 0 0 0 0 0 0.03 0 0 0 0 0 0 0 0 0 0 0 0 0 0 0 0 0 0 0 0 
##$DATE= 1766060542
##$DBL= (0..7)
120 120 120 120 120 120 120 120 
##$DBP= (0..7)
150 150 150 150 150 150 150 150 
##$DBP07= 0
##$DBPNAM0= <>
##$DBPNAM1= <>
##$DBPNAM2= <>
##$DBPNAM3= <>
##$DBPNAM4= <>
##$DBPNAM5= <>
##$DBPNAM6= <>
##$DBPNAM7= <>
##$DBPOAL= (0..7)
0.5 0.5 0.5 0.5 0.5 0.5 0.5 0.5 
##$DBPOFFS= (0..7)
0 0 0 0 0 0 0 0 
##$DE= 6
##$DECBNUC= <off>
##$DECIM= 32
##$DECNUC= <off>
##$DECSTAT= 4
##$DIGMOD= 1
##$DIGTYP= 9
##$DL= (0..7)
0 120 120 120 120 120 120 120 
##$DP= (0..7)
150 150 150 150 150 150 150 150 
##$DP07= 0
##$DPNAME0= <>
##$DPNAME1= <>
##$DPNAME2= <>
##$DPNAME3= <>
##$DPNAME4= <>
##$DPNAME5= <>
##$DPNAME6= <>
##$DPNAME7= <>
##$DPOAL= (0..7)
0.5 0.5 0.5 0.5 0.5 0.5 0.5 0.5 
##$DPOFFS= (0..7)
0 0 0 0 0 0 0 0 
##$DQDMODE= 0
##$DR= 18
##$DS= 0
##$DSLIST= <SSSSSSSSSSSSSSS>
$$ [...]
##$SUBNAM0= <"">
##$SUBNAM1= <"">
##$SUBNAM2= <"">
##$SUBNAM3= <"">
##$SUBNAM4= <"">
##$SUBNAM5= <"">
##$SUBNAM6= <"">
##$SUBNAM7= <"">
##$SUBNAM8= <"">
##$SUBNAM9= <"">
##$SW= 18.0517328524113
##$SWIBOX= (0..15)
0 0 2 0 0 0 0 0 0 0 0 0 0 0 0 0 
##$SW_h= 3612.71676300578
##$TD= 16384
##$TD0= 1
##$TE= 0
##$TE2= 300
##$TE3= 300
##$TEG= 300
##$TL= (0..7)
0 120 120 120 120 120 120 120 
##$TP= (0..7)
150 150 150 150 150 150 150 150 
##$TP07= 0
##$TPNAME0= <>
##$TPNAME1= <>
##$TPNAME2= <>
##$TPNAME3= <>
##$TPNAME4= <>
##$TPNAME5= <>
##$TPNAME6= <>
##$TPNAME7= <>
##$TPOAL= (0..7)
0.5 0.5 0.5 0.5 0.5 0.5 0.5 0.5 
##$TPOFFS= (0..7)
0 0 0 0 0 0 0 0 
##$TUNHIN= 0
##$TUNHOUT= 0
##$TUNXOUT= 0
##$USERA1= <user>
##$USERA2= <user>
##$USERA3= <user>
##$USERA4= <user>
##$USERA5= <user>
##$V9= 5
##$VALIST= <valist>
##$VCLIST= <CCCCCCCCCCCCCCC>
##$VD= 0
##$VDLIST= <DDDDDDDDDDDDDDD>
##$VPLIST= <PPPPPPPPPPPPPPP>
##$VTLIST= <TTTTTTTTTTTTTTT>
##$WBST= 1024
##$WBSW= 4
##$XGAIN= (0..3)
0 0 0 0 
##$XL= 0
##$YL= 0
##$YMAX_a= 434478
##$YMIN_a= -433889
##$ZGOPTNS= <>
##$ZL1= 120
##$ZL2= 120
##$ZL3= 120
##$ZL4= 120
##$ABSF1= 10
##$ABSF2= 0
##$ABSG= 5
##$ABSL= 3
##$ALPHA= 0
##$AQORDER= 0
##$ASSFAC= 0
##$ASSFACI= 0
##$ASSFACX= 0
##$ASSWID= 0
##$AUNMP= <proc_1d>
##$AZFE= 0.1
##$AZFW= 0.1
##$BCFW= 1
##$BC_mod= 2
##$BYTORDP= 1
##$COROFFS= 0
##$CY= -3
##$DATMOD= 1
##$DC= 2
##$DFILT= <>
##$DTYPP= 0
##$F1P= 0
##$F2P= 0
##$FCOR= 0.5
##$FTSIZE= 0
##$FT_mod= 4
##$GAMMA= 1
##$GB= 0.15
##$INTBC= 1
##$INTSCL= 1
##$ISEN= 128
##$LB= 0.25
##$LEV0= 0
##$LPBIN= 0
##$MAXI= 10000
##$MC2= 0
##$MEAN= 0
##$ME_mod= 0
##$MI= 1.114404
##$NCOEF= 0
##$NC_proc= 0
##$NLEV= 6
##$NOISF1= 3.799351
##$NOISF2= 2.8
##$NSP= 1
##$NTH_PI= 0
##$NZP= 0
##$OFFSET= 14.38212
##$PC= 1
##$PHC0= -3705.138
##$PHC1= 12.59231
##$PH_mod= 1
##$PKNL= yes
##$PPARMOD= 0
##$PSCAL= 0
##$PSIGN= 0
##$REVERSE= no
##$SF= 200.129724274929
##$SI= 16384
##$SIGF1= 3
##$SIGF2= 2
##$SINO= 400
##$SIOLD= 16384
##$SREGLST= <1H.CDCl3>
##$SSB= 0
##$STSI= 0
##$STSR= 0
##$SW_p= 3205.1282051282
##$SYMM= 0
##$S_DEV= 0
##$TDeff= 0
##$TDoff= 0
##$TI= <>
##$TILT= no
##$TM1= 0
##$TM2= 0
##$TOPLEV= 0
##$USERP1= <user>
##$USERP2= <user>
##$USERP3= <user>
##$USERP4= <user>
##$USERP5= <user>
##$WDW= 1
##$XDIM= 8192
##$YMAX_p= 0
##$YMIN_p= 0
$$ End of Bruker specific parameters
$$ ---------------------------------
##NTUPLES= NMR FID
##VAR_NAME=  TIME,          FID/REAL,        FID/IMAG
##SYMBOL=    X,             R,               I
##VAR_TYPE=  INDEPENDENT,   DEPENDENT,       DEPENDENT
##VAR_FORM=  AFFN,          ASDF,            ASDF
##VAR_DIM=   8192,          8192,            8192
##UNITS=     SECONDS,       ARBITRARY UNITS, ARBITRARY UNITS
##FACTOR=    0.0002768,     1,               1
##FIRST=     0,             0,               0
##LAST=      2.2672688,     0,               0
##MIN=       0,             -433889,         0
##MAX=       2.2672688,     434478,          0
$$ Real data points
##PAGE= N=1
##DATA TABLE= (X++(R..R)), XYDATA
0 0 0 0 0 0 0 0 0 0 0 0 0 0 0 0 0 0 0 -2 8 -6 8 -8 8 -8 13 -15 16 -18 21 -24 28 -32 36 -41 44 -52 57 -64 71 -79
40 -79 89 -97 108 -118 132 -146 160 -175 196 -213 235 -262 287 -318 352 -391 435 -488 546 -620
60 -620 709 -821 969 -1164 1449 -1882 2639 -4191 8698 -49359 -207493 -75450 215152 434478
74 434478 428497 260674 124982 81293 78061 106796 94771 1889 -155573 -330205 -374626 -242360
86 -242360 -111043 -95177 -168450 -201805 -75551 105880 184683 186330 177559 208812 258448 227298
98 227298 146311 94223 40968 -21242 -89751 -154929 -169400 -184187 -244051 -263350 -201262 -80681
110 -80681 24060 19922 -18397 35176 152957 261830 282433 199655 124205 91132 64024 47823
122 47823 11917 -50705 -120575 -213731 -262311 -203204 -112366 -59542 -75078 -120702 -72760 61667
134 61667 168749 202713 163318 118589 132816 145016 124974 92535 26867 -46539 -110411 -161679
146 -161679 -147138 -103262 -111810 -149912 -172114 -122532 1890 81547 79171 65927 77502 132382
158 132382 180725 158366 115842 81932 32568 -12166 -53678 -79212 -74420 -101709 -154956 -161277
170 -161277 -122258 -57721 -16611 -29398 -14716 53897 110592 130992 107395 82028 105537 114700
182 114700 76332 27023 -25115 -53852 -65710 -96220 -104442 -87547 -90877 -98545 -95963 -59657 23185
195 23185 71929 59778 46415 55637 99029 138981 111001 59042 24432 -2888 -13145 -30122
207 -30122 -61709 -73437 -89671 -110388 -95582 -65827 -28890 -347 -9343 -2172 45956 88768
219 88768 110669 92226 52489 51085 60754 46368 18331 -31006 -64471 -64387 -71740 -74266 -66055 -68950
233 -68950 -59551 -41834 -21717 25878 59233 54623 47844 45658 69713 104522 83894 27430 -15330
246 -15330 -34693 -17012 -8037 -42486 -74889 -95531 -95427 -56166 -18557 6630 20928 -1558 -11015
259 -11015 29131 83225 123757 104613 28392 -14296 -4323 24579 42115 -20 -66287 -97297
271 -97297 -100278 -68124 -19256 -4388 -12885 -34746 -48310 -1184 69844 103835 91535 37658
283 37658 2907 28153 54289 52284 20887 -35909 -65209 -61592 -56906 -41116 -36324 -51216 -48871
296 -48871 -36637 -7687 36839 46814 34450 34534 43446 70558 81142 41418 189 -18570 -16487
309 -16487 4118 -8334 -52188 -79786 -88513 -61183 -10497 9502 5290 -10531 -27355 3364
321 3364 62169 98687 97851 44576 -15677 -15337 18744 48907 39832 -29522 -90326 -97063 -67951
334 -67951 -16849 9476 -12007 -35950 -48704 -29229 34246 82599 87541 57518 6402 -4662
346 -4662 32122 56029 49770 5992 -50934 -64759 -53073 -40500 -24466 -28379 -39087 -35998 -33840
359 -33840 -9889 31380 47375 47926 38406 27324 43049 51460 32320 15452 -3377 -12311 -11813
372 -11813 -36653 -58100 -54148 -45021 -26610 -15879 -22782 -13551 -602 7776 33467 53640 61734
385 61734 57209 21574 -1142 14733 31939 33204 -212 -56242 -73001 -55005 -31635 -9792
397 -9792 -15248 -32893 -33983 -30228 -1808 48099 69983 60826 27299 -3925 14979 52422 56190
410 56190 28074 -23131 -56591 -45979 -32424 -24782 -19997 -34327 -43595 -40861 -29841 11266 46270
423 46270 43407 28492 13813 22378 54846 57076 32120 8445 -13701 -17543 -18202 -34422 -36390
436 -36390 -33794 -41778 -40527 -36724 -22195 8036 15788 11982 22688 33292 48703 53169 31544
449 31544 23501 25100 15570 3925 -19181 -38526 -33725 -35842 -42721 -38366 -37223 -26382 -12339 -10578
463 -10578 7475 31469 39255 42152 34255 29388 44377 43535 22758 3437 -19101 -24390 -21217 -35041
477 -35041 -42482 -42211 -44645 -34206 -24810 -14607 11154 22681 21420 28432 33832 49240 60488 39919
491 39919 18263 8062 -909 -1774 -16625 -40844 -44403 -45350 -46334 -37715 -33599 -18742 2730 4610
505 4610 10945 26801 38989 53732 50970 35197 34345 26945 10130 -2743 -20465 -25361 -22859 -42984
519 -42984 -58807 -56188 -41593 -12221 1492 -6301 -1435 9521 27061 53439 61303 56300 43098
532 43098 11818 -2291 7966 14515 10254 -24609 -70525 -76043 -51747 -21242 -1552 -15907 -33128
545 -33128 -24436 -3389 34820 67719 65689 47411 21634 6998 27108 43578 30399 -1246
557 -1246 -46269 -65204 -47228 -33097 -26099 -28372 -41998 -34912 -14351 4226 29798 39800 37191
570 37191 41529 40387 40505 42378 23548 6338 -1111 -12261 -17565 -31889 -57018 -59647 -46629 -26617
584 -26617 -3244 -6232 -18852 -12724 6067 42487 73610 64530 37816 9934 -2418 19477 39211
597 39211 26702 -7491 -57239 -80766 -55344 -19984 2643 -4963 -42767 -55228 -26186 21386
609 21386 66757 68161 31329 6624 5637 31212 62170 49989 7622 -33545 -57880 -41242 -12246
622 -12246 -10347 -25929 -52061 -62286 -30051 9287 31622 33103 10879 4512 29026 50903 59875
635 59875 42349 5550 -9192 -6348 -2869 -1689 -22772 -49437 -52649 -44175 -21583 -10 -7520
648 -7520 -18133 -13679 6403 44171 60919 39466 16834 5773 17543 40731 32154 170 -28497
661 -28497 -48889 -40346 -17526 -10861 -14430 -33511 -51369 -31603 7854 39417 46661 17055 -5594
674 -5594 11066 38521 57635 46524 6531 -18488 -23431 -20170 -6100 -6523 -24150 -39785 -52191
687 -52191 -39656 -1709 17306 14359 890 -7158 16640 44203 44864 33399 15583 4973 11519
700 11519 6395 -4448 -10416 -25666 -33924 -31122 -28181 -14744 -10170 -22084 -18554 -627 21312
713 21312 38513 26866 9929 15416 25255 34566 30236 4757 -11396 -17472 -22858 -15133 -12727 -20895
727 -20895 -26372 -36328 -31102 -2685 13969 15592 8641 -1034 15172 38400 38266 27898 10172 -2610
741 -2610 4853 4236 -4894 -11874 -26450 -33023 -27271 -22499 -9212 -2199 -12611 -12585 -401 18333 37516
756 37516 30716 11760 10643 16043 24907 23674 -592 -16649 -18050 -19606 -14310 -15519 -24033 -22810
770 -22810 -23237 -17454 3855 14758 14233 9004 1097 16775 39977 37207 19110 -4515 -15028 1053
784 1053 9032 -2021 -16802 -34289 -36267 -20671 -9811 1821 5085 -10074 -14121 -365 22336
797 22336 46029 36569 6206 -5548 1354 18793 26839 2554 -22552 -29877 -29245 -14451 -4552
810 -4552 -7872 -10913 -20215 -23351 -444 22496 32221 24238 -109 -2847 19955 32511 28139 5201
824 5201 -19475 -17650 -9581 -9565 -7803 -16411 -23709 -21186 -19393 -4538 14083 12107 4220 1227 8311
839 8311 30800 35197 14115 -1116 -5521 4061 14827 -1146 -21283 -28088 -28025 -13736 -1098 -2720
853 -2720 -4288 -13677 -19700 943 27121 40640 31644 -2828 -18563 2387 27635 36901 14208
866 14208 -25760 -39766 -29398 -10141 10363 7031 -13097 -28464 -34436 -10830 28786 41237
878 41237 25677 -3165 -19873 2857 31029 34226 17692 -10326 -25483 -16671 -9915 -4763 -1188
891 -1188 -12179 -20712 -20842 -14366 6018 17541 8629 4320 5359 14218 25194 15050 1613 3141
905 3141 5319 7137 -839 -19749 -22332 -15771 -11943 -3637 -4120 -9529 -7977 -9954 -500 21048 27250
920 27250 20499 4922 -8608 3975 21763 20124 7643 -14106 -26446 -17382 -9728 -3944 152
933 152 -10033 -18583 -16470 -7921 14124 25956 15765 3921 -1054 5387 21337 20811 8165 -1737
947 -1737 -13225 -13278 -8017 -10062 -6593 -8977 -19059 -16458 -7981 1609 13519 8822 1904 7768 11844
962 11844 17104 18300 7239 3955 3129 -3879 -4503 -8160 -13488 -10768 -14193 -16195 -7616 -5833 -3158
977 -3158 1467 518 9297 17114 12740 11815 9679 8425 13811 7798 -2572 -5413 -11182 -11627 -8879 -13598
993 -13598 -12056 -9790 -13473 -6542 1167 5058 11807 8019 5119 12661 15835 15968 13304 811 -1972
1008 -1972 -482 -4371 -6361 -10880 -17191 -14188 -12879 -12668 -2205 -1183 -1225 3665 3626 11919 19691 14137
1024 14137 11158 8154 4429 9263 4115 -6466 -7512 -12804 -13678 -10310 -14034 -13005 -7885 -8739 -1943
1039 -1943 4227 5348 10491 9970 7306 14669 16388 13605 9173 -2882 -5543 -997 -3863 -6505 -12661
1054 -12661 -21333 -16735 -10725 -6736 2280 1607 -818 1990 4061 13784 23481 19145 9814 1782 -3966
1069 -3966 5019 7465 -551 -7473 -18696 -22694 -14155 -9754 -3476 489 -6893 -8707 -2860 5653 20807
1084 20807 23145 11095 5639 2877 7495 15151 7809 -2111 -8338 -16279 -14534 -9595 -9643 -6062 -7885
1099 -7885 -14108 -7292 1610 7846 13461 6896 5485 13146 14850 14679 8861 -1348 -39 1425 -3432
1114 -3432 -5926 -13768 -18788 -13274 -10907 -5212 1860 -3567 -5940 -2999 3333 19142 23986 12138
1128 12138 2997 -1989 3446 15883 12601 666 -10053 -21299 -17554 -6236 -2163 432 -7247
1141 -7247 -18965 -13972 -660 13168 21838 10142 -308 34 4939 16265 19043 7145 -3188
1154 -3188 -9254 -13600 -5245 -1307 -4493 -7327 -15550 -17219 -5027 2535 7215 6712 -1776 2125 10006
1169 10006 12075 14758 8406 1337 2802 2009 -733 -320 -7981 -10667 -9455 -10137 -4530 -1404 -7170
1184 -7170 -6561 -4054 1811 13223 12316 4184 2061 -502 7903 16461 9602 560 -8429 -13499 -5555
1199 -5555 995 50 -2331 -12531 -17480 -7741 1694 10448 10922 -2212 -6521 58 8188 18326 14288
1214 14288 -123 -4433 -5361 -1037 5686 1468 -5128 -9238 -13860 -7608 1152 1922 1628 -3552 -6794
1229 -6794 2375 8775 9291 7844 -210 -782 6104 4958 3071 -808 -6955 -4082 -1818 -3977 -1866
1244 -1866 -4246 -6961 -3057 -2240 1731 6757 1594 -1346 246 2471 10110 9559 -609 -3504 -3756
1259 -3756 -358 5096 20 -5392 -4994 -7062 -3804 1358 341 2688 169 -5957 -1323 4818 7768
1274 7768 8366 -659 -5631 283 2576 3825 1700 -5426 -4208 -2099 -3239 -444 49 -1028 709
1289 709 -2195 -2424 4356 4394 2191 890 -2361 2747 5644 -791 -3104 -3840 -1841 3581 -426 -5318
1305 -5318 -3004 -2310 784 3563 175 1426 2073 -2328 122 4513 4945 4669 -2977 -7572 -1728 2514
1321 2514 3654 -1000 -9884 -6925 800 2577 3686 374 -3982 160 1507 3853 8226 4313 -1437
1336 -1437 -4211 -4981 3765 9493 823 -8398 -12708 -7859 5260 8263 672 -4487 -8346 -3566 6163
1351 6163 8421 8834 4885 -4853 -5596 -7 6321 11600 2372 -10767 -10944 -6103 1918 5149 -3339
1366 -3339 -6964 -4440 -2581 2189 2933 1819 5088 3978 810 3662 3295 2739 1312 -3100 -1112 3846
1382 3846 -1608 -7120 -11088 -8564 3915 7606 132 -5368 -7855 -2868 8827 9775 8546 4541 -3627
1397 -3627 -5320 -508 6075 13588 5821 -11385 -17086 -11793 1842 11252 2238 -8794 -11068 -7807
1411 -7807 2953 9451 8334 7085 344 -6202 -306 6215 11865 8975 -5413 -12916 -5481 1618
1425 1618 4448 -1986 -10773 -7433 -1203 565 2768 857 15 2494 -320 1917 8039 5926 2675
1440 2675 -2829 -5733 4142 6706 -109 -8008 -11182 -5461 4329 2225 -3634 -4475 -4291 519 4087
1455 4087 2638 5232 4377 -1300 -1508 1505 6398 8586 -1676 -9575 -5712 608 5711 743 -9374
1470 -9374 -7856 -957 2451 4093 475 -1597 984 -459 -201 5947 6584 4099 -2249 -8442 -1958
1485 -1958 6713 5241 -991 -8899 -8353 1024 3625 845 -204 -2378 -788 696 -1284 2965 5889
1500 5889 2398 -1011 -3980 -1447 5792 3574 -2763 -4357 -3461 1665 3027 -3249 -3110 -203 1323
1515 1323 877 40 -1924 1745 808 -1629 545 1242 3082 1630 -4939 -3833 1634 2781 2065 -2920
1531 -2920 -5480 667 2855 1404 1083 -872 180 1840 -1689 -342 2224 1118 632 -2747 -3558 1756
1547 1756 2227 -1474 -2637 -2815 1121 4449 -69 -2042 -161 1044 4224 2307 -1846 -177 -16 -1028
1563 -1028 852 -421 64 -185 -4617 -3943 590 2240 3045 -982 -4739 -27 4133 4377 3194 -1350
1579 -1350 -2182 1551 1069 1030 913 -2576 -2572 -2758 -3048 1179 1204 -2143 -2829 -3412 1146 6321 3045 -451
1597 -451 -1285 -805 4205 5338 1094 -670 -2557 -3209 114 204 -319 -498 -4843 -5244 -1195 1191 4161
1614 4161 2285 -3290 -1620 1614 4473 6092 1906 -1252 -160 -506 342 1578 -820 -2001 -3532
1629 -3532 -4918 -1271 536 -659 422 -2882 -622 3352 4038 2470 1889 -667 1691 3965 1852
1644 1852 698 -1413 -3145 -1839 -1174 -1063 -50 -3616 -5062 -2014 -195 3717 4409 -564 -1899 -552
1660 -552 2524 7077 5226 121 -2834 -4523 -1558 2865 1855 -508 -4409 -8032 -3988 1419 3481
1675 3481 3819 -1284 -5084 -1107 3079 6853 6710 724 -2559 -2031 -181 3601 2504 -1877 -4280 -5668
1691 -5668 -4088 918 1504 -265 -1414 -3698 -471 3763 3661 3010 452 -1600 1550 2559 1685 934
1707 934 -2834 -2696 -30 -723 -927 -1641 -3815 -2081 371 809 3094 1317 -1324 206 1402 3707
1723 3707 5289 586 -3158 -2496 -1538 2117 2565 -2028 -3711 -4412 -2980 1184 1673 1185 1059 -2330 -1669
1740 -1669 2228 4012 4989 1816 -3307 -2465 -43 1364 2449 -1197 -4007 -2474 -2487 -363 1809 362
1756 362 403 -647 -1764 1672 3873 2978 1572 -1612 -1751 1968 1343 -270 -1576 -3439 -1419 -48
1772 -48 -1631 -728 -559 -1145 597 444 1000 3201 1328 -193 865 1130 2731 1679 -2680 -2667 -1066
1789 -1066 -547 890 -1909 -3900 -1373 -629 415 1776 605 852 1081 -231 1559 3453 2111 1259
1805 1259 -1959 -2836 567 758 -851 -2633 -4377 -2138 622 -236 -306 -135 -497 1773 1649 1585 3189
1822 3189 1869 252 511 -180 1058 1484 -2361 -3152 -2113 -1686 340 -1376 -3182 -758 9 1162
1838 1162 1899 225 881 2829 1641 2186 2199 764 1007 -985 -2188 -22 -337 -2117 -2950 -4423 -1715
1855 -1715 1266 451 -318 -697 -671 2701 3645 2158 2753 1114 164 949 -34 1096 1289 -2621 -4082 -4039
1873 -4039 -2445 893 682 -2428 -2636 -1815 491 3543 2715 2206 2204 347 1146 2259 2248 2551 -437 -4283
1891 -4283 -3308 -1566 -28 216 -3313 -3934 -1863 -396 1635 2126 420 1679 1930 1687 3353 2990 1542
1908 1542 972 -1366 -1155 530 -924 -2760 -3613 -4451 -1096 470 -1215 -1302 -1933 -193 3704 3723 2408
1925 2408 2340 617 1253 2784 2088 1889 -388 -4299 -4034 -2312 -468 747 -2415 -4855 -2999 -433
1941 -433 2595 3770 1053 779 1478 1725 3958 3962 1922 596 -2261 -3094 -392 -403 -906 -2990 -6071 -3662
1959 -3662 -250 850 1363 -407 -907 2065 3133 3660 4130 2114 811 502 -707 19 839 -1783 -2984
1976 -2984 -4121 -3676 -688 -659 -1649 -1262 -1097 835 3385 2378 3019 2808 1432 2223 1825 631 697 -1393
1994 -1393 -3444 -2682 -2705 -1680 -1382 -3534 -3069 -1050 148 2652 2410 770 1825 2386 2650 3859 1979
2011 1979 586 41 -2120 -1789 -949 -2289 -2506 -3489 -4402 -1676 -79 340 1084 -7 1141 3374 3303
2028 3303 2899 2521 731 1373 1230 -675 -650 -2070 -3370 -2365 -3370 -2383 -682 -1693 -1705 -319 625
2045 625 3239 3715 1844 2015 2231 2523 3344 1099 -840 -1119 -2448 -2742 -2106 -3115 -2287 -1971 -3159 -1570
2063 -1570 199 1244 2906 1902 1362 3231 2993 3139 2735 573 268 -34 -2138 -2347 -2790 -2928 -1960
2080 -1960 -3031 -3227 -1072 -390 850 1695 1170 2595 3564 2592 2772 2651 1735 1748 -541 -2390 -1892 -2004
2098 -2004 -2072 -2412 -3987 -3015 -1052 -1356 334 894 1053 2984 2310 1873 3376 3253 2879 1774 -919 -1047
2116 -1047 -477 -1561 -1703 -2832 -3764 -2468 -2324 -2096 -106 484 985 1395 702 2383 4175 3094 2559
2133 2559 882 -329 734 -67 -1558 -1631 -2914 -3030 -2262 -2611 -1256 -282 -738 -201 388 1435 3842
2150 3842 3221 1767 1539 1402 2222 1985 -228 -1575 -1403 -2702 -2049 -2018 -2587 -1223 -1694 -1804 7 846
2168 846 1574 2563 1165 1096 2601 2322 1968 1016 -478 247 -124 -1846 -1857 -2755 -2067 -1158 -1713 -1384 71
2187 71 -325 498 1405 1705 3256 2746 848 652 476 1014 2303 -389 -2370 -2512 -2482 -1104 -429 -1375 -862
2206 -862 -1075 -1876 2 1607 2634 3317 823 -374 1095 1693 2666 1394 -1358 -2012 -1683 -2012 -896
2223 -896 -700 -1371 -910 -2195 -1562 1123 1839 2188 919 -133 1322 2636 1981 1519 -296 -1046 -187 -930
2241 -930 -1365 -1148 -1889 -1877 -1259 -1601 239 1111 30 113 849 1879 3391 1561 97 230 581 1044 723
2260 723 -1598 -2012 -1399 -2017 -778 -702 -1203 -104 -972 -578 1135 2094 2415 1610 -418 819 1869 1608
2278 1608 1045 -1224 -2089 -784 -792 -1191 -870 -1784 -1584 -670 -842 642 1658 772 702 254 835 2778 1997
2297 1997 529 -213 -894 64 318 -1111 -1481 -1428 -2154 -1156 -853 -652 804 384 -174 792 1331 2139 2249
2316 2249 647 -152 787 450 682 -427 -1659 -1171 -1400 -1564 -1065 -1386 -698 -463 -820 -98 1493 1132
2334 1132 1587 828 220 1649 1644 388 390 -640 -947 3 -1079 -1198 -1060 -1787 -934 -413 -731 798 526
2353 526 -216 655 995 1780 2421 580 -50 482 124 644 274 -1650 -1429 -1477 -1209 -361 -647 -829 -418 -801
2373 -801 220 1444 919 1569 724 117 1343 1522 930 462 -772 -1162 138 -366 -742 -1003 -1807 -1323
2391 -1323 -767 -229 700 452 -446 304 981 1368 1906 729 89 307 114 763 477 -1124 -1153 -1506 -1185
2410 -1185 -283 -522 -901 -736 -797 -32 1065 890 794 656 81 847 1640 864 617 -385 -882 -264 -444 -349
2430 -349 -636 -1594 -1261 -604 -334 509 414 -157 508 450 971 1387 764 214 429 -112 715 631 -848 -894 -1231
2451 -1231 -1340 -505 -198 -609 -420 -678 -419 634 983 1222 985 -55 399 960 871 1191 -54 -876 -903
2470 -903 -819 -419 -48 -1161 -1112 -1005 -912 467 868 342 80 78 525 1730 1461 648 453 -474 -289 290 -182
2491 -182 -84 -819 -1567 -876 -260 -484 473 45 -549 333 778 760 1277 41 52 577 212 1142 135 -948
2511 -948 -945 -764 -536 150 -553 -715 -579 -483 468 1125 570 424 120 87 1072 996 477 -44 -591 -796 -269 -238
2533 -238 -473 -469 -1332 -954 -119 -244 637 271 -35 735 437 1016 988 333 -16 343 -318 -161 -304 -998 -688
2554 -688 -795 -843 -234 -326 -164 369 253 452 1080 438 675 902 261 716 188 -169 -462 -900 -1191 -136
2574 -136 -653 -656 -509 -653 -144 180 187 1143 1001 165 823 686 588 1100 171 -70 -330 -913 -573 -655 -1134 -1022
2596 -1022 -909 -938 -284 318 168 549 439 692 1235 1086 1207 898 270 97 -212 -679 -428 -829 -1292 -873
2616 -873 -896 -766 -127 -605 288 320 457 845 1074 583 1006 823 320 741 -122 -693 -680 -1102 -687 -403 -1142
2637 -1142 -716 -806 -306 491 661 507 547 748 947 1295 923 541 310 -85 -357 -307 -354 -666 -1089 -1310 -1082
2658 -1082 -539 -241 53 -346 -31 905 743 1419 1099 641 795 768 324 211 -232 -401 -675 -1310 -857 -496
2678 -496 -616 -357 -489 -744 97 807 490 1198 904 912 730 336 358 412 -197 -364 -488 -1167 -805 -958 -912 -267
2700 -267 -613 -173 175 -34 168 877 835 760 739 330 692 537 -12 157 -371 -848 -657 -991 -948 -383 -727
2721 -727 -421 -255 -233 386 767 968 1043 348 559 918 487 254 291 19 -459 -323 -878 -532 -509 -411 -284 -71
2743 -71 -352 305 458 175 507 318 244 443 522 409 229 -203 -484 -421 -670 -191 -541 -622 -509 -302 -44 240
2765 240 -9 489 452 303 585 452 310 682 324 -288 149 -312 -277 -13 -589 -651 -470 -630 -66 -94 21
2786 21 10 -117 -149 311 419 632 335 -404 -98 111 -256 -93 -193 -681 -211 -223 -368 -90 8 14 251 -48
2808 -48 218 621 358 450 96 -254 297 455 -19 237 -159 -190 -128 -182 -375 -111 -49 415 188 -90 176 197
2830 197 86 48 227 395 120 -290 -485 152 -31 -151 -326 -489 -380 -4 -195 96 327 -293 389 226
2850 226 275 470 41 258 249 -373 253 350 -128 -384 -522 -518 149 -134 -138 29 49 -186 397 75 509 511 -25 -5
2874 -5 289 176 568 125 -316 -427 -236 -38 111 -280 -177 103 -90 170 312 93 528 313 211 406 264
2895 264 221 246 -330 -215 96 6 -150 -240 -475 93 -226 -241 -3 168 334 341 220 419 364 -73 304 -7 7
2918 7 348 -383 -469 -629 -665 -101 -215 -381 -665 59 58 461 354 192 121 31 60 148 188 256 301 -273 -557 -17
2942 -17 6 36 -356 -806 20 -62 -91 228 -51 59 203 62 336 540 53 224 37 -17 275 170 -637 -166
2964 -166 -764 -225 66 -116 87 -47 -146 -62 189 262 530 -70 297 321 233 -265 183 -229 -278 0 -21 -165
2986 -165 -300 -510 13 31 120 216 -103 -60 233 413 307 467 -86 -131 -169 131 146 255 -84 -361 -335 -35 -186
3009 -186 58 -179 -362 -135 230 151 336 204 398 -229 178 346 11 339 -69 -276 -36 -355 73 119 -158
3030 -158 -181 -268 27 231 317 84 7 188 -244 496 346 -190 49 -417 44 -128 -506 -396 -340 -229 -343 18
3052 18 -79 115 -279 -245 265 143 267 103 -238 -23 312 260 131 -46 -402 -423 -176 -78 309 -172 -220 378
3074 378 -96 500 217 -44 -37 -117 192 501 337 109 -61 -381 -144 301 -59 -283 -192 -564 -86 53 202
3095 202 305 62 -93 221 380 287 187 -197 -153 117 -54 247 -101 -517 -114 121 91 116 -50 -74 168 -213
3117 -213 226 213 114 93 -152 -161 11 -203 -187 2 -223 -350 168 -20 -254 -357 -216 109 124 104 366 201 -6
3140 -6 -77 -157 133 476 -204 -572 -349 -120 -20 -67 -459 -176 127 -36 417 97 22 281 -237 -1 351 137
3162 137 -34 -8 -598 -149 83 -248 216 -149 -279 -16 77 287 276 149 205 136 15 283 44 -211 142 -423
3184 -423 -121 -57 -131 -448 -311 -109 346 -23 -389 -3 266 -66 427 451 -80 -109 -215 -89 -189 161 -85
3205 -85 -138 -558 -77 -96 -186 123 -272 -215 51 -43 151 519 -385 -65 222 209 388 -140 -345 -372 -465 -168 314
3228 314 158 -606 74 -535 -86 435 179 206 -92 219 262 237 -48 138 -42 -390 335 -131 -52 -96 -369 -257
3250 -257 70 -49 256 28 -411 175 69 223 595 -120 -109 239 4 -37 117 -395 52 53 -40 152 138 -284
3272 -284 51 -86 293 303 -77 -72 86 -158 279 136 50 390 -196 -105 121 -254 27 225 -388 80 -206 -193
3294 -193 -78 229 -83 -54 240 163 278 31 182 -179 59 -76 124 -19 -30 40 -461 280 149 34 120 -390
3316 -390 12 27 111 150 117 -273 275 458 155 89 -10 74 81 -166 -563 -89 -9 -289 226 -163 56 73 -240 -25
3340 -25 -40 -40 242 167 -307 -93 -86 259 40 -313 -7 205 -96 238 268 -140 68 -68 -210 181 126 -105 -197
3363 -197 -300 418 121 74 -182 -301 -588 132 16 -59 69 -303 -298 -71 4 189 278 12 -143 170 71 564
3385 564 79 -125 -136 -183 -149 2 -258 -97 210 -205 -56 45 -173 139 335 175 494 -122 109 137 -83
3406 -83 -29 277 -280 -159 -424 -320 201 164 -258 -92 -366 -124 137 466 268 305 -358 68 70 13 568 43
3428 43 -251 -114 -143 -122 313 -431 -626 -212 -272 16 46 -76 352 328 -11 538 124 208 317 47 -392 54
3450 54 -122 -111 90 -356 -334 -285 -491 211 -280 -234 371 -41 210 309 358 329 282 -402 197 234 57 -251 -422
3473 -422 -560 -62 -252 -451 -504 -297 407 364 -170 41 264 350 381 401 227 370 -263 57 257 -151 -37 192
3495 192 -1087 -223 98 -219 172 -129 -337 180 188 336 698 -49 24 411 247 365 595 -19 126 -262 -316
3516 -316 95 -162 -664 -266 -491 -82 385 -104 15 236 237 343 479 -14 395 280 -100 217 -218 -145 6
3537 6 -223 68 -106 -584 136 -91 -339 423 441 124 322 169 264 636 185 285 151 -138 80 -68 -327
3558 -327 99 -22 -283 -241 -362 58 664 -5 -40 -6 -40 435 385 195 331 -76 -66 198 -141 -99 -69 -560 -544
3581 -544 -390 -212 616 314 -337 -191 43 213 593 420 39 208 63 20 118 -154 -179 -432 -518 -22 2 23
3603 23 86 -242 -295 29 256 316 371 49 241 387 36 -93 -38 -148 119 -281 -314 133 -482 -217 -143 14 625
3626 625 211 -215 68 118 489 493 83 -143 -297 -418 -119 87 -236 -200 -328 -350 -44 299 98 240 -366 -317
3648 -317 798 708 567 411 -491 204 34 -122 198 -516 -984 -388 -514 -255 74 -174 -381 166 -109 330
3668 330 868 186 148 188 -84 450 -153 -370 -96 -498 -328 -76 -458 -340 -257 -335 -103 165 50 516 378
3689 378 -50 634 628 80 466 6 67 217 -253 -233 -333 -483 -97 -337 -324 47 -118 120 235 -71 334 601
3711 601 57 248 370 -34 310 148 -171 -564 -409 -235 -43 -474 -201 -40 -418 -81 213 80 154 182 -279
3732 -279 455 295 621 569 -374 -200 28 -408 -194 -204 -605 -375 -242 -256 268 -247 -330 -132 -27 337 357 249
3754 249 282 391 -170 410 45 -195 219 -449 -610 55 -462 -500 -145 -504 -50 271 181 479 323 26 486
3775 486 221 228 546 67 -58 252 17 6 -23 -483 -453 -233 -328 17 -55 -187 303 -107 186 521 228 52
3797 52 207 116 243 247 -23 -313 -307 -285 185 -99 -315 -256 -650 -363 -41 -30 187 282 -162 1 114 248 250 392
3821 392 -356 256 149 -42 286 -401 -401 -89 -475 58 101 -365 299 10 -45 224 57 395 410 16 -97 441
3843 441 -329 38 115 -393 143 -147 -144 -258 -375 -518 38 -186 194 185 -336 54 124 -70 372 77 -184 234
3865 234 -102 -151 160 -202 -39 -122 -774 -115 28 85 -25 -223 -329 254 101 188 328 -135 164 74 -284 147
3887 147 -79 -380 112 -254 -308 291 23 -248 150 -16 205 207 2 104 -50 75 128 -3 -413 -39 -267
3908 -267 164 180 -243 -320 2 -98 272 449 24 346 -265 123 384 220 -71 -16 -324 -10 -103 -255 -226 -182
3930 -182 -434 -63 161 25 97 -92 157 517 324 286 169 -215 -238 59 50 463 -7 -590 -136 -71 -28 264
3952 264 -196 -96 23 57 250 353 -91 82 36 40 539 214 -189 152 -208 -244 -95 -279 -177 -248 -385 120
3974 120 84 -68 166 47 -251 260 154 412 248 -131 141 139 -319 261 -122 -614 -180 -159 -236 178 -210 -110
3996 -110 88 -302 207 611 202 107 168 -289 347 158 358 -74 -213 -357 48 -33 -2 -94 -692 -137 -318 -188
4018 -188 572 156 88 288 140 276 561 113 43 278 -231 107 266 -379 -113 -328 -444 76 -273 36 342
4039 342 -347 322 381 109 346 287 99 348 177 135 195 -142 -155 3 -295 -121 -17 -645 -261 -14 -130 199
4061 199 -82 -165 245 187 293 602 226 244 255 -60 217 315 -303 -167 -432 -352 -239 -255 -219 -469 -234 -178 188
4084 188 83 119 266 161 460 275 4 361 -61 -256 231 -140 -118 -184 -441 -753 -166 -385 23 -190 2
4105 2 417 185 334 858 88 108 625 -43 347 258 -325 -168 101 -234 171 -82 -576 196 -426 -186 618
4126 618 107 41 382 -298 340 354 237 356 -329 -277 15 11 -89 203 -610 -605 275 -354 -48 97 -555 161
4148 161 -161 284 297 53 120 309 -109 4 431 38 337 36 -292 -83 291 -242 52 -316 -408 328 -66
4169 -66 -139 553 -250 46 151 122 259 -91 -300 59 -102 28 431 -121 -280 -243 -221 -2 181 -490 -128 101
4191 101 147 48 222 -394 151 -25 -136 444 -206 -250 -219 -479 137 286 24 117 -261 -478 151 270 355 239
4213 239 -416 -567 233 66 268 -171 -41 169 31 261 551 -67 -251 -24 -182 186 328 -368 -221 -52
4233 -52 -401 211 228 -363 158 -309 -260 297 -155 215 370 -24 -122 361 180 408 236 -45 286 -16 -45 247
4255 247 -245 -114 168 -438 -124 28 -437 130 -117 -156 349 177 -119 170 48 101 466 -249 -94 85 15
4276 15 176 273 -159 -2 -243 -303 213 -499 339 -29 -278 -183 284 -162 383 338 -272 369 166 233 423 -152
4298 -152 -168 -290 -381 -77 141 -357 -117 -11 -121 518 380 240 -4 -272 177 464 117 272 105 -242 104
4319 104 98 -98 127 -598 -512 -12 -295 -233 440 -245 70 630 -174 509 457 -118 557 298 67 -2 9 -380
4341 -380 -78 -242 127 53 -795 -326 -98 -298 456 -19 -96 268 43 93 833 199 -39 241 -165 -103 259
4362 259 -144 -32 -457 -755 30 -314 -114 104 -389 -453 308 66 650 233 -170 341 -226 -202 427 -100 79
4383 79 70 -113 -101 161 -314 81 114 -517 -77 18 -174 506 233 -161 275 78 193 -41 -62 -105 -260 -365 11
4406 11 83 -340 74 -132 -161 15 -420 27 366 -259 196 28 47 -44 179 -5 355 -87 -212 -283 -278 -104 202
4429 202 -179 -152 57 -524 229 -40 -90 96 -189 -137 419 35 -165 169 -275 -285 150 -38 358 -17 -10 273
4451 273 126 192 494 -11 -78 349 -35 35 139 -400 178 -96 -257 114 -122 -292 169 -173 -10 437 -263
4472 -263 232 563 -129 375 315 -354 122 23 -304 243 -86 -256 -119 -462 -135 132 47 168 -140 -232 341
4493 341 140 -32 191 153 47 367 66 47 156 -381 -298 88 -155 -312 -376 -140 -102 146 66 353 -68 -33
4515 -33 405 252 177 231 -195 238 -58 -205 113 -425 -306 -160 -245 -389 94 -468 -188 -93 -171 666 144 -180
4537 -180 760 279 50 419 4 -149 222 -417 -32 -21 -468 -98 -251 -642 239 53 -121 416 -118 -230
4557 -230 345 1 172 412 2 29 117 -176 338 -415 -281 -79 -516 -402 -83 78 -181 360 -89 185 291
4578 291 89 531 26 423 366 682 71 15 -508 -10 69 -369 -199 335 -287 -424 -122 106 286 267 -40
4599 -40 569 56 429 -268 -172 386 -208 -189 21 124 -305 48 -394 -227 331 -254 31 134 -317 133 329
4620 329 19 360 115 -103 291 -26 -139 83 -482 -301 198 -161 131 157 -426 -237 -162 88 380 -253 -343
4641 -343 365 -15 5 176 -50 154 -3 -415 235 -175 -518 306 -317 243 260 108 -298 90 -97 57 144
4662 144 -329 86 -81 -239 211 50 46 99 -75 -11 297 -126 -196 350 -372 90 63 -430 321 -347 -247 225
4684 225 -141 -116 330 -170 -50 108 -273 46 85 23 4 212 -438 37 -389 -144 275 519 364 93 -51
4705 -51 302 314 -680 -39 -341 -257 307 328 -92 229 -516 165 426 -290 -20 36 -223 121 14 28 -78 -389
4727 -389 -437 113 -162 -103 -171 -526 170 188 -179 264 108 -75 174 148 191 446 162 -182 -22 -67 -141 -202 -207 4
4751 4 -294 -198 56 -73 -68 270 154 241 487 23 239 81 229 356 470 -184 -324 42 -83 160 -127 -297
4773 -297 -164 -587 -302 162 56 195 -65 4 42 216 336 257 252 -354 62 -223 -170 94 -343 -191 -454 -380
4795 -380 -156 -63 -74 18 -86 143 298 -9 199 354 -110 268 264 -69 247 200 -409 -80 -148 -352 -124 -427
4817 -427 -6 174 -474 99 146 229 349 47 15 253 -54 117 77 -107 27 114 97 -203 -221 -61 188 72
4839 72 -284 161 -15 -274 191 194 62 130 -80 602 283 7 163 -9 -415 28 -179 -29 7 -440 -390 -150
4861 -150 -371 120 315 -248 -190 -43 -146 491 397 312 473 -54 101 402 -13 -88 142 -394 -113 -71 -360 229
4883 229 -58 -236 -70 -166 105 256 -52 210 356 -87 282 -47 -205 378 -121 -331 170 -538 -434 -93
4903 -93 -294 34 -40 -140 -226 117 -119 478 189 -32 331 -130 215 550 -92 36 47 -124 -89 -257 -338 -109
4925 -109 -566 -470 280 -61 16 282 -352 143 207 -117 396 442 -125 100 159 10 386 43 -604 -63 -441 -366
4947 -366 239 -262 183 170 -147 189 72 -94 496 -18 -157 287 -196 96 -22 -271 9 -50 -430 -42 71
4968 71 -391 248 -28 -254 258 167 234 383 -81 348 339 -131 72 -194 -404 -13 -177 -238 -72 -62 -134 129 -287
4991 -287 -115 38 -262 161 314 -177 228 -162 -77 -15 78 -262 116 -189 -129 16 -229 400 307 54 76 -11
5013 -11 13 220 241 129 117 -371 -204 145 -447 52 -33 -405 -139 -20 87 38 -257 -119 135 83 284 306 -58
5036 -58 291 148 -72 240 -94 -268 156 -348 -19 4 -345 232 186 -206 111 131 49 517 193 -40 388 10
5058 10 -8 196 -391 -58 -4 -678 -256 17 -261 202 -38 -270 258 -56 490 569 234 171 610 53 262 -106
5080 -106 -183 225 63 -398 -65 -161 -483 193 -83 -108 -182 -198 107 296 54 326 241 -115 117 -150 147 183
5102 183 -355 -332 -115 -615 -180 -95 -324 -7 -125 83 305 184 137 493 1 313 461 128 -188 119 -531
5123 -531 -118 -55 -200 -263 -585 -92 13 -279 54 34 -261 124 388 31 320 352 -44 126 236 76 439
5144 439 2 -145 -15 -294 -337 -177 -467 -181 63 7 379 47 -102 292 -135 -96 254 -45 116 157 -215
5165 -215 -63 -173 -678 -36 -133 -123 -22 -195 -19 395 -235 -81 340 216 497 78 -201 382 -342 -73 311
5186 311 -65 -208 77 -390 -146 277 -352 47 -87 -405 -62 -65 170 415 161 -62 197 85 398 32 16
5207 16 -73 -223 -452 -208 -43 -274 -32 -94 -60 408 -219 142 50 -24 280 74 -180 35 -86 -13 257 25
5229 25 -339 111 -271 -195 143 -241 -5 26 -243 301 75 67 -86 -231 -24 226 35 -187 286 -312 19 146
5251 146 -185 312 447 -342 62 284 -114 307 -275 -332 34 -221 168 83 -340 -63 -6 -65 187 -53 33 287
5273 287 -67 96 292 17 213 260 -543 431 -275 -53 919 -83 -226 -173 -473 -106 174 51 -274 143
5293 143 -168 191 360 74 494 73 243 375 115 -136 188 -319 2 62 -613 42 224 -485 309 70
5313 70 144 217 21 202 398 280 528 347 -185 -85 84 21 -331 -519 -295 -155 -476 36 250 -89 -233
5334 -233 -243 -78 600 223 137 151 240 -172 754 112 268 206 163 164 -201 550 -520 -6 -411 -75 44 -62
5356 -62 -279 322 -166 192 94 123 275 283 50 305 -274 -125 -67 -248 190 -547 -574 84 -218 -270 192 -127 -21
5379 -21 342 -209 146 447 -67 485 125 79 15 -339 -8 158 -122 -195 -42 -290 -38 16 -171 -142 -60 -200
5401 -200 382 -92 344 370 -60 -145 98 -112 264 158 13 200 -181 -109 -117 -404 -108 -22 -97 -158 366 -190 204
5424 204 43 -162 261 -175 121 525 153 -41 388 -239 -100 21 -73 90 153 -263 195 6 -171 32 -207
5445 -207 -272 292 142 -180 375 -114 447 233 -52 383 160 -150 251 -144 -280 155 -191 -102 243 -176 103
5466 103 271 -34 326 125 50 275 217 -250 264 86 -118 -90 -196 153 -98 -117 209 289 -86 150 -81 88
5488 88 215 39 31 154 -111 108 347 110 19 -99 -141 318 -107 85 114 -86 -327 -18 -318 160 93 -299
5510 -299 71 -39 -454 52 40 -162 345 -10 37 16 -119 121 84 -452 255 94 -116 -86 -80 -270 -10 -82 -127
5533 -127 167 -337 -224 -120 -425 -261 -17 -42 191 52 258 416 -189 181 212 -274 -106 -44 -201 -38 -156
5554 -156 -450 227 -80 -242 178 -147 -186 369 105 137 283 -116 310 155 -93 467 -46 -400 -8 -181 -311
5575 -311 -91 -323 -33 -204 -384 25 89 -195 187 163 -291 438 523 134 382 -229 -218 146 -79 252 -196
5596 -196 -366 -55 -115 42 48 -369 25 -19 17 -119 184 130 172 111 16 433 -258 -231 81 -51 -18 26 -181 -273
5620 -273 149 -431 -10 -161 -148 223 -19 -200 360 157 -58 171 -175 36 456 -324 -199 -6 -163 -121 -193
5641 -193 -62 -26 -85 -171 293 -11 -72 473 -89 31 469 -14 187 153 -61 -15 -282 -162 2 -257 20 -173
5663 -173 -631 30 194 -286 -65 140 -292 23 38 -51 342 133 -80 292 -82 409 68 -248 -107 -139 -388
5684 -388 -39 11 -394 383 -238 136 64 49 210 -53 -18 199 134 145 260 165 -150 270 30 -65 213 -253 -287
5707 -287 340 -130 79 40 -587 -21 177 125 283 -199 -36 152 96 -32 179 -28 -150 200 -146 185 148
5728 148 -119 -265 -53 -194 211 232 -19 -103 3 -95 197 -160 322 -30 134 199 77 71 242 -136 -162 308
5750 308 -148 -66 387 -160 -71 0 -630 392 -73 64 94 -170 65 317 210 198 373 -23 148 467 21
5771 21 -25 -247 -258 -99 -21 -460 49 -433 -224 212 -298 285 24 -314 -24 -70 155 209 48 -56 -95 -145 165
5794 165 140 -439 -133 26 -274 173 -22 32 233 -136 -5 350 291 20 38 -349 -133 404 -88 204 -11
5815 -11 -305 107 -133 -171 211 -73 -176 -22 -414 289 99 -171 246 -39 217 72 -50 -209 230 91 -9
5836 -9 -50 -203 -251 133 -287 107 -30 -330 6 -247 -381 300 -312 17 218 -327 49 221 12 297 23
5857 23 -171 148 -25 -315 201 -420 -533 42 -63 -145 -81 -445 -44 -77 65 564 17 -351 270 -311 56
5878 56 283 69 43 76 51 -155 176 219 34 -360 -170 309 -83 46 136 -385 -8 -7 66 380 429 -1 127
5901 127 -51 292 190 159 -255 -95 -244 49 283 -197 -134 -231 -695 237 176 -153 376 -145 12 267 -87
5922 -87 138 25 -118 184 272 -392 102 148 -439 196 -82 -244 -35 -192 -225 68 -15 469 71 13 212 312
5944 312 219 -9 89 38 311 -86 -156 121 -72 -234 -397 35 29 -52 74 192 -560 -175 227 235 -12 193 -102
5967 -102 56 -63 -335 -11 -232 73 9 -193 82 37 -182 146 241 60 235 352 -57 206 44 -335 174
5988 174 289 -259 187 58 -206 185 -120 -352 -274 -232 -48 -192 -238 98 197 -187 244 73 -46 343 51
6009 51 -161 175 -230 57 100 -62 54 -21 -158 163 -274 51 227 -124 61 204 190 163 -36 -127 116 84
6031 84 -138 330 269 25 337 -427 265 295 -329 50 114 -115 5 -191 -65 184 10 128 56 14 29 89 -172
6054 -172 302 258 -138 103 112 297 302 86 35 113 -87 -135 69 -609 19 -9 14 78 183 66 36 -405 17 429
6078 429 186 235 201 -279 -20 123 -162 -140 -170 -199 311 61 -345 38 -54 14 186 -9 134 153 175 130 138 -180
6102 -180 260 146 2 145 -76 -55 -191 -333 -159 82 -312 -34 -258 -224 18 99 -201 490 -189 245 90
6123 90 29 405 342 -3 38 -90 -213 137 -109 -216 -63 -33 -69 88 -323 41 201 128 194 210 -292 286 -318
6146 -318 -192 405 20 -102 140 -178 -23 21 -338 -167 -222 -309 111 198 50 413 -172 2 311 122 28 105
6168 105 -205 64 -212 39 -32 -288 -59 202 66 -405 270 -177 -37 34 -15 190 215 -159 43 -191 -73
6189 -73 221 -78 -291 -165 -332 -87 50 -301 -108 -198 -246 151 -171 -237 -15 -62 -110 83 44 -231 97 96 78
6212 78 -45 -356 193 44 -148 303 -328 -113 84 -107 -60 283 -195 45 259 -325 135 -253 -274 226 44
6233 44 23 342 -238 -136 42 24 41 459 -274 -250 18 -16 131 36 -340 -163 -90 -75 42 -136 -149 -189 -478 173
6257 173 291 -140 62 68 -174 -10 101 -98 143 -223 40 21 81 163 -15 -130 246 -135 -136 248 -55 -13 234
6280 234 143 331 291 60 19 155 31 55 -78 -143 18 -225 51 -123 -7 8 -249 -468 -35 351 -2 225
6302 225 65 81 345 17 52 106 -33 61 -34 -265 263 90 -222 19 -8 -179 462 183 -35 206 -57 98
6324 98 291 -200 195 64 -281 -177 -57 -84 5 -361 -154 312 -71 -45 84 -59 107 227 43 218 217 -82
6346 -82 139 132 208 80 -43 -159 -205 -93 76 -86 -204 -133 77 -185 -15 -2 -115 -86 -176 247 279 60 33 -72
6370 -72 -138 236 202 -261 98 -327 -202 41 11 -26 240 -744 -12 207 -108 84 116 -289 40 109 -5 277
6392 277 121 -40 -12 133 19 31 -81 -166 126 -456 226 -164 -51 80 -14 121 295 -125 13 239 -207
6413 -207 -29 200 299 25 -163 -278 -59 -143 -372 71 -388 -127 159 -327 51 -78 -276 141 515 -64 264
6434 264 218 96 126 -55 98 350 -57 -83 -131 -253 -81 167 -63 -168 -152 98 190 50 179 151 133 259 -17
6457 -17 131 -35 16 -302 9 -86 6 212 -224 -39 -283 -231 83 145 -356 68 -115 191 199 199 35 -98 -124 35
6481 35 125 -165 -19 -108 -340 -44 130 30 19 -3 -163 -25 15 9 378 -174 22 256 231 48 84 -213 169
6504 169 1 153 280 -14 -127 121 -174 -154 -10 -166 13 -138 -103 70 365 -225 -26 -285 -309 238 199
6525 199 -90 181 -182 -147 86 -252 137 206 -311 133 29 130 15 -249 90 -122 -126 -24 211 -201 -143 229
6547 229 159 267 -85 -174 28 -84 -26 333 -17 2 115 90 96 2 -78 102 -180 -121 193 -376 274 130 -148
6570 -148 314 149 -63 200 54 -153 105 -102 -74 52 -167 120 -292 -43 431 -35 -235 361 -6 -8 149
6591 149 -700 179 394 -179 115 413 103 -330 16 -211 120 96 -135 184 -279 -189 261 -166 124 129 71 41
6613 41 171 186 550 -17 -216 38 -105 -161 284 146 -89 159 -168 -2 -140 43 199 -21 12 301 -28
6634 -28 65 143 90 -334 118 144 124 113 -205 -82 0 48 21 -143 -7 150 242 328 74 -72 95 111 -331 50
6658 50 49 -119 75 81 -136 310 -57 -303 -237 -89 129 87 -336 131 -102 142 156 98 207 167 80 -125 226 63
6682 63 140 -27 97 -222 77 -418 -156 -245 -340 119 -256 -49 -120 -7 76 304 110 -2 362 143 258 -182
6704 -182 -59 5 -197 -223 -63 144 165 179 -135 148 -258 -210 164 2 -173 -128 -232 -172 348 -74 253 59
6726 59 -123 5 364 -45 167 128 -307 23 155 173 48 62 -210 39 19 177 321 -34 -205 -20 -51 560
6748 560 47 -59 -159 -49 35 -67 -280 29 -160 -62 183 102 -202 12 -239 19 -7 -64 -220 151 -28 103
6770 103 64 -1 206 230 -121 345 232 192 169 -83 69 -203 -360 -176 221 -101 28 -173 -151 18 81 -173
6792 -173 -156 -41 -170 206 -122 127 340 -296 -207 59 -241 -44 90 31 115 84 -253 16 -152 -41 183 -22
6814 -22 -70 332 -282 122 117 -70 -58 171 -71 299 3 -56 93 -78 45 56 187 71 -118 -251 3 -47 25
6837 25 96 104 -149 314 -13 -54 287 -108 -274 -160 280 -11 -260 -49 195 -190 -340 256 -86 -12 363 262
6859 262 -140 -60 122 315 38 -233 -96 109 -359 -71 -106 111 -58 -307 -224 -25 -90 -135 101 216 180 -204
6881 -204 170 62 -156 31 91 -125 -101 -196 -324 136 157 -300 125 -71 -243 84 143 323 16 77 247 210
6903 210 182 327 258 93 119 349 -50 190 52 15 194 -173 49 59 -59 -151 -56 216 -155 4 45 208 57
6926 57 -32 76 265 -26 86 -166 305 43 -344 89 1 -13 69 86 -242 180 133 27 429 -79 -110 31 -24
6949 -24 -81 147 73 380 63 55 241 30 60 66 248 -249 370 65 105 98 188 225 -33 -87 440 101 45 56 79 -80
6975 -80 59 -378 78 133 -284 46 -343 -477 57 -266 12 173 -140 402 13 -138 -43 243 40 -87 -76
6996 -76 -198 146 -283 0 128 -18 -168 287 73 39 286 143 78 -282 150 -359 -150 211 -9 -113 -178
7017 -178 52 128 1 -207 -184 114 -63 89 146 -124 80 210 -140 -63 194 28 -122 167 155 243 2 -44
7039 -44 220 -6 120 183 -80 53 0 -218 -97 22 91 82 36 -201 70 -164 92 42 -51 204 111 38 131 32
7063 32 -236 146 -79 12 79 -254 17 187 -353 82 82 -196 154 -250 -285 122 78 -179 102 -237 148 510
7085 510 105 222 -116 -89 75 167 36 231 -141 -479 28 16 -169 47 -76 -167 25 -316 295 46 -348
7106 -348 129 155 -67 124 22 115 278 -136 -18 -47 -20 -2 -135 -78 37 -388 -291 -23 -154 -275 96 -124
7128 -124 -22 336 -25 -150 -293 -143 -28 -64 -292 -147 -147 57 122 -162 -93 84 83 -76 169 30 232 7
7150 7 15 243 36 -261 -82 -29 26 12 -256 51 95 134 -105 -173 -23 134 -31 -178 -232 259 210 118 -106 260
7174 260 124 -152 -22 296 -122 32 -168 -102 -41 -248 49 -103 -73 -261 -44 -281 206 -73 355 319 -112
7195 -112 -255 90 4 206 318 -146 185 171 -240 -144 -219 25 94 -32 -250 257 -130 -23 -5 -90 -208 77
7217 77 -173 148 42 -138 346 41 -203 16 48 37 -115 15 -193 -254 122 -88 288 260 39 31 52 -25 -41
7240 -41 -138 -56 -162 -209 133 11 -49 235 -118 94 -137 -169 -98 60 337 -127 20 57 -29 50 -29 11 99 209
7264 209 71 301 -57 243 -68 77 -137 -187 230 -192 -30 51 -97 -142 70 -127 274 105 -88 -105 160
7285 160 -22 7 -257 39 71 0 267 130 -290 146 -347 -231 117 10 -120 -57 -249 302 -5 51 176 -51
7307 -51 -22 -67 42 -107 171 28 2 -98 -38 107 185 -48 67 -184 -122 169 252 -278 59 12 -170 -50 -134
7330 -134 -17 481 13 28 89 -194 264 39 -16 -208 -68 -38 157 -281 -286 -8 -125 343 111 113 98 75 -228
7353 -228 129 -90 -152 -38 -193 -125 234 -72 -40 -180 -10 21 0 -131 0 33 -104 128 -113 20 347 184
7375 184 62 -23 28 163 213 -23 152 37 -276 118 0 114 332 120 -130 146 169 116 -32 -9 214 223 143
7398 143 166 47 -184 45 -297 168 -118 18 65 -124 -183 388 6 129 -106 53 280 225 100 -69 29 245
7420 245 77 -93 -91 -201 -299 -271 -51 8 -166 114 -327 -52 -6 -27 -170 128 197 142 -60 -38 15 -70 -132 99
7444 99 -31 -202 -89 168 -304 -13 81 -106 -214 -56 14 -39 -198 26 277 144 59 66 143 21 -38 -77 -229
7467 -229 179 -7 228 188 17 -113 -10 162 -234 -237 -113 89 36 -113 274 159 120 53 131 -260 -131 65
7489 65 7 -153 -189 -11 -217 -150 -3 102 -66 -5 118 1 88 -84 38 43 68 -46 -112 -153 -73 240 -129 -100
7513 -100 133 35 -177 192 -99 79 -208 -175 -63 164 -227 -25 162 194 357 -4 -195 -98 38 -97 -27 -158
7535 -158 158 -88 -278 282 133 -281 -84 100 -25 -66 -291 -117 32 -68 -134 -75 -40 -14 67 260 221 174 -11
7558 -11 -85 -50 -283 -71 -87 217 -100 127 254 84 81 -100 -140 129 23 -79 243 105 240 -77 -131 8 -114
7581 -114 138 125 107 -83 -98 3 -266 -123 132 -118 -301 8 -156 22 177 65 -66 151 -78 -103 -203
7602 -203 -49 -7 -159 258 16 -58 -139 -50 -163 3 -68 -89 310 -276 -117 185 -222 230 118 24 -126 -5
7624 -5 321 74 19 -75 130 -203 31 -173 132 -188 -149 -132 -120 -26 50 22 85 44 -78 -11 -162 151 -214 16
7648 16 -162 60 -69 86 -103 -37 -249 -6 152 -136 -62 -27 302 2 86 313 121 -125 -95 99 260 181
7670 181 88 62 -163 -306 -71 -111 367 -308 -156 -57 -15 -11 27 -124 -97 -106 51 6 115 -3 19 -229 155 -77
7694 -77 12 60 -144 -48 10 177 78 -209 -156 -120 61 70 -32 -65 -200 140 115 124 -201 -144 46 21 -320 37 -111
7719 -111 97 88 -37 297 288 -42 -51 38 210 189 154 -160 -69 -13 -94 -93 -62 -11 55 -144 62 -143 -16 -75 235 -191
7745 -191 76 274 247 76 13 -173 -44 -81 110 375 -456 -204 134 104 22 201 -60 202 -179 -73 379 110
7767 110 -299 -149 -132 -27 17 -117 -13 103 -224 3 10 -84 105 -252 3 -53 50 -209 -41 -166 242 201
7789 201 -89 296 58 220 -236 -159 -184 129 44 29 99 185 -15 -43 36 -63 261 -239 -166 31 -113 85 143 -128
7813 -128 -249 -96 -389 186 -184 82 59 10 59 -66 10 219 188 15 -65 -293 -14 40 -223 -78 -47 91 -137
7836 -137 27 127 84 -95 175 123 95 -439 -100 175 -290 188 -52 -170 -195 -37 76 218 -37 -193 94
7857 94 28 2 233 -101 315 69 165 -207 -130 -17 -116 -24 142 100 319 -252 -198 253 97 -52 107 177 -156
7880 -156 -16 103 45 65 -67 -431 -63 132 175 -106 -162 -148 -163 -379 -68 -66 -185 -21 -25 -273 41 -106 20
7903 20 -179 -37 262 133 -194 262 -68 -243 126 341 74 210 87 -78 -61 -57 74 -117 -140 -163 148 -218
7925 -218 -17 161 -259 -15 21 -63 157 -200 106 82 -115 -156 -128 -423 -45 -136 -148 -180 -268 -495 -303 -154 95
7948 95 -41 -130 116 44 35 75 188 294 19 -71 -12 57 -95 98 135 111 -33 27 -81 108 -68 -98 91 22 -39
7973 -39 -169 -57 12 -244 38 26 168 -200 -120 175 -333 -50 4 -50 -191 -99 169 165 -103 -120 196 -30 211
7996 211 56 -154 -192 -9 -32 209 100 43 -189 110 -209 -383 -220 -20 -132 -295 73 -129 135 -51 328
8017 328 13 -79 -19 -17 120 16 296 -73 189 -182 277 -213 56 -81 -195 17 13 107 -33 -140 136 -49
8039 -49 125 -34 212 -174 253 -86 -186 75 -195 -36 39 -126 -330 -107 119 -227 46 -166 -11 72 103
8060 103 -118 -74 -11 84 -54 235 109 123 194 -118 118 -217 -136 -53 -2 34 -49 0 -156 -20 85 7 311 47
8084 47 -47 -15 -158 -70 238 77 20 25 146 -53 12 -266 164 136 194 98 273 -12 -70 116 -48 -242 -80 -81 -48
8109 -48 45 -21 -38 5 -12 -46 276 -101 -58 18 167 -15 -35 -60 97 -110 39 -30 154 8 157 217 36 -1 117
8134 117 71 64 36 78 -60 156 46 -156 -72 -6 -3 38 -9 -139 -124 49 -151 -171 161 -88 -83 162 26 -8 -39 174
8160 174 62 -26 -39 191 -171 -123 -293 131 -109 -16 -213 107 81 -23 91 121 -152 84 19 -140 -137 -306 -290
8183 -290 -182 -48 158 35 -326 -251 115 -111
8191a11
$$ Imaginary data points
##PAGE= N=2
##DATA TABLE= (X++(I..I)), XYDATA
0 0 0 0 0 0 0 0 0 0 0 -3 8 -8 8 -16 16 -23 24 -32 33 -41 49 -64 72 -88 104 -120 137 -161 185 -209 241 -273
32 -273 313 -354 399 -450 504 -568 632 -706 785 -873 969 -1073 1187 -1310 1446 -1594 1758
49 1758 -1935 2134 -2351 2592 -2860 3160 -3498 3885 -4328 4846 -5455 6186 -7088 8225
63 8225 -9715 11760 -14752 19582 -28687 52024 -248986 -433889 -55956 23189 -13703 -165133
75 -165133 -124853 26676 214332 321542 366735 281486 174863 67772 66465 144956 151006
86 151006 -17424 -213936 -321701 -258343 -158630 -163654 -220447 -205208 -119453 4003 64422
97 64422 84004 144061 210621 232123 231312 202469 178175 132628 26818 -57856 -71195 -74639 -113130
110 -113130 -220603 -310818 -261691 -135225 -45587 -23848 -52066 -29164 71491 161602 220203
121 220203 239116 203429 152299 88808 42270 60160 61930 -18718 -142112 -245323 -237176 -138988
133 -138988 -88983 -106831 -135283 -119829 -22110 80869 125628 150787 153617 138712 134257 123430
145 123430 126145 123958 45799 -64348 -129444 -131447 -85310 -86497 -158249 -192868 -153123 -70040
157 -70040 10353 29303 34516 74370 105310 125490 141482 141170 139116 97934 17585 -21846 -24775
170 -24775 -35947 -71462 -138026 -165142 -117861 -79198 -72891 -72770 -52691 19473 83452 87765 85599
183 85599 92923 103605 116873 95280 63675 47812 2219 -55080 -85701 -90784 -66920 -67627 -115797
196 -115797 -130709 -89605 -23359 35167 36657 21651 48294 81225 105849 113638 88176 67495
208 67495 44103 2115 -15539 -22376 -42890 -66707 -105539 -120235 -79141 -42065 -30455 -30779 -32031
221 -32031 11392 70335 86988 82540 68378 58546 73158 66036 35629 12786 -21972 -51069 -61456
234 -61456 -72463 -64738 -56868 -76380 -77674 -49431 -5050 45671 48969 22194 29673 59954 96104
247 96104 106700 61329 13784 -6011 -16558 -7796 -9952 -40417 -68964 -101077 -107728 -55927 -267
260 -267 21901 6386 -32903 -20599 50199 104440 116334 74188 13849 1613 15988 28801
272 28801 35261 -710 -58602 -95551 -105979 -64261 -6626 -1353 -29963 -56721 -45302 24828
284 24828 81929 83981 61889 31284 26030 48871 50735 36918 13689 -29623 -53569 -55333 -52281
297 -52281 -37732 -44291 -66681 -54888 -23845 12869 38029 21470 10449 36020 65582 87818
309 87818 72129 19722 -7455 -8249 1534 15062 -9259 -57892 -86224 -93289 -58225 -896 16874
322 16874 1525 -28626 -41790 9909 79933 105941 84901 22672 -19725 1953 36252 51223
334 51223 29309 -35754 -83412 -88771 -66043 -17105 7500 -14614 -43372 -56131 -24223 47018
346 47018 83759 71541 39018 7368 17092 45776 47063 33860 3890 -34947 -49124 -54240 -48335
359 -48335 -26251 -27824 -41722 -41303 -31162 2050 32928 30822 31732 40677 46269 54336 37937 13797
373 13797 15376 13655 2534 -13773 -44338 -55900 -48953 -48575 -33358 -15705 -13055 -10227 -16372 -7937
387 -7937 38298 71937 69070 41501 3225 3250 34078 41277 26958 -9271 -51257 -61819 -55728
400 -55728 -39821 -9774 -7692 -31484 -46409 -41135 6690 63076 67933 40631 12461 5723 35937
413 35937 54846 41144 20405 -13297 -40809 -43578 -40965 -25016 -13406 -35761 -55071 -47973 -19735
426 -19735 25023 39530 22610 20372 27529 39476 51566 38609 26336 21314 -681 -17922 -25589
439 -25589 -31609 -26311 -34917 -54159 -46057 -28072 -12368 586 -2639 7032 34550 43451 42805 38008
453 38008 29305 37280 34581 12114 -752 -14859 -27701 -32021 -45415 -47189 -32608 -31933 -31828 -24582
467 -24582 -13043 17890 37246 30558 30328 33113 40148 51104 36739 16340 7713 -8279 -18632
480 -18632 -25493 -38435 -37261 -38782 -51009 -43629 -27271 -7604 14226 12447 10993 30367 45034
493 45034 54720 51401 30705 24338 20903 3748 -7116 -20917 -33716 -35003 -48241 -55795 -41140
506 -41140 -28496 -15383 -5405 -4585 13835 34015 36714 42858 45490 45473 47267 24841 -1717 -5312
520 -5312 -6797 -9554 -24014 -55515 -64423 -51708 -37210 -14922 -4584 -6516 155 3204 18540
533 18540 55268 71996 62982 33728 -1394 1522 25389 27278 6881 -36418 -72700 -66811 -46027
546 -46027 -24340 -8137 -19877 -33595 -27727 -6386 38246 71105 61362 37890 17214 16085 40180
559 40180 44572 20971 -7426 -39349 -50038 -40603 -39137 -34893 -34016 -40843 -29949 -11780 3499
572 3499 24198 29631 31110 46098 50608 46672 36459 12079 3681 8467 2179 -9800 -37187 -66668
586 -66668 -63726 -43012 -18072 1254 -11163 -28334 -21121 4491 48782 78551 62411 29310
598 29310 1843 -1258 31063 49788 29436 -13231 -64330 -78280 -44798 -11588 978 -17342
610 -17342 -54124 -54816 -17071 29170 64363 55038 20039 6372 14931 42098 64439 41956 -652
623 -652 -34220 -47460 -26310 -6407 -17105 -38742 -60081 -55733 -15690 14788 21185 14762 1343
636 1343 12887 42236 53988 50902 30508 3001 74 5208 4235 -1943 -30586 -56320 -52461 -34034
650 -34034 -9024 -1621 -23823 -32267 -11673 21650 53639 50411 22029 11105 14017 29024 44553
663 44553 29485 -936 -29601 -49943 -35644 -7572 -4431 -21037 -49925 -58383 -19337 22343
675 22343 37674 28572 3507 656 24583 41233 49951 40163 8474 -13101 -22253 -17315 1669
688 1669 -3578 -31798 -49815 -50473 -23667 6709 5309 -4322 -3219 6285 28158 37713 30718 28882
702 28882 21356 11337 12171 7642 1357 -8743 -32686 -39128 -24674 -15637 -12335 -24384 -35054 -13870
716 -13870 12750 25647 27526 13856 10460 23214 27764 31100 27564 7903 -7557 -18546 -22098
729 -22098 -8359 -7514 -25078 -36988 -39539 -19960 7619 8978 964 376 6144 26510 37602 28610
743 28610 22165 11935 3708 8072 4490 -1981 -10011 -30846 -37403 -25244 -13747 -5078 -11647 -24645
757 -24645 -11145 11681 24892 29597 15779 8964 20753 24315 22800 16045 -2047 -10332 -14495
770 -14495 -19247 -11541 -12319 -25582 -31308 -29309 -9900 16331 14321 -58 -3827 6145 32320 44273
784 44273 25855 8222 -2497 -3994 7662 6389 -4373 -14867 -35050 -40028 -21180 -2534 8724
797 8724 -1660 -24422 -16973 11776 35035 41225 19038 -1587 4193 13702 20752 19547 -839
810 -839 -16957 -26729 -31236 -12854 445 -6080 -19788 -31607 -20672 13243 29806 21620 7685
823 7685 -1888 12200 29299 25151 17011 4272 -10296 -11477 -12384 -10607 -4231 -16238 -30021 -26209
837 -26209 -13192 7778 13542 -3767 -6789 8048 25237 35730 20716 214 1115 6480 11666
850 11666 12049 -5078 -20138 -28358 -32070 -13908 6965 5616 -9432 -29881 -26031 13430 42362
863 42362 39791 15300 -14457 -11847 15097 29950 30458 9570 -23118 -35948 -30933 -10204 15444
876 15444 9726 -19592 -38328 -33783 2554 36147 30805 10318 -5781 -5902 15218 26703 21927
889 21927 13935 -3351 -17697 -16193 -12198 -3606 -1838 -18195 -24546 -15229 -3366 8229 4358 -3030
903 -3030 8587 19368 20563 15753 2590 2537 11977 9643 4835 -3565 -17658 -20114 -19408 -14439 849
918 849 1395 -10832 -17281 -15140 7329 30206 25894 10451 -860 -3196 12403 21009 14085 5863
932 5863 -10404 -23070 -18933 -11547 -1168 2435 -14208 -23779 -15910 -278 18637 20318 7750
945 7750 4442 5517 10012 19365 15880 7854 1759 -11959 -13751 -7670 -6823 -6116 -13811 -22674 -13105
960 -13105 -2806 2409 7084 3243 4698 13430 12572 13604 14830 8319 7294 2975 -4868 -2924 -6065
975 -6065 -13376 -13626 -16257 -12476 -4593 -8607 -8352 -548 4494 13722 14860 8165 10906 12409 10757 12760
991 12760 5278 -1742 -2772 -10558 -12472 -8434 -11879 -12173 -14032 -16175 -5495 4197 4439 7665 4855
1006 4855 7093 17018 16092 12937 10073 2289 1244 239 -6088 -5611 -9207 -17157 -15755 -14307 -9691
1021 -9691 -1363 -4372 -4933 3009 7092 14882 16663 9466 11043 11466 8551 9120 1873 -5251 -4652 -10547
1037 -10547 -12823 -10422 -14034 -12883 -10251 -11839 -409 7064 5553 7648 5991 9710 19517 18279
1051 18279 11093 5860 -2624 -1974 1593 -4604 -6518 -12474 -21105 -17917 -13098 -6151 4204 589 -5115
1066 -5115 -337 3694 18116 25388 15402 7971 2219 9 6804 6805 -215 -5440 -17520 -23159 -15096
1081 -15096 -8682 -1304 -1009 -12038 -10995 -746 9544 20842 17261 8022 8003 6628 8570 12952
1095 12952 6059 -560 -5313 -15283 -13857 -8177 -9298 -9520 -14387 -14299 -1910 3813 4814 6115 4064
1110 4064 10742 18495 14346 10341 5990 -120 3215 2474 -2076 -3514 -13556 -20888 -15720 -9071 -110
1125 -110 2513 -9553 -12567 -3462 8491 22799 20559 6606 1745 512 6493 16680 11930 1382
1139 1382 -9576 -21934 -16606 -4020 687 -660 -12507 -22235 -11130 3076 13413 16910 5818
1152 5818 -235 3423 7356 14737 17101 6385 -1033 -9182 -11860 -2244 -416 -5822 -10308 -17820 -12993
1167 -12993 -1119 1544 2918 1721 -1066 6290 11135 9708 11642 6526 2651 4555 2884 1895 -118
1182 -118 -9458 -12790 -9034 -5909 -338 -2899 -12153 -9835 -2814 6371 14735 7653 392 -50 2211
1197 2211 10961 16256 8326 298 -8645 -12635 -3381 3339 1559 -4213 -16380 -18094 -4052 5406
1211 5406 10192 5281 -5788 -5152 4024 10140 14671 9889 -870 -2458 -3376 517 5973 280 -6040
1226 -6040 -10004 -13044 -3977 2864 -812 -2667 -5513 -3611 6856 8122 4401 3536 289 3535 8010
1241 8010 3265 1835 -973 -5794 -2968 -2032 -2794 -512 -5814 -9162 -3117 483 5330 4892 -3586 -3464
1257 -3464 2762 6252 9742 4787 -2918 -963 -323 -483 3063 -687 -3482 -4707 -9194 -4217 3758
1272 3758 3278 1131 -4224 -6498 3174 7680 5142 3331 -2277 -1068 3820 782 634 939 -2435 -2290
1288 -2290 -3676 -4464 1650 1574 -2201 -2052 -1934 2494 6436 73 -2511 1209 2620 5647 1746 -5151
1304 -5151 -2173 290 -243 1356 -2871 -4023 -1636 -3710 -629 5092 3319 1964 -2370 -4680 3870
1319 3870 8236 4891 -175 -6077 -4357 4043 3130 -828 -4255 -7905 -3552 874 658 3783 1078
1334 1078 -4453 -1967 1660 8262 11942 1125 -7882 -5822 766 9586 7652 -5523 -10554 -9580 -3935
1349 -3935 4750 4073 -470 -3154 -8229 -4588 6223 10701 11024 2156 -8821 -3997 5064 8990 7214
1364 7214 -3793 -8958 -3928 -2718 -903 -1109 -3954 -2465 -1436 -3952 220 3385 2650 3672 2246
1379 2246 3997 8657 3385 -3281 -3146 55 7234 6550 -6326 -12678 -10165 -3482 5939 3782 -2289
1394 -2289 -4992 -7424 -3663 6178 12239 13577 5165 -9813 -8663 3129 12708 13385 -845 -14758
1408 -14758 -12510 -5065 2414 5146 -1114 -5799 -7869 -8445 304 9788 11190 5493 -4573 -6869 5585
1423 5585 11832 8884 283 -8341 -4733 1836 265 -1825 -4673 -6470 -3940 -3659 -2099 3516 2922
1438 2922 -1631 -2428 -633 8914 11506 2041 -4748 -3801 3011 9100 3757 -6898 -7199 -4566 -1167
1453 -1167 879 -2497 -2314 -1076 -4863 -2634 3642 6570 7357 -937 -6459 1450 8510 8153 1661 -8024
1469 -8024 -6114 3008 3039 396 -3994 -6755 -2947 -1585 -1445 3558 3909 -322 -3151 -4429 3196 11247
1485 11247 6213 -2218 -6126 -3763 5138 5853 -1278 -3524 -4426 -3095 -410 -1755 279 3672 -616
1500 -616 -3689 -2343 1046 6868 4536 -3370 -2678 692 3429 3613 -2996 -4138 638 279 -1106 -2219
1516 -2219 -2898 1520 836 -1430 414 2188 2304 1345 -3437 -2098 4250 3878 699 -3325 -5161 983
1532 983 3443 -217 -1190 -1913 -1177 1608 -492 -631 3096 1181 -871 -1496 -1510 2418 3168 -2171 -2905
1549 -2905 -1598 544 2711 -2035 -4570 -835 904 2147 1145 -2304 -232 2430 1045 2434 1815
1564 1815 513 628 -2557 -2731 1927 2090 -631 -3479 -6222 -1001 3912 1605 -488 -2943 -2424 3352
1580 3352 3609 1998 2556 46 -465 903 67 2067 1663 -3351 -4240 -3134 -224 3318 -793 -5478
1596 -5478 -3462 -725 3287 4653 73 -1352 177 999 4443 4288 1166 179 -3045 -3872 417 1531
1612 1531 287 -2313 -6877 -4715 953 2009 2439 -231 -3411 849 2765 3935 5256 1518 106
1627 106 693 -1059 398 2189 -1768 -2881 -4235 -3334 556 787 -2644 -1920 -1898 1122 4611 2376 1587
1644 1587 946 128 2491 3758 1926 730 -2164 -4427 -1920 313 902 -1484 -5689 -6149 -1460 1467
1660 1467 4832 2512 -2311 -2582 -215 3750 7151 4619 -351 -2501 -4303 -632 3899 1976 -1459
1675 -1459 -6015 -8449 -2749 2619 3481 1850 -2906 -4370 614 4055 6715 5580 -705 -2713 -909
1690 -909 235 3408 2208 -2541 -3881 -4996 -2442 1823 535 -1610 -1888 -2879 1199 4179 2006 1465
1706 1465 47 266 3489 2854 138 -602 -2456 -1817 566 -890 -1125 -2055 -4689 -1908 968 2093
1722 2093 3158 -513 -2942 566 2720 4984 4183 -1136 -2642 -1268 -129 1982 1197 -2089 -2969 -4594
1738 -4594 -3505 1838 2879 1459 -838 -3802 -807 4079 4295 3532 79 -2748 -197 693 215 882
1754 882 -1390 -3310 -2344 -3074 -410 2479 340 -1070 -1165 -317 3804 3689 481 320 -446 648 1888
1771 1888 -648 -1502 -651 -2048 -1046 -1015 -1652 328 -875 -2265 250 1642 2662 2436 -1104 -616 2682
1788 2682 2771 2420 -533 -3333 -911 66 -902 -496 -2213 -2775 -1049 -1749 367 2841 1132 42 -258
1805 -258 108 3815 4052 303 -550 -1576 -614 1948 -764 -2593 -2364 -2852 -1077 -390 -1440 394 281
1822 281 -910 947 1964 2848 3601 433 -641 1468 1628 1541 -492 -3560 -1830 -659 -1901 -1281 -2721
1839 -2721 -2557 400 -186 46 1796 1031 1716 2211 917 3168 3262 496 -452 -1208 -455 1224 -1352 -3708
1857 -3708 -3164 -3218 -550 645 -1064 -320 132 -180 2099 2861 3253 3544 872 -668 1078 1185 2298
1874 2298 592 -3997 -3996 -2579 -1575 564 -752 -2966 -1393 -1642 12 3305 3324 2859 1904 -978 1464
1891 1464 3788 3054 1594 -1869 -3751 -1615 -933 -1209 -1646 -3727 -2914 -1154 -1057 776 1557 573 1490
1908 1490 1375 2091 4357 3013 690 418 -354 1092 895 -2713 -4188 -3531 -2827 -48 -485 -2763 -1945
1925 -1945 -1334 623 3645 3219 3049 2009 -298 1092 3541 3336 1991 -2101 -4967 -2945 -712 -286
1941 -286 -765 -4301 -4863 -2017 -209 2281 3031 937 1114 1049 1458 4567 4565 1575 -419 -2658 -1469 938
1959 938 -791 -2605 -4049 -5238 -2072 11 -447 766 135 -301 1701 2639 3332 4471 1824 290
1975 290 412 348 1315 460 -3155 -3626 -3505 -2571 -874 -1828 -2501 -599 -573 1254 2977 2431 3186 2846 792
1994 792 2437 2582 1371 587 -2284 -3457 -1655 -1966 -1813 -2112 -3821 -2545 -375 361 1894 1818 1022
2011 1022 2261 2226 2701 4006 2115 530 -275 -2095 -1083 -317 -2381 -3298 -4153 -3566 -427 -319 -863
2028 -863 452 273 2095 3339 2528 2729 2791 1202 1620 1037 -473 -214 -2255 -3718 -2744 -2882 -1922 -1240
2046 -1240 -2877 -1769 128 1331 2983 2539 1635 3004 2642 2202 2940 1136 -235 -476 -3060 -2897 -1708
2063 -1708 -2554 -2304 -2975 -3633 -831 641 719 2282 1639 2377 3592 2260 2377 2880 1386 1199 -612 -2965
2081 -2965 -1856 -1925 -3026 -2543 -3670 -2947 -806 -828 -151 1449 1935 2784 2909 1370 3332 3482 2001 1192
2099 1192 -1215 -1795 -1101 -2034 -3002 -2612 -3257 -2505 -1892 -2188 -66 1389 1428 1968 1449 2259 4363 2845
2117 2845 2025 1382 -60 -33 -895 -2227 -1667 -2287 -3453 -2990 -3231 -1501 758 421 295 870 1156 3158
2135 3158 4010 2130 1700 1756 673 1064 -79 -1190 -1217 -2759 -3376 -2720 -2549 -803 -633 -1800 -614 1296
2153 1296 1949 3190 2045 1348 2364 1796 1719 1477 -369 -728 -1473 -2977 -2220 -1485 -2131 -1700 -2325 -1799
2171 -1799 498 1068 1043 1604 1383 2647 2947 1552 1402 1111 482 560 -615 -2102 -1713 -2181 -2452 -1636 -1478
2190 -1478 -378 -274 -1466 -268 1354 2533 3328 1844 162 949 1524 1507 1376 -475 -1492 -2031 -3311
2207 -3311 -2133 -312 -700 -787 -2098 -2522 604 2425 2670 2035 90 288 1929 1388 1759 959 -512
2224 -512 -1052 -2020 -2268 -378 -296 -1371 -1957 -2638 -309 1960 1136 759 766 634 2554 1980 1152 1242 138
2243 138 -583 -417 -1210 -1131 -660 -2408 -2750 -1529 -607 933 142 -1103 630 1757 2330 2470 547 124
2261 124 979 784 664 -25 -1284 -1100 -1708 -2749 -708 -23 -882 -1076 -1546 39 2152 2047 1238 743
2279 743 257 1827 2217 457 355 -479 -1133 -737 -1734 -1119 -454 -1659 -1891 -1403 -400 1494 1420 -388
2297 -388 386 1224 1906 2724 882 -53 557 -168 -154 -201 -1562 -1137 -1571 -2659 -1401 -428 55 -32 -544 -406
2317 -406 1407 1837 2160 1604 436 890 1184 252 333 -219 -762 -1138 -1780 -1942 -526 -1000 -1502 -832 -1189
2336 -1189 721 1575 726 899 954 902 2009 1180 319 369 -606 -595 -482 -1187 -1015 -1336 -2184 -1129 -643 -23
2356 -23 456 -243 -537 1192 1421 1775 1611 204 226 925 433 712 5 -1490 -1208 -1462 -1127 91 -760
2375 -760 -1376 -849 -1028 589 1436 774 810 552 820 1827 1716 509 338 -515 -634 113 -563 -604 -1186 -2341
2395 -2341 -1315 -329 -245 279 -307 -649 641 1398 1562 1690 -38 27 876 558 540 134 -1327 -1333 -988 -1004
2415 -1004 -114 -746 -990 -1045 -716 222 1212 748 428 584 383 1389 1510 828 646 -245 -894 -129 -401 -534
2435 -534 -769 -1782 -1189 -421 -247 232 223 -736 315 633 827 2041 741 -28 537 225 562 508 -445 -740
2455 -740 -1188 -1015 -368 -135 -532 -795 -1306 -449 1046 861 1105 485 -119 697 1360 1063 959 -308 -1124
2474 -1124 -400 -379 -178 250 -1318 -1425 -815 -384 666 693 -143 7 4 371 1652 931 626 288 -308 122
2494 122 454 -147 -501 -1106 -1254 -653 -102 -256 152 -341 -541 626 663 1050 864 37 535 782 439 729
2514 729 -321 -829 -909 -758 -519 40 -605 -848 -615 -202 566 1010 591 417 84 -55 1218 842 345 352
2534 352 -586 -797 135 -530 -634 -622 -1181 -458 -287 -116 579 259 -155 950 521 794 1039 259 368 175
2554 175 -456 -98 -483 -893 -617 -713 -614 -140 -546 -492 417 376 607 1279 441 608 879 323 603 -57 -266
2575 -266 -217 -987 -1174 -679 -1023 -581 -469 -1006 -332 98 334 1209 675 489 836 928 535 1045 -124 -346
2595 -346 -465 -984 -330 -725 -925 -941 -1175 -820 -56 -84 61 631 401 810 1254 1122 1377 841 -54 11 -143
2616 -143 -442 -544 -976 -1121 -753 -949 -605 -474 -486 15 725 542 1176 726 544 972 814 764 698 -299 -582
2637 -582 -521 -829 -831 -642 -1285 -1098 -757 -379 546 348 367 910 990 846 1438 911 569 362 -133 -183 -64 -637
2659 -637 -660 -1261 -1534 -703 -544 -652 9 -487 -149 802 719 1125 1309 701 905 359 185 746 108 -498 -732
2680 -732 -1222 -887 -509 -1004 -663 -558 -494 283 334 466 1210 866 780 897 531 774 721 -220 -69 -438 -831
2701 -831 -292 -890 -1195 -425 -471 -379 126 111 251 1087 698 783 805 473 411 513 55 212 -102 -768 -530 -1182
2723 -1182 -693 -330 -857 -417 -332 -205 173 569 213 975 704 423 652 366 461 264 -266 -466 -457 -675 -524
2744 -524 -462 -793 -544 -577 -546 46 60 352 1009 90 310 613 373 646 392 -276 -111 -155 -408 -302 -240 -447
2766 -447 -416 -271 39 1 133 420 185 182 577 478 268 596 53 -135 65 -155 -203 -19 -673 -483 -380 -548
2788 -548 -83 340 101 272 -154 135 695 472 159 290 -45 60 132 -138 -39 -58 -439 -514 -497 -451 269 387
2810 387 -119 59 -288 575 540 -133 312 161 143 201 -148 -334 -74 -8 -342 -401 -382 -291 -249 -143 -31 269 232
2833 232 49 77 -104 339 303 169 283 -238 -144 166 -211 -434 -78 -595 -49 -128 -453 207 48 -34 535 245
2855 245 391 458 185 87 297 -38 136 68 -462 -296 -231 -376 -96 -83 -172 217 -23 16 511 244 601 42
2877 42 -174 -159 109 185 342 31 -221 -91 -406 -68 -333 -217 -14 -120 2 154 347 346 164 67 230 522
2899 522 318 287 72 -92 -124 -98 -440 -277 -380 -268 193 -289 -302 96 177 117 220 302 674 219 22 39 311
2922 311 91 -61 -191 -314 -140 -139 -122 57 -307 -286 -235 -288 378 394 196 85 -122 164 460 173 -26 106
2944 106 -436 -3 474 -23 38 -682 -430 -242 -130 7 -26 -152 -94 159 475 477 740 7 -39 33 84 324 -302
2967 -302 -605 48 -225 -221 -39 -318 -118 -231 -138 64 213 -94 182 108 369 618 319 208 -185 -282 -71 100
2989 100 26 5 -232 -476 242 57 -128 246 -49 1 288 446 313 704 -83 119 33 74 277 274 -356 -628
3011 -628 -217 -300 178 -151 -151 -79 -185 -29 313 429 286 297 -498 167 328 222 355 -399 -289 -31 -55 -154
3033 -154 84 -531 -95 -272 -162 212 104 5 78 -33 -39 473 -34 -126 -276 -82 25 -45 -88 -187 -411 -506 -65
3056 -65 -207 -235 -15 -93 -133 340 61 442 160 -220 291 343 0 -46 -149 -415 45 56 -346 172 -422 -424 13
3079 13 111 459 89 -113 -107 -19 112 446 5 295 -253 -141 -220 48 88 1 78 -222 40 2 -193 175 152 -191
3103 -191 200 51 269 144 -114 9 150 -166 -112 10 -437 -24 -297 42 456 -11 123 139 -3 237 366
3124 366 -272 -23 -400 77 262 -61 -343 -149 -267 -196 98 -81 272 61 -322 113 -25 154 166 -27 -246
3145 -246 246 20 -23 14 -442 -110 -14 -557 33 97 -150 17 -135 74 28 269 204 86 -142 367 286 -257
3167 -257 -235 38 -424 -9 176 -89 -287 -373 -188 159 -87 367 280 27 166 29 242 346 96 -239 21
3188 21 100 -158 -69 -443 -86 -121 29 161 93 -130 -11 317 -70 384 195 139 94 -101 183 348 31 -318
3210 -318 -366 -748 54 210 -439 -306 -351 -212 247 349 238 -23 10 48 310 213 522 -58 -483 96 -323 64
3232 64 168 -345 -472 -523 -104 293 342 61 -316 -60 208 419 357 157 262 -131 48 303 81 20 117 -467
3254 -467 66 274 -163 -182 -68 -334 146 294 121 403 -123 1 236 -62 246 429 -239 94 -57 135
3274 135 152 -272 -252 189 -107 124 417 210 -100 167 -60 34 323 -144 74 -351 -102 307 -164 -240 -241 -471
3296 -471 -19 -3 56 70 38 -93 112 80 -24 -67 -299 -97 136 -63 204 195 73 -68 -112 -135 353 125 -30
3319 -30 -46 -34 29 -129 19 -232 46 -233 164 299 -62 285 -21 -76 277 106 110 267 -538 -259 214 -8
3341 -8 137 68 -337 170 275 185 176 50 -367 422 -129 183 159 -119 -45 -251 -185 93 63 -104 106 -375 140
3364 140 310 -79 181 -210 -58 351 283 90 113 -352 -283 220 63 -86 67 -397 -330 192 84 333 165
3385 165 -277 8 469 -94 248 109 81 152 155 -220 -27 -488 -178 -185 -28 75 -22 -238 477 330 424 212 97
3408 97 151 157 102 204 99 -365 -296 -292 -417 204 -126 -436 -189 -465 -46 138 294 436 298 -84 221 115 342
3431 342 509 -27 -264 -249 60 88 319 -603 -427 -104 -267 163 160 -222 319 170 15 592 34 434 151
3452 151 -16 19 38 73 193 -202 -289 -212 -193 -572 172 55 -256 408 -201 261 507 334 389 164 254 270 -27
3475 -27 -31 -10 -154 -134 -43 -666 -421 -226 -130 -19 -3 26 101 -69 118 283 92 -33 412 -62 -83 273 83 -290
3499 -290 -120 -454 -257 -62 -63 -34 -641 -300 362 122 440 508 -46 80 361 545 495 410 -199 -139 -325 -207
3521 -207 199 -225 -511 -91 -189 -87 116 -105 31 247 122 58 101 147 424 -91 9 60 -391 -54 -300 -564
3543 -564 -139 59 -476 -170 -195 -237 357 202 28 100 256 285 336 290 124 266 -348 -86 -258 -201 27 -148
3565 -148 -256 -240 -188 -103 450 -130 203 -1 138 460 376 313 412 -197 -252 53 -12 -56 -73 -731 -261 -189 14 195
3589 195 -120 -311 240 11 97 588 177 -41 -78 -180 274 96 -294 -60 -280 -630 241 331 -85 -459 -342
3610 -342 102 336 4 28 159 156 288 230 -13 29 -192 -576 -56 -108 -26 -111 -415 -445 10 243 430 201 -28
3633 -28 297 343 226 373 59 -603 25 -131 130 77 -293 -350 -542 -602 568 80 -105 -26 -77 260 769 430
3655 430 87 114 -109 369 140 -268 -74 -254 -835 -222 -368 -141 132 -442 -623 173 -4 379 486 56
3675 56 391 362 260 437 -77 -267 198 -235 -370 -235 -603 -270 -305 -720 -115 144 -82 401 508 378 875
3696 875 406 118 175 -197 39 20 -463 -408 -497 -637 -253 -489 -320 252 -206 -309 265 331 426 412 64 564
3718 564 222 366 549 32 -343 -15 -382 -374 -60 -293 -260 -387 -386 149 278 339 437 163 146 641 332 538 722
3741 722 -165 90 -206 -280 -68 13 -449 -288 -590 -30 74 -295 -83 133 5 357 476 101 250 313 43
3762 43 486 316 -355 -52 77 -235 121 -454 -474 -155 -716 -5 0 -281 -32 291 -121 511 394 486 468 -259
3784 -259 -229 308 99 -6 30 -635 -527 -471 0 267 -124 -266 -437 83 134 622 -239 103 552 9 393
3805 393 515 -48 86 -295 -386 282 -116 -349 -35 -520 -474 190 -137 -42 139 -28 97 118 417 469 268 -121
3827 -121 63 -133 -25 -6 -244 -320 -78 -328 102 -335 -250 -59 -212 -108 348 -172 211 478 -101 294 463
3848 463 -120 -103 -209 -297 97 -234 -342 -212 -377 -92 322 -43 -220 109 -190 238 295 268 445 -46 -236
3869 -236 80 -190 -93 -86 -196 -10 -90 -33 4 -76 -122 144 -212 -103 558 74 -155 157 -234 185 154 -96 95
3892 95 -337 -274 142 206 301 134 -4 -41 391 -27 219 -204 -330 -20 173 -207 283 -72 -422 -157 -119 269
3914 269 297 -133 -99 -14 -242 603 121 -128 -2 -63 79 259 62 -53 124 -391 -182 411 -116 -172 -450 -354
3936 -354 7 176 129 271 143 -214 331 263 206 196 -324 67 -11 -168 388 -270 -424 23 -621 -272 190 -272
3958 -272 -189 48 -152 210 267 -93 344 268 234 344 -48 -326 145 -325 -246 295 -246 -223 -201 -409 331 96
3980 96 -285 345 -41 61 595 185 7 29 -570 -31 260 -297 -15 -145 -667 -294 5 -95 -29 -307 -347
4001 -347 134 -111 318 267 80 633 1 72 93 192 152 207 -457 -137 -135 -220 -172 -363 -466 -43 -114 -50 303 -79
4025 -79 -8 346 405 209 807 -73 -7 109 86 -69 -88 -365 -350 -81 -347 60 -250 -284 -51 -115 400 613 44
4048 44 253 -40 -116 544 624 -129 232 -299 -235 371 -225 -24 -248 -613 -194 31 -215 127 -174 -187 529 165
4070 165 409 509 -6 222 237 -371 421 211 -458 -92 -242 -423 10 -413 -330 -26 -413 -99 488 -123 264
4091 264 248 -171 598 505 93 478 138 14 397 -364 -89 -248 -662 -414 -56 -239 -17 -15 -82 156 127 76
4113 76 738 135 -157 379 277 154 78 -390 -59 -37 -356 78 -583 -553 -292 -382 -74 330 -252 -70 79 -138
4135 -138 410 568 -67 397 -132 -270 134 -84 -140 57 -466 -356 -426 -187 218 237 -147 -92 350 -21 562
4156 562 -35 11 188 -164 81 654 -79 27 -281 -441 311 29 -44 469 -228 7 157 -313 134 -43 -308
4177 -308 32 116 34 431 -164 -180 342 195 51 280 -419 -254 -5 -234 -131 -217 -164 -43 105 179 604 -103
4199 -103 -449 139 20 111 495 -105 -96 -235 -41 444 303 -392 33 -135 -361 432 35 199 -90 -481 -136
4220 -136 1 130 39 -165 -502 162 -77 79 465 -137 -112 -4 -134 150 279 -356 -105 -313 -176 240 182
4241 182 -401 75 -24 -254 366 -238 225 140 127 397 67 -139 303 95 104 193 130 -116 116 -318 -78 -90 -223
4264 -223 -277 -13 -284 -56 -167 66 375 78 -188 590 323 216 419 -115 -29 211 -104 310 40 -153 -122
4285 -122 -352 -392 226 -78 19 13 -511 58 187 24 169 87 -464 192 175 278 390 -60 -413 -25 -362 -2
4307 -2 -11 -506 -318 -319 -166 608 290 7 147 97 182 539 -20 314 152 -208 111 161 -334 -135 -275 -345 257
4330 257 -435 214 44 -524 195 280 346 384 35 -145 326 113 209 153 -271 -154 92 -259 -207 -206 -493 -161 -124
4353 -124 -327 312 -151 -273 291 -178 607 731 -6 -8 315 -75 285 247 -242 237 -211 -355 -123 -291 -210
4374 -210 61 -288 -167 206 -105 256 493 -183 271 338 -25 166 -92 120 32 -515 -279 -12 -521 -268 249
4395 249 -159 93 77 -180 325 102 115 312 -182 59 393 69 319 64 -117 -48 -63 -359 294 -408 -404 199
4417 199 -93 -14 189 -176 325 286 94 275 217 64 242 42 -40 195 -399 -85 75 -152 36 7 -180 311
4439 311 131 42 25 -40 -483 185 -124 -102 107 -443 -157 243 -245 256 12 -149 -143 -77 1 43 19 -190 163
4462 163 -330 69 -62 -306 4 286 -168 -40 18 -56 142 62 -92 400 -31 93 281 -3 484 86 -384
4483 -384 229 187 -185 196 -156 -271 -140 -83 -18 -281 -144 230 -37 89 164 183 33 444 109 -44 341 -121
4505 -121 48 -104 -406 155 -190 -408 6 -341 -437 323 -181 9 180 27 -30 502 -236 546 394 -342 117
4526 117 -246 -397 21 -416 -312 72 -482 -277 193 -490 -148 312 -146 469 455 -167 509 220 -74 615
4546 615 -65 6 -99 -591 57 -253 -518 145 -250 -161 263 -21 -129 376 186 270 286 -145 323 235 -183 296
4568 296 -97 -227 169 -195 -252 -178 -511 -260 -104 -173 85 300 -149 112 867 653 278 132 -160 515 31
4589 31 25 354 -497 -69 -453 -659 194 60 -416 118 -317 -276 156 225 -285 336 51 223 225 -197 76 57 277
4612 277 214 -63 -684 -76 -554 -472 -47 -211 3 102 -273 151 332 -216 224 212 -141 372 118 176 6 -221
4634 -221 -23 36 -204 158 -54 -652 99 -230 -160 391 -15 -16 -152 -138 -57 278 -295 16 93 129 -47 -477 -244
4657 -244 -39 -195 -90 199 -93 174 103 -117 124 247 270 143 88 -204 34 -222 -140 299 -332 -138 266
4678 266 -307 -69 2 -106 195 -89 -157 115 -10 80 269 -347 -12 207 -88 -1 24 -65 353 117 -348 346
4700 346 -148 -72 76 173 184 355 -305 113 51 24 26 -241 -94 -128 -281 20 342 -61 97 -15 -535 163 233
4723 233 -247 76 132 -430 173 32 -61 62 -282 -99 132 -43 -117 354 -514 6 304 49 506 156 -305
4744 -305 439 303 256 184 -69 143 90 -54 -16 -146 -426 -65 -168 -311 191 -31 -283 -20 -9 481 227 39
4766 39 126 167 4 511 172 -237 -67 -498 -11 70 -29 -51 -186 -494 -82 332 -38 208 -23 -518 368 240
4788 240 227 228 -135 448 290 -169 3 -155 -471 -2 -291 -528 -213 -197 0 200 -41 -90 420 157 36 323
4810 323 182 29 224 -197 342 27 -223 203 -620 -619 83 -627 4 110 -345 88 256 -70 363 222 -218
4831 -218 531 234 219 402 117 -3 -104 -187 -283 -111 -150 166 -54 -101 17 -266 208 309 47 36 129 -203
4853 -203 178 487 90 452 -292 -396 270 89 -36 1 -182 -349 -143 -362 184 -13 -434 45 -8 167 417
4874 417 71 -199 331 -352 254 319 -250 -74 248 -557 -34 -301 -404 152 -456 -247 -40 8 467 112 -222
4895 -222 325 266 157 124 85 93 151 266 -187 -88 -509 -181 79 -454 -253 -136 -247 -51 122 173 239 20 -134
4918 -134 282 174 280 548 -300 48 -6 -134 70 16 -127 -87 -403 -243 119 -233 -103 181 26 -51 149
4939 149 95 394 282 -161 258 142 -164 22 -90 -326 -87 -409 -279 96 -295 207 120 -456 257 101 -2
4960 -2 403 -135 -7 270 -216 284 139 -308 -241 -414 -115 111 -15 -138 -78 -51 10 230 71 136 207 9 402
4983 402 -77 -20 283 -279 -569 105 -280 -566 45 -112 57 196 -8 99 305 -292 184 307 -122 150
5003 150 -37 -169 117 -100 -209 153 -393 -86 235 -144 162 298 -150 284 14 386 445 -176 41 171
5023 171 10 -275 -151 -529 79 -227 -561 -17 -23 -144 124 18 -43 382 -278 496 154 -85 46 -276 55
5044 55 190 200 -393 95 -404 -226 14 -97 -54 -119 -195 248 533 16 372 138 138 366 -86 94 13 -363 45
5067 45 -53 -617 -313 -357 -485 -17 -299 214 486 170 252 636 185 414 373 -111 143 50 -103 101 -401 -367
5089 -367 -309 -438 -377 -270 -109 -13 -98 -243 562 466 81 473 80 94 515 468 237 7 -428 -64 -27 -289 -78
5112 -78 -377 -410 -160 225 -40 547 133 105 472 107 304 712 127 120 239 -395 -101 -247 -436 -261 -337 -350
5134 -350 -188 -451 11 264 -238 255 458 35 353 98 -164 487 57 117 164 -374 -259 274 -420 -277 -170
5155 -170 -605 -237 -132 -163 384 44 138 533 49 85 520 -135 146 271 -359 34 179 -348 -233 -257 -487
5176 -487 -260 -333 -272 231 -146 261 35 -59 581 394 106 121 -67 -143 40 157 -101 -168 -332 33 125 -359
5198 -359 12 -61 -313 312 141 -260 405 -76 -11 270 -164 117 -70 -306 -213 55 -209 284 -213 -392 322
5219 322 -491 -172 469 -50 173 156 52 236 235 -426 -86 -120 6 186 -84 28 293 -568 361 47 -325
5240 -325 49 -179 -222 156 110 -157 180 -296 -136 100 109 21 92 -607 -9 35 -199 248 77 -203 29 228
5262 228 245 383 65 -206 218 -163 21 126 -439 -317 -308 -469 41 -105 -62 38 135 -118 117 -339 444 521
5284 521 -217 221 235 -231 -16 58 -489 161 -219 -230 107 -651 76 -94 71 72 43 -5 549 287 63 152 -232
5307 -232 127 256 -116 -130 15 -643 -264 84 -139 338 -92 81 392 76 102 489 239 80 388 -246 326
5328 326 96 -162 -53 -207 -452 -45 -241 97 385 -234 -70 24 -180 122 157 228 205 -32 375 597 -372
5349 -372 -501 37 -291 312 101 -322 -12 159 -355 162 89 -220 275 94 -263 177 -176 240 54 -321
5369 -321 330 206 -43 16 232 -290 131 -292 -193 -159 -216 101 154 30 341 55 78 37 237 163 347 4 77
5392 77 258 -263 126 139 -173 75 -182 -216 -40 -145 -432 -17 63 -324 164 -120 18 372 -116 96 164 -344
5414 -344 287 53 -304 84 -174 -166 -34 -21 -96 -16 -359 -176 368 -398 172 247 -299 -8 159 259 626 -45
5436 -45 24 339 171 139 100 -349 124 -232 -294 283 -212 11 -68 60 58 289 -260 71 246 -232 335 227 -257
5459 -257 238 -141 -219 464 -296 -186 15 -202 -9 113 175 -49 -9 -324 233 321 134 490 -10 -179 271
5480 271 -101 -193 250 -151 262 -151 -190 435 -103 -358 -48 -251 -124 133 110 84 414 -174 75 -90 -7 180
5502 180 237 -198 121 -170 -291 -31 -124 113 106 -271 -5 360 -39 61 72 -343 191 142 45 245 -54 -227
5524 -227 74 94 258 97 -179 45 1 142 151 -45 -134 22 -66 220 129 -60 -221 155 -6 180 85 -400 227
5547 227 -87 41 247 -159 -44 262 -49 -290 292 -407 142 47 -305 47 -125 -557 -34 -158 -98 460 62
5568 62 99 353 -177 301 -12 55 189 46 -29 -139 -358 -179 -89 -366 -380 221 -381 -11 249 -274 209 -153
5590 -153 -22 438 -14 18 209 -453 287 138 -92 -150 -54 -127 140 -146 -270 12 -336 -116 409 -201 7
5611 7 372 -202 221 347 48 30 243 -269 -90 -163 -200 99 -450 -206 -108 -215 -200 -300 -12 7 -67 -106 486
5634 486 119 25 154 149 -14 242 -226 -115 -3 -259 -244 100 -318 0 -89 138 42 -95 -83 440 -140 -233 80
5657 80 -3 439 344 -78 277 -239 -20 285 76 70 125 -175 -393 -52 -34 18 32 -409 193 -261 45 398 63
5680 63 -190 183 -124 193 366 -294 -22 18 -5 252 120 -278 244 -232 -14 52 76 0 -100 -157 112 201 -250
5703 -250 123 77 39 433 -30 -153 116 -463 -41 158 -186 -179 -294 -531 39 -18 -196 600 -24 -117 358 2
5725 2 284 227 -178 37 -123 -169 196 -7 -88 4 -245 -245 -5 58 -70 363 -291 79 208 -182 27 -201 -128
5748 -128 185 341 99 357 39 -161 262 -181 -169 85 -91 -92 38 194 127 30 -270 148 -140 218 200 -145
5770 -145 375 254 -105 -54 161 -154 11 -134 -351 185 -98 126 97 -218 -65 60 -104 99 161 51 15
5791 15 46 190 365 -328 -91 429 -303 23 150 -552 -239 45 72 252 -91 -297 -53 -107 38 219 -139
5812 -139 284 197 -312 377 -83 -205 -88 117 -167 -79 -137 -41 -48 -352 -111 151 194 24 27 -468 129 -11 108
5835 108 274 -20 -258 132 -154 70 130 -9 231 -128 -260 80 -192 -130 249 -246 -189 298 -255 67 197
5856 197 257 142 -105 -14 282 -130 -162 237 -49 -201 396 -130 -234 47 -317 -147 35 -374 -219 -39 -117
5877 -117 251 -139 -198 347 -86 102 128 310 31 71 -300 71 270 130 302 -180 -30 1 -127 221 182 -312
5899 -312 173 40 -6 303 259 -218 313 144 25 622 -303 -24 85 -264 105 -130 -407 43 -2 -235 382
5920 382 175 -114 -3 -17 77 367 -141 216 176 -340 98 375 -269 47 -166 -453 125 -173 -226 16 -51 -382
5942 -382 37 -37 469 128 285 190 151 219 351 -26 -333 11 -150 -18 -142 -476 -458 -175 -459 429 -243 44
5964 44 130 -82 -13 251 328 155 398 -214 252 -12 0 -59 -208 -253 65 109 -303 -51 -178 30 -18 -179 274
5987 274 -166 -54 90 200 153 218 -148 -259 -52 80 93 211 -191 -15 -112 -249 54 24 -72 110 -115 20
6009 20 403 -294 -54 402 -63 56 56 -304 148 246 -153 141 -34 46 182 -131 -58 25 -209 -81 113 1
6031 1 -57 168 -83 249 100 56 122 85 -279 -95 145 -280 -52 -175 199 -150 -342 93 -54 19 298 -252
6053 -252 -192 22 -168 -331 183 -166 218 -46 39 122 -130 22 408 183 105 215 -206 -3 -36 -153 115 140
6075 140 -133 140 -117 -436 171 19 29 253 195 160 285 340 347 136 -268 -121 28 -180 97 -182 -169 -31
6097 -31 -257 109 109 -98 240 148 -74 247 92 290 62 -44 88 46 79 -105 154 -215 23 -135 -342 -299
6119 -299 82 -240 219 -125 135 -42 -118 177 12 56 -61 101 -266 203 129 -280 26 -58 -389 -334 -86 -138
6141 -138 56 -288 54 50 -287 561 147 86 122 117 22 109 -244 54 105 -196 -248 -117 -382 -194 -250 -148 181 -36
6165 -36 196 -14 56 -81 223 99 216 179 -78 12 -133 -302 -118 -21 -13 -3 -19 -388 178 -137 89 384 -67
6188 -67 259 228 140 304 9 -25 -30 117 41 89 -230 4 78 -168 -132 123 -140 193 175 -140 77 32 101 -193
6212 -193 -85 127 221 -179 98 -173 -37 199 -158 -31 55 233 180 402 46 232 199 -318 83 188 -80
6233 -80 103 -235 -253 399 -176 -13 158 -141 114 29 63 38 223 -209 166 -4 -101 211 -10 -124 32 -10
6255 -10 102 -6 -277 -41 180 -191 65 78 52 129 -56 -95 110 29 -300 -189 -226 326 213 -133 -135 -121 -201 10
6279 10 37 235 -19 -201 -17 146 165 72 -115 -106 201 -179 -72 597 -5 -18 -115 -231 164 122 -372 156 -194
6302 -194 -170 98 66 14 205 112 128 329 -41 206 142 -74 14 -142 -358 98 111 -99 248 -221 -215 145 -73
6325 -73 37 253 -21 5 322 122 98 -97 -233 133 -84 -16 -38 -326 -148 -219 -136 -209 4 -62 -119 68 60 377
6349 377 65 -334 -4 129 -55 163 60 -199 63 -144 -19 14 -439 115 -81 -292 110 130 -159 201 -65
6370 -65 37 489 -7 -37 -5 -91 232 -43 -46 183 25 -97 30 82 -170 88 -377 64 -142 -106 75 -133 -26
6393 -26 256 -61 -84 159 -48 -179 190 -394 51 22 -57 -87 -156 -189 259 -63 -203 55 -180 34 315 -229
6415 -229 311 318 -145 375 -36 52 235 -13 -304 71 -250 236 156 -114 50 32 -121 1 35 -255 152 -125
6437 -125 139 415 -116 182 226 -98 22 132 -123 -265 -108 -71 -91 -43 -272 -53 -236 -465 32 -108 139
6458 139 29 147 -123 -69 -127 124 -189 -345 292 14 -4 110 -64 65 22 33 -118 178 -141 53 -83 -51
6480 -51 273 185 242 81 -60 245 231 268 -37 23 -271 97 109 -189 197 -307 -95 198 9 165 153 -140 289
6503 289 51 -55 191 -188 -245 157 -7 -83 -45 103 0 7 -139 -18 229 -128 -104 103 -96 26 66 -138
6525 -138 190 11 -12 212 -333 -63 -32 -274 284 -68 -54 124 35 -21 153 125 -141 85 -79 -288 62 158
6547 158 57 -156 -77 183 71 -41 341 -14 -53 46 187 120 189 -139 221 -17 -165 57 -152 -40 94 -135
6569 -135 -99 -51 264 -64 70 53 -212 -262 -193 -73 240 155 702 -32 -46 230 103 -356 576 25 -24 105 -109
6592 -109 448 -657 221 360 -466 -95 247 -313 229 286 -51 319 -77 -538 34 -93 -288 132 30 -218
6612 -218 13 -124 37 179 -81 71 164 -126 296 207 -111 273 -114 188 -6 -326 164 100 -321 -69 65
6633 65 -408 77 -64 -137 261 53 125 -100 20 378 434 211 349 23 -341 80 167 -251 0 166 -212 124
6655 124 -132 -201 38 -231 -127 300 65 219 207 4 166 36 -18 -255 -27 -151 130 -366 -389 248 -162
6676 -162 19 59 -59 -12 51 201 237 179 -112 428 -260 -31 218 -178 66 31 -142 190 163 -199 53 -476
6698 -476 -99 -198 -246 -231 232 27 198 130 -24 339 105 -192 93 130 -78 1 -228 58 100 20 88 7 -2 -2 -33
6723 -33 146 90 -145 226 329 -55 13 49 -20 -31 -119 -129 173 122 -116 75 -80 -314 215 222 -117 1 -464 209
6747 209 -33 -166 -74 -167 -46 -123 86 -45 -102 -164 75 286 -34 -57 -165 1 -106 -31 -63 220 106 125 381
6770 381 -27 8 51 59 -72 156 135 -28 184 -217 13 -28 -42 146 -40 -67 160 107 -56 187 -105 144 209
6793 209 -64 -112 -95 -217 146 -80 120 273 -51 -8 -1 208 119 13 -141 54 132 58 273 -30 -60 216 -185
6816 -185 222 -53 36 -28 56 -188 -122 -76 -160 58 120 -70 215 -94 -49 14 -148 -77 -15 -266 -185 15 -181 -59
6840 -59 35 303 288 24 -48 326 79 302 118 -27 -14 125 -34 77 -305 -393 41 -211 -106 310 -130 -50
6862 -50 56 -185 233 490 36 51 123 -101 -90 -47 -65 92 -219 -19 -205 -174 248 -3 -292 -33 70 -345
6884 -345 172 -29 9 68 162 191 -117 5 -24 -29 -75 248 -235 -9 86 -131 45 -25 -221 -120 -26 170 149 360
6908 360 58 184 258 -20 269 105 85 7 -226 -81 173 -35 -195 -102 -135 -93 137 -274 -168 127 -222 227
6930 227 29 121 65 -187 50 -183 -17 -78 294 -151 -167 -121 -8 186 -74 -99 17 -204 -73 35 85 356
6952 356 135 -294 308 110 -39 262 -133 -315 131 -160 -121 -146 -249 80 -82 -113 120 85 -213 -100 219
6973 219 21 232 -157 237 -117 29 136 283 -43 -243 88 -38 -7 31 -56 -98 -112 250 336 -77 43 101
6995 101 -76 6 59 -76 349 -222 -220 8 -110 205 138 -53 -213 -133 63 7 -261 7 173 -283 201 -163
7017 -163 55 47 68 -74 37 236 39 -20 177 -78 129 33 -329 12 10 207 10 -190 291 -26 -215 278
7039 278 26 -221 -42 62 -70 23 -189 65 27 -9 81 -2 199 102 -225 -356 -19 39 234 110 -69 -188
7061 -188 -23 -185 69 -133 -67 136 62 -242 246 93 241 206 -200 54 6 -165 -8 -40 -8 -68 224 192 157
7084 157 72 -170 410 140 50 120 28 420 278 43 118 -112 -170 -107 -174 -13 374 -237 9 113 -84 -299 -146
7107 -146 -97 39 85 -166 86 18 -51 56 -358 87 292 -241 122 -69 -190 -157 -128 -366 75 -86 -41 64
7129 64 94 -27 13 -45 138 157 -16 -2 251 -148 54 -35 -139 -44 -10 -120 0 29 -118 51 -159 189 -208
7152 -208 -34 64 231 199 65 13 -114 -18 -23 -137 -114 -185 51 -104 -291 -25 52 -117 161 115 58 -26 117 390
7176 390 -99 74 151 370 -266 92 -31 -10 -156 -138 30 249 237 -183 -30 -225 112 91 94 287 166 11
7198 11 389 -29 266 -260 24 -180 -152 -189 -429 -38 -338 177 215 -91 -73 -33 -17 -15 254 40 -245 -31 219
7221 219 31 270 273 -7 -51 -92 -20 -170 -36 -12 202 -28 -214 122 -25 -109 -14 -147 101 127 33 258 -180
7244 -180 -185 -44 20 -192 155 -309 22 18 -121 -213 -26 -115 194 217 144 62 40 -95 -257 -2 92 96 201 -126 168
7269 168 90 -70 226 -6 -292 -92 -43 0 233 -236 251 -34 76 2 -57 79 182 -215 174 72 -22 73
7291 73 261 -149 -7 114 -3 137 -45 70 298 119 -387 196 -104 -2 -58 -131 311 113 -111 111 115 -127
7313 -127 62 -87 -86 -26 -53 3 81 65 120 -53 -532 363 123 -18 61 71 35 111 -47 232 -150 -3 -107 -46
7337 -46 -190 -38 -57 64 -24 41 -108 135 -11 60 -129 99 -254 -11 22 -82 227 -92 194 15 31 122 188
7360 188 -15 70 -293 207 85 -142 -35 4 175 145 254 -109 108 -45 -111 -32 -148 68 76 -188 137 47 329
7383 329 -120 -52 -212 13 -156 128 7 -49 88 -147 -50 -32 327 133 136 -279 143 159 79 -231 193 64 53
7406 53 202 -281 157 55 -46 -59 -37 -20 -30 88 -299 -92 -76 -21 254 -258 100 149 6 41 117 59 217 -7
7430 -7 -249 -228 -24 -44 -32 -142 11 -334 19 -251 -15 -195 -14 -2 -120 353 221 37 -226 -161 82 37 -190
7453 -190 72 -208 -4 -237 1 -92 -61 -247 -36 55 -155 -13 129 -140 -115 -13 -124 115 101 -42 108 -121
7475 -121 171 53 -54 -27 182 -96 178 117 -31 78 -127 121 215 367 145 108 -28 -31 356 -81 -261 -35
7497 -35 104 109 117 -116 42 -43 -253 452 -115 49 -142 80 53 385 83 31 -185 -16 190 159 -86 57 -94
7520 -94 136 4 -163 167 64 49 249 73 -130 277 -185 192 353 -69 205 44 75 -24 -134 -179 -19 -238
7542 -238 1 130 -137 107 35 80 190 -216 0 156 48 -118 -389 108 68 36 202 -225 310 172 -84
7563 -84 299 -213 199 87 -193 89 121 -179 66 -135 111 193 92 -42 10 -121 50 51 -128 286 178 464
7585 464 208 96 125 159 -103 -148 111 -471 -152 397 102 65 212 -25 26 -138 -63 152 121 -61 -77 58 31
7608 31 216 35 138 124 -286 141 -270 -129 150 -32 -326 190 -48 -79 97 160 -30 91 -254 97 172 209
7630 209 19 -62 78 -141 40 -156 -31 -68 -198 -113 -152 279 -129 -156 81 306 303 166 78 -72 195 -20 -52
7653 -52 -320 -136 179 -4 -103 43 21 122 54 58 -8 -3 -141 -131 76 -120 153 145 65 -21 -159 70 87 59 74 -160
7679 -160 -192 16 158 102 -98 101 -144 -74 268 243 -62 155 255 56 -74 64 -106 -162 31 334 42 -119
7701 -119 -44 18 110 -58 -23 50 139 -83 16 68 -17 83 -198 189 231 -130 -44 169 -13 -24 -327 380 26 10
7725 10 -17 -138 -116 -23 -15 69 132 -160 -51 -181 250 -31 -29 -142 -39 -110 1 -142 -226 -180 69 60 -93 106 -146
7750 -146 -112 276 -58 146 -42 -64 84 78 -203 138 -99 -140 258 288 6 175 -99 14 -165 -111 -178 -170 -56
7773 -56 48 18 -201 139 97 254 93 -84 -13 65 -59 24 23 -67 152 11 -155 184 -198 -46 30 -232 207
7796 207 -191 9 -13 5 39 153 -61 -4 86 208 -61 44 46 229 208 -182 118 198 17 -225 -202 78 132 -156
7820 -156 -160 -307 11 206 115 112 104 161 -13 91 -161 -362 168 214 -141 -4 -4 -129 -83 -229 82 -51 -183 258
7844 258 133 138 18 -160 -319 93 -142 230 -51 -358 -182 -78 -63 -61 -21 -113 126 75 67 122 82 -220 172 197
7868 197 47 -35 -58 117 79 40 -41 -37 -82 289 -154 53 6 -225 -8 212 53 91 -66 102 291 43 -12 115
7892 115 -6 42 188 -27 -15 55 -29 -125 127 111 268 245 -233 -76 222 -110 348 -234 -149 239 -122 155 -24
7915 -24 237 38 77 17 -87 152 -68 260 -250 -37 73 -150 30 -301 -209 91 -43 112 83 -52 188 64
7937 64 -12 -7 96 127 -64 -69 -59 83 88 -196 104 1 -139 97 -100 -61 -261 -172 71 79 -23 -20 -109 96 -222 -87
7963 -87 -170 97 -59 89 48 -10 -359 -168 111 9 -96 -290 -82 -107 64 57 159 -63 -101 -163 327 -245 -102
7986 -102 -8 55 78 111 -16 -34 -102 221 345 -41 140 210 -79 -120 133 277 -124 339 145 162 101 21 152 -252
8010 -252 37 214 -26 -435 39 -132 -42 -145 -5 245 104 79 100 -10 -14 -25 81 -53 -46 -133 -177 68 -121
8033 -121 -215 56 -64 -321 2 142 -334 -37 -315 -34 15 7 -134 -83 -200 -142 -27 -176 -17 -101 303 197
8055 197 -222 31 -141 -61 98 13 -63 129 117 70 187 -230 53 -41 -1 -21 26 -163 203 111 -52 387 -29
8078 -29 -200 -184 -205 8 326 -83 184 94 -125 76 154 -181 -167 30 131 -125 -83 -190 -17 -74 424 219 -279
8101 -279 190 -77 -210 -88 234 -49 53 180 10 -10 147 69 139 -76 29 -35 -52 27 221 -168 260 24
8123 24 303 92 104 5 26 -57 273 194 -328 36 -34 -345 250 107 269 203 -60 -64 -304 -85 77 11 -179 126
8147 126 33 -190 -78 -53 -90 3 180 -80 122 -177 -54 -17 -73 199 -86 -190 -26 9 -5 25 55 -72 160
8170 160 -36 24 130 -373 59 45 -38 -169 -109 -141 -177 96 136 -205 -141 -198 -50 79 125 304 -337
8191c37
##END NTUPLES=NMR FID
##END=
