##TITLE=1H_Pr Q-18-1
 200.13MHz,CDCl3.
 8 sc
 
 18.12.2025
##JCAMPDX= 6.0         $$ Bruker NMR JCAMP-DX V2.0
##DATA TYPE= NMR FID
##DATA CLASS= NTUPLES
##ORIGIN= UXNMR, Bruker Analytische Messtechnik GmbH
##OWNER= pz
$$ XWIN-NMR		Version 3.5
$$ Thu Dec 18 16:04:14 2025 Russian Standard Time (UT+4h)  she@DPX200
##.OBSERVE FREQUENCY= 200.1313
##.OBSERVE NUCLEUS= ^1H
##.DELAY= (6, 6)
##.ACQUISITION MODE= SIMULTANEOUS
##.ACQUISITION SCHEME= undefined
##.AVERAGES= 8
##.DIGITISER RES= 18
##SPECTROMETER/DATA SYSTEM= spect
##.PULSE SEQUENCE= zg30
##.SOLVENT NAME= CDCl3
##.SHIFT REFERENCE= (INTERNAL, CDCl3, 0, 14.3821)
##AUDIT TRAIL= $$ (NUMBER, WHEN, WHO, WHERE, WHAT)
$$ ##TITLE= Audit trail, XWIN-NMR		Version 3.5
$$ ##JCAMPDX= 5.01
$$ ##ORIGIN= Bruker BioSpin GmbH
$$ ##OWNER= she
$$ F:/spectra/data/she/nmr/H-C/1/audita.txt
$$ ##AUDIT TRAIL=  $$ (NUMBER, WHEN, WHO, WHERE, WHAT)
(   1,<2025-12-18 16:02:56.32 +0400>,<she>,<DPX200>,
      <created by zg, POWCHK disabled, PULCHK disabled
       configuration hash MD5:
       00 E9 B6 7A A2 85 ED C7 34 08 36 98 17 FE 4E 26
       data hash MD5: 16K
       84 29 63 63 B5 BB 27 63 AA 88 21 41 B3 56 B0 CD>)
$$ ##END=
$$ 
$$ hash MD5
$$ C5 86 23 24 00 CB 17 B6 5F 7F C1 96 A1 62 2D 99
##$RELAX= 
##$RELAX= 
##$RELAX= 
##$RELAX= 
##$RELAX= 
##$RELAX= 
$$ Bruker specific parameters
$$ --------------------------
##$DU= <F:/spectra>
##$EXPNO= 1
##$NAME= <H-C>
##$PROCNO= 1
##$TYPE= <nmr>
##$USER= <she>
##$AMP= (0..31)
100 100 100 100 100 100 100 100 100 100 100 100 100 100 100 100 100 100 
100 100 100 100 100 100 100 100 100 100 100 100 100 100 
##$AQSEQ= 0
##$AQ_mod= 1
##$AUNM= <au_zg>
##$AUTOPOS= <>
##$BF1= 200.13
##$BF2= 200.13
##$BF3= 200.13
##$BF4= 200.13
##$BF5= 200.13
##$BF6= 200.13
##$BF7= 200.13
##$BF8= 200.13
##$BYTORDA= 1
##$CFDGTYP= 0
##$CFRGTYP= 5
##$CHEMSTR= <none>
##$CNST= (0..31)
1 1 145 1 1 1 1 1 1 1 1 1 1 1 1 1 1 1 1 1 1 1 1 1 1 1 1 1 1 1 1 1 
##$CPDPRG= <>
##$CPDPRG1= <>
##$CPDPRG2= <>
##$CPDPRG3= <>
##$CPDPRG4= <mlev>
##$CPDPRG5= <mlev>
##$CPDPRG6= <mlev>
##$CPDPRG7= <mlev>
##$CPDPRG8= <mlev>
##$CPDPRGB= <>
##$CPDPRGT= <>
##$D= (0..31)
0 0.7 0 0 0 0 0 0 0 0 0 0.03 0 0 0 0 0 0 0 0 0 0 0 0 0 0 0 0 0 0 0 0 
##$DATE= 1766059375
##$DBL= (0..7)
120 120 120 120 120 120 120 120 
##$DBP= (0..7)
150 150 150 150 150 150 150 150 
##$DBP07= 0
##$DBPNAM0= <>
##$DBPNAM1= <>
##$DBPNAM2= <>
##$DBPNAM3= <>
##$DBPNAM4= <>
##$DBPNAM5= <>
##$DBPNAM6= <>
##$DBPNAM7= <>
##$DBPOAL= (0..7)
0.5 0.5 0.5 0.5 0.5 0.5 0.5 0.5 
##$DBPOFFS= (0..7)
0 0 0 0 0 0 0 0 
##$DE= 6
##$DECBNUC= <off>
##$DECIM= 32
##$DECNUC= <off>
##$DECSTAT= 4
##$DIGMOD= 1
##$DIGTYP= 9
##$DL= (0..7)
0 120 120 120 120 120 120 120 
##$DP= (0..7)
150 150 150 150 150 150 150 150 
##$DP07= 0
##$DPNAME0= <>
##$DPNAME1= <>
##$DPNAME2= <>
##$DPNAME3= <>
##$DPNAME4= <>
##$DPNAME5= <>
##$DPNAME6= <>
##$DPNAME7= <>
##$DPOAL= (0..7)
0.5 0.5 0.5 0.5 0.5 0.5 0.5 0.5 
##$DPOFFS= (0..7)
0 0 0 0 0 0 0 0 
##$DQDMODE= 0
##$DR= 18
##$DS= 0
##$DSLIST= <SSSSSSSSSSSSSSS>
$$ [...]
##$SUBNAM0= <"">
##$SUBNAM1= <"">
##$SUBNAM2= <"">
##$SUBNAM3= <"">
##$SUBNAM4= <"">
##$SUBNAM5= <"">
##$SUBNAM6= <"">
##$SUBNAM7= <"">
##$SUBNAM8= <"">
##$SUBNAM9= <"">
##$SW= 18.0517328524113
##$SWIBOX= (0..15)
0 0 2 0 0 0 0 0 0 0 0 0 0 0 0 0 
##$SW_h= 3612.71676300578
##$TD= 16384
##$TD0= 1
##$TE= 0
##$TE2= 300
##$TE3= 300
##$TEG= 300
##$TL= (0..7)
0 120 120 120 120 120 120 120 
##$TP= (0..7)
150 150 150 150 150 150 150 150 
##$TP07= 0
##$TPNAME0= <>
##$TPNAME1= <>
##$TPNAME2= <>
##$TPNAME3= <>
##$TPNAME4= <>
##$TPNAME5= <>
##$TPNAME6= <>
##$TPNAME7= <>
##$TPOAL= (0..7)
0.5 0.5 0.5 0.5 0.5 0.5 0.5 0.5 
##$TPOFFS= (0..7)
0 0 0 0 0 0 0 0 
##$TUNHIN= 0
##$TUNHOUT= 0
##$TUNXOUT= 0
##$USERA1= <user>
##$USERA2= <user>
##$USERA3= <user>
##$USERA4= <user>
##$USERA5= <user>
##$V9= 5
##$VALIST= <valist>
##$VCLIST= <CCCCCCCCCCCCCCC>
##$VD= 0
##$VDLIST= <DDDDDDDDDDDDDDD>
##$VPLIST= <PPPPPPPPPPPPPPP>
##$VTLIST= <TTTTTTTTTTTTTTT>
##$WBST= 1024
##$WBSW= 4
##$XGAIN= (0..3)
0 0 0 0 
##$XL= 0
##$YL= 0
##$YMAX_a= 26381
##$YMIN_a= -36199
##$ZGOPTNS= <>
##$ZL1= 120
##$ZL2= 120
##$ZL3= 120
##$ZL4= 120
##$ABSF1= 10
##$ABSF2= 0
##$ABSG= 5
##$ABSL= 3
##$ALPHA= 0
##$AQORDER= 0
##$ASSFAC= 0
##$ASSFACI= 0
##$ASSFACX= 0
##$ASSWID= 0
##$AUNMP= <proc_1d>
##$AZFE= 0.1
##$AZFW= 0.1
##$BCFW= 1
##$BC_mod= 2
##$BYTORDP= 1
##$COROFFS= 0
##$CY= -3
##$DATMOD= 1
##$DC= 2
##$DFILT= <>
##$DTYPP= 0
##$F1P= 0
##$F2P= 0
##$FCOR= 0.5
##$FTSIZE= 0
##$FT_mod= 4
##$GAMMA= 1
##$GB= 0.15
##$INTBC= 1
##$INTSCL= 1
##$ISEN= 128
##$LB= 0.25
##$LEV0= 0
##$LPBIN= 0
##$MAXI= 10000
##$MC2= 0
##$MEAN= 0
##$ME_mod= 0
##$MI= 1.114404
##$NCOEF= 0
##$NC_proc= 0
##$NLEV= 6
##$NOISF1= 3.799351
##$NOISF2= 2.8
##$NSP= 1
##$NTH_PI= 0
##$NZP= 0
##$OFFSET= 14.38212
##$PC= 1
##$PHC0= -3695.348
##$PHC1= 0.7923126
##$PH_mod= 1
##$PKNL= yes
##$PPARMOD= 0
##$PSCAL= 0
##$PSIGN= 0
##$REVERSE= no
##$SF= 200.129724274929
##$SI= 16384
##$SIGF1= 3
##$SIGF2= 2
##$SINO= 400
##$SIOLD= 16384
##$SREGLST= <1H.CDCl3>
##$SSB= 0
##$STSI= 0
##$STSR= 0
##$SW_p= 3205.1282051282
##$SYMM= 0
##$S_DEV= 0
##$TDeff= 0
##$TDoff= 0
##$TI= <>
##$TILT= no
##$TM1= 0
##$TM2= 0
##$TOPLEV= 0
##$USERP1= <user>
##$USERP2= <user>
##$USERP3= <user>
##$USERP4= <user>
##$USERP5= <user>
##$WDW= 1
##$XDIM= 8192
##$YMAX_p= 0
##$YMIN_p= 0
$$ End of Bruker specific parameters
$$ ---------------------------------
##NTUPLES= NMR FID
##VAR_NAME=  TIME,          FID/REAL,        FID/IMAG
##SYMBOL=    X,             R,               I
##VAR_TYPE=  INDEPENDENT,   DEPENDENT,       DEPENDENT
##VAR_FORM=  AFFN,          ASDF,            ASDF
##VAR_DIM=   8192,          8192,            8192
##UNITS=     SECONDS,       ARBITRARY UNITS, ARBITRARY UNITS
##FACTOR=    0.0002768,     1,               1
##FIRST=     0,             0,               0
##LAST=      2.2672688,     0,               0
##MIN=       0,             -36199,          0
##MAX=       2.2672688,     26381,           0
$$ Real data points
##PAGE= N=1
##DATA TABLE= (X++(R..R)), XYDATA
0@%%%%%%%%%%%%%%%%%%%%%%%%%%%%%%%jKlNpQrJ0j1J3j6J8j8J9k1K4k6K7k9L1
51A6l5L9m3M8n4O2o9Q0r2J05j25J53j91K47l39N00q33J766p734k9700L1234K3238
73A8273p327p087l296P130r215j1459K4209L846k2056K163K732o96K620p532Q045
88C50N873j6296N642J1259p921K135r31j205J1394p862n139Q782q169Q56P380
103F148q544L336j92j0529P999K115l873O211p625l69R773r078L030J0729j0093
118i62j61M431k305N143p340k889J2739q417o155R632o599j300M252m892O435
133A612j765q058J1868j381p814R089n15k57K894r876M784O811r149M670Q75r296
149e508M989r58k117P085p859n61P626q585K805P044o431N102O4o409P833j267
$$ y = [0, 0, 0, 0, 0, 0, 0, 0, 0, 0, 0, 0, 0, 0, 0, 0, 0, 0, 0, 0, 0, 0, 0, 0, 0, 0, 0, 0, 0, 0, 0, 0, -1, 1, -2, 3, -4, 4, -5, 5, -6, 7, -9, 9, -9, 10, -11, 13, -13, 14, -15, 16, -19, 20, -23, 25, -29, 33, -36, 44, -48, 57, -68, 85, -106, 141, -198, 302, -531, 1235, -6499, -36199, -4965, 18273, 10946, 3859, 563, 7693, -1522, -12981, 11228, 15074, -6982, -4819, -2087, -2783, -163, -7695, 350, 6223, -10073, -4431, 6828, -1093, 1042, 111, -1094, 10300, 2438, -2701, 6081, -2088, -1232, 6148, -2396, 940, 748, -9781, -1782, 333, -3540, 2671, -4954, -5323, 4450, -4628, -1598, 9131, -962, -1123, 3308, 1003, 6146, -1194, -4083, 8656, 239, -5916, 3716, -2883, -4183, 69, -4823, 1612, -153, -8211, 3657, 2276, -5538, 3551, 3036, 2779, 5673, -4203, 581, 7392, -1757, 2913, 3788, -5508, -519, -1477, -3594, 3491, -4368, -4929, 2697, -5888, -3083, 3961, -2470, 2632, 2696, -3713, 4120, 2853]
165B853k910O419p687l26P110q215J633L478q402N194J324n563O548m012k453
180e009Q707m764N38O322p895K406M112n218O478j635q296P060k401l327O241
195C319o804K28M821p576M525L281p514O598Q85n117O592k424j287O451p001J450
211D27N732p844K780J570p316O248m64n631N711m439j709P231n213J442M586p153
227d042N189K947o139O482j216n229O366l482j912N730o915K06L581o857M654
242f37J595o788N708r79l502P780l472j309N526n677L084M390o857M324L07o764
258c271O388j807m686O110n134j574N448n609K470L241o237N037J460n027O692
273C501j474l883O677m050n45M952o444J835K416o776M884j83n821N481k525l034
$$ y = [2853, -57, 6362, -1325, -1651, 5459, -2756, -1123, 2355, -6047, -853, 471, -5092, 1456, -2556, -5009, 3698, -1066, -528, 5794, -2101, 305, 4417, -801, 5677, 4042, -4254, 2806, 405, -2922, 3319, -3485, -3257, 1564, -6012, -1487, 1794, -5720, 878, 1763, -3354, 3238, 814, -473, 5978, -1023, 427, 6159, -1685, 1095, 2665, -4651, 1597, 1133, -4498, 1213, -3226, -4935, 2296, -2917, -1475, 3111, -4042, 1147, 4094, -2045, 4437, 3221, -2008, 4358, 876, -1036, 4694, -2221, -2015, 1566, -5291, -637, 958, -5830, -122, -1101, -4603, 3177, -295, -1604, 3922, -1755, 1329, 5719, -1138, 3186, 3493, -3271, 3117, 1310, -3376, 2734, -2400, -3974, 1474, -4135, -1665, 1576, -4661, 376, 1836, -3191, 3501, 2027, -1856, 4821, 771, 226, 5178, -1266, 569, 2985, -3791, 1093, 910, -4911, 570, -1955, -4989]
289d989P254m460n72N139n295L670L477o165N149j21n460O976k817l328N392n659
305a809k61M533o052K373J709o310N550Q6l811O934l173k603O746l947L87M927
321E279o170K211J739n363N277j211n529N512l708k195N980m495R5M017n910M019
337d52K741m640N097r77l802O506k992j551N299o011K68L695n664K561Q02n584
353d704N012j611l189O171l748j185N755m436J823M066n552L632J400m780N068
368C722j990l634N360m494j199M953n825P87L143n514M187J193m439N407j703
383d6k815P028l863l08M671n581J834L087n664L463j8n314M808k232k317M959
399A692m442p02M776m783K779L241n063L789O59l454N535k103l014N356m623Q1
$$ y = [-4989, 2265, -2195, -2767, 2372, -2923, 747, 4224, -1941, 3208, 3087, -2373, 4603, 1786, -1542, 3850, -1809, -2070, 2463, -3589, -1216, 493, -5817, -267, -181, -3992, 2942, -231, -2834, 3912, -35, 352, 5279, -891, 1320, 3059, -2304, 2973, 1762, -3767, 1745, -1963, -4158, 1822, -2673, -2578, 1439, -4471, -452, 2289, -2351, 2746, 1769, -2033, 4473, 1481, -70, 5229, -782, -514, 3181, -2483, 78, 880, -4704, 308, -1303, -4492, 1679, -2069, -3254, 2501, -1935, -112, 3954, -1598, 2034, 3434, -1346, 3722, 1732, -1902, 3458, -1036, -2235, 2718, -3107, -2320, 823, -4691, -504, 689, -3750, 1657, -46, -2861, 4167, 304, -4, 4667, -914, 920, 4007, -1657, 1806, 1788, -3526, 1282, -950, -3267, 1692, -2750, -3452, 1324, -3459, -680, 2561, -2502, 1287, 1946, -1508, 4027, 1924, -1090, 4266, -357, -276]
415b76L895o127J909J978n810M373K1m447N590k640j332N478l931R37M219n297
431a460K887K504n116M082o79m274N077l264k322M706m886N08L180n248L191K417
447A303n033M458j62l019N551k261j251M493m598J605L450n638J928J108m913
462b979M410j301l864M676l024j079M442m110J530L511m868L685J401m166N293
477C557j408l305M612l025p46L879n720Q27K567m874L592R2m585M797j051k272
493c063N125k852k4M185m410K021K867m921L579j11m583M605j923k738M270m461
509b434r0L797m966K557K150m567M225M79l596N385j492k593M709l436L38L661
525D127m940J345J220m551L987q51m532M572j914j650M640l842N88L844l765K739
$$ y = [-276, 3619, -2508, -599, 1379, -4431, -58, -37, -4484, 1106, -1534, -2866, 2612, -1319, -382, 3837, -1460, 1427, 3931, -1185, 2897, 2218, -2056, 3021, -243, -2565, 2141, -2745, -2237, 943, -4305, -1114, 1303, -3730, 728, 566, -2453, 3098, 837, -414, 4079, -519, 1086, 4536, -1102, 826, 1934, -2979, 1431, 130, -3734, 942, -2082, -3161, 1281, -2829, -1299, 2212, -2656, 1029, 2430, -1736, 3557, 2149, -1156, 3456, 431, -315, 3564, -2156, -1329, 1238, -3636, -44, 48, -4537, 260, -791, -3063, 2062, -790, -814, 3371, -1039, 982, 3849, -1072, 2507, 2396, -2187, 2418, 495, -2243, 2027, -2434, -2524, 1273, -3693, -1136, 1014, -3553, 672, 1151, -2445, 2940, 1448, -1145, 3564, 128, 466, 4127, -813, 532, 1752, -2799, 1188, 337, -4195, 377, -1537, -3187, 1453, -2389, -1801, 2043, -1722, 1017]
541A017J482m036M571m86m043M427k334j461M219m937k51L066m213K685J090n269
557d473M169J75l022N490k915r63M598l642J301K768m112K397O49m206M018j322
573I10l083L975l627j336M641l911N13K505m051L589J511l995M344j022k208M892
589C647k891r72L783m096O03K099m256K900k99m541M046r31k076M446l343o41
605b522M480l182J680K203m482L542J018l613L901k214k033M170l908o46L232
620A626m301J706J564m719L484Q52k913M068j657j572N020l000j4L180l970J802
636A156J860m418K986o00l260L826k563j849L989l493J44L296l919K375K083m035
652b422L765L17k631M143k178j360L992l980P3K583m634K274P83m312L290m14
$$ y = [1017, 2499, -1537, 3034, 2548, -1495, 2932, 598, -863, 3356, -1581, -1832, 1234, -2979, -294, 796, -4473, -304, -129, -3151, 2339, -576, -1539, 3059, -583, 718, 3486, -626, 1771, 2420, -1786, 2232, 910, -2173, 1802, -1825, -3161, 1480, -2431, -1918, 587, -3464, 125, 1636, -2359, 1985, 963, -1245, 3647, 756, -216, 3567, -529, 74, 2173, -2083, 817, 518, -4023, 23, -908, -2984, 1462, -1881, -2522, 1958, -1224, 456, 2659, -1823, 1719, 2737, -876, 3025, 811, -1222, 2948, -960, -1606, 1626, -2675, -969, 595, -4124, -640, 212, -2701, 1367, -290, -1862, 3158, 158, 144, 3324, -646, 1156, 3016, -1402, 1584, 984, -2276, 1550, -1013, -2862, 1127, -2366, -2222, 1074, -2845, -470, 1613, -2422, 1343, 1660, -971, 3172, 994, -366, 3626, -354, -281, 2302, -2332, -58, 725, -3587, -297, -711]
668g11k541M220k408q45M267l124J141K846m096K859J016l411L369j382k615L822
684B407k840j271L275m056J176K191m473K667J335l305L830p73k307M802k324
699C34m78L557m095J430K407m451K292K61l929L761j269k577L604k822k51L299
715A073l410J487K474l690L156P19k846L930j122k409L880l098m11K871m537J475
731d58J524l967K782k5l315L742j149j521M093k578J24L396l501J973J755l690
747h15K980n38l152L669j783k176L176l428L40K642l773J928J317l179L450J24
763G82k601M082j428j277L591k979K85K393l688J583Q96l754K804o18l178L538
779D31j689j246L720l187P76K723l335K673J016l012L444o66k482L741k491j083
$$ y = [-711, -3252, 968, -1440, -2285, 1982, -1142, -1, 2845, -1251, 1608, 2624, -787, 2582, 1200, -1415, 2407, -433, -1704, 1571, -2485, -1309, 882, -3591, -924, 411, -2894, 936, 163, -2144, 2658, 334, -144, 3413, -682, 748, 3155, -1296, 996, 1257, -2672, 1089, -180, -2757, 847, -1975, -2226, 1073, -2337, -850, 1624, -2066, 1090, 1809, -1037, 2893, 1771, -638, 3242, 144, -267, 2604, -1933, -458, 1066, -2901, -119, -144, -3459, 283, -866, -2387, 1706, -872, -748, 2648, -853, 1120, 2875, -815, 2165, 1627, -1525, 2144, 361, -1815, 1361, -2067, -1727, 915, -2858, -930, 387, -2792, 658, 782, -1819, 2263, 835, -442, 3149, 170, 455, 2848, -840, 743, 1639, -2115, 689, 71, -3107, 431, -1258, -2504, 1216, -1971, -1195, 1528, -1807, 866, 1882, -1130, 2314, 1648, -834, 2907, 416, -667]
795f67L077l691L97K035l958K379O27l194L334p05k033L990k115n37L564l087
811e84J370J873l578K594L59l598L388j511k238L237k688p09L047l470J178K164
827H34l280K748N92k710L639j039j703L973k704l92K838l486Q45J396l419K125
843B57j48k911L265j615j472L463k442J22L074l065K076J676l562L192k2k691
859h03L381j892j570L330l390j97K384l516J397J337l499K966Rk320L692j501
875a92q80L415k521M17K676l284J565J152l642K684q81k544L086k149j085K820
891F37k804O15K468l285K392J065k822K945j0j987L418j986q51K926l106M96J869
908A980l756J747N96l234K826o33k110L059j790l75L538k965Q32K550l428K601
$$ y = [-667, 2410, -1281, -884, 1151, -2807, -428, 199, -2995, 339, -366, -2399, 1591, -524, -1061, 2503, -584, 786, 2659, -919, 1675, 2034, -1564, 1824, 313, -1925, 1312, -1376, -2085, 962, -2508, -1330, 834, -2446, 302, 894, -1816, 1823, 784, -919, 3054, 350, -42, 2796, -690, 155, 1551, -1868, 257, 109, -2802, 463, -1152, -2624, 839, -1603, -1481, 1593, -1472, 604, 2280, -1282, 1910, 1888, -803, 2578, 686, -884, 2446, -944, -1141, 1243, -2273, -876, 461, -3038, -72, -63, -2383, 1309, -192, -1072, 2343, -178, 239, 2915, -369, 1196, 2348, -1294, 1390, 509, -2035, 1051, -1098, -2183, 637, -2167, -1552, 916, -2369, 23, 1088, -1734, 1211, 1201, -786, 2632, 646, -205, 2721, -385, 111, 1980, -1776, -29, 567, -2667, 159, -474, -2584, 475, -1315, -1690, 1848, -1117, -285, 2265, -1163, 1438]
924A438P91l253L191j212k126L185k578o26K841l818J169J563l287K498N28k677
940b373L103n92j250L127j990q0K671l544J598J952m095K113P8j788J564p15k142
957b363L361k815k42K990l144J678J834k850K592O3k330L702j397j463K825k720
973b79J12K000l191J200J182l653K569j4k364L013j449r29L445k444N12K444l027
990h73J749J339l147K686p74k160K826j819j263K686k975K05J960l093K294N50
1006A91k378K341J53j529K958j064q76K635k355L08K118l893K105M62l047L018
1022A147j280k130L590k818n98L150k911J196J833k346K229O94l152K899L12k290
1038d75K061j489p10J731j600m13J954k742J215R50k903K705q02j616L593k019
$$ y = [1438, 2229, -1024, 2167, 955, -1171, 2014, -564, -1190, 1651, -2167, -998, 565, -2722, -224, 304, -2373, 730, 138, -1112, 2015, 25, -55, 2616, -928, 670, 2622, -1473, 640, 718, -1070, 494, -221, -2363, 998, -1817, -2059, 931, -2213, -535, 1299, -1551, 1041, 1104, -1226, 2476, 1079, -384, 2441, -279, -167, 1833, -1358, -158, 1024, -2629, -60, -74, -2438, 575, -874, -1803, 1642, -802, -290, 2154, -873, 876, 2215, -932, 1754, 980, -1180, 1646, -173, -1436, 1250, -1725, -1520, 440, -2653, -359, 191, -2187, 154, 307, -1222, 1736, 672, -204, 2431, 76, 384, 2502, -1391, 714, 1176, -1871, 1147, -133, -2263, 1327, -1491, -2089, 1061, -1850, -654, 1179, -1167, 1062, 1756, -1396, 1503, 1815, -475, 1586, 97, -613, 1118, -482, -895, 1059, -1683, -468, 482, -2421, 284, -518, -2134, 1459, -560]
1054e60j94K834k591J011J773k822J923r7k374K657j354j768K743k515k21K478
1070I23k896J136J394k655K664l6k165L559j216j207K857k379P6K031k650R27
1086C63P36k651J975m82k475L133j642q00K754k280L48K743k976J540J131k294
1102h77K597n63j965K896j393j479K678k872J88J722k797J251P36k497K670n42
1118b47j527K752j527k07K765k520N78K329k614J138M33k424K337r08k018K355
1134F95j632p45K631k664L88J962k374J823N65k117K715n90j203K552j674n28
1150a96K351k326M91J294l188J343O33k556J840j45j416K669j960M4K383k173
1166i12P61J722k362K055J44k228K438q39j446K400k436k61K124k732P24J254
$$ y = [-560, -754, 2080, -511, 500, 2273, -549, 1374, 1277, -1097, 1560, 206, -1562, 1181, -1334, -1555, 923, -1973, -837, 557, -2098, 566, 530, -1635, 1924, 708, -499, 2358, -21, 55, 2086, -564, 363, 1099, -1552, 423, -59, -2534, 599, -1043, -1843, 911, -1369, -1021, 1722, -1254, 286, 1417, -877, 1720, 1157, -808, 2088, 695, -784, 1894, -978, -790, 932, -1865, -614, 122, -2375, 295, -247, -1774, 978, -549, -756, 2009, -511, 67, 2396, -218, 920, 1353, -1071, 1266, 358, -1660, 695, -937, -1682, 949, -1715, -1327, 635, -1739, 84, 649, -1468, 1247, 657, -546, 2006, 332, -196, 2155, -171, 320, 1614, -1574, -231, 402, -2154, -314, -459, -1875, 794, -1166, -1122, 1261, -912, -151, 1571, -791, 1264, 1408, -820, 1618, 779, -667, 1733, -703, -964, 1160, -1572, -848, 406]
1182D06k680K060J71j857K923r96r21K744k073M70J984k631Q95J307k555J566
1198H13j06k265K038r63j154K398j989j9J883k230J604R39k257K113K85j598K129
1215A621j061r24K419k326KJ613k524J072P10k566J936j89j696K478j424m03K379
1232A117j664M32J701k467J723O41j941J791n75j478K364j710j156K100k179M04
1248h97J317k430J852M54k067K356j56j476K477j134n46K097k163O55J494k504
1264f71J272J73k286K092r56j249K273j801m15K325k091J028J168k149K088M10
1280A211j832K146p65j394K332j564m52J721k423P76J088k602J605O6j708K181
1296C86q46j057K597j448j47K079k059J019J040k136J714O1k161K171j340j174
$$ y = [406, -2274, -214, -43, -1900, 1023, 27, -894, 1850, -223, 247, 2231, -400, 495, 1802, -753, 813, 707, -1558, 480, -483, -1637, 761, -1228, -1247, 636, -1594, 10, 949, -1308, 805, 1090, -508, 1621, 560, -364, 2055, -271, -269, 1344, -1180, -108, 602, -1964, -28, -217, -1913, 565, -859, -1262, 1117, -547, -115, 1586, -881, 842, 1483, -458, 1333, 758, -720, 1644, -66, -1222, 878, -1301, -897, 420, -2010, -158, 296, -1771, 585, 429, -1047, 1430, 296, -250, 1847, -316, 339, 1833, -671, 601, 774, -1512, 580, -376, -1625, 648, -1153, -1568, 757, -1334, -306, 862, -1287, 801, 1211, -621, 1525, 760, -634, 1698, 134, -318, 1403, -1020, -244, 844, -1758, -153, -87, -1795, 386, -460, -1517, 1080, -368, -515, 1564, -495, 524, 1564, -572, 1142, 1203, -958, 1213, -127, -1301]
1312a301K189j885j86J480j856R75J120k097J808L11j615K361q62r23K247j663
1328A03J52J467k418P72Q57k137J848n66j855K179r90r47J937j586N08J812k142
1345a006J458Q39k011J864k42j495K247j488p52K026k098K49J049k259J028O71
1361H0k029K091k48j247K169j054m75K144j687N26J481k243J189K45j636J743
1377A049p31j527J831j596m6J430j767N06J402j773J324O61j692J996m57j025
1393d15K123j239n03J804k205N32Q47k168J597j72j922K029q21j089K232j355
1409g25j46J998j759O32J068j577J370j6j143J562p50j014J500j562j84J501j968
1426a213P60Q21j986J552K34j418J816n08o38K002j334J9J443j767P58N15j744
$$ y = [-1301, 888, -997, -1183, 297, -1559, -584, 536, -1561, 247, 558, -1057, 1304, 442, -481, 1766, 103, 255, 1722, -696, 76, 933, -1204, 644, 78, -1777, 402, -588, -1535, 402, -1184, -676, 1136, -1006, 452, 1291, -720, 1144, 902, -593, 1654, 166, -586, 1440, -658, -409, 640, -1619, -591, 80, -1949, 142, -106, -1353, 816, -238, -713, 1431, -256, 270, 1751, -492, 697, 942, -694, 1049, 318, -1209, 622, -974, -1020, 410, -1357, -851, 551, -1222, 102, 763, -929, 1067, 610, -415, 1708, 469, -34, 1770, -435, 97, 944, -1224, 373, 201, -1721, 308, -513, -1602, 630, -725, -871, 1127, -632, 0, 1068, -509, 861, 845, -298, 1264, 514, -500, 1000, -562, -746, 755, -1213, -453, 368, -1618, -66, 168, -1250, 566, 58, -580, 1422, 88, 107, 1550, -217, 541, 1056, -688]
1443f88J413k41j511J675j234o33J472j224J29J386j688R29J038j656J554P6j041
1460b44J544p20p22J682j709k0J123k121Q71M97j511J360k69j392K110q81l59
1477g61J694j531N07J374j691J182L94j399J246l38j432J689j037o58J537j803
1493a027K65J027j693J313M55j772J971k90q30J717j075j79J519j563N26P65j849
1510g20J182J68j635J502p69j035J749j389r6J378j165N16R64j549J444N70j694
1527e79J861p77q47J658j361j48J165j855L31P71j644J375k9j155J531n64m46
1544g13J764j466J67J444j447P43P05j704J350j53j263J301r52o69J572j491J86
1561f26P02j059O72M04j190J308K95j209J747q28n22J626j493L22R40j737P84
$$ y = [-688, 725, 484, -1027, 648, -586, -1219, 253, -971, -842, 544, -1144, -215, 823, -833, 721, 797, -244, 1300, 580, -142, 1540, -169, -189, 934, -1187, -316, 181, -1330, 30, -239, -1631, 479, -402, -761, 933, -598, -91, 1283, -408, 774, 1168, -231, 1015, 677, -755, 934, -103, -761, 776, -1027, -762, 265, -1428, -115, 340, -1432, 539, 249, -581, 1136, 61, -118, 1401, -162, 364, 1129, -720, 462, 630, -1005, 497, -272, -1307, 442, -947, -1043, 335, -830, -314, 650, -899, 545, 1115, -579, 1282, 505, -342, 1316, -45, -193, 972, -883, -552, 219, -1425, -50, -79, -1234, 297, -267, -713, 1051, -415, -248, 1196, -251, 492, 1197, -507, 843, 690, -573, 728, -224, -893, 679, -812, -626, 76, -983, -311, 93, -1097, 211, 506, -703, 1044, 216, -306, 1320, -173, 149, 1089, -648, 136]
1578A36M53j488J167l93j176J584r15m64J563j135j3J238j125R04N52j146J176
1595I18p7r72J332j039j45J207j755K28Q54j645Q77M68j344J106j22q26J424o90
1613b01k54J613j500O50R29j581R55O3j057R40m13r05J336j192j92J215j616P62
1631d48O38j233R82M33j064J349k19q18J644j010k37R63j171K10N23j392P50P9
1649b1j160J156l97n72J403j058J35J231j245P27P00j207R96R5j058J412j067
1666G0n75J179j132j29R22j088L31N04j169J113J07j011J223l75l89J376q03J88
1684C42P88j740J060M87j399J133m14j214J191n29m04J099j279J85J231j291O69
1701h5M40r93J382o6r81J361p51n14J092j242K58Q75j372O29q0j081J139J9r84
$$ y = [136, 589, -899, 268, -125, -1301, 283, -632, -1096, 467, -668, -681, 557, -568, 336, 888, -258, 918, 841, -131, 1201, 162, 17, 1224, -531, -303, 551, -1094, -217, 251, -1093, 13, -109, -935, 489, -201, -455, 1158, -342, 308, 1237, -344, 611, 674, -383, 557, 144, -761, 575, -617, -809, 406, -1210, -448, 190, -1043, -61, 372, -692, 657, 438, -380, 1264, 254, 17, 980, -191, 19, 542, -850, -100, -21, -1181, -25, -422, -994, 409, -649, -514, 717, -528, 199, 899, -308, 688, 783, -275, 1137, 70, -505, 674, -458, -587, 335, -753, -422, 82, -1087, 26, 133, -878, 345, -30, -419, 957, 154, 342, 1130, -610, 450, 937, -462, 671, 257, -957, 234, -295, -699, 400, -879, -694, 537, -754, -85, 355, -638, 744, 678, -303, 1058, 307, -207, 885, -357, -99, 776, -596, 33, -47, -1128, 11, 30, -954]
1720i54J176n03n17J374p50L86M02q84Q02K75j074J195p11o35J028q41k67R75
1738D77j190M9R45j197J072J16j213J160p6m73J106q25O3J222j274L32O68j289
1756c27P27l04q61Q77j11j033J399j092k4J130j043L84R20q99P93J07q16J102
1774I29n08n04J027j221j86J041j121J01P98j215P73j34q60J292m17o09J487q61
1792a88J78R24j333R47L01r07Q57m50q02R95n00n96J091j071j34Q71r85N21N98
1811C17j280J029J31q13J446n54j68P19q61K47O73j289M98K03q39P11m78m80R24
1830A36m93m13J111q74M28N78q38N36N00r90R79l25o81J052o48l54O80p88K21
1849a83M44j259J121p7q43Q34ll95Q68n69o9R14j022M16O18j121Q06j93p88J140
$$ y = [-954, 222, -281, -798, 576, -174, 212, 614, -270, 532, 807, -267, 928, 217, -418, 610, -231, -498, 477, -713, -664, 281, -916, 156, 272, -941, 219, 143, -330, 776, -49, 14, 1236, -38, 294, 962, -327, 400, 96, -765, 112, 1, -1032, 367, -725, -749, 381, -662, -278, 642, -257, 536, 643, -173, 929, 421, -83, 944, -277, -463, 578, -543, -442, 356, -859, -86, -220, -1080, 212, -205, -814, 673, -188, -10, 914, -419, 528, 829, -78, 779, 329, -473, 522, 22, -574, 517, -554, -688, 183, -802, -281, 317, -963, 66, 197, -616, 830, 276, 108, 827, -34, 213, 886, -403, 95, 298, -541, 170, -308, -788, 136, -357, -770, 341, -533, -105, 473, -365, 171, 671, -319, 660, 335, -346, 706, 58, -296, 384, -404, -183, 261, -998, 123, 46, -797, 37, 34, -361, 507, -62, -131, 783, -239, 177, 795, -326, 480, 287, -501, 639]
1869F39n03o40J119r03l71J058j055K91O49r40Q54J21q55J162j65p31J201o67
1887B64k46Q99j175M04L17j065O47k36n15O38l77j52J080r61J35P76o81L63O05
1906G20r46P21K1p77Q61n99k45O56p21j39O66q55L09M00q96R03j7p40Q97j20m89
1927c90J130n52o3Q36j115N97K09j125P70p5q10P61n67k56O85n31O4O51j024P89
1947a6L04m63M68J56n01Q06o56l03Q29p78m6N20q34M13L69j003Q44k76l51O24
1967A06m42P5P37q11K47O80q04O25K85r33O77k61p89J112n91k74P82r92K52L90
1987G1q65Q95lq21R80j48j43P59o28j82Q05o73J13Mo56P35j18q50Q93m59k67Q81
2009C23o97k18J036q59O65Jn42O06J14p60R97l97l67Q36p03k38O65r24N8N09q18
$$ y = [639, 136, -504, 615, -288, -659, 399, -656, -365, 284, -656, 198, 319, -536, 626, 461, -270, 931, 264, 18, 917, -258, 146, 463, -602, 45, -191, -706, -68, -445, -597, 483, -478, -343, 433, -248, 115, 720, -226, 495, 516, -261, 600, 1, -244, 412, -309, -448, 218, -637, -328, 72, -824, 79, 62, -678, 219, 99, -390, 740, 188, 125, 961, -154, 443, 652, -473, 297, 222, -588, 173, -394, -650, 35, -496, -432, 219, -805, -16, 288, -175, 293, 449, -52, 754, 98, -205, 624, -154, -200, 320, -514, -101, 268, -735, 109, -167, -518, 106, -336, -261, 476, -335, -88, 592, -212, 413, 698, -235, 442, 181, -608, 504, -87, -361, 421, -571, -319, 71, -794, 101, 98, -723, 257, 109, -34, 725, 97, -85, 720, 47, 160, 164, -492, 243, 125, -725, 168, -291, -558, 323, -374, -592, 444, -415, 250, 251, -291, 315, 429, -331, 666, 269, -98, 738, 35, -203, 462, -462, -404, 105, -713]
2030g13N87L9p74R27l94j2P65m17j09P40q28L76M02r35R14m29o13R45n49l21N97
2051A98p29R1M22p55M93K23n63P61J20o69J025n24k29P86p71J62O03r45M76M8
2071B23q09R41m42p44J086m54m13Q93o24J0N56o07O08N17q14O50l71m84P85m75
2091C2k22N24o60J6O22j121O05K56n33N03m7k24P68o45j68R33r04L46N37p81N61
2112C98lo18O48o12k66P98o52k54P74q19N31L61q79Q47J75n42O45k81m50O75k92
2133A84j6L81p85L80R0p90O23n5o34O79k60n18J205o79j17P81m97J44L67r66R41
2154D58j46k84O08m36p04P59n57j52P52q16J17N05q11Q13M1m78P10n34J07P10
2174F62r33J63Q86r97K83J95l26L20k79m58Q10n92l13Q73q15K51L37o55O36K82
$$ y = [-713, -126, -87, -861, 66, -328, -340, 425, 8, -101, 639, -189, 187, 589, -346, 568, 139, -474, 471, -78, -399, 198, -531, -440, -18, -773, -280, -57, -620, 141, 261, -408, 617, 93, -136, 650, -121, 41, 644, -301, 175, 223, -586, 355, -87, -831, 255, -199, -612, 281, -343, -333, 223, -384, 224, 741, -73, 577, 206, -278, 507, 32, -190, 334, -326, -310, 312, -809, -204, 52, -481, 22, -25, -249, 519, -126, -294, 639, -265, 81, 618, -163, 398, 395, -223, 425, -187, -453, 345, -307, -561, 213, -606, -75, 286, -593, 254, 429, -113, 532, 251, -199, 476, 184, 168, 549, -236, 144, 234, -556, 67, 12, -622, 57, -203, -721, 484, -195, -312, 469, -28, 116, 483, -483, 458, 312, 28, 636, 200, -504, 255, -302, -454, 298, -518, -401, 104, -707, 106, 147, -331, 379, -155, -48, 662, -271, -108, 778, -219, 64, 259, -67, 253, -26, -484, 326, -266, -579, 294, -521, -270, 67, -588, 48, 330]
2194C30n91N67J17q12Q02j35j22L48m75j97O07q83N28l9p05P00p1n31R39p55J82
2215a96Q12n95P5M56n07L66l7n81O91j96n99N98m28k26O50o75K65K14n70L64J65
2236D6n04P35j59j18L46l80L4N66p04K59J88l50J65o1n03L99j31l30N15l18k98
2257f03P80n73M73M24o55M22N2n03M81j11l82P66n54j29K05l12J32Mn36P86j7
2278A50n08O78l80k86Q00p48J20O32n50L36ql60M69m0o66N47l01l15N78m81K48
2299h5L03p34L24L61m20N13j02l74O51l22l53P01k93j37L17n28K18J31n01L21
2319il0l58O21l68j14O28m79N8L77l49K15K94o86N99j40l71P52o92RL06n24o6
2341c27O35p32M88pl76M65m77M5P33n03k3L66m77L68J73n45N32k53k89N42l60
$$ y = [330, -261, 306, 423, -389, 413, 278, 156, 504, 29, -168, 439, -444, 84, 45, -660, 40, -31, -562, 377, -378, -196, 616, 21, 96, 552, 45, 411, 374, -207, 484, 288, -311, 287, -141, -367, 283, -392, -127, 87, -483, -119, 46, -458, 277, 118, 0, 346, -34, 0, 566, -138, 121, 309, -41, 124, 63, -440, -41, -172, -502, 13, -305, -603, 177, -396, 77, 501, -154, 268, 320, -183, 298, 187, -195, 571, 17, -112, 93, -219, -87, -83, -619, 167, 150, -358, 320, -60, -346, 454, -294, -174, 458, -92, 244, 236, -124, 345, 305, -361, 186, -115, -430, 148, -333, -85, 218, -516, -192, 169, -251, 262, 160, -214, 437, 115, -238, 463, 170, 33, 350, -178, 40, 171, -330, -9, -39, -397, 224, -144, -258, 370, -109, -51, 326, -23, 192, 486, -200, 399, 259, -112, 640, -52, -43, 263, -261, -327, 308, -424, 64, 57, -319, 146, -331, -286, 447, -56, -79, 287, -190, 178, 351, -194, 338, 85, -204, 338, -22]
2362b2j83M63p86J73M41m47K97j5m41M57K08l49N58k24k26Q32o94j95M77n55L41
2383A10l3j89J82J98n58L96k18k04N61l64J7M45m28J37K63m50L53j10k82N99l20
2404A05k63J79j28j51M15n02M08j49k64M03Jn40P71j02n0J86l19J02K77m29K86
2425B36j16l28N90n84o5J73j7k66L24k06J49M43p43N39K25n75L60Pr1L77n68j8
2447a54M59k05j59J35k94MK48l07L58j74j18L44j03j61K22j2j03L70m87K58L37
2468D58o17N29j23o07M76l05m0L55n09J99J92l92L47J25m33N00k06K8L54k57j39
2489f5L17l28K35J68o14M32r9l28M99l25j06J49m33K79K45k96K25J51j94J31K46
2510B89l87K78j6l84M66l60m0L14k41LO5p1J5P1j88K36K4k98M81n08L52L0k01
$$ y = [-22, -205, 258, -528, -355, 86, -361, -64, -79, -520, -63, 145, -204, 354, 130, -96, 736, 42, -153, 324, -231, 110, 77, -112, 70, 268, -290, 106, -112, -316, 245, -119, -102, 343, -85, 52, 315, -135, 218, 108, -174, 425, 105, -158, 21, -107, -258, 157, -345, 63, -86, -350, 53, 54, -486, 285, 183, 133, 319, 0, 102, 379, -50, 236, 120, -208, 382, -202, -267, -94, -111, -377, -53, -259, -110, 333, -410, 129, 354, -221, 139, 146, 55, 432, -136, -154, 305, 100, -59, 76, -218, -214, 34, -273, 85, -89, -207, 137, 34, -127, 95, 83, -20, 350, -137, 121, 458, -159, 370, 247, -360, 116, -189, -229, 126, -383, -184, 8, -384, -37, 88, -345, 155, -51, -23, 331, 74, -65, 252, -76, 159, 327, -287, 145, 46, -282, 217, -108, -214, -65, -498, -219, 26, -270, -45, 106, -88, 43, 289, -98, 180, 164, -220, 246, -114, -154, 160, -81, -78, -13, -84, -69, 2, -186, 50, 74, -224, 257, -251, 101, 131, -70]
2533g0J72r2j24K61j06j05M24l69k4j34j19J19L28m05L43Nj01K15o8m50N73j56
2555A17j35L55k61j48K09l92J82K62m47M75k86l45L68j37J6K67k02M7K17m53N4
2576b37N50m08L95k89k80O19m89j5L85k76MJ62k86K54q8j76K09k74J53L10l30
2597a07m5L53m75L34O1k43J62J62n43M74J11j83J79l81L6k4O9l18L08j80K22K21
2619A93j81K98l16j83N67n44J80L00n91K87J1m68L55j24j6M04l52M2L02k74J55
2640D5K13j98N9j24j29L93k76k12M07p4j41K18k62J8J87k62J81j3j18M66m53r7
2662a72L97j12j47K27k18m3K85k65M8J09m66L56k3l03O35l45j73K99k48J78n5
2683c6m02M59K53l91M6oO4K21R1m74L77j74j34K86n0n3N9k54J64k34M2M18j08
$$ y = [-70, 102, 10, -114, 147, 41, -64, 360, -9, -33, -167, -286, -167, 161, -244, 99, 104, 3, 218, 150, -300, 273, 117, -18, 337, 76, -72, 137, -255, -73, 189, -258, 217, -69, -414, -46, -183, -167, 100, -102, -55, 162, -291, -237, 313, -95, 300, 11, -269, 350, -139, -154, 231, -45, -41, 121, -165, 89, 1, -175, 34, -240, -87, 223, -107, -152, 201, -274, 60, 121, -122, 40, 202, -341, 133, 244, 61, 240, -141, -105, -129, -60, -378, -70, -250, -28, 193, 12, 310, -6, -189, 378, -166, 14, 314, -277, 10, 21, -447, -92, -216, -232, 172, -180, -138, 164, -110, 45, 258, 60, 119, -5, -134, 259, -17, -229, 178, 104, -37, 181, -81, -63, 124, -138, 43, 30, -88, 378, -75, -172, 225, 113, -34, 193, -25, -68, 217, -48, 0, 109, -357, -1, -24, -327, 308, -37, -210, 89, -159, 19, -36, -438, 21, 274, -117, -71, -77, -13, 208, 299, -175, 202, 28, -106, 180, 130, 77, 136, -118, 46, -188, -146, 272, 164]
2706A64k19J34j66K36L61n26Q1J50l43O8Q6j80L30j13r1J93l03K19r4p1K94k25
2728a5k0l1J06j38J96k00M3K73o3k32J12p4J2J15n5K31m02LK20q0j68M94l39P7
2752F5K1Q6k5n5j60K18j43j4k7J28J20j03k72k0K43l22L56j73j46Q8J74k11L57
2775A85j06RK13l33N0L70l16k1K5j50K65m20K33N4k43K4K08o7J9J29m93O15j47
2798A03j79J11j33oK94j13j48K59n26K13L7J40q7J11L2l9n6M0K6j42J29Q2Po5
2822I0k02kQ7j9J58k6p9j33K47o3k06K96k75J52l0k16K64p8m3K59j34K3J08k75
2846i7P4J0k0j2J81k58N0J73k77J75J7j3J76j83o6K64j58kR8j27N3R4k58J75n8
2871A1j04K96l28K15M8k62L79l39J69p3J3J6j30K38j91J67l0k4J30n9p0K3j43
$$ y = [164, -55, 79, -87, 149, 510, -16, 65, 215, -128, -60, 26, -154, 176, 63, -28, 165, -138, 81, -13, -84, 210, -15, -35, -66, 40, -98, 98, -102, -59, 214, 151, -81, 31, -43, -31, 84, 29, 260, -142, -139, 81, 1, -167, 327, -12, 65, 86, 172, 147, 92, -68, 150, 7, -7, -34, 94, 214, 111, -161, -181, 62, -260, 96, -77, -223, -135, 39, -172, 185, 79, 88, 301, -32, 18, 388, 72, 51, 76, -74, 191, -229, 4, 58, -185, -161, 47, -20, -1, 128, -365, 250, 103, -76, 35, -98, -104, 190, 77, -71, 188, -338, -125, -88, 52, -35, 76, 108, 69, 13, 53, 79, -63, 66, 148, 155, 90, -112, -114, -27, -46, 112, 86, 7, -126, 121, 58, -148, 148, -127, 25, -5, -221, 43, -35, -78, 181, 47, 70, 178, -97, -23, -13, -33, -45, 136, -122, -72, 101, -176, -1, 16, 3, 179, -4, -70, 194, 36, 34, 132, 5, 58, 152, -106, 69, 11, -93, 203, -125, 90, 138, -124, 255, -84, 85, 12, 25, 41, -89, 149, -42, 125, 95, 71, 201, 142, 72, 95, -48]
2894d8R0l0j13K25O6k97n1j60J48K76l6o6n1l3K28k20J65J17j12j73J88j66J03
2917E0o2l9K6K25k53Q5M8k2j64j28J88J08k00J86k12k2N9J7J97Q7j78j92J59k7
2941f4mK03k28QL0J37j27O0P4j59J45j88K62k29J31P8o7R9p5m3j76q6O1L77j00
2966A19r1J66k49j00K60k14J12L5o2n0K53j32J4J85j30k01M4J88j79j52k03L77
2988a0k44K76nk88J60J08o9rN1m0RQ4r7J33l1L0o4k05L55L9k59K46j34n2l5m4
3014i5J20j89J3J17KK4N8j00k9P2P9%J87k56J37j90j37R6J62n1J37m8j78J29k4
3039C6o2M2k43L4K06K0Q6N9m50L36j9R9K41l32j28J19nj97O5lJ35m5J9L9j43J40
3065D9j41l1J78j9q7J9l5j05J43K04k76J82r2k67M20j57k49M80Qj68m5r7K4J26
$$ y = [-48, 42, 12, -101, 124, 190, -107, -158, -318, -170, 106, 70, 4, -47, -80, 148, -72, 93, 210, 98, -75, 113, -53, 50, -12, -51, -25, 200, -53, 32, 80, 58, -106, -234, -46, 62, -138, 48, -164, -186, -127, -110, 87, 174, -4, -196, -37, -64, -68, 135, -93, -85, -55, 82, -45, 15, 89, -70, 75, -113, 149, -80, 51, 129, 62, 161, 86, 43, -133, -219, -158, 219, 119, 28, 194, -55, -155, 105, -109, 3, 38, -24, -74, 179, 47, 61, 246, 116, -85, -41, 147, -32, -184, -387, -10, -254, 22, 17, -271, -111, -3, -72, -81, -30, -70, -61, 23, -74, 59, 28, 58, -6, -211, 144, 183, -76, 170, 36, -16, -51, -95, 25, -164, -151, -34, -32, -8, 50, -50, -79, -7, 72, 72, 259, 3, 140, -50, -187, -91, 71, 20, 157, 109, -69, 60, 36, -26, 16, -227, -193, 13, 33, 119, 178, -272, 64, 45, 144, 385, 53, -75, 44, 39, -158, -93, -96, 39, -6, 13, 52, -91, 49, -92, -123, 55, 36, -51, -32, -67, -172, -29, 175, -101, 81, -11, -278, 142, -15, -264, 216, 224, 56, 11, -86, -62, 64]
3089F4k5j24Pk5J97L1j86K3pm3J53k26n9K45o5q5P2J0r0O8J05k00J43o4Q4jn7
3116e5J87k70O6j50N17l85J65p5J17J6l10J74p6k4J26Q1J17k01l06M76k28J33
3138I5k79K7K06j83J40j13J39q9r0J96m3r9O5J51O5l32J87j24J05J7p4O6j9k25
3162b11J89L0m9O3Q1j40j91L19j03n8K12J22l17J70j00r8J39M4j61l8J93j47k07
3185b58K63j34l98N37j1q5j8Q1M6Q7j21Qj01m1J81p0K52k37K27j74j01J60q2J6
3209B7J47j46K7J31j79j33J09K49j87KJ43k36MJ77j30K0J35l05k0J87o3J43K8
3232A30Ok01J31j56p7M10m28J47j23M23o83K49L37m83P88q02L71j58k98Q35J28
3253E46m64M55k76M5l63J97J92k55m7J79p6n3n5j66J83r7K04k61n4L68l1k45Q5
$$ y = [64, 39, -85, -78, -103, 94, 125, -61, -38, -45, -88, 65, -161, -220, 25, -40, -125, -53, -43, -133, -65, 40, -160, -17, -81, 3, 2, -55, 132, -138, -72, -222, 295, -90, 75, 0, 117, 133, -177, -3, -79, -103, 23, 104, 221, 20, -286, 190, -38, 95, -184, -157, 49, -134, 6, -107, 32, -57, -147, 49, 6, -93, -28, 123, 188, -144, 43, -81, 24, 41, -33, 33, 14, -211, -22, 8, -41, 22, 103, -37, -228, 91, -12, -70, 142, 264, -53, 117, 17, -81, 58, 102, -59, -97, 96, -51, -258, 5, -129, -527, 10, -1, -86, -104, -23, 23, 110, -11, -3, -104, -145, 36, -34, 218, -19, 208, 34, -67, 93, 11, 27, 174, 28, 55, 186, 7, -126, -17, 232, 45, 47, 190, -46, -42, 135, 5, 25, 160, -145, -165, 22, -41, 102, 130, 136, -65, 66, -90, -167, 243, -185, -38, -161, 262, -421, -172, 165, -318, 470, -332, 39, -119, -417, 418, 546, 82, 537, 261, 306, -57, 140, 332, 77, 30, 209, 133, 80, 25, -141, 42, -55, 149, -112, -166, 202, 171, -74, 11]
3276A1p3J29N3j05r5l0P5Q0J37k51NJ5o8J29m9M6m0LJ22J07m35K81q4J45j51K58
3302B15k05J23J11j36J06k24l0oP9q3J4J27j76J24j62J40k5k1N0J36k68K94k41
3325e8K13j14j97m9K55Q5l3L8k23O5j94J46Q9P6p8M5l35K79J12j75L04j53J12
3348B10k52J02Mq7qJ93j25Q2j66K4l6l1O7k5Q8l08J17J13M3R7j70J6R6R0o7l8
3374B9O3p8J5j42J34j99J27j14J67m7N1r4Q2K5k44J60J22Q5l18Q8J43j59L92l33
3398d5J32l9k70K65j23l5J21j56J36R4j43J39J28k53L4L48k80J07K6k56K02k38
3420a06K50j57q7PP8n5N6L9j08R9P1j83J64k4k00K27P0l5j56J8J43j34o2K27k27
3445h5K43l22N3j07L13j38o0K81l93L62p7R5l15K05j20J62j4j6j8m1N0j27J24
$$ y = [11, -62, 67, 120, 15, -80, -110, -35, 45, 182, -69, -64, -49, -117, 12, -37, 9, -31, -28, 94, 201, -234, 47, -37, 108, -43, 215, 10, 133, 244, 108, 214, -10, -40, -46, 33, -50, -36, 91, -85, 39, -123, 17, -8, -29, 21, 157, -111, 183, -58, 155, 41, -156, -205, 50, 135, 102, 140, -83, -18, -212, -66, 23, 99, 21, 66, -269, 10, 122, -53, 251, 98, 210, -42, 60, 64, -23, -31, 162, 37, 119, -47, -23, -59, -90, -23, -48, 40, -268, -151, -38, 5, 102, -68, -52, 44, 134, 67, 29, 92, 14, 29, -113, 21, -178, -51, -165, 2, -45, 6, -88, -6, 19, -225, -65, 57, 142, -176, -88, 55, -104, 288, -45, 87, 48, -222, 43, -80, -115, 6, -150, -14, 80, -63, 76, 204, -49, -15, 333, 53, 160, 186, -70, 132, -106, 144, -13, -100, -93, -15, -70, -14, 25, -83, 16, 87, -96, 68, 44, -156, 71, 141, 106, -50, -32, 111, -23, -85, 142, -85, 158, -164, -111, -218, 95, -43, -103, 178, -215, 147, 70, 165, -150, 55, -65, 97, 83, 67, 49, 8, 58, -69, 55]
3468E5p9K36l30J20m8oK28l26L4K93j59j02Q1r4K26J0k79L01j90p2K30J3j54N8
3492D6RPm9j24k1q3J25J1J51l31K28j01J22J11j38K04m4j11J02p5k37K32n0j12
3516a28N34o97J69n8J12J41N3j86K44l03J64K5j33R4K23m21M4R9j81L05k50J34
3538a6k1K9q2L63m23K37J76l13j85L85k19P0Q2j48J43k86K30oq3R4n4r9k1k0K10
3563D3k3N9k11J90k29K71j95K33n5J28j02J31j33j48L1J01m65L48P6l30K88k28
3585b20L21j33L0j54K73k31Q5L32k19j45K16j83K06k28J46m3k67J81P7k80R7K97
3607A58k35R0J9m6j19J69J05j09k94K45K97r4m1J72k90j67J54n0L45l79k39M70
3629A61l18%M26l87J26K89l35nL6p6K72k07J19O6k60K14M5m48J56o6J22K03j34
$$ y = [55, -24, 212, -118, 2, -46, -52, 176, -150, -116, 177, 18, -84, -3, -97, 129, 139, -140, 161, -29, -101, 129, 142, -12, 46, 55, 62, 13, -111, -132, -215, -90, -79, 72, -259, -31, -132, -10, 101, -37, 167, 123, 12, 114, 39, -198, 34, -16, -128, 406, -291, -122, -180, -68, 73, 126, -60, 184, -119, 45, 70, -63, 31, 254, -167, -123, -24, -205, 100, -150, -16, -37, -8, -90, 273, -150, 87, 263, -50, -235, 150, -69, 1, 83, -65, 78, -208, 22, 16, -67, 27, -27, -126, -147, -167, 43, 20, 79, -132, 58, -171, 100, -95, 138, 83, 211, 109, 240, 107, -41, -10, 91, -374, -26, 50, -280, 8, -220, 101, -32, -2, -156, 117, -114, -29, 303, 84, -61, 155, -28, 178, -50, 96, 53, -214, -33, 44, -236, -139, 158, -77, 13, 32, -14, -133, 36, 141, 32, -262, -17, 280, 186, 145, 317, 27, -140, 14, -36, 309, -70, -309, 161, -157, -157, 269, -118, 8, 297, -38, -43, -7, -83, 189, -18, 101, 167, -93, 121, 166, -282, -126, -192, -70, 133, -1]
3652aJ9n8Q3J34r6k36J23J11l08N13j52p4q0K33k98J14q1k08L27j52J46j23j28
3675a92k0L35j69j1o9L25R6k67p5L84m00K88j29l11L51m7j89J98k22KL16n33M17
3698G8n5N9j31J45l06R1O7j27L76j71K45j31o8k04J01j88L88j21k48R5K34m18
3720b89L21k65K20J09J1l7k2p3k3M4jM3M2J39j37qj24J19l34R8K23J34J1j49j09
3745e7M6K03l63K32j9m5N3Rn08J077m72k29J61k68L19l65K62r6J22k57N08n10
3767a97J56P7j36K49q6l91M90j14j02J1l9R0j7p1M1J03k09J59Q6q3O2l49J80R8
3791Hj65Q0R5j66L03r7J5n8j69K41J66j43j81J82k62J91J10k36Q1j65l4L32o0
3814F8j39R7j51K24R1j58JO3r4o1J51k42L14m7m02K61l8L0M0j24J1J49o7J0J30
$$ y = [-1, 18, -40, 43, 177, 81, -155, -32, 79, -229, 284, 132, 58, -22, 211, -87, 27, -54, -262, 65, -87, 59, -64, -192, -212, 123, -46, -57, -126, 199, 295, 28, -47, 337, -63, 225, 96, -215, 136, 89, -100, 98, -124, -122, 194, -339, 78, 23, 82, -49, 96, -210, -119, -52, -179, 197, 26, 271, 140, 72, -132, -31, -219, 169, 48, -200, -105, 129, -289, 32, -233, -13, 96, 107, 70, 48, -25, -48, -4, -5, 38, 80, 219, 82, 74, -50, 69, -265, -167, 56, 190, 201, 52, -57, -11, 192, -171, 61, 42, -3, 50, 59, -449, 628, 156, -73, 88, -180, 139, -226, 36, -60, 62, -195, 313, -197, -41, 36, -100, 149, 63, -328, 162, 48, -54, -43, -82, 8, -9, -80, -39, 64, -145, 14, 100, 17, 79, -270, -90, 8, -157, -77, 18, -148, 155, 58, 73, 15, -154, 87, 253, 110, -71, 111, -151, 40, 150, -86, -5, -170, -204, 128, 68, -71, 26, -125, 99, 190, 32, 33, 96, 2, -59, 92, -150, 164, 117, -285, -24, -62, -32, 8, -116, -105, 44, -23, -13, 117]
3839A17l19K30J87l16L81j44o7J15Nm04K29m5N6M8l57K57j12j7K27k92K67L4p5
3862ER1J31j74J70j63l17K91k86P1%K40m38M22k00P8J03J4j02J44k39K52k6R1
3885A58J84l84J01L08q4l44P5j70M7J82j37j2n1J02J56j42k49M95l36K40k15R0
3907A4J10M8q9p0J05j64J73j86J89j24k7r1J76k34K11Q9l17J45M4j35L50k06J08
3930A19J1m47L72M0j19J66k75K51k65J04J1R3l50K84K68l13o8J55k30L51k17q8
3952a47O6K15q8J64l15J28j7k4rK09k20R3j44k82N10l28Q5P5j59L24Q1l85N2K08
3976I2mL6p5nj67O0P6K9j75N5Qm6o3K84k28k8L23l27L16qq6M3Q1k50J91l00P8
4003i0L21l57L18q5j95M2q1R1J43k26J28J65m23K48J61j74K38p8j92K42r8q3N6
$$ y = [117, -202, 28, 215, -101, 280, 136, 69, 184, 189, -215, 14, -31, 25, 73, -284, -27, -139, -156, 71, -221, 46, 80, 5, 96, 227, 53, 223, 60, -257, 34, -252, -181, -181, 59, -379, 43, -157, -79, 24, 38, -64, 80, -159, 93, 67, 158, 342, -42, 59, 367, 283, -61, 14, -156, -109, 73, -64, -76, -127, -25, 131, -11, -260, 235, -101, 139, -76, 14, 124, 172, 83, 13, 118, -46, 127, -59, 130, 6, -21, -112, 64, -170, 41, 130, -187, -42, 2, -133, 217, 11, 119, 130, -317, 55, 95, -24, 142, -133, 118, -147, -43, -32, 61, -289, -5, 263, -50, -118, 37, -193, 158, -59, -147, -81, 134, 46, 210, -105, 23, 6, -18, -27, 182, -38, 55, -89, -371, 139, -189, -104, -29, -188, 136, 217, -168, -116, 92, 88, 124, 49, 44, -123, -63, 13, 42, -133, -78, -70, -116, -179, 105, -123, -151, 172, -155, 161, 153, 67, 110, 191, -59, 132, -168, -90, 231, -126, 192, 107, -88, -46, -127, -36, 107, -119, 9, 174, -249, -1, 160, -14, 224, 146, -46, 196, 98, 15, 71]
4026G1m2R3q0k02J03R3l12M46j74r3K58r9J55k13r1R7j82J62K32k16j19L11k94
4049i6P0K83m09j23K58j41K38j53J2K6J62k35L49k19l2K11j00p3J03J80k50J92
4071B53l54j94O1J50j53J41J0j10J63m9J52k49J63L0j45K81L5l31K91lk53K49
4093A38l06K39J01k77L2K47n73M74j32J8M9L6q3K04k26J8L55k05j38J3n5J54k76
4116a93M0K35j00j62J70K09k03J94l84P5N3J06R6L6p1J35k23j71K85k62L1Q7n2
4139f9O1J52j11M3K4k32K17k0j55J17J52R6k5l51K48l27LL65j65K2j11J97k43
4162a12K34m40K95K9n7J31l72K12K16j18OP2j67K1K53l09K32j60j7l7K01j32K76
4185B57k59m6R4k7o1j4p9K42K9j74O7j01J26L43l95K85j69k16M5o7j03L96k91
$$ y = [71, 29, 122, 42, -160, -57, 36, -276, 170, -4, -97, 161, 62, 217, 4, -87, 10, -172, -10, 222, 6, -113, 198, -96, -26, 257, -152, -275, -17, -158, 80, -73, -61, -35, 127, -108, 241, 22, -10, 201, 101, 28, 131, 311, 61, 253, -101, -295, -234, -84, -237, -96, -86, -196, -33, -82, 70, -179, -16, 14, -131, 150, 185, -146, 145, 142, -111, 138, -168, 71, 172, -105, -73, 174, -399, 75, -57, -39, 10, 46, -37, 167, -59, -41, 314, 109, -29, -16, -71, 83, -193, -153, 82, -18, -180, -10, 199, -4, 190, -194, -119, -66, 40, 136, 172, 101, 236, 13, -158, 127, -135, -104, -17, -69, -8, 144, 33, 76, 100, -132, 85, 65, -90, 27, 179, 275, 250, -101, 147, -180, -177, 188, 23, 45, -66, 131, -112, 122, -318, -23, 6, -51, 80, -292, -80, 136, 18, 24, 96, -71, -50, 203, -106, 126, -34, -51, -88, 113, -19, 257, -2, -48, 46, 19, -42, -56, -135, 107, 136, -38, 29, -72, 54, 397, 2, 287, 118, -98, -53, -120, -223, 173, -118]
4208a18j39K84M8l64M12j08p0L11m76L38K1nO5J69k23j30j7l7Lk3j52L69l16m0
4232a98Q8k22L81q5J62n7j54o7J84pL9J24j63k44N39l51J92j58j74J83k70K73
4254A5K9j74J11J2j96J99M7l46L42K38m45J13J70k23K75j19K5L2j66K7L6j96O2
4277a32L04k01m6O7l1J51pj58L61m11K10K29l73lK02l95L62k9q5j40P4J5J74k78
4301a40P0R1j48J03q1j0J33N1l8K63k13J83o3k24J35q5q8K39j48k73J89J20j85
4324a19L64k46J9L24m01K54j9j14P1j24j7K44l59L0K50l30K14p1k04L02j43j75
4346b50M07j0j40K00k33J53j28m3J96k1p1kN2l16M30m66K39L8o4j%q7mK72j66
4371a5o3N0N9M9R6o1J2j11k1M7q0l7n9j28K07M6l47M29m7l3L06m05J26N3k3K27
$$ y = [-118, -257, 27, 75, -289, 123, 15, -55, 256, -220, 118, 139, 134, 199, 368, 145, 15, -2, -39, -36, -59, -211, 158, -158, -198, -110, -332, 49, -36, 126, 69, -85, -152, 32, 25, 64, 188, 25, -219, 320, -31, 161, 3, -171, 12, -258, 15, 44, -130, -19, -7, -203, -4, 43, -303, 39, 277, -168, -55, 115, -108, 167, 48, 73, 105, -61, -34, 2, -194, -132, 172, -29, -75, -8, -39, 112, 105, -53, 308, -103, 107, 336, -37, -40, 162, -233, 129, 100, 15, -125, -51, -36, 138, -140, -70, 21, -127, -24, -105, -115, 18, 69, 31, 294, 81, 264, 201, -23, 112, 27, -61, 178, 30, -243, -54, 66, -119, 245, -1, 18, 342, -59, 195, 176, 62, 133, 9, -8, 236, -123, -93, 157, -173, 41, -30, -234, 68, -75, -250, 157, 147, 7, 207, -26, 127, -1, -44, 152, 131, 60, 58, 110, -206, 224, -242, -3, 35, -29, -30, -30, -117, -121, 151, -15, -78, -28, 31, 80, 176, 115, 127, 16, -5, 42, -38, -75, -134, -262, -55, -9, -356, 73, 26, -7, 299, -106, 20, 73, 50, 277]
4397B77j04k40J82j64p3J76l3r6P9J7l05L40k67J74K2j29J79k8l7K43j65j96L22
4420A74j67P7K94j38j60j22Q5rq6J93k37o9J45n2j85Q0M00k34o5P3pJ20j66oo38
4445g00L57N87M3k31k62J25j58L36R6k29O6q2j78L87k72j22L34k6J84k41j5J43
4467A42m5l67K63o1P3J69j15m8Jl54L76O4o6j88R0J25K96l99R8M6j10O5J34l59
4491a70K29j23j40K91j4k33L62k01p2j38o56K90O62k75Q9J75k37M10k30j3P4P1
4513A51j54K05k84K05k98K14N09q03N11j51J50o71N14n6Q69q41J5j63N96l64k94
4534a40o2N3N01j38j44j44J67m52O84o85K69K05o00L16K29k58L48q1r2J80j29
4555B7j80K91k76J37P7r5Q7p1j02O1q8j18K85k45J46K11j86K00j11j22K98K5m46
$$ y = [277, 173, -67, 115, -49, -122, 54, 21, -75, 4, 21, -284, 56, -211, -37, -15, -144, 35, 7, -30, 213, 48, -148, 174, 7, 84, 378, 240, 80, -42, 43, 34, -52, 141, -96, -165, -20, -72, -257, -177, 223, -11, -76, -3, -10, 110, -56, -62, -700, -343, 244, 287, 56, -206, -81, -239, 97, 193, -36, 30, -52, -230, 157, -115, -237, 97, 71, 255, 14, -1, 142, 97, -270, -7, -68, 5, 174, 59, 11, 12, -342, 34, 98, 32, -156, -66, 59, 355, -44, 54, 100, -10, 55, 189, -170, 59, -64, -204, 87, 73, -160, 202, 1, -71, -209, -865, -575, 87, -188, -99, 76, -161, 249, 19, 6, 80, 151, -3, 202, -82, 123, -175, 39, 548, -255, 256, 105, 255, -416, 98, 42, 911, 70, 85, -78, 518, 154, -140, -202, -149, 352, 214, 70, -74, 93, -359, 325, -360, -91, 114, -486, -170, 59, -199, 149, 68, -24, 156, 27, -153, 138, -138, -1, 76, -19, 68, -3, -105, -44, -132, -250, 35, -210, -64, 147, -39, 161, 50, -72, 226, 251, -195]
4578a95M41l34J93jM5j68K44l40L83j79m17K86j62M87o32k05N25K56k13j95P1
4599a10P5J06m3j64L58j05k38L95k58k24Q1k01K68Q2k59K79q8k62L65l1k32M16
4621B10l1k55L63l01J23J51l54n6K17O5r8O4m53L31L3j68K00j48L1K55j83M8J39
4644A83l02L43j29k66K18j89l2Jo9K58Rj76O4N7k0n7k4M5L11j33j92j03K26K80
4668C03j52k90J78J30k44J87j22J17m6n5m5M4j62J92N0j19K4r9M1PK35j16%l0
4692B8q1K39j34k29J62k52J84O4r4J55j87r2L12j84J34m5j31R1J51j08J33L1k15
4715f8J80j23J88j47M2k48K15k47J79O7k11J66J9j26J78r2o6M18n02K18r0K53
4737B03p5nl11K79k96L6M48k39k12L60k40O3m4j93J35J85l3J11q3j90J58r4KJ97
$$ y = [-195, 246, -88, 105, 104, 149, -19, 225, -115, 268, 89, -328, -42, -204, 283, -349, -554, -29, 227, 14, -181, -110, -35, 71, 28, -136, 222, 117, -121, 274, 16, -208, -127, -328, -60, 22, -237, 42, -46, -308, 57, 26, -206, 210, 179, -76, 287, -14, 109, 260, -94, -150, 67, 132, 34, 98, -355, -24, 9, -159, 41, -107, -76, 179, -4, 44, 183, -119, 224, 95, -171, 47, -142, -174, -173, -242, 16, 25, -151, -87, -30, -50, -107, -131, -86, 225, 92, -100, -203, 23, 303, 151, -139, 39, 169, -75, 112, -10, 107, 61, 6, -39, 5, -157, 35, 85, -34, -10, -109, -68, -61, 174, 58, 58, 28, -53, 186, 52, -177, -15, -267, -83, -19, -113, 42, -145, -237, 75, -109, 25, -20, -151, -60, 91, -17, 116, 147, -68, 112, -11, 177, 30, 72, -176, 39, -208, -29, 38, -173, -7, 12, -114, 64, -28, -94, 324, -178, 40, -50, 203, 128, 123, -188, 91, -205, -169, 279, 40, -172, 188, -52, 11, -33, -226, -91, 94, 61, 172, 89, -101, 57, -37, -35, 162]
4761A62k75K35j76Q6kJ07l97M03k88M3J57q0k9q6M6L00J36l84L32j63j24n6J03
4784E0Q2j89K31m19K04j64M87n73O8M36j56l38L20Q0r3m2N5Q5R4k41j0K26j82
4807A1r4J25l35M20j97p9J93j96j5L13k42J38J0j28L68mk89L88l16k67J84j47
4829a59K38M0j07j66N69n71j04Q8R0K41p5j02K28k19m3J69pm5J66l02lM6k31M78
4853B19l61K07J60m10J69J74k84J55j36K53j01q6L7J26j50K8R6J9p7L01l35r4
4875i0J56j01Q5j08K6J05Ok59K71o1p8j06LJ86Rl7J69j01Q3j01r9o3J28j35J81
4900F9l6k18J91m2l14O23l24J64K7k70K41K01m13K08j63O25o07k81O06m07R1j80
4922b09M94l83J08j12r5K54Lj25P9J03k39K05J60k67J95j50L3K23m23J55K64l69
$$ y = [162, -113, 122, -54, 32, 30, 137, -260, 143, -145, -102, 55, -25, -54, -140, -94, 206, 342, -42, 290, 127, 3, -53, 50, 132, -57, 174, -245, -41, -205, 282, -291, -223, 213, 57, -281, 39, 119, 26, -16, 39, 124, 218, -23, -33, 193, 11, -83, 42, -293, 127, -70, -149, 44, -152, -167, 146, -96, 42, 52, -76, 292, 288, -1, 387, 71, -196, -12, -159, 79, 119, 12, -154, 415, -156, -260, -172, -82, 159, 84, -18, 210, -9, -52, 117, 110, 65, 231, -71, -74, -28, -259, 219, -142, 65, 225, -185, -16, 158, -126, 29, -107, 146, 45, -41, -4, 122, -28, 0, 96, 115, 38, 339, 4, -90, 66, -35, 50, -58, -32, 73, 79, -180, 91, 30, -48, -154, -151, 35, 44, 7, 176, 75, 158, 57, -42, -105, 23, -112, 69, 33, -185, 6, -36, -350, 273, -51, 113, 140, -130, 111, 312, -101, 107, -56, 569, -38, -319, 287, -120, -29, -209, 285, -98, 10, -102, -197, 57, 60, -65, 14, 117, -122, 83, 243, -24, 171, 21, 54, 277, -146, 9, 273, -96]
4944i6j4oj62K35k69L92Q4j09r7J74l24L57k44O8K28j17m4Q6m35K47j69k45m14
4967h74J214l91l46O28n03K31J57k26K15J04k69L56j95K21j54J02k20n3o13P32
4987A16J92l02p4K91l23K40l40J80K7j38J86Ql92L81J68k55L28l2j61K27l21L0
5009C6O6o1O8M8k49J65k12R9K28k37j00L44k70M9p9K16k43O36p12j68K06M9L56
5032B35p5j40n0k32j90N65k85L29k49n7J40K86l19K0q8J88R3j60L37j90m12M51
5054A97j81k05L52j59n0Q6k25K22K33k18k17M73n34J77L25k78J07p3j7K10j51
5075G4j18K89l33OR1j89M06l44K71k69k61M79q7Kj25J49j1L1Lj82K12j84J7K85
5099B12l58j9L64m76J12P7j12J43K48k82J01J39j45O5k7k01L85j92O7n3o0Q4J59
$$ y = [-96, -110, -116, -278, -43, -312, 80, 164, 55, -42, 132, -192, 165, -79, -11, 217, 100, 56, 142, -293, -46, -215, -460, -874, 340, -51, -397, 231, -272, -41, 116, -110, 105, 209, -60, 296, 101, 322, 168, 270, 50, -3, -616, 116, 308, 6, -68, 223, -100, 140, -200, -20, 7, -131, 55, 63, -329, 52, 220, -35, 293, 261, 100, 327, 6, 36, 102, 41, 109, 157, -92, 73, -139, -40, 188, -49, -149, 195, -75, -26, -105, 111, -132, 504, -208, -376, -170, -121, 235, 160, 20, -30, -262, -452, 113, -172, 157, -92, -149, -9, 277, -42, -22, -110, 78, 171, 11, 348, 158, -254, 197, 16, -189, 163, 4, -46, 40, -185, 37, 270, 52, -165, 308, -226, -49, 276, -2, 105, 32, 15, 225, 74, -44, 245, -88, -82, 9, -180, 226, -118, 153, -116, -377, 102, 15, 17, -108, 41, 30, 61, 64, -118, 94, -90, -73, 212, -146, -165, 199, -277, -165, -88, -200, -57, 191, -91, 10, 149, 4, 69, 42, -159, 226, 34, 101, 48, -12, 72, 231]
5122B31l67K89k59k14L28Lk83M29n1o2J52l53J44J2J44K81m27k0q6j01K61Q0l14
5145a83M0q2M06p29J183n61O3p24j06Q91o63N85L16m80l63L36k41J65K37k84K32
5166C8j70j50P86o87K81k09K34l49K65j40M54k2k70J4J54j28Pk26J92K49p3m27
5188a77J98m22N50k74q9L19j7k15J91l95N4l4K59k38J81N4J67K12mn6o53N70K9
5211B10j30j40O3l52L16n6l51L19M45m21K71k91j3M34m71L65K9q08M65M48k95
5232C7K82j14n78N82j26n13O68m50J72J08J31R7p88J64P83k26m72O13p36L86p6
5253e6p47R06k54K11n1J12j25j76kk96M50j9M95p35L3K12o6K49J82l05j39K33
5275A12K35j76Q0m51N19m00J02J29M6o72K96K85k92O60j76j115J016j95j35k68
$$ y = [231, -136, 153, -106, -320, 8, 11, -272, 157, 106, 44, 196, -157, -13, -1, 143, 424, -3, -23, -109, -210, 51, 131, -183, -143, -225, 181, -548, 635, 74, 137, -587, -693, 198, -465, 120, 436, -44, -407, -71, -312, -147, 90, -194, 38, -132, -282, 504, -183, 98, -111, 123, -226, 39, -101, 353, 331, 61, 75, 229, 101, 108, -118, 74, 323, 250, -177, 21, -401, 149, -125, -214, 105, 88, -127, 64, -331, -277, -311, -52, -290, -109, -55, 112, 324, 320, 264, -389, 181, 210, 80, -60, 3, -349, -33, -89, -440, -121, 324, -97, 174, -117, -130, 304, -167, 198, 227, -581, -116, 332, 37, 319, 205, -373, 209, 83, -430, 238, -212, -40, 68, 199, 296, -492, -328, 455, 229, -243, 370, -366, 20, -56, -803, 103, -151, 60, 9, 121, -4, -180, -182, -478, -28, -47, 448, -287, -254, -42, -108, 141, 323, 18, -121, 112, 347, 171, 251, -200, 319, -81, 21, 150, 196, -476, -180, 105, -187, 473, 297, -818, 198, 3, -132, -400]
5295d00j0K47p1O4M56o21K8P84o93L83j88k28k72M9J93N68J00m47M57q21K71O25
5317D74q20L12O6j13n06N77l10O10k96K85l90L94n10pK30K72p8o33Q20r9J91m20
5339D9L24o01M28m34L06m5j42J58n1k13J52O2n6o6J77k43L88j13j57Q3J09j24
5361iJ33j82K4L3j38J10J64j52r2L96k00j5j92j46L70mk49L10r2p9K00k58J86
5384A18m5j19L59n92L01M05o42M62j90l67L45k53L1J30O3nJ72r7k5mo7K25Nn13
5408c03M96n5J48j84k67L6K61l09P5L48m89L7k06K63J34j3k35K01M5O2Q5k81Q5
5431f6L98m35O9k4j19K90r7k38J80k00J58M6j46L30l6o4n9J11k65L23j15j9K75
5454B97m96L47n6k81Q8Q9k24K79j19j16L47k80n3L54j49o8P1l8kK37l67J83qj54
$$ y = [-400, -410, -163, -234, -170, 286, -335, -307, 477, -216, 167, -21, -249, -521, -472, -279, 289, 389, -58, 399, -422, -151, 474, -346, -34, 32, -81, -587, -10, -320, 290, -6, 279, -111, 283, -227, -234, -4, 268, 190, -443, 377, 278, 469, 49, 373, -228, 200, -234, 72, 27, -115, 43, -8, -221, -69, -7, -63, -129, 48, -195, 193, 80, -77, 6, 115, -9, 124, -58, -34, -1, -139, -29, 135, -17, -109, 287, 87, 72, -120, -266, 104, 100, -149, 161, 69, -10, 190, -68, 118, 73, -46, 313, -279, 22, 427, -215, 247, 57, -310, 35, -218, -187, -57, 6, 1, 173, 76, 51, 47, -20, 205, 210, -303, 193, 138, 286, 102, -165, -129, 132, -177, -102, 246, -243, -206, -412, -149, -15, -28, -263, -62, -17, 45, 130, -151, -66, 332, -103, -34, -58, -177, 113, 16, -222, -42, -242, -84, -38, -184, 146, 110, 46, -13, 98, -167, 156, 41, 22, 297, -199, 148, 92, -189, -101, -12, -236, 43, -76, -192, 155, -125, -178, 176, 27, -41, 30, -8, -10, 227, -140, 43, 35, -119]
5478a19K47j12k15J75n0r2J10j39L71j54l08K27J06k1L6j66K79M9j68j0j10j6
5500h0J38R5l06J15K05j72k24J51r3M41m55O3L51m61K37K56n01K86Q2j31N8O9
5522A24j33j57K62r3N7k30J24J27k49K34n3j47K73j28j49K46k75K20Lr3J79l6
5544A06j73J38r1k3J43k95J94l99L87j37J99k83K13J7j39K10k20J00o3J15N1J07
5566A57k04N1J98n08N06j71N5j16o5P6o7P8n7K33j6q6l6k7K17j52l09K94j15K03
5590A39p5j2j12K2j76O55m29p40N51M4m2K79O0m16O43l35L32jo8j21j40j39J55
5613G4N3k82L47k33l07M81k98K43j01j55K48j6j26J26K17l65j3K9J95K85m83P9
5635bJ54j90J79N0l58K9p6J22K05j71M9%n7J19J08j37K1O0j66K20M0o99M40J43
$$ y = [-119, 128, 16, -199, -24, -74, -166, -56, -195, 176, 22, -286, -59, 47, 26, 62, -104, 175, 224, 56, 46, -64, -80, 58, 153, -153, -38, 167, -5, -229, -78, -171, 270, -185, -122, 229, -232, 5, 261, -240, 46, 128, -3, 55, 124, -9, -166, 96, 3, 60, -170, -46, 81, -168, 66, 13, -134, 139, 11, -138, 108, -167, 53, 56, -37, 142, 106, -67, 71, -20, -43, 100, -195, -1, -400, -13, -150, 49, -234, -21, -4, -143, 67, -153, -53, -116, -1, 50, 157, -47, 4, 202, -306, 200, 29, 84, -32, -97, -21, -88, -10, -67, 166, 150, 64, 28, 1, 218, 66, -243, 51, -64, 139, 64, 52, -60, -38, -214, 441, 12, -728, -177, -133, -175, 104, 164, -252, 391, 56, 388, 387, 319, 198, 58, -81, 74, 127, -155, 192, -41, -348, 133, -165, 78, -23, -178, 70, 54, -72, 54, 271, -94, -107, -78, 117, 402, -81, -2, 152, -38, 141, 191, -167, -138, -214, -92, 113, -58, -9, -9, -66, 53, 161, 24, 45, 105, -61, 159, 199, -500, -60, 83]
5659H3j91K53J3j53M5n5J79k26j27J29N3j99K76p9kJ19p1J12j29k8P6j8l20J59
5683a01j5j05J92j34J01P7k51L27K9l96L69n7j86K58k59K55k25l34L21L54j20
5704A00j3J11l31K39M1l35M18l67l5J0L22LJ5q3j22P2l29P06n5p25j7P78p22L00
5728a9rj68J65k0J55pl45K16PM2J35p8Q8O4l84K43Q3j51kP8r3j50J44j72K89k68
5754a57J1L47l92J09J05j32J94p5Q5J21k26J12j1k15L9o3lJ56j47L03k44Q9m5
5777c9P1q1k57M77j86N9n1Q3J5J56j45P2q9k63K31l0p6J84k9j52r1n2O9O6l2M54
5803C64k04n69L64K23m09K46k7j5K43l51J93J71l09K9j95K4K95k26P5Q0J60n9
5825A03K1k91K32K87n22J24J02m0R8j54l2L04r2l18L05k31j07K51j93J51p4r6
$$ y = [83, -108, 145, 158, 5, 50, -5, 174, -52, -179, -50, 3, -196, 80, 1, -1, 118, 47, 159, 30, 2, 78, 60, -260, -101, -116, -221, -29, -163, -62, 15, -236, 91, 120, -276, 93, 36, -150, 108, -151, 104, -121, -455, -134, 220, 100, 87, 198, -133, 106, 147, -188, 230, -137, -172, -162, 160, 163, 178, 95, -27, 45, -284, 422, 367, -358, -375, 403, -319, -19, -28, -196, -31, -51, 104, 97, -248, -32, -25, 17, 152, 74, 162, 226, -158, 85, 168, 17, 15, 93, 0, -150, -6, -178, 111, -157, -146, 201, -191, -82, 23, -109, 85, 10, 95, 216, -10, 102, 91, -124, -85, -148, -151, 5, -142, 161, -83, 6, -39, 32, -49, -306, 171, -15, 44, -7, 76, 91, 247, 102, 174, 85, -178, 53, 23, -53, 131, 102, -50, -141, -193, -124, -58, -90, 364, 160, -409, -45, 178, -231, 15, -12, -27, 216, -135, 58, 229, -80, -51, -246, -222, 73, -153, -78, 2, 162, 103, 124, -167, 65, 352, -170, -46, 56, 16, 114, -40, -72, 232, 140, -178, 127, -104, -211, 40, -153, -2, -76, -172]
5847a72K71k20Q4L5r9L3K27j18R5N3j32p1j97K94l5j76Q8J15q3m3Qj88J97l6j04
5872a74J75l1m3L09j06k77L96l29N7J89k75J82q3j66J60J27n3J47k56JJ58k97
5894a89J52K23j48J75n4j08J29P3j58Q8q0j93K91l19N2P1P8k71J55j19K5J21o
5917a2J45j44K02mk78J21J72k80M6q8M7J68j48k10N36m65K13O6j71K15k79Q5P
5940e6J25o6J38o2k17K75j64J5n1M6R7k0j23N7L4J1j94L03k75K63l12J3K53O8
5964A58K0J23k95k42K90j79M31k46k25K06L3L1q0k09K43q0K18j06o9j40L07m13
5986b24K09J20n2J18n6p0r5J96k73QL5k77N44l03R8K22j42k03L80k20q8J15N7
6009I9r0K6Q1J03k40q6P2L4j00KK9J03o3j17R0J3j70K95l04L29J26l33K63N2l15
$$ y = [-172, 99, -121, -37, -2, -101, -68, 159, 41, 136, 189, 57, -14, -211, 83, 48, -128, -40, 75, -8, -51, -43, -231, -34, -70, -174, 1, -30, -73, 236, 130, -147, 249, -80, -23, 166, -109, 73, -10, -176, -16, 111, 58, 205, -51, -50, 108, -189, -37, 186, 38, 213, 159, 51, 180, 253, 95, 183, 103, -90, 201, -118, -66, 5, 83, -188, -33, -152, -127, -6, -12, 133, -11, 191, 187, -91, 30, 202, -78, -32, -120, -73, 95, -53, -263, 273, -192, 21, 87, -84, 131, -148, -63, -56, 69, 3, 141, 79, -138, 137, -27, -12, -63, -17, 80, 60, -63, -6, 28, 39, -155, 148, -127, 136, -176, -163, 90, 158, 178, 301, 6, -236, 54, -125, 306, 60, -165, 41, 74, 105, 25, -184, 59, -21, 197, 91, 22, -118, 189, -224, -15, 105, 53, 171, 115, 45, -50, 146, -127, -119, -84, -361, 183, -120, -22, 200, 58, -145, 235, 15, -73, 42, 99, 9, 35, 116, 219, -21, -107, -35, -1, -101, -99, -70, 33, -30, -147, -57, -44, -214, 81, -223, 106, 232, -101, 162, 214, -101]
6034a01L03j30M5M4j63J7K14m33K99K59n67n0K91o1K41k22p7J49k9j5Q2K9n3J27
6058A99j97j23J85l36L85k05o1K13p3K6K1Nj92J48M6J14j33J77M6o4k89J24J14
6081A30Jk1k14J5J98j39q1L9j10K04R6j62J63j30K47q0k69K0K25k79J45M5k4J02
6105A21k0o2l7l7m7lq4O9J11p3J04n8r0L56j28k64L61n2o5j92L4n5K16M4j62p9
6131i2j33K09q1j25K64j44J21q7j7M0K69k56J24J73l20J84J49l25M7P7j19K0j00
6154a22L70k27j01K60Kj13Q8l20J50K23j81j55K13q4J49j5k00KQ3j93J74j23Q2
6177c8J13J7j54J06l32K51J31l75K70qK8l1J24j17P1k3N4J25l38lL39r2J2k97
6201a67K92k33kq2J92mm2Q8m7L4J37J09k48J70j00j17j95K28J47k40K4M5n2L57
$$ y = [-101, 202, 72, 117, 161, -2, 15, 229, -204, 95, 354, -213, -263, 28, -33, 208, -14, -91, 58, 29, 14, 96, 125, 72, 199, 2, -121, 64, -272, 113, -92, -153, 60, -13, 13, 34, 39, -153, -5, 41, 155, 22, 199, 245, 181, -108, 16, 130, 131, 110, -104, -89, 109, -30, -111, -72, -182, 22, 118, -44, 119, -11, 236, 156, -113, -93, 132, -147, -2, 43, 19, 121, 101, 39, 2, -35, -82, -85, -169, -100, 11, -62, 42, -16, -106, 250, 122, -142, 219, 167, 102, -90, -56, -111, 105, 149, -13, -92, -225, -16, -97, -222, 42, -102, 19, -68, -85, -45, 224, -32, 92, 265, -55, 129, 278, -47, 0, 77, -42, -22, -122, 248, 21, -80, 180, 182, 69, 157, -163, -13, 210, 29, -126, 87, 3, 152, 137, -63, -61, 22, -171, 3, -120, -38, 75, 92, -62, 44, -288, -37, 94, -281, -11, -19, 9, -22, 102, -15, 56, 33, 87, 212, -126, -129, 210, 118, 130, -167, 125, -108, -110, -192, 0, -4, -46, 42, -5, 29, 166, 275, 27, 197, 97, -20, -215, 13, 160, -80, -56, -11, -63, 294]
6225B94l30J04j11J08j7L6j66K00M8l35J5K68k14J85m4J3M8j79K00p4l60N09k64
6248f6j06K32Q7k72N7K33j14J76Ok67K62k46r5J36MK28j38k07J58R2m90M29j62
6271f3lK23r4JJN7l21K78k42J96K0oQ0k22k18M52l14P1K53m28J87n5J97PJ64m25
6297b04L29k39J72j21j01R9K55o7%r9N7k29P1l3K67l27P1J72j74L77j96j50J95
6320A25M9j40P4k38J36J0L9k94L19k70k5K63p9j06L36n07L04j2j73K22o1M0Q0
6343I2k78L01k52J9K94k65mJ91j42j53L31k98J11O3p1Q6J22k48J97Qk06J58K23
6366B79m59M65l32K42j9j65R7j31j72L66k78j9J79j53m3J98l4r9J85j75J39r9
6388b8n0l0K63k50J27r9m2L41k56rJ37l01K99k31m2J17k0J4K50k02LK99j87j6
$$ y = [294, -36, 68, -43, 65, 48, 84, -82, 118, 166, -169, -154, 114, -100, 85, 41, 54, 102, -77, 123, 49, -311, 198, -66, -172, 60, 147, -125, -68, 165, 51, 227, 233, -34, 228, -18, -113, 23, 27, 255, 117, -90, 68, 160, -330, 99, -63, -66, 157, 63, 64, 65, 122, -199, 79, -163, 33, 53, 47, 127, -95, -313, 139, -175, -104, 149, -279, -92, -147, 50, 57, 221, -204, 125, -114, 58, -63, -164, -65, 190, 123, 123, 24, 81, -148, -77, -110, 157, -170, -99, 73, -101, 276, 80, -70, 125, 174, 34, 108, -130, 6, 16, 55, -239, 80, -190, -215, 48, -31, -137, 199, -308, -4, -16, -189, 33, -28, 12, 92, -186, 115, -137, -118, 176, -89, -93, 98, -44, -197, 134, -164, -53, 10, -61, 25, 147, -101, 96, 104, -102, 56, 279, -180, 285, -47, 195, 176, 11, 108, -23, -195, 171, -107, -126, 53, -100, -143, 55, 21, -78, 107, -68, 71, -28, -78, -108, 155, -95, 32, -67, -109, 232, -24, -33, 104, -197, 102, -129, -171, -54, -74, -60, 190, -12, -9, 290, 103, 87]
6412H7J49l80L06j16K30l19J81j69lL3o8K68l73N8L80k42PQ5k3Q8j71R7o4m3j56
6437a58P8J21K4L5k56J25J83k65J54p5K8j74L22l45L97k63J95M9k62J71j9j86
6459a21M7n3m2L16l78L38O7l59l8L69k15J35j07L6k4J85l09K14O3k39K10k26P5
6482e6j8J77M0k13lj1J09k82N71l47k06M81j92J13J23m22M30j23q5K2l4J8J4p0
6506C6lj3R0j24J3k67M04K23l12R4n9k59J70j34j08M46l50K05Q2j20K0R4j14l3
6530a9L8j40K44k51K47j40r4M0R1n5K0J8k76J98l2j0K73lp2Mk44J78n8M9J16l88
6556b66L55n7m8k30K31j1k04L07j11L33m49R3J64k89J18l7j4J45J06k04OK3p1
6579a10J5q0R0L45l80Q5M0L3L0R4Q6l18J02K2PJ79l16K7j19J53K29m07m4K07j81
$$ y = [87, 236, -144, 162, 46, 276, -43, 138, -31, -34, -1, -69, 199, -174, -116, 264, 22, 29, 114, 91, 179, 8, 105, 41, -2, -158, -80, 41, 65, 100, -156, -31, 152, -113, 41, -34, -6, -180, 142, -203, 194, -69, 126, 175, -87, 84, 65, -121, -74, -127, -169, 147, -231, 107, 174, -185, -223, 146, -69, 66, -41, -5, -29, 156, -153, 61, 124, -115, 95, -131, -56, -74, 103, 143, -70, -73, -84, 25, -257, 314, -33, -239, 242, 50, 163, 286, -136, 294, 171, 86, 108, 74, 92, 106, 36, 33, 20, 110, -14, -1, -268, 136, 359, 47, 141, 82, -177, -7, -141, -249, 197, -153, 52, 134, 14, 34, 128, 14, -19, 19, -121, 123, -128, 119, -21, -115, -75, 16, -39, -19, -1, -277, -79, -111, -121, 152, 149, 77, 81, -163, 15, -43, 6, 122, -266, 89, 32, -16, -246, -15, -26, -230, 77, -34, 299, -150, -57, 107, -182, -64, -101, -115, 30, 136, -68, -62, -39, -110, -95, -175, -85, 260, -120, -35, 5, 38, 68, 162, 248, -70, 32, 54, 61, 240, -76, -49, -168, -15, 214, -193, -237, -30, -211]
6604b11J82K10l10J48j0m8K54j83m0J73k62K56j21J53r1j25p0l5K38k77O0J30
6626B1l7r6J16k9J45l74K14O6k03J93m7l6J37j39l2M2J74q7oj51P6l5l4J99j56
6651g9K12q9r2O5J60j77J09K0L3k56K35l23J45K36j43M5l18J05J22j96J87p5k2
6674i6j29L71j97k6J16k2J08l05J58J32l35J86M21m00M3k0L3M6j58L3J79j75Q1
6697D4j51J33o0J30J30k15N6k94L24l8J52j3j20k11J65k3M6j65k8J06j24K2J66
6720C2m5M1Q3k83L36P2k28J70j94j23J29J39j48k3M2j98Q8K15l13K89j76r6K56
6743F5j94Q4L84l19%o3qP8O1M3q5j28M9n0j3J11K7r1K12m75K84L82m23K6J15k57
6769a85K39J79k75R7n5r9K06n3j02K25l24J66k2j15J16L8k01K26j57J25J11kj87
$$ y = [-211, -29, 181, -129, 19, 9, -39, 215, 32, -8, 165, -97, 159, 38, 191, 100, -25, -95, -130, 108, -169, -109, 21, -16, -112, 4, -25, 120, -254, -40, 26, -177, 16, -31, -67, 70, -69, -101, -59, 115, 28, 22, -129, -53, -88, -122, 77, -79, 133, 44, -48, 17, 177, 0, 109, 129, 162, -94, 141, -182, -37, 199, 56, 101, -217, -112, 10, -186, 1, -74, -96, -225, 146, -51, -77, 39, 17, 125, -180, -22, 110, -225, -39, 382, -18, 25, 5, 38, 84, -74, -41, 138, -37, 44, -107, 26, -34, 96, 226, 11, 67, -227, 97, 59, 211, 198, 78, -133, 32, 9, 55, -110, -138, -32, -156, -134, 32, -13, 28, 111, -172, 164, 236, 8, 178, -16, -139, -10, 129, -19, -42, 0, -198, -110, 105, -208, 81, -95, -191, 65, -129, -45, 339, 20, 20, -43, -51, 27, 88, 131, 46, -82, -33, -83, -96, 15, 42, -49, 163, -312, -28, 354, -69, -43, 72, -185, 54, 233, -42, 55, 0, -99, 107, 54, -48, 177, -147, 19, -3, -118, -2, 36, -165, 61, -96, 29, 140, 138, -49]
6792d9q3J83l3K04k96J93K5l16L57k18q6k7J14j39L07m2j7j04J09j69J43J13j25
6815D4K9m5J29q2k35J31o6J88q9N7q5r2q1J36m7R3J04j06N7J89j32o2J83j97Q
6840B9o0k22M34j20j59L39m53Q5K08k74K87k2j48J52j42K38j35J86o08M86q6k00
6862a85N62p31L10j94j54K37K23k43J64NJj41L17n78m3J72M35J1j13O9l64RL14
6885H3k3k14M04k48l19L56k66O5M2j47K08J01r2N7j74N8K63j69N5K3j68J93K5
6908A13k9J7k43R2ml71J83K4q6L40l85M05M59n30K93k32p8q9L67k50J4K8K8j05
6932c9O7j0j61J22j62J28Q3q8O5j10O0R5j22J47k14q3K36J35j82J31j27M9J21
6955A41k82R7j01J33q5O4L8Q0j1mo5j53R7J43K4m8J23J9j24K2j05J90k38j30J50
$$ y = [-49, -132, 51, 18, 222, -74, 119, 144, -172, 185, -33, -119, -146, -32, -171, 136, 94, 77, -27, 82, -87, 56, 169, 44, 73, 28, 157, 75, -160, -29, -95, 93, 4, 61, -24, -116, -197, -61, -108, -15, 89, -17, 40, 229, 97, 35, 218, 21, 29, -31, -253, 181, 61, -98, 241, -212, -127, 81, -193, 94, 72, -76, 76, -66, 172, 37, 223, -385, 101, 15, -185, 377, -354, -44, -238, -392, -155, 68, -175, -11, -6, -5, -146, 171, -407, -450, -278, 157, 168, 55, 124, -240, -231, 83, 60, -154, 250, 2, -317, 39, -227, -162, -120, -267, -59, 42, -50, 7, -167, -109, 154, -15, 40, 63, -105, 88, 113, 84, 101, -142, -50, -54, -425, -242, -218, -304, 36, -349, 56, 515, -15, 278, 46, -32, -121, 246, -4, 10, 38, 66, -39, 28, 18, -143, -21, -183, -55, 28, -60, 5, -105, -45, 50, -72, 75, -139, -222, 14, 149, -33, 98, -29, 20, 141, -141, -44, -145, -12, -97, -33, 5, 85, 74, 70, 5, -148, -51, 92, 116, 68, 191, 210, 86, 108, 3, 193, -45, -175, -25]
6980b5jj09J31M8M8r5M6k35J45RJ30q4j14K52p0J5L3j05J40J3l32J4J56kP9K2
7006A09l22K67j06J72r2j11K4Q3r6Q6Mk51K21n5RJ40j37k7K12j54k24M02j92R6
7030E8j26J21M7M0k52P6J48M1o6k34J64J06k7J79l71Q9ll1l5J39q5l3J37q9k97
7055c04M47j53J49k10K05j45J49k63K73k90N6J09p0J47k50L17n3J26m14K52o6
7076A2k09L44L6j71J40q4j1O4j75R3n5l15O35k42J99k12k79K66r2j68R1K87o8
7099H6J3o8J5kj04j56Q0J58k63L55j54K89k31j00J26o2M7J07n9l9j6j13p4K92
7123A27m08M07Or0J41k50m3J51Q8k12J24r6j35K78J6m0n8J40m2j51n4K58k56r3
7147a92K36l0n0k7J66l1R4l1j91m9K02J9k1j39J83l80N0K02J8K65l41MK6%J16
$$ y = [-25, -26, -135, -4, 44, 92, -3, 43, -192, -47, -38, 92, 8, -106, 146, 76, 91, 124, 19, 159, 172, -160, -146, 10, 8, 87, 109, -213, 54, -52, 120, 28, -83, -59, 24, -72, 14, 18, -233, -12, -67, -58, 82, -55, -82, 130, -24, -248, 154, -38, 58, -68, 53, 100, 140, -112, -36, 112, 153, 87, -147, 17, 123, 96, 275, -96, -7, -10, -41, -76, 63, -22, -55, 82, -7, -304, 143, -10, 139, -71, 134, -11, 138, -125, 148, -142, -86, 23, -47, 100, -150, 167, 114, 240, -174, 78, 12, -197, 147, 183, 12, 152, 68, 57, 121, -54, 39, -16, -331, 304, 62, 261, 49, -230, 36, -56, -224, -133, 154, 86, 99, 31, 46, 44, -60, -216, -136, 22, -241, 114, -40, 249, 18, -82, 44, -18, 29, 136, 77, 38, 22, -91, -165, 127, -281, 126, 132, 42, 183, -67, -110, 41, 129, -83, 41, -55, -190, 88, 104, 64, 6, 146, 104, -47, -101, 157, -99, -192, 44, 14, -36, -63, 103, 72, 166, 135, -56, -105, 97, 116, 95, -44, 139, -241, -191, 11, 29, 294, -47, -43, -17, -17, 99]
7172I9J73m23M5M14m44J93l5l54M04r2K7k7j24K0J85k4P8R6l30M05l16m3J20Q4
7196A31k21M24j68k9j04q5j00rJ97J9q7p6K16J13j75q0J35r7L6l6R0Pm1k27M42
7221B75k82R0k76J01L15k36k0m2OJ41K4j29j37M3J71J63k54K8N7q4L2J03k05O9
7245d7J25Q5l30m6K45J71m61N6K11Rk05J34j3L27k79j2J88R2J1Mk61k3J22k63
7269a60J85p2P7j77K10K5J15j83J26J01n39L07J04r8N4q9k00K84P9j87KR0q3%
7293b9o7o8J67K42q5k19o3K47J6n5j20o6l0J06m9J57j8j07m8K41k24J63j59L9
7317b9O6j39J21n0J27j21kP7k08J75j43K52r7p5k2n0K9P3j00J3J79j16J35k36
7341a41K22j32o7J8J71l31N0K23o2j05J78L1L7o2p5m8J23k08L51j63Rnj20R8J66
$$ y = [99, 272, -151, -106, 308, -136, 57, 22, -332, 72, -20, 7, -20, -144, -124, 61, 37, 115, 211, -119, 286, -30, -73, 47, 131, -90, 334, 166, 137, 33, -52, -152, -161, 36, 55, -32, -108, 108, 221, 46, -34, 101, 4, 40, 4, 94, 101, 60, -167, 275, -7, 83, -193, -92, 223, -13, -33, -75, -69, 72, 96, -33, -170, -127, 44, 207, -47, -19, 38, -46, -14, 89, -116, -47, 78, 163, -167, -213, 32, 203, -258, -202, 9, 18, -187, -53, -66, 261, -18, -30, 158, 250, 261, 265, 4, -19, 103, -160, 25, -47, 30, -147, 63, 88, 203, 20, 146, 247, -292, 15, 119, 21, 75, -14, -214, 70, 149, -38, -36, 54, -29, -29, -96, -164, 3, 245, 160, -59, -122, 125, 141, 86, -34, -100, -130, -24, -73, 84, 66, -41, -89, 152, -72, 91, -68, -29, 37, -102, 19, -31, 96, -25, -27, 50, -158, 17, -126, 126, 29, -46, -68, -118, -89, -16, -116, -103, 76, -40, 95, -141, 81, -51, -118, -100, 71, -260, -210, 13, -49, -154, 24, 55, 92, 30, -45, -93, 30, -178, 173, 10, 19, 14, -106, -8, 158]
7366A58j06p0l2O9J25j41l5K09j81mM3J02j75M4J43k70J73k15K12k27J52O8R6
7389A38k3mk3j7n1m9l5J34j56K56k99R8P1K4o4L6K3j54J94o6Q5j84M2L2M1l0Q0
7416I9k1r0K5J04k17R6M5l38L83l04J99O5j89K48k04R1j07J6Lk3J35J23r3K1n
7441F2j91J00j18j03J46K19j1Q1j47j46N8o9p4K35j6L0J6j76J38O9k01j71M79
7464B10l08K93m58K95K22o78P72l60J33J5m47J27P5kj91P01q6n33K98l11K55p6
7486e4L55k41k3k6j77M44m90L95Q2o11N17k38k02K92N8O6j62R1k12L4R7J43J02
7509B40j69K7n8P4j90n9J57k06O7qJ57Rl8k67K09J9J87k47N65o16N16m16o26M57
7533b16p6L08k54N21j15J24j65m1k85O52r29M82K17m44J81O9Q8n7j15K74j50j63
$$ y = [158, 52, -18, -50, 19, 144, 3, -32, 177, -4, -8, 35, 137, -38, 6, 149, -121, 52, -163, 49, -178, -26, 42, 138, 115, 111, 88, 71, 20, -29, -64, 70, -86, 170, -129, -31, 40, 64, 0, 36, 59, -95, 99, 33, 118, -66, -24, 8, 49, 19, 99, 78, -12, 13, 117, -100, -4, 41, -297, 86, -218, -19, 46, -143, 105, -99, -8, -115, -99, -96, -119, 16, 139, 46, 67, 62, -129, -29, -147, -250, -104, 115, 104, 185, 38, -108, -50, -119, -193, 42, 26, 56, 72, -104, 34, 103, -98, -269, 210, -98, 195, -263, 32, 254, -424, 348, -12, 121, 136, -311, -184, -109, -111, -302, 399, 313, -220, 78, -233, 22, -54, 301, 60, 37, 11, -166, 278, -212, 183, 265, -346, 171, -67, -269, 23, 81, 147, -15, 76, -136, -102, -5, 138, 240, 71, 98, 40, 114, -76, -135, 22, -184, -117, -125, 32, 41, 3, -264, -55, -36, 151, -96, 469, -147, 369, -47, -673, -216, -292, 16, -238, 283, 168, 292, 127, 86, -199, 453, -476, 6, 223, -221, -40, 29, 117, 60, -55, 219, 69, -94]
7555i4J28J77k21j95K03o6M7m8M6j73L40q8j48J36lJ29j76O1k47J65J06j24N6
7578A1l8O6l7l4O5L0o0l3J75l33L52j28j17P5J72j59M63m49QJ56n2l11M54k77
7602aO06r45K42K84l01J93K6m78K53K07j51O7K06j76K30j91P7J1k87M84p54K4
7624c74O65j28l67M48j85J7J33j26m22L98R4j53J1r5mJ47k08K56M0M7k46J19j70
7647a03k7R5J69j42j97O9K05j35R4J58r6l22M43m07K16K44k70K79m34R8J19j41
7669h5K68m15K93p24M31P73j18q26R78o76K75j61j39N49j32k82j96j4j97O80j72
7690A10m0j46J83l15K74l66L41J7L9n54O39l19L74j35j72J53j49j74K97N4L1k11
7712f9o3K61k7l35K87r9J12k05K38J15k03m21L55Q7j82rL26k08P8k46mK79J5l9
$$ y = [-94, 34, 211, -10, -205, -2, -68, -21, -69, -23, -196, 144, 56, -92, 44, 41, 170, -6, 55, -192, -27, 79, -45, 11, -27, 39, 2, -32, 33, 63, 3, -30, 145, -188, 164, 36, -81, -6, 166, 7, 470, 21, 29, 185, 133, -178, 276, -1, 605, -340, -98, 186, -115, 78, 104, -374, -121, 86, -65, 2, 208, 32, 262, 71, 148, 159, -128, 356, -398, -374, 291, 163, -204, 244, 59, 76, 209, 83, -339, 59, 153, 0, 11, -84, -88, 59, -149, 107, 147, 194, -52, 67, -103, -130, -35, 134, -8, -205, -136, 69, -66, 28, 186, 90, -232, 211, -196, 20, 264, -6, 273, -161, -63, 56, -85, 183, -232, 61, -663, -232, 541, 423, -403, 575, -101, 174, 13, -126, 423, 291, 9, -187, -201, -398, 282, 110, 70, -76, 107, -208, 66, -300, 41, 58, 97, -457, 182, -137, 237, 102, -70, 83, -66, -240, 57, 111, 142, -69, -132, 129, 102, -233, 54, -45, 67, -138, 100, 215, 12, -409, -54, 33, -149, -158, 168, -40, 38, -208, -212, 67, 82, 43]
7736D3k22O2nJ93q2L53l08k00L15k52K20o9Q0M46o35J34J22l04M52r08K36L25
7758dj15K78k72L8J15p1k95j28L86M36k42Nl5p68R70l53j12R82q74m37K03J50
7780a43L3O9J74j93O9P6k18r2j78J84k48O31j11J01l77K44j89J45O3j24P5J02
7802I3k5J28j96j82L0K93j8n9k6j5kP5j29K16j55Q6m86k5n6L55K06m2n6J24m1
7827I3k85K98k04J96k05N2L3R3J13l07N5J72M7j90Q2k5O2j43J05p3k58L80k8l1
7851C2o3j07O0J30j12K31m0k98J97j61o4K50q1Q9r2J90o7r8Q0J9j39J03J78j83
7875E4J16j80P9N8j85j6N4l4p9K97q9j00N9J64j16Kk50PJ26J26j37RJ5J4oJJ2
7902Aj66K69jo5j50K42j27J76k61J67j7j33K28Jj10qm9J9m6M5j90K51K2k6jo4
$$ y = [43, -179, -117, -122, 71, -11, 342, 34, -166, 149, -103, 117, 48, 128, 574, -61, 73, 195, -109, 343, -565, -329, -4, -119, 159, -113, -75, 40, -31, -326, -454, -68, 368, 126, 131, 96, -672, 298, -55, -167, 815, -59, -496, -293, -143, -110, -41, 133, -60, 9, 85, -133, -225, -403, -219, -467, 164, 53, 154, -223, 21, -168, -23, 40, -84, -9, 93, 68, 196, 0, -182, -152, 141, 123, 64, 38, 23, 21, 96, -33, 183, 28, 114, -372, -397, -453, -98, 108, 66, 10, 134, 93, -192, 106, -98, 98, -107, -55, -22, 71, 184, -123, -68, 104, 151, -39, 43, 18, 80, -63, 42, -31, -289, 91, 63, 32, -31, -138, -78, 52, -60, 171, 131, -167, 30, -131, -195, 55, -26, 63, -29, 161, 94, -4, 76, 95, -44, 59, 237, 54, 170, -10, 69, 127, -58, -74, -20, -54, -133, 164, 75, -25, 34, 198, 82, 84, -166, -159, -33, 93, -44, -35, -20, -6, -12, -11, 1, -165, 104, 103, 38, -112, 130, 3, 179, -82, 85, 68, -65, 163, 164, 54, 46, -3, 16, -30, 15, -175, 76, 98, 72, 71, 7]
7928Gr7On5L42k94L4R6mk31J46O0J62k81J47M6M0N3j09j8l61M28q6n6L4nJ69j70
7955CK93l05J50k73J35J1J22k74J52o1N6j50J25k05Q7J19j09qL2J45J18Pk51J34
7979E3k61K57k6o0K2N0J64k68j9j5N8K02l70J01R1Km01M65j75m3L00k40M0J15
8003D2j45M27n92K43k08N83n17J19J68k34K52k64J42j1j68J47JR7q1J13j12K01
8025B03j85K79n02M61J30k00R8k69Q8k36rj52K01L5K41k86J77j73J31q1J56j18
8047a1J13J29n12K55M1j8K04l15k11K18N2j62J69J76j60J27Q9m09K20K96k34M8
8069A05j8P9j37j01P2l3j32L16k4p6l7m3n2jJ10K6q3m1J79l9l36K58K27r1o0j2
8095E6J40k25K3L2J4K6q1K27r9j42L5r8K4J79k75K13R0M8l32M52k89N1j11K0J20
$$ y = [7, -90, -84, -139, 203, -91, -57, 39, 35, -196, -50, 10, 172, -109, 38, 84, 124, 177, 68, 50, -311, 117, 31, -25, 9, 4, 173, 3, 296, -9, 141, -132, 3, 14, 136, -138, 14, -47, 9, -141, -16, -221, -134, -15, -124, -132, -100, 45, 163, 170, -81, 53, -208, 49, 23, -37, -15, 35, 199, -69, -88, -103, -45, 157, -213, -112, -21, -19, -420, 45, -130, -173, 127, -113, -73, 42, -103, 324, -268, -25, -233, 350, -167, -48, 120, -114, 138, -126, 16, 5, -163, -16, -15, 82, 1, 114, 2, 203, 18, 297, -205, 256, 386, 186, 284, 15, 103, -133, -142, -294, -93, -58, 183, -103, 74, -99, 32, -49, 107, -11, 102, 231, -281, -26, 15, -3, 201, -114, -325, -107, -55, -217, -48, 128, -32, 95, 184, -225, -5, 291, 57, 105, 87, 166, 29, -72, 0, -33, -165, 151, 127, 51, 14, -29, -81, -82, 28, 54, -29, -70, 109, 70, -266, -8, 219, 128, 68, 56, 196, -29, -6, 26, 40, 66, -15, 212, 113, -29, 6, -92, -68, 111, -164, 49, 139, 187, -145, 307, 18, 69, -42, -22, 98]
8120I8OJ5P8l02j71M06j83J20M6k87J67J63j48m6P8k3J60j70j08J33J8Q7j97N9
8144ak7k6J58J5j11o8j15L36j87j47K27p0M3M6Ml5OO0k52J70r4jq8K63l9K1r2
8171dJ99l52M0J39J35l19L19k08n1K71j93j17K5K47k05N9q4j1J76%
$$ y = [98, 104, 119, 197, -105, -276, 130, -53, 67, 113, -174, -7, 156, 8, -38, 40, 17, 177, 7, -101, 32, 50, 137, -60, -1, -28, -54, 104, 119, 8, -60, -175, 161, -26, -173, 54, -16, 27, 73, 77, 42, 48, 108, -144, 26, -68, -69, -157, 106, 67, 88, -4, 195, -157, -117, 22, 157, -162, 157, -51, -102, 169, -24, -141, -116, 131, -74, -15, -99, -110, 66, 66]
8191F6
$$ Imaginary data points
##PAGE= N=2
##DATA TABLE= (X++(I..I)), XYDATA
0@%%%%%%%%%%%%%%%%%%Mj2J6j6J6j6J7k5L2l2L7m5N0n7O5p3Q4r5J06j19J34j50
40g9J66j84K06k28K52k80L09l39L74m14M56n02N52o08O71p42Q21r13J021j145
60f06J293j472J696j985K370k913L744n193Q452l2740J3646M0089k4353q197k988
75i157R697j353p069J7726J0778k7329J033J1665k909P57m054m99Q248j5106q14
90h386J4954q773m053N366l457Q550k588r303J0804p80m239J0356o100k423N254
105E182r232M663O792q896K777l018n728R978n035m121J1818q209m895R493k031
120d62J868n39n220J1847k201j0735J0737j414o744O965l867K3K304r931O666
135g03M209j1821O921L784o041M190n100J590J1031p959m47O380q522L160M752
$$ y = [0, 0, 0, 0, 0, 0, 0, 0, 0, 0, 0, 0, 0, 0, 0, 0, 0, 0, 0, 4, -8, 8, -8, 8, -8, 9, -16, 16, -16, 21, -24, 26, -31, 34, -39, 45, -50, 56, -63, 71, -79, 87, -97, 109, -119, 133, -147, 162, -177, 197, -217, 239, -263, 289, -319, 352, -390, 431, -482, 539, -606, 687, -785, 911, -1074, 1296, -1617, 2127, -3066, 5386, -27354, -13708, 26381, 2028, -6169, -9157, 540, -813, -7882, 9844, 20622, -6707, -5674, 5991, 3082, 3839, -215, -714, 7534, -7572, -8386, 6568, -2205, -6258, -892, -4349, 4201, 1613, -7690, 3114, 2334, -1905, 8451, 2351, -72, 5182, -4050, 613, 7405, -1491, 1286, -1732, -7460, 2518, -2517, -6638, 5180, -3029, -7924, 1569, -462, 1406, 867, -4353, 7494, 5293, -5442, 5295, 3881, -2863, 4102, 235, 258, 2562, -7369, -703, 3506, -8315, -1394, 2390, -3651, 539, -4561, -2971, 8060, 101, -346, 6034, -2488, 672, 5424]
150E424n664M862l734n957Q542n559l367Q893o163j102M509o779N222L910o111
165c074O029k159l955R841m606l170P195o958Q52N379p807K500M54o644P611j754
181b66n203P134n338j895Q498m620K355L163q131O159L458o313N693k509m309
196b124O855n688j277O209p845J323M557p585L999J844m813O267k579k618Q546
211E071n152j037O293o128K830M187p834L465K40n758O760k675m623N821n621
226d161Q0O397o462K831L777o665N535J549m383O669l340l475O840n279L48M815
242E076q328K337K988o750N117k60o070O393k695j379P007n157L92N449o326M071
258A865L482o798M879r23n041O266l106k867M871o162Q73M548o696L294K208o146
$$ y = [5424, -240, 4622, 888, -5069, 3473, -2086, -5453, 3440, -2723, -3825, 684, -6095, -873, 3037, -3074, 2955, 796, -3159, 6682, 2076, -1094, 6101, -857, -5, 5374, -2433, 67, 521, -6123, 1488, -266, -5469, 1665, -3673, -5568, 2930, -1690, 665, 3828, -4303, 1856, 5314, -999, 4694, 2185, -2124, 4731, -957, -2234, 3975, -3870, -2547, 2010, -5575, -1576, 268, -4545, 1722, -857, -3475, 5071, -81, -1118, 5175, -953, 1877, 6064, -1770, 1695, 1935, -3823, 2937, 262, -4361, 1460, -4161, -4081, 2316, -4146, -1315, 2462, -4203, 1332, 2881, -1502, 5167, 1827, -1648, 5192, -87, 261, 5076, -3252, -915, 2073, -4677, 440, 180, -5890, 503, -2192, -3571, 3436, -1721, -1329, 4120, -2206, 1865, 5347, -1451, 3428, 2505, -2536, 3730, 624, -2243, 2628, -3534, -2661, 1887, -4809, -1515, 693, -5453]
274e453N894M46l913O545l065j732O298n303J417M267p238L398J453o351N399
289B062j452n380N517l119j123N721n956J647M156n657M900K007n713N670j075
304B205l901O947l986j962M595o175J243L517o318L669L73o408O406q27l081O092
320B389l662j044N765m537K769L066o487M224P28n234N722k265m311M910m540
335b507m19M865n690J781K454n528N387J050m459O062k142k620O409l753k64L930
351D556n780K328J997o085M191o92n303N759k640k471N709m382L00M779m910L147
367E03K443n130N072l53l782N928l105l204N252m881Q4L896o217K418J433n380
383e023N371l56m100N809k848j004O030m224N63M057n469K906J776n038M258j619
$$ y = [-5453, 441, 887, -3026, 3519, 454, -1278, 5020, -283, 1134, 5401, -1837, 1561, 3014, -3337, 2062, 610, -4770, 747, -2372, -3495, 2226, -3730, -2083, 2073, -3584, 1316, 3323, -2390, 3280, 2205, -1696, 5251, 1265, -697, 3898, -2277, -1034, 2483, -3835, -166, 207, -6201, 205, -622, -3703, 2389, -1273, -2317, 3448, -1089, 1680, 4746, -1741, 2483, 3211, -2023, 3699, 1434, -2877, 2033, -2507, -2926, 1939, -3751, -1970, 484, -5044, 343, 1393, -3066, 2996, 854, -1766, 4643, 890, 626, 4556, -1224, 1104, 3101, -2984, 1207, 515, -4788, 971, -1669, -4140, 1569, -2813, -2513, 2266, -2644, 503, 2946, -2184, 2888, 2535, -1247, 4681, 1576, -1628, 3624, -1257, -1173, 2723, -3494, -1076, 357, -5023, 348, -8, -4108, 1701, -1147, -2151, 3879, -345, 218, 4275, -1194, 1712, 3488, -1550, 2708, 1089]
399A089m406N409l452j880N364n338M78L860m846L692J488m716N408q02k627N453
415D174l402j421N089m857P35L240o022K773P20m638M481k054l089N542l400p31
431b860N266m319J776L390n192M353Q15m557N022k162l141M905m236n11M118n536
447b869J088K324m518L640M68l956M886j716j502N918m042j82M299m369K097K268
463C834n261L154R1m305M402k610k504M840m452K71L891m884K730K663n120M232
479I72P68k916M964k761k030N029l916K97K920n821K310J617m879L700n24l914
495d184M860k399j117N267l976R34L704n046L376K250m797M054j026l329M450
510C021l029j721L934m608O46K596m706L260J205m458M292k23k278N244k868r19
$$ y = [1089, -3317, 2092, -1360, -3240, 2124, -3214, -2736, 1124, -3722, -30, 1458, -3258, 2150, 1348, -1279, 4174, 772, -649, 4440, -417, 318, 3558, -2464, 309, 1029, -3609, 872, -1182, -4271, 1271, -2129, -2860, 2406, -1913, -137, 3253, -1939, 2414, 3229, -1328, 3694, 1532, -1609, 3296, -940, -1451, 2667, -2869, -1781, 543, -3975, -335, 133, -3823, 1063, -653, -2155, 3763, -279, -461, 3838, -531, 1566, 3834, -1427, 1727, 1818, -2487, 1915, -695, -3199, 1641, -2811, -2540, 1351, -3533, -803, 1860, -3260, 972, 1740, -1176, 3788, 1027, -1003, 4026, 110, 407, 3327, -2494, -184, 1433, -3446, 254, -270, -4184, 676, -1723, -2840, 2427, -1549, -615, 3089, -1957, 1419, 3669, -1128, 2926, 1900, -1429, 3021, -8, -1729, 2205, -2403, -1757, 839, -3867, -607, 598, -3860, 432, 209, -2069, 3175, 307, -612]
526f12M068l686J826K300n524K618J187m501L720j805l074M547k903r94M081m261
542c013K019K958m939L734J491l520M599j904l025N140k916k76K617n327J852
557e10K324m594K971l88m051M622j423j919M694l188L19L803l771K160K579m720
573a092L480j93l607M600k549k752L859l429J93K874m462J808J916m149M012J79
589F88l038M637j763j666M774l117K17K850n049K154J861m454L294j479l767M976
605A118k202j738L570l385R52L680m030K391J641l565M458r15l277M691k559j421
621e91L454m404M49K821m210J709O30l768M444j077k606M665k463m11M058l675
637i75J394K640l877K923L59l681L687j602k907L863l045j105L374l934Q38K800
$$ y = [-612, 3456, -230, 1596, 3896, -1628, 990, 2177, -2324, 1396, -409, -3483, 1064, -1839, -2833, 1248, -3013, -994, 1964, -2975, 759, 2250, -1270, 3329, 1425, -1600, 3540, 624, 348, 2965, -2362, -510, 1814, -2780, 191, -197, -4248, 374, -1049, -2968, 1726, -1462, -1143, 2660, -1111, 1049, 3628, -1092, 2388, 2195, -1412, 3188, 639, -2113, 1746, -1683, -1490, 1384, -3078, -1270, 646, -3503, 509, 688, -2350, 2287, 524, -1142, 3632, 515, 732, 3582, -1467, 687, 2548, -1906, 1388, -91, -3858, 1118, -1084, -2822, 748, -2637, -1685, 1995, -2035, 356, 1997, -1568, 2890, 1975, -1302, 3389, 830, -591, 2863, -1541, -1092, 1729, -2481, -772, -142, -3910, 534, -543, -3149, 1516, -947, -1358, 2700, -975, 419, 3059, -818, 2105, 2464, -1217, 2470, 868, -2039, 1824, -1221, -2326, 1048, -2886, -2048, 752]
653G52l721K998O08l079M432j041k145M454k761l11L447m237Q99K221m249K224
669D91Pl851L809j481j864L951l263j4M136l574J595K100l696L673L16l300M033
686C068k240j726L877l851m32L196m249J347J112l701L658K7l022M066j850p33
702a453M094k957K05L247l686J955J406m014L019o55l207L736k616j414L570l669
718b439L78K845l340K202J458l674L978j02k378M123k295j185L711l261K32K080
734B333m134J981P48l771L349j192k450L514j963o44L967l293J272K741l884K905
750A479J088l248L072j128k409L935l051j046K794l489P56K050m083K838O03l152
766b991L739q08j448L617k195k21L352l540J575J731l984K414J65l428L531j890
$$ y = [752, -2969, 29, 637, -2442, 1990, 949, -1196, 3258, 497, 186, 3633, -604, 295, 2516, -1733, 491, 498, -3353, 456, -1025, -2889, 1062, -2201, -2215, 1921, -1653, -58, 2042, -1654, 2019, 2335, -965, 3068, 828, -898, 2979, -872, -1304, 1892, -2357, -1010, 102, -3599, 59, 86, -2936, 1130, -720, -1453, 2641, -316, -111, 3136, -550, 1405, 2811, -1203, 1816, 1161, -2046, 1690, -926, -2340, 1230, -2439, -2061, 784, -2556, -354, 1104, -2570, 1408, 1306, -1072, 3051, 756, -429, 3282, 21, 253, 2333, -1801, 180, 928, -2843, 506, -686, -3136, 378, -1585, -2229, 1738, -1555, -283, 2458, -1426, 1479, 2567, -681, 2391, 1263, -1146, 2789, -262, -1308, 1486, -2003, -1247, 803, -3280, -442, 161, -2991, 748, -60, -1508, 2109, -86, -307, 3045, -495, 1080, 2811, -1173, 1241, 1406, -2022, 1509, -381]
782c81k140L356k802k78L498l707J753J989l533L365L36k625L834j540j728L704
798C101k823j71K281l970J275J497l913K778j21k862L469j579j114L527k685N94
814g16L095l633K349J345l366L225n48k927L553k254j538L143l436L00K338l649
830b719J796J276l232L464k38k385L834j592p69L683l197N64K094l418K152M82
846A795l506K696j018k481L256k077p32L088l224J026K303l015K570J261l215
861a273L388o59k161L790k438r35K664l534Q17J717l827K158L13l081L400p57
877d18j938L577k091j21L197l089J354J964l115K260L62l030K963j459k038L095
893A473k728o28K896l454J176J706k974K634K67k307L638j123j255L317k454k13
$$ y = [-381, -2521, 835, -1967, -2245, 1253, -2454, -701, 1288, -2245, 1120, 1456, -1169, 2665, 1125, -603, 3101, 278, 107, 2388, -1582, -307, 1190, -2723, 55, -66, -2928, 541, -1038, -2152, 1375, -1310, -716, 2379, -1254, 1095, 2440, -926, 2299, 1751, -1176, 2377, 123, -1415, 1728, -1708, -1408, 930, -2719, -923, 353, -2879, 585, 347, -2038, 1796, 204, -565, 3118, -79, 485, 2579, -839, 1313, 1795, -1711, 985, -33, -2514, 742, -1335, -2067, 1021, -2203, -1177, 1126, -1889, 681, 1942, -1273, 2115, 1456, -705, 3085, 647, -288, 2376, -1158, -341, 1376, -2451, -293, 20, -3061, 339, -418, -2356, 1221, -870, -991, 2206, -883, 471, 2435, -680, 1580, 1942, -1088, 1875, 416, -1622, 1473, -1255, -1883, 1013, -2441, -1265, 441, -2533, 101, 368, -1939, 1699, 576, -679, 2638, 184, -29]
909b9K713l356J336J219l607K379l55k522L131k074j294L351k501L12K879l337
925a755J950J667l054L085k54k397L284j845j274K696k885J57K229l834J651R47
941C68k949K437j64j956L297j735l95L716k542M51K436m089K433R63l313K960
957A918j179k632L388k219j136L254l756R88K110k896K073J260k929L292r90j286
973g40L152k134k49K876l533O93J901l116J429R0k589K711j145j736L091k111
989a410m5L153k898J171J686k723K668J95k599L012j238j977L169k614l36K366
1005A580l337J290O59k804K355M33k465L122p45j139K486j683L55K064l214J889
1021H46J014k988J905M18k861K356j284j163K690k183M1K822l209J143J230j903
$$ y = [-29, 2684, -672, 664, 1883, -1724, 655, 300, -2222, 909, -1165, -2459, 892, -1609, -1297, 1582, -1755, 195, 1862, -1192, 1893, 1639, -758, 2526, 681, -593, 2103, -782, -625, 1604, -2230, -579, 368, -2581, -144, -308, -2264, 1033, -702, -1097, 2619, 77, 528, 2964, -1125, 1308, 2271, -1042, 1918, 739, -1893, 1495, -724, -1860, 1394, -2362, -1374, 736, -2160, -87, 1173, -1756, 1536, 546, -740, 2412, 278, 29, 2905, -628, 65, 1966, -1150, 279, 369, -2220, 491, -654, -2390, 701, -1410, -1455, 1698, -1200, -29, 1657, -1066, 1602, 1797, -802, 2210, 972, -1005, 2164, -450, -786, 1580, -1757, -467, 192, -2612, -257, 176, -2289, 833, 88, -1051, 1435, -248, 107, 2171, -1043, 846, 1860, -1128, 777, 1195, -1666, 690, -594, -1757, 933, -1250, -1209, 1613, -1596, -453, 777, -1126]
1037a126J952j7j587K491r54r27K636j940o29J929k758R74N93k937K608m32k214
1054b338K801j539o80L273k485P43J773k220J801P18k754K554l54k026K578k146
1070c01n34K138k539J75J582k940K051P12k668K910m82j614L200j613k73K508
1086B312k351O20J462k926J751M75k841K495j274j825K768j786p48K580k469J083
1102f74J676k521K220N54k229K594p54j423L027k067q42K102k579O24J326l238
1118b204K035J67k340K806j098j321L076j756M2K269k498J404J382k440J875m2
1134A357k115K480j342j554K566k316l37J718k336J205J197k732K310Q1j584K774
1150A372j226n76K681k241j60K270k843R72N12j689J298l63j806K384j512q08
$$ y = [-1126, 826, 809, -778, 1713, 759, -168, 2468, 528, -101, 1828, -930, 44, 637, -2300, 308, -124, -2338, 463, -1076, -1756, 1517, -968, -225, 1548, -672, 1129, 1847, -907, 1647, 1293, -733, 1845, -301, -835, 1303, -1236, -1061, 521, -2419, -368, 344, -2324, 586, 104, -1510, 1690, 77, -196, 2312, -39, 581, 2043, -883, 868, 1343, -1498, 997, -277, -2102, 666, -1120, -1868, 712, -1757, -674, 1002, -1519, 701, 1255, -974, 1620, 866, -557, 2470, 403, -439, 1663, -916, -292, 1034, -2204, -169, -2, -2342, 464, -634, -1955, 1121, -635, -593, 1676, -822, 582, 1964, -476, 1399, 1357, -758, 1722, 380, -1174, 1392, -924, -1261, 457, -1879, -674, 523, -2209, 101, 182, -1402, 1372, 146, -430, 2251, 10, -150, 2120, -723, 249, 761, -928, 370, 7, -1799, 585, -927, -1735]
1166a735K196j525K95J862k492J655J310k304K246m92j723K814j873o77K105k326
1182f64L49J357k954J522N28k178K115m29j448K680j160n33K536k027P52J569
1198B015k576J552M91k430K246r83j731K409j800o23K094k376O27J630k413J934
1214F6N43k188K806n84j279K528j423m83J900k406P94J272k978J544Q3j999K270
1231D66j125j081K294j654K24K025k276P16J669j948J883J55k011K408q52j355
1247d62K019j803j13J490k725J034J081k392J858k60j576K587p52q99K562j930
1263b81L88J879k280Q24J039k255J677n37j631K109j432p69J875k043L04J864
1279G31k238J201R12j842K230l22j454K258q75p60J954k074M60J352k597J221
$$ y = [-1735, 461, -1064, -769, 1093, -1399, 256, 1566, -738, 1508, 1016, -707, 2107, 234, -443, 1662, -664, -315, 1042, -1912, -390, 138, -2040, 75, -354, -1802, 878, -282, -815, 1721, -306, 446, 2015, -561, 991, 1482, -948, 1298, 315, -1416, 993, -807, -1430, 664, -1712, -1085, 545, -1868, 66, 609, -1579, 1227, 643, -636, 1892, 469, -14, 1886, -520, 274, 1546, -1432, 112, 195, -1804, 466, -659, -1740, 554, -1100, -876, 1149, -1127, -411, 1258, -690, 1193, 1348, -663, 1745, 893, -462, 1557, -246, -359, 1131, -1594, -560, 521, -1871, -13, -273, -1849, 738, -14, -913, 1649, -281, 107, 1986, -294, 530, 1569, -686, 991, 454, -1177, 932, -500, -1269, 606, -1437, -1133, 731, -1507, -306, 606, -1236, 994, 672, -782, 1476, 601, -159, 1795, -279, 181, 1533, -1064, 157]
1295A57L96k157J638j97j727K579j527m24K287j803N34J611k065J433P16k040
1311e89J894l17j665K111j512o02J861k636N27J391k125J500K75j704K079m12
1327G6r04K052j254J7J654j788R05Q58k455J620q6k029J864o27j155J779j517
1344i90l43J823j829O69J509j994J888N6j395K051p46j119J967j300l05J355k218
1361i21Q35R26k494J552J44j765J984p31r96K210j294K52J429j527R38R24j951
1378d85J543j43j701K232j326q17J537j819K00J534k238P71Q71j597J611K12j414
1395a029K137q26m96J839j360m7J487k028R88L21k002J326l48j272J704j035o27
1412a268J883j846P48J489k010J468N14j580J867j97j375J821j470m82J692j874
$$ y = [157, 553, -1604, 34, -163, -1890, 689, -838, -1262, 1025, -778, -244, 1367, -698, 735, 1451, -589, 1305, 988, -677, 1434, -78, -680, 1181, -1455, -928, 463, -1662, -162, 113, -1591, 488, 76, -828, 1224, -30, -13, 1641, -147, 758, 1616, -839, 781, 695, -1334, 530, -97, -1252, 527, -990, -1333, 490, -1339, -670, 839, -1155, 733, 789, -606, 1445, 699, -420, 1547, 247, -58, 1297, -921, -86, 840, -1654, -102, 42, -1723, 261, -470, -1466, 744, -550, -298, 1131, -396, 542, 1466, -485, 1058, 915, -786, 1446, 120, -697, 840, -979, -779, 755, -1483, -712, 159, -1438, 173, 385, -1029, 1108, 282, -214, 1625, 265, 218, 1705, -323, 665, 986, -1016, 310, -38, -1310, 394, -641, -1268, 615, -1231, -483, 1006, -1004, 464, 978, -602, 1265, 1068, -307, 1514, 44, -438, 1254, -620]
1428f20O5J198k130J128M79j549J366k64q93K074j217j9J740j598M79J024j621
1445c58J113M20j786J712p45j191J510j396j87J254j590N89J131j842J319M44
1461C97j180J683o00m61J750j582j57J645k123P16R15k109J343j22j360J820r93
1478d18p60J617j304R6J571j438Q16P84j870J889m0j336J795r80p52J556j588
1495c62k7J149j905M69Q58j517J461l6j373J672m62m55J837j511J73J430j615
1512b14Q42O52j828J005o5j328J450q38p53J384j344J51J463j563P95P21j341
1529h11J286J82q62J454j012k68J255j582K20J111j622O67K76j475J115l54j005
1546a425J612p74l12J554j163K61J214j435Q82O29j367J307m76p69J310j294m49
$$ y = [-620, -555, 643, -1487, -359, 120, -1429, -63, -327, -1220, 854, -363, -382, 1358, -240, 239, 1263, -358, 755, 1175, -611, 1101, 356, -835, 675, -721, -908, 346, -1244, -655, 476, -1366, -47, 397, -783, 900, 300, -161, 1589, 7, -150, 1495, -628, 88, 1003, -1106, 237, 115, -1245, 575, -418, -1178, 439, -865, -769, 802, -636, 180, 964, -906, 983, 943, -393, 1402, 422, -330, 1226, -362, -389, 760, -1145, -676, 182, -1335, 126, 90, -1283, 389, -73, -528, 1309, -202, -29, 1401, -214, 628, 1280, -548, 457, 392, -936, 514, -324, -1077, 307, -1037, -886, 577, -986, -191, 530, -811, 475, 657, -205, 1249, 237, -31, 1224, -358, -138, 973, -649, 18, 294, -1181, -66, -420, -1425, 187, -587, -899, 655, -508, -247, 967, -468, 414, 1043, -324, 983, 507, -262, 1048, -246, -695]
1563f95J366j800N65P33j570J169K66j223J545k61p84J576r35n9J646j431L39
1580D47O69j707J133j38j183J302q17o63J256j277L04J320j507O16P98j532J510
1597E31J34r93J465n35q08J135q33l22J152j615M67N52j441J045p3j139J594m08
1615i2p37J491j086L50J132j325Q21M10j333J235j25j262J300q46p64J269j201
1632g63q4J263j576P79O56j536J400K32j143J791q20n34J587j346P5J108j490
1649d01N75M98j316J056m63r97J206p25k87J210j270O19R64j211P82N60j289J224
1667G35k01p34J199p21o01J148j290Q4O15j123O22K98j332J317k10p91J571j040
1685d54k2J536j188L77O99j309R86R8j125Q76n82n39J110r09k23J033j271L73
$$ y = [-695, 671, -1129, -564, 169, -1401, -232, 34, -1189, 356, 95, -689, 887, -48, -107, 1539, 108, 447, 1116, -591, 542, 404, -779, 523, -294, -957, 299, -978, -674, 646, -861, -245, 553, -979, 531, 665, -328, 1137, 602, -206, 929, 96, -226, 926, -689, -222, 330, -1111, -66, -139, -1278, 316, -92, -829, 662, -424, -74, 1058, -267, 554, 964, -369, 866, 741, -521, 779, -67, -831, 438, -763, -847, 416, -1160, -381, 275, -1261, 139, 371, -772, 1019, 199, -335, 1252, -94, -19, 1089, -401, 174, 672, -644, 412, -51, -1048, 158, -567, -854, 356, -914, -295, 669, -542, 240, 800, -489, 735, 534, -200, 999, 278, -323, 825, -465, -381, 234, -889, -267, 31, -1301, 16, -194, -985, 586, -454, -476, 1060, -128, 249, 948, -361, 625, 723, -402, 474, -108, -647, 463, -446, -669, 364, -907, -534]
1703e34P81j068Q75J50q48J479o77m40J359p52l30Q70j125N64M99j452R74k90
1721C5r92J000m42m70J043j008K28J140j106N70O05r53Q66K55j016J338q31o83
1739d21J133j134J16P73j398O29N20j127R85l97n55J094n02j52J526r47k29J076
1757I90j189O29L66j018P85n05p67J063o81m22J126j164L76P52j118O50L66q58
1775f19J092j21o73J212m71l18R03j177L30N26j255M94L08j195J273n64n87J180
1793C38q54j03J182q29J25R32j184R78l0p71P80k70o60J046j010l1O65q66K33
1812c29M23j011P08J99r03J341j83m93J070q80j79J354j191M00N47j190N94Q2
1830C59j203J068m14n16J023q35o7Q00q65L42Q31r84R66m4r64J236l51n22J020
$$ y = [-534, 247, -821, 54, 204, -644, 835, 158, -282, 1077, 325, -5, 865, -260, 304, 803, -649, 325, 35, -957, 43, -399, -869, 174, -834, -606, 534, -572, -2, 603, -350, 516, 771, -245, 1093, 262, -421, 712, -422, -306, 467, -931, -302, 218, -909, 76, -321, -876, 218, -284, -436, 1090, 143, -86, 990, -199, 430, 796, -222, 563, 58, -709, 354, -327, -749, 377, -787, -411, 341, -777, -127, 239, -619, 473, 352, -321, 891, 420, 102, 1005, -172, 158, 684, -571, -77, 231, -964, 309, -255, -842, 338, -516, -619, 563, -266, -141, 791, -393, 585, 555, -216, 564, 294, -366, 680, -330, -361, 304, -562, -329, 94, -917, -209, -10, -913, 428, 245, -248, 822, -58, -237, 1117, -74, 326, 873, -317, 277, 359, -844, 224, -190, -706, 317, -518, -585, 215, -650, -308, 523, -461, 505, 461, -503, 733, 382, -140, 880]
1849H80r25o5P39j184L44L40j070Q06j42o01J100n40l57J117q11M59N02q33O12
1868C71K00p47O92j43q77J200r58j78R24r69k8Q57j001L35N22j086J184k21n63
1887d86J024n34j11R47j026N54N40j293M43K98p68P71m26n80R06q97k84J186q99
1906f35L54P31r69P60L47j023J075l18m17J032j041k87J128r16k4M47j080P09
1924a27K25j169J276k82p96J301n70o6R95r65N57K32p24N01K90j052Q32n76m90
1943f08J045p84k9O11q09L31K40q39J019J52r08J032j63n27J170q30M1P08j085
1962b33L33L34j051P22j43o98J035n25m85Q99n22j38R65r30N21M50p15O42J42
1981F03p60P51n10m19R47p38m73Q16q92M49K45p51R19k65p34J278m85k88J004
$$ y = [880, -45, -110, 629, -555, -211, 129, -941, -135, -277, -878, 222, -318, -675, 442, -369, 90, 592, -241, 371, 571, -176, 516, 373, -504, 696, -262, -440, 484, -485, -513, 344, -657, -322, 200, -886, 298, 77, -486, 538, 4, -107, 840, -186, 368, 908, -385, 58, 356, -412, 359, -67, -647, 259, -638, -922, 264, -635, -281, 450, -519, 241, 588, -435, 640, 322, -95, 937, -104, -391, 737, -179, -203, 244, -836, -127, 98, -1071, 205, -77, -873, 428, -142, -208, 787, -178, 379, 611, -113, 388, 678, -374, 458, -118, -608, 437, -347, -376, 235, -574, -243, -3, -842, 177, 329, -579, 453, 290, -237, 933, 103, 144, 852, -233, 100, 434, -617, 105, -38, -736, 299, -226, -711, 188, -334, -472, 493, -437, 84, 534, -181, 461, 603, -157, 594, 84, -335, 612, -126, -599, 217, -675, -226, 19, -732, 187, -78, -812, 466, -19, -307, 697]
2000F97p25M9P09q00L20K84q75R14l01q75J006q32k61Q79r48L50O09q50Q07p9
2020G8o02J014k54n07J141q99r7P71r29L00L66r19O88k6p94P48l08m06Q80m87
2040b42k31P94m91L49L68p61L95L73o53O20j94p77J072r79N6N13r04K14O53p54
2060e79N25K2q24J237k76n31J015o19Q2Q28r74J18N17j081Q06m2p26O14l71m18
2080f77P06m63K47L26p61N55N14p76N96n4n15J002k73o06Q17o66j9L85o11L74
2100A01R1p16L61L62r27R18m94j46O48l75L24K27m22L41J66o61Q25m25q28J194
2120E64p28k61O16o45J35M03q05N28M92j013R64J8p10P32l63MQ60p85J57L20o12
2141a29K90L2p54P32l34m80R72o01j48O65p49L54O34p54M80J86n93O28n0n86N55
$$ y = [697, -28, 21, 730, -70, 250, 534, -341, 573, 272, -603, 403, -429, -690, 189, -759, -409, 200, -650, 157, 78, -524, 490, 236, -271, 870, -29, -126, 645, -284, 16, 382, -537, 151, 125, -669, 79, -229, -635, 245, -242, -473, 321, -170, 179, 547, -214, 181, 554, -99, 521, 327, -450, 622, -357, -301, 212, -692, -478, 175, -579, -54, -32, -856, 381, 105, -426, 589, -30, 52, 880, -94, 24, 541, -540, 266, 224, -502, 112, -259, -677, 29, -434, -187, 139, -622, -67, 447, -329, 267, 213, -302, 700, 427, -179, 638, -28, -47, 338, -273, 101, 192, -524, -163, 199, -728, 190, -304, -450, 198, -177, 147, 374, -48, 293, 459, -202, 623, 198, -630, 564, -164, -425, 191, -454, -319, 84, -721, -193, 299, -714, 250, 268, -442, 290, -73, -69, 791, 6, 163, 483, -129, 161, 193, -561, 171, -163, -643, 329, -272, -420, 245, -504, -150, 484, -270, 210, 396, -197, 431, 381, -205, 350]
2162C50l89j00M71n88q0N36r19N12K96q35P77j51l50Q26l11l42Q53o27mN84o94
2183a85M22J37o82N76m01l66P23o02J67L09k87m1K96m89N55R7p20J004n15l44
2203c46R29p04J66M88r09M63K63p64N21j58o28O24j92j33N22m07J26O88p63L16
2223A02L34o73N89k4m26O47m01l60N68p99K82M02p95N81l3m27N70n8n97P44m60
2244b34P3N76n70L59M28o61L21J00p81M43P2n68P30o24K38L72o79K34L81p70M49
2265a11K97l18M68p7m02P37m33k36N61n21n8N70q02M76r9n93O85l66k75O12m45
2286c30J82M90p21O32L00r83N46K41n55N60j34n03O44n22n7N08p78K20M07m74
2306c27L42j03l75N85j08k58O90k60q4J52j95P0L39n61k2J59l30M48k50j04L22
$$ y = [350, -39, -139, 332, -256, -336, 200, -719, -207, 89, -746, 31, -120, -470, 356, 45, -297, 556, -71, -75, 509, -185, 237, 374, -308, 268, -133, -499, 224, -378, -211, 98, -189, -230, 66, -423, 132, 229, -491, 513, -2, -346, 583, -121, 45, 533, -376, 87, 350, -414, 107, -51, -679, -55, -247, -380, 142, -265, -139, 549, -214, 102, 436, -237, 352, 328, -98, 549, 148, -212, 356, -443, -161, 241, -554, 27, -6, -433, 137, 79, -518, 226, -234, -161, 415, -155, 204, 632, -29, 292, 392, -389, 54, 126, -442, 288, -336, -98, 274, -405, -171, 210, -560, -111, 186, -132, 336, 259, -143, 594, 161, -75, 486, -35, -93, 477, -325, 151, 52, -541, 144, -222, -497, 115, -330, -148, 342, -379, 253, 553, -430, 116, 357, -198, 362, 228, -275, 369, -153, -210, 298, -480, -260, 147, -327, 15, -88, -463, 122, 14, -244, 446, 186, 102, 254, 59, 129, 468, -93, -115, 44, -286, 162, -88, -192, 130]
2327A30n08J88N08o37K97M18n88L52m6l21Q00l70k98O70p16J38Q7n74M03M26n89
2348b30J72pl91O32k04k90M99l54J93J70k75J29L50p04O32j44m43N78k69o6L02
2369B80n79j26M51l38L39p7j94N31k97j72M99p9k07M73n77K12L55n98K11J26l91
2390a58L78l64k99O14l57k51O47l80p9L05l90M65K61m62L40J30o99N88l53n6L67
2411B47n06L11P5m46K02J30m70M15J05l78O86o00K58K37l33J51J38m38M11n1l16
2432a72K69j04j52K69j57m01N29p62P21N1m66L39J08k44M74l08n6M92m12l8M20
2453D00m75nJ59k26K77Nl50K19j57k18N56l78L3L21m77M90J23n72M64jl43N62
2475D07k47k48L58o04K20M00r15O07J31m38M32K5l46L55k3l00J81n9J00K49k32
$$ y = [130, -378, -190, 318, -319, -22, 396, -192, 160, 114, -207, 593, 223, -75, 595, -121, 17, 104, -470, -67, 359, -230, -58, -65, -456, 176, -28, -318, 181, -173, 20, 190, -85, 44, 394, -310, 322, 178, -265, 313, 44, -22, 280, -299, -425, 26, -312, 27, -50, -244, 287, -10, -182, 317, 238, 31, 504, -73, 139, 494, -104, 107, 233, -158, 220, -144, -443, 171, -186, -437, 210, -170, -249, 56, -334, 131, 392, -70, 270, 400, -299, 289, -64, -120, 247, -259, 52, 127, -319, -117, 13, -457, -42, 63, -315, 371, -229, 29, 266, -67, 84, 222, -216, 195, 144, -172, 97, -7, -159, 110, -47, -448, 81, -681, 40, 91, -375, -36, 72, -172, 302, -6, -62, 430, 18, -20, 400, -75, -80, 79, -147, 130, 135, -215, 4, -153, -371, 185, -193, -160, 161, -316, 174, 297, -275, 189, 188, -155, 407, 160, -88, 270, -334, -114, 286, -629, -22, 109, -329, 103, 128, -218, 137, 114, -186, -5, -64, 36, 285, 53]
2496E3j5J57m42M62p5k87M21m13j19L57m70L88R9k52O9K44l56K40r3j05L68j45
2518H6k69M22j96OK77m88l8J12k32K40K0k38N34l38J35K35m22J69K48l42M70j49
2540B42l86L12L9k65L63m25PJ27l04L04j15k8m2L45l93L78j00n6N04n90NK43l46
2563a81J23J91k73K20l5l88L23j53J36R0j30r5L79m15J85N4j01K35k4n0J58k76
2585b7k9L43k87nK02m06L74jm18K43K8k92M10j77k62N02j07k19K55jj06J80n01
2608c01L87l2k31K97k42P7J45k15l6L69m08P3L23n28M32o1k60L62j03j10J09J9
2630F6j8K43n16K38J4j33K58l75o8L01k0k07L19k00J20O4K1O1nl58L23K14m15
2653g3L62k89l58N14k50p7J99j28J26o6l7J83l40J45L62l17J28K8n2j55J99l15
$$ y = [53, 38, 195, -247, 215, 140, -147, 274, -139, -258, 99, -371, 17, 116, -136, -67, 177, -179, 61, -32, -137, 231, 86, -183, 239, 43, 49, 326, -162, -200, -88, -320, -80, -60, -298, 236, -102, 33, 268, -154, 15, 263, -79, 391, 242, -144, 168, 207, -58, 305, -120, -113, 14, -290, 14, -101, -129, -171, 174, -219, 159, 59, 3, 507, -83, -78, 165, -181, -58, 133, -140, 80, 45, -343, -20, -173, -37, 53, -77, -172, 207, -208, -23, 31, -70, 165, 141, 91, 249, -27, -56, 287, 0, -5, 197, -209, 165, 164, -254, -11, 17, -275, 135, -42, -304, 198, 91, -128, 127, 126, 20, 200, -301, 86, 54, -177, 120, -122, -45, 100, -115, -151, 218, -190, -117, 206, -322, 110, 49, -211, 151, 48, -62, 47, 66, 48, 291, -225, 13, 27, -106, 152, -223, -291, 10, -10, -217, 102, -98, 22, 86, 107, 168, 163, -195, 128, 342, -73, 289, 0, -358, 156, -94, -171, 28, -100, 26, -40, -77, 106, -234, -89, 273, -44, 84, 112, 60, -95, 104, -211]
2675b11L72k07j59N67m34m8K39k75p5J78j52J98J25m17M28r0j03J02j8l7K76k67
2697hJ10kk59n0L65k71O6k8q5K29l28P9K62j41J6Q3k0R8J09j76l3L7l6K41o8j92
2723bJ14k70K67r4p6Q6j39l3J43j47M4L91l01K1N0J11l02K15j14J30J28j68K2
2746G6O0l95K75j33r7L19l31J46J49p9n8J48l17J95K4J91p4q5o1J81k37J92l2
2769E7k38p0L45l25O3J12q3J85k1l3n1R5P3k6J17k80J12k02L06l54J97j09Nk14
2793c39L43j01k6J72k55L39o5k32J78R6J10r1p1J64j30o5j92K23q5J14j53P2p6
2816g0j89K21J26j24l4pP7J10k10k2J03o1J5J85k54J28K78j18j27rk31K39J39
2839A65j25k4J81k43J63p7k39K72o1%R0q0j02L17j11j54Q9k90K11J15nq3j58N4
$$ y = [-211, 161, -46, -205, 362, -72, -120, 119, -156, -231, -53, -205, -7, 118, -299, 129, 39, -64, 38, 20, -17, 259, -8, 102, 100, -159, -209, 156, -115, -49, -77, -162, 67, -261, -182, 80, -61, -45, 38, 18, 116, 225, 49, 16, 53, 17, 258, 190, -2, 112, -158, 109, 15, -61, 25, -114, -147, -4, -151, -107, 284, -17, 4, 54, 165, -137, 78, -36, 94, 222, 54, 76, 136, -259, 16, -117, -214, 105, -226, -80, 69, -10, -68, 80, -237, -42, -18, 173, 99, 14, -47, 134, -103, 89, 57, -181, -251, 94, -231, -168, -56, -139, 46, 25, -8, -59, 36, 109, 83, 200, -80, 32, -170, 136, -218, -21, -130, -125, -339, 4, -97, -123, 49, -206, 133, 68, -164, 14, 110, 220, 129, 58, 222, 92, 27, -165, 58, -27, 87, -66, 6, -70, -259, -38, 88, -36, -70, -77, 0, 110, -100, -122, -19, -80, -65, 120, -134, -6, 272, 154, 27, 18, -213, 26, 165, 40, 16, 197, -46, 117, 40, -199, 73, 12, 12, 102, 22, -80, 237, 126, -28, 61, -229, -18, 97, 92, 9, -149, -95]
2863i5J75l31J74R7j08K2M3j17J54j8m8K34j53K2j18K55o6o0p8j0o3J85j11N6
2887D1N2m0m1L2r9j33J30J88m9J28l41K62K1qk18L26l45p8L97l03P6Q1j54l3K71
2912A63j58N4j45Q5P2j14j10L46k22J48k81o8K29O3j98R4L9j08L06m10P9K42m9
2935E7n8J62j78O8j56J2L64k61mr7M8N9M2k71R5J03j8l9p5J63q1J02j51K85l00
2960a29J26M7J01O4k14P5m8L9j9J41k87Np4K60k26K04q5j02K04j69J67j08o4P1
2984b1n2r8J08J92M8j04j78J21L6l9j20L54l30mq9J81J06j75J70j36J74q1k81
3007b18M75j31o5k1M6Kj00K81l55J40k52J71p1J50n8rj0M0m8m3J98Lm7Kj13k63
3033b96L05k30K40r6K57j83M5l5ro3l2J39N6m6%l5j71L67k37j48K89o2m9J7p9
$$ y = [-95, 80, -251, -77, 20, -88, -66, -23, -140, 14, -4, -52, 182, 29, 51, -67, 188, 122, 62, -16, -26, -89, 96, -15, 41, 93, 53, 12, 44, -55, -188, -58, 130, 81, 209, -132, 130, 151, 143, -75, 251, -94, -172, 225, -78, -2, 79, -75, -108, 163, 5, 59, -86, -1, 71, -43, -153, 193, -29, 119, -162, -230, -1, 62, -136, -42, -3, -111, 195, -215, -136, 106, 57, -1, 161, -17, 51, -105, -93, 271, 10, 6, -91, -43, 16, 58, -213, -118, -15, -33, -72, -147, 16, -65, 37, -114, 171, -129, -3, 44, 145, 209, -5, 70, 22, 61, 42, 183, -104, -99, -173, 87, -139, 65, -20, -122, 82, -87, 80, -28, -92, -21, -73, -171, -63, 129, 177, 73, -105, 16, 52, 13, -107, 247, -83, -87, -176, 5, 111, -64, 106, -30, 144, 63, -218, 257, 126, 61, 40, 86, 88, -12, 269, -86, 54, -198, -27, -98, 52, -6, -15, -25, 15, -33, -76, 122, 125, 78, 80, -33, -296, 9, -221, 19, -77, 180, -3, 42, 7, -2, -65, -97, 42, 98, 52, 52, 17, -154, 213, -24, -172, 117, 55, 6, 23, -56]
3058e6j20n3M71l75J29j17J71k09J31J2p1Q7Q9j75m2K75p4P5k63K05j23r3n7j8
3082b01K02K1j94K21q3J16J0K9j96p0kK09O8k18L0R2k7L4J08j64j69K58q5j49
3106a60k4J71q2L11l05J17J78l07J16R3j33P0j56j88L06J4J50k02OJ74k50R7P8
3129G4Q3r0Q8k1j22M1l7l2L0q4J1R4q2L6J34q9M0j25L5o1K84l45K40k1k26L8J71
3156F4j59J42j0j54J31M4p5J66j58o9J75J10j34P3n1J09j32j44KJ04q5L05j29
3179A25p4l02K82k5j00j76j98K26K9N13l59P9m4L03k87K94l12J03j08jj28K97
3201A37p2P6o7J2L8j75L7J04k26J57j17O4K53j16k50K59k21K0m2p3L44l63J95
3224b6j8J4j9J02M5J0k42N6J39j07j26J46j38J70p7J33RK76k81l71QN57J00q25
$$ y = [-56, -176, -229, 242, -133, -4, -121, 50, -159, -28, -16, -87, 0, 89, -86, -128, 147, 73, 148, -115, 90, -33, -126, -183, -201, 1, 22, -172, 49, -34, 82, 92, 121, -75, -145, -147, 62, 130, -88, -58, 34, 7, 41, 149, -15, -184, 74, -11, -160, -184, -13, -95, 216, -89, 28, 206, -101, 15, 108, -25, 45, -111, -299, 7, 21, 171, -31, -25, 149, -101, -4, 74, 157, 67, 155, 134, 12, 53, 16, -16, 14, -70, -59, 35, -47, -11, 123, 34, 74, -51, -16, -77, 207, -138, 102, 81, -145, -107, 64, -95, 47, 37, -117, 14, 58, -17, 149, -9, -78, 97, 207, 73, 146, 95, 204, 72, -72, -70, 34, -51, 254, 125, 51, -251, 31, 6, -94, -270, -468, -242, -213, 300, -59, 20, -24, 279, -8, 286, -26, 77, -31, -32, -160, 137, 65, 141, 74, 86, 124, -51, -14, 90, -136, 21, -96, -32, 221, 105, -145, 114, -107, -87, -129, -202, 142, -221, -26, -44, -30, -49, 53, 98, 108, -134, -78, 61, -46, -172, -26, -164, 6, -71, 62, 71, 347, 66, -305, -297, 260, 360, -465]
3248d65L40K04l34N92j32m23M66J18k76k16N8l4K43p7J2k74J72J59l37K60K9j12
3270b7p7P3O6o3o2K13j84q9K61k9m6r4p3O8r5J80Q5k90J50K32k40J8M0j72K68
3295A13nj92J17p0j30J80r4Q9J83l99M2M40k55J9L0J02J26k88M5j76K1P1J37m
3319A02j55k3q0K25p4m4M0p9j9Q3N8j54M5R1J39J4q0J09m34j19M95k45O2L70m11
3344h4k4J18n1N7p0R0L1j58K3J00L7k88K53k1j85J86j66k1K15O2j76J2oJ55o0
3369B9j48K04k13J54m5o5N8J23m30M85r0j42O9J37k23J63j71KK62k46l8J52k3
3392Dm0J10l4m2N6kJ67l40jL01k95J45Q2n0K0k27K5J82o2l8J75l9k02K20l10K43
3418D8r0J2J66lJ00j8k29j20J34j87pJ72k40K28j0J31k5Kr2J72p3p8K35k32K2
$$ y = [-465, -125, 79, -255, 337, 205, -218, 248, 366, 90, -126, -68, -102, 141, 64, 76, -198, -26, 133, -204, 56, 85, -27, -104, -31, 35, -28, -90, 123, -61, -150, 111, 82, 36, -58, -131, -63, -158, 22, 107, -183, -33, 199, -41, -23, 17, -155, 113, 108, -84, 33, -37, -167, 13, -81, 8, 191, -208, -166, 274, 19, 38, 68, 170, 296, 8, 53, -123, -102, -31, 106, 102, -53, -76, -156, 69, -5, -49, -9, -88, -107, -24, 34, -120, -75, 16, 155, 169, 89, 198, -236, -355, 140, -105, -43, 327, -84, -108, 10, -41, 16, -54, 36, 67, -91, -68, 32, 69, -219, 34, 13, -172, 14, -152, -173, 42, 104, -72, -60, -66, 89, 29, -119, 85, -128, 26, -19, -84, -26, 97, -333, 152, 62, -80, -11, 126, -97, 66, -105, -103, 159, -87, -125, 27, 4, -36, 74, 40, -2, 54, 52, 219, -121, -122, 179, -116, 29, 111, 61, 81, -146, -121, 61, -1, -39, 136, 97, -105, 115, -195, 48, -42, -30, 136, 133, 233, 215, -14, -134, 0, -187, -194, -22, -262, -34, -44, 87, 62, 64, -28, 144, 71, -7, 228, -4, 18]
3443A8m6j12L10j16j88jO5K61r4m36N08k32l7j26K05o1K60j91m4L00q9N7j67M3
3467H7J23j59o9K08Jj91J22j61j63J44K45l64L72K4j96J28k23J65M5k17K95j78
$$ y = [18, -28, -140, 170, 54, -134, -135, -70, 191, 97, -339, 169, -63, -100, -226, -21, -82, 178, -13, -57, 243, 154, 211, 44, 87, 210, 51, -18, 190, 191, 0, 122, -39, -202, -58, 187, -177, 195, 219, 23, 151, -72, 93, 138, -79, 216, 38]
$$ [...]
8191H1
##END NTUPLES=NMR FID
##END=
