##TITLE=1H_Pr EtOH-12
 200.13MHz,.
 8 sc
 
 21.1.2026
##JCAMPDX= 6.0         $$ Bruker NMR JCAMP-DX V2.0
##DATA TYPE= NMR FID
##DATA CLASS= NTUPLES
##ORIGIN= UXNMR, Bruker Analytische Messtechnik GmbH
##OWNER= pz
$$ XWIN-NMR		Version 3.5
$$ Wed Jan 21 15:34:42 2026 Russian Standard Time (UT+4h)  she@DPX200
##.OBSERVE FREQUENCY= 200.1313
##.OBSERVE NUCLEUS= ^1H
##.DELAY= (6, 6)
##.ACQUISITION MODE= SIMULTANEOUS
##.ACQUISITION SCHEME= undefined
##.AVERAGES= 8
##.DIGITISER RES= 18
##SPECTROMETER/DATA SYSTEM= spect
##.PULSE SEQUENCE= zg30
##.SOLVENT NAME= CDCl3
##.SHIFT REFERENCE= (INTERNAL, CDCl3, 0, 14.3821)
##AUDIT TRAIL= $$ (NUMBER, WHEN, WHO, WHERE, WHAT)
$$ ##TITLE= Audit trail, XWIN-NMR		Version 3.5
$$ ##JCAMPDX= 5.01
$$ ##ORIGIN= Bruker BioSpin GmbH
$$ ##OWNER= she
$$ F:/spectra/data/she/nmr/H-C/1/audita.txt
$$ ##AUDIT TRAIL=  $$ (NUMBER, WHEN, WHO, WHERE, WHAT)
(   1,<2026-01-21 15:33:44.17 +0400>,<she>,<DPX200>,
      <created by zg, POWCHK disabled, PULCHK disabled
       configuration hash MD5:
       00 E9 B6 7A A2 85 ED C7 34 08 36 98 17 FE 4E 26
       data hash MD5: 16K
       16 48 D1 D1 9A 56 07 FA 3F D3 CD 49 62 B2 09 0C>)
$$ ##END=
$$ 
$$ hash MD5
$$ DC 3F 23 73 F5 30 8A EE BB C5 81 98 86 C7 EB 95
##$RELAX= 
##$RELAX= 
##$RELAX= 
##$RELAX= 
##$RELAX= 
##$RELAX= 
$$ Bruker specific parameters
$$ --------------------------
##$DU= <F:/spectra>
##$EXPNO= 1
##$NAME= <H-C>
##$PROCNO= 1
##$TYPE= <nmr>
##$USER= <she>
##$AMP= (0..31)
100 100 100 100 100 100 100 100 100 100 100 100 100 100 100 100 100 100 
100 100 100 100 100 100 100 100 100 100 100 100 100 100 
##$AQSEQ= 0
##$AQ_mod= 1
##$AUNM= <au_zg>
##$AUTOPOS= <>
##$BF1= 200.13
##$BF2= 200.13
##$BF3= 200.13
##$BF4= 200.13
##$BF5= 200.13
##$BF6= 200.13
##$BF7= 200.13
##$BF8= 200.13
##$BYTORDA= 1
##$CFDGTYP= 0
##$CFRGTYP= 5
##$CHEMSTR= <none>
##$CNST= (0..31)
1 1 145 1 1 1 1 1 1 1 1 1 1 1 1 1 1 1 1 1 1 1 1 1 1 1 1 1 1 1 1 1 
##$CPDPRG= <>
##$CPDPRG1= <>
##$CPDPRG2= <>
##$CPDPRG3= <>
##$CPDPRG4= <mlev>
##$CPDPRG5= <mlev>
##$CPDPRG6= <mlev>
##$CPDPRG7= <mlev>
##$CPDPRG8= <mlev>
##$CPDPRGB= <>
##$CPDPRGT= <>
##$D= (0..31)
0 0.7 0 0 0 0 0 0 0 0 0 0.03 0 0 0 0 0 0 0 0 0 0 0 0 0 0 0 0 0 0 0 0 
##$DATE= 1768995223
##$DBL= (0..7)
120 120 120 120 120 120 120 120 
##$DBP= (0..7)
150 150 150 150 150 150 150 150 
##$DBP07= 0
##$DBPNAM0= <>
##$DBPNAM1= <>
##$DBPNAM2= <>
##$DBPNAM3= <>
##$DBPNAM4= <>
##$DBPNAM5= <>
##$DBPNAM6= <>
##$DBPNAM7= <>
##$DBPOAL= (0..7)
0.5 0.5 0.5 0.5 0.5 0.5 0.5 0.5 
##$DBPOFFS= (0..7)
0 0 0 0 0 0 0 0 
##$DE= 6
##$DECBNUC= <off>
##$DECIM= 32
##$DECNUC= <off>
##$DECSTAT= 4
##$DIGMOD= 1
##$DIGTYP= 9
##$DL= (0..7)
0 120 120 120 120 120 120 120 
##$DP= (0..7)
150 150 150 150 150 150 150 150 
##$DP07= 0
##$DPNAME0= <>
##$DPNAME1= <>
##$DPNAME2= <>
##$DPNAME3= <>
##$DPNAME4= <>
##$DPNAME5= <>
##$DPNAME6= <>
##$DPNAME7= <>
##$DPOAL= (0..7)
0.5 0.5 0.5 0.5 0.5 0.5 0.5 0.5 
##$DPOFFS= (0..7)
0 0 0 0 0 0 0 0 
##$DQDMODE= 0
##$DR= 18
##$DS= 0
##$DSLIST= <SSSSSSSSSSSSSSS>
$$ [...]
##$SUBNAM0= <"">
##$SUBNAM1= <"">
##$SUBNAM2= <"">
##$SUBNAM3= <"">
##$SUBNAM4= <"">
##$SUBNAM5= <"">
##$SUBNAM6= <"">
##$SUBNAM7= <"">
##$SUBNAM8= <"">
##$SUBNAM9= <"">
##$SW= 18.0517328524113
##$SWIBOX= (0..15)
0 0 2 0 0 0 0 0 0 0 0 0 0 0 0 0 
##$SW_h= 3612.71676300578
##$TD= 16384
##$TD0= 1
##$TE= 0
##$TE2= 300
##$TE3= 300
##$TEG= 300
##$TL= (0..7)
0 120 120 120 120 120 120 120 
##$TP= (0..7)
150 150 150 150 150 150 150 150 
##$TP07= 0
##$TPNAME0= <>
##$TPNAME1= <>
##$TPNAME2= <>
##$TPNAME3= <>
##$TPNAME4= <>
##$TPNAME5= <>
##$TPNAME6= <>
##$TPNAME7= <>
##$TPOAL= (0..7)
0.5 0.5 0.5 0.5 0.5 0.5 0.5 0.5 
##$TPOFFS= (0..7)
0 0 0 0 0 0 0 0 
##$TUNHIN= 0
##$TUNHOUT= 0
##$TUNXOUT= 0
##$USERA1= <user>
##$USERA2= <user>
##$USERA3= <user>
##$USERA4= <user>
##$USERA5= <user>
##$V9= 5
##$VALIST= <valist>
##$VCLIST= <CCCCCCCCCCCCCCC>
##$VD= 0
##$VDLIST= <DDDDDDDDDDDDDDD>
##$VPLIST= <PPPPPPPPPPPPPPP>
##$VTLIST= <TTTTTTTTTTTTTTT>
##$WBST= 1024
##$WBSW= 4
##$XGAIN= (0..3)
0 0 0 0 
##$XL= 0
##$YL= 0
##$YMAX_a= 310790
##$YMIN_a= -276798
##$ZGOPTNS= <>
##$ZL1= 120
##$ZL2= 120
##$ZL3= 120
##$ZL4= 120
##$ABSF1= 10
##$ABSF2= 0
##$ABSG= 5
##$ABSL= 3
##$ALPHA= 0
##$AQORDER= 0
##$ASSFAC= 0
##$ASSFACI= 0
##$ASSFACX= 0
##$ASSWID= 0
##$AUNMP= <proc_1d>
##$AZFE= 0.1
##$AZFW= 0.1
##$BCFW= 1
##$BC_mod= 2
##$BYTORDP= 1
##$COROFFS= 0
##$CY= -3
##$DATMOD= 1
##$DC= 2
##$DFILT= <>
##$DTYPP= 0
##$F1P= 0
##$F2P= 0
##$FCOR= 0.5
##$FTSIZE= 0
##$FT_mod= 4
##$GAMMA= 1
##$GB= 0.15
##$INTBC= 1
##$INTSCL= 1
##$ISEN= 128
##$LB= 0.25
##$LEV0= 0
##$LPBIN= 0
##$MAXI= 10000
##$MC2= 0
##$MEAN= 0
##$ME_mod= 0
##$MI= 1.114404
##$NCOEF= 0
##$NC_proc= 0
##$NLEV= 6
##$NOISF1= 3.799351
##$NOISF2= 2.8
##$NSP= 1
##$NTH_PI= 0
##$NZP= 0
##$OFFSET= 14.38212
##$PC= 1
##$PHC0= -3780.103
##$PHC1= 7.192311
##$PH_mod= 1
##$PKNL= yes
##$PPARMOD= 0
##$PSCAL= 0
##$PSIGN= 0
##$REVERSE= no
##$SF= 200.129724274929
##$SI= 16384
##$SIGF1= 3
##$SIGF2= 2
##$SINO= 400
##$SIOLD= 16384
##$SREGLST= <1H.CDCl3>
##$SSB= 0
##$STSI= 0
##$STSR= 0
##$SW_p= 3205.1282051282
##$SYMM= 0
##$S_DEV= 0
##$TDeff= 0
##$TDoff= 0
##$TI= <>
##$TILT= no
##$TM1= 0
##$TM2= 0
##$TOPLEV= 0
##$USERP1= <user>
##$USERP2= <user>
##$USERP3= <user>
##$USERP4= <user>
##$USERP5= <user>
##$WDW= 1
##$XDIM= 8192
##$YMAX_p= 0
##$YMIN_p= 0
$$ End of Bruker specific parameters
$$ ---------------------------------
##NTUPLES= NMR FID
##VAR_NAME=  TIME,          FID/REAL,        FID/IMAG
##SYMBOL=    X,             R,               I
##VAR_TYPE=  INDEPENDENT,   DEPENDENT,       DEPENDENT
##VAR_FORM=  AFFN,          ASDF,            ASDF
##VAR_DIM=   8192,          8192,            8192
##UNITS=     SECONDS,       ARBITRARY UNITS, ARBITRARY UNITS
##FACTOR=    0.0002768,     1,               1
##FIRST=     0,             0,               0
##LAST=      2.2672688,     0,               0
##MIN=       0,             -276798,         0
##MAX=       2.2672688,     310790,          0
$$ Real data points
##PAGE= N=1
##DATA TABLE= (X++(R..R)), XYDATA
$$ [...]
$$ plain form
1406 390 -355 143 331 -763 754 -389 52 127 -495 923 -968 339 393 -718 733 -852 846
1423 846 -172 -878 1378 -1016 497 -245 -218 1214 -1820 1205 62 -780 902 -1259 1691 -1061
1439 -1061 -657 1887 -1666 981 -836 389 1135 -2618 2240 -521 -619 792 -1418 2513 -2212 -77
1455 -77 2137 -2211 1430 -1446 1271 706 -3153 3263 -1175 -329 469 -1267 3143 -3381 690 2197
1471 2197 -2519 1662 -1975 2257 20 -3418 4119 -1804 40 -43 -834 3527 -4511 1637 1987 -2639
1487 -2639 1712 -2408 3333 -1032 -3339 4830 -2502 501 -745 -78 3543 -5613 2823 1448 -2546
1502 -2546 1588 -2647 4436 -2380 -2834 5291 -3112 996 -1530 933 3245 -6414 3979 773 -2203
1517 -2203 1230 -2651 5328 -3626 -2194 5409 -3444 1331 -2308 1970 2734 -6866 4849 179 -1774
$$ packed form
1406C90p45M98J88j094J517j143M41P5o22J418j891J307N4j111J451j585J698
1423H46j018p06K256k394J513p42K7J432l034L025j143q42J682k161K950k752
1439a061M04K544l553K647j817J225P46l753M858k761r8J411k210L931m725K135
1455g7K214m348L641k876K717n65l859O416m438Q46P98j736M410o524M071J507
1471B197m716M181l637M232k237l438P537n923J844q3p91M361q038O148L50m626
1487b639M351m120N741m365k307Q169p332L003j246O67L621r156Q436j375l994
1502b546M134m235P083o816m54Q125q403M108k526K463K312r659J0393l206k976
1517b203L433l881P979q954J432P603q853M775l639M278P64r600J1715m670j953
$$ plain form
1532 -1774 700 -2415 5900 -4789 -1378 5278 -3585 1515 -2851 3028 1917 -7007 5615 -496
1546 -496 -1279 79 -1922 6249 -5932 -293 4904 -3593 1631 -3367 4157 831 -6780 6233 -1278
1561 -1278 -593 -724 -1256 6347 -6902 819 4202 -3323 1587 -3812 5186 -242 -6317 6415 -1789
1576 -1789 79 -1493 -563 6174 -7473 1692 3546 -2904 1341 -3967 5854 -1160 -5686 6385 -2105
1591 -2105 507 -2119 223 5726 -7708 2497 2774 -2444 1078 -3846 6338 -2204 -4778 6193
1605 6193 -2431 947 -2738 1105 5009 -7800 3316 1840 -1814 643 -3688 6732 -3230 -3704
1619 -3704 5674 -2566 1402 -3409 1974 4188 -7556 3847 919 -1018 128 -3362 6831 -3948
1633 -3948 -2657 4939 -2434 1664 -3801 2672 3301 -7045 4117 233 -442 -326 -2809 6589 -4390
$$ packed form
1532a774K474l115Q315j0689L411O656q863N100m366N879j111q924J2622o111
1546d96p83J358k001Q171j2181N639N197q497N224m998P524l326p611J3013p511
1561a278O85j31n32P603j3249P721L383p525M910n399Q998n428o075J2732q204
1576a789J868j572R30O737j3647R165J854o450M245n308R821p014m526J2071q490
1591b105K612k626K342N503j3434J0205K77n218L522m924J0184q542k574J0971
1605F193q624L378l685L843L904j2809J1116j476l654K457m331J0420r962m74
1619c704R378q240L968m811N383K214j1744J1403k928j937J146l490J0193j0779
1633c948J291P596p373M098n465O473O29j0346J1162l884o75J16k483R398j0979
$$ plain form
1648 -4390 -1653 4243 -2286 1709 -3880 3197 2283 -6294 4181 -382 76 -814 -2211 6103 -4775
1663 -4775 -643 3340 -1970 1644 -3943 3691 1276 -5372 4101 -953 712 -1398 -1540 5452 -4791
1678 -4791 244 2360 -1418 1445 -3866 3954 369 -4281 3701 -1276 1233 -1725 -805 4644 -4582
1693 -4582 943 1489 -983 1223 -3465 3864 -376 -3256 3266 -1424 1348 -1834 -263 3657 -4166
1708 -4166 1351 777 -605 878 -2901 3606 -939 -2247 2633 -1381 1400 -1921 264 2743 -3519
1723 -3519 1547 167 -163 545 -2326 3174 -1255 -1315 1862 -1161 1452 -1784 616 1860 -2746 1496
1739 1496 -293 245 169 -1732 2565 -1307 -555 1254 -957 1227 -1521 708 1162 -2006 1338 -429
1755 -429 289 89 -1168 1833 -1103 -256 807 -701 893 -1124 542 739 -1249 929 -366 250
$$ packed form
1648d390K737N896o529L995n589P077r14q577J0475m563M58q90j397Q314j0878
1663d775M132L983n310L614n587P634k415o648R473n054J665k110j42O992j0243
1678d791N035K116l778K863n311P820l585m650P982m977K509k958R20N449r226
1693d582N525N46k472K206m688P329m240k880O522m690K772l182J571L920p823
1708d166N517n74j382J483l779O507m545j308M880m014K781l321K185K479o262
1723c519N066j380l30P08k871N500m429o0L177l023K613l236K400J244m606M242
1739A496j789N38p6j901M297l872P52J809k211K184k748K229M54l168L344j767
1755d29P18k00j257L001k936Q47J063j508J594k017J666J97j988K178j295O16
$$ plain form
1771 250 108 -809 1230 -714 -104 463 -529 651 -749 322 489 -802 577 -331 184 166 -558 771
1789 771 -373 -91 304 -411 481 -435 70 346 -538 403 -146 -26 262 -521 459 -98 -143 318 -411 395
1809 395 -154 -189 463 -406 252 -96 -136 423 -544 360 58 -275 373 -443 425 -90 -343 510 -494 295
1829 295 -16 -265 520 -648 289 66 -342 490 -556 487 -94 -349 632 -538 346 -38 -250 552 -592
1848 -592 435 -23 -227 473 -579 480 -141 -228 532 -567 448 -179 -151 474 -598 486 -184 -130 418
1867 418 -561 491 -264 -102 388 -465 448 -274 -5 259 -405 489 -390 69 297 -446 440 -224 112 148
1887 148 -412 424 -308 115 70 -203 322 -327 236 62 -226 211 -265 185 -109 -36 212 -240 250 -33 57
1908 57 94 -195 202 -175 66 37 -134 205 -226 231 -106 -53 207 -227 232 -194 87 171 -365 330 -210 191
$$ packed form
1771B50j42r17K039j944O10N67r92J180j400J071J67j291J379r08N15j8p24J329
1789G71j144K82L95p15Q92r16N05K76q84R41n49J20K88p83R80n57m5M61p29Q06
1809C95n49l5O52q69O58l48m0N59r67R04l02l33O48q16Q68n15k53Q53j004P89
1829B95l11k49P85j168R37k23m08Q32j046J043n81k55R81j170Q84l84k12Q02j144
1848e92J027m58k04P00j052J059o21q7P60j099J015o27K8O25j072J084o70N4N48
1867D18r79J052p55J62M90q53R13p22K69K64o64Q94q79M59K28p43Q86o64L36L6
1887A48n60Q36p32M23m5k73N25o49N63j74k88M37m76M50k94P3K48m52M90k83R0
1908E7L7k89L97l77K41k9j71L39m31M57l37N3K60m34M59m26K81Q4n36O95n40M01
$$ plain form
1930 191 -20 -262 503 -475 138 142 -267 349 -501 462 10 -429 591 -426 314 -246 -141 691 -823 435
1950 435 7 -217 346 -680 866 -356 -435 690 -579 512 -565 171 722 -1231 838 -171 -43
1967 -43 196 -870 1342 -817 -318 804 -684 679 -1020 581 646 -1446 1079 -353 205 -43 -813
1984 -813 1674 -1233 -86 797 -650 764 -1301 1028 482 -1634 1309 -497 382 -367 -713 1952
2000 1952 -1667 123 758 -577 729 -1569 1494 202 -1715 1520 -618 606 -743 -434 2116
2015 2116 -2071 441 625 -413 618 -1772 2012 -206 -1655 1628 -706 835 -1174 -82 2156
2030 2156 -2412 730 426 -177 415 -1910 2449 -572 -1570 1645 -740 998 -1578 265 2148 -2672
2046 -2672 931 283 51 199 -1968 2819 -932 -1442 1635 -715 1098 -1923 674 2041 -2848 1177
$$ packed form
1930A91k11k42P65r78O13Mm09O16q50R63m52m39J020j017P40n60J05Q32j514J258
1950D35m28k24N63j026J546j222p9J125j269J091j077P36N51j953K069j009J28
1967d3K39j066K212k159M99J122j488J363j699J601O5k092K525j432N58k48p70
1984h13K487k907J147Q83j447J414k065K329n46k116K943j806Q79p49l46K665
2000A952l619J790O35j335J306k298L063j292j917L235k138J224j349L09K550
2015B116m187K512J84j038J031k390L784k218j449L283k334J541k009J092K238
2030B156m568L142l04o03N92k325M359l021r98L215k385J738k576J843J883m820
2046b672L603o48k32J48k167M787l751n10L077k350J813l021K597J367m889M025
$$ plain form
2062 1177 114 294 -94 -1895 3117 -1378 -1175 1566 -662 1166 -2280 1160 1778 -2932 1404 -119
2078 -119 621 -489 -1749 3363 -1802 -834 1341 -504 1200 -2636 1667 1452 -2894 1518 -331 966
2094 966 -892 -1534 3496 -2145 -509 1099 -323 1146 -2857 2110 1076 -2785 1617 -476 1212
2109 1212 -1254 -1198 3491 -2464 -157 872 -124 980 -2933 2524 586 -2554 1641 -597 1410 -1669
2125 -1669 -741 3321 -2702 247 526 161 728 -2935 2911 21 -2153 1513 -650 1621 -2106 -192
2141 -192 2991 -2765 606 129 554 386 -2783 3152 -492 -1670 1287 -605 1693 -2403 347 2537
2157 2537 -2709 849 -159 818 20 -2444 3171 -971 -1202 1064 -514 1584 -2515 821 1960 -2522
2173 -2522 1030 -384 1010 -353 -1982 3060 -1331 -684 762 -333 1428 -2518 1256 1338 -2141 1056
$$ packed form
2062A177j063J80l88j801N012m495K03K741k228J828l446L440O18m710M336j523
2078a19P40j110j260N112n165R68K175j845J704l836M303k15m346M412j849J297
2094I66j858o42N030n641J636J608j422J469m003M967j034l861M402k093J688
2109A212k466N6M689n955K307J029r96J104l913N457j938l140M195k238K007l079
2125a669R28M062o023K949K79l65N67l663N846k890k174L666k163K271l727J914
2141a92L183n756L371m77M25j68l169N935l644j178K957j892K298m096K750K190
2157B537n246L558j008R77p98k464N615m142k31K266j578K098m099L336J139m482
2173b522L552j414J394j363j629N042m391O47J446j095J761l946L774Q2l479L197
$$ plain form
2189 1056 -555 1225 -741 -1430 2728 -1513 -197 361 -61 1138 -2372 1537 695 -1639 952 -636
2205 -636 1303 -1026 -853 2241 -1547 159 61 125 776 -2023 1603 177 -1182 800 -600 1162 -1100
2222 -1100 -387 1702 -1415 375 -103 255 466 -1569 1488 -164 -729 607 -483 987 -1052 -15
2238 -15 1178 -1146 451 -257 343 201 -1141 1249 -348 -346 359 -332 784 -913 197 680 -798 422
2256 422 -301 375 13 -713 897 -403 -96 166 -212 524 -674 254 337 -508 331 -241 275 -20 -389
2275 -389 560 -294 11 108 -151 315 -376 145 184 -292 228 -170 126 32 -232 279 -152 0 89 -130 186
2296 186 -151 19 118 -162 127 -77 -9 108 -153 110 -19 -42 107 -146 116 -1 -116 146 -107 74 -9
2317 -9 -105 224 -167 49 73 -97 168 -191 127 77 -210 214 -134 84 7 -171 294 -240 63 76 -149 223
$$ packed form
2189A056j611J780j966o89M158m241J316N58m22J199l510L909q42k334K591j588
2205f36J939k329J73L094l788J706r8O4O51k799L626j426j359J982j400J762k262
2222a100P13K089l117J790m78L58K11k035L057j652n65J336j090J470k039J037
2238a5J193k324J597p08O00j42j342K390j597KP05o91J116j697J110M83j478J220
2256D22p23O76l62p26J610j300L07K62l78P36j198R28Q3q45Q39n72N16k95l69
2275c89R49q54L05R7k59M66o91N21L9m76N20l98K96r4k64N11m31J52Q9k19L16
2296A86l37J70R9k80K89k04O8J17k61K63j29k3J49k53K62j17j15K62k53J81q3
2317ir6L29l91K16K4j70K65l59L18n0k87M24l48K18p7j78M65n34L03J3k25L72
$$ plain form
2339 223 -248 161 56 -243 249 -191 131 -12 -167 317 -286 128 39 -145 241 -293 217 8 -198 281
2359 281 -254 184 -40 -134 280 -287 188 -35 -110 235 -267 226 -53 -104 241 -264 204 -76 -77 217 -256 219
2381 219 -95 -60 187 -249 212 -119 -39 161 -234 219 -109 -10 127 -203 219 -138 -1 139 -164 171 -122
2402 -122 43 78 -176 187 -96 24 46 -114 171 -129 33 71 -109 108 -97 70 14 -112 127 -84 35
2423 35 -13 -33 99 -120 49 13 -33 41 -58 70 -40 -33 66 -57 34 -37 33 19 -54 57 -33 19 -2 -12 44 -65 59
2450 59 -9 -13 34 -52 74 -67 18 54 -84 65 -54 56 -11 -84 132 -98 30 14 -34 98 -162 113 28 -116
2474 -116 110 -92 125 -82 -73 220 -191 72 -5 -5 111 -253 228 -12 -141 138 -130 201 -194 -44 305 -262
2496 -262 106 -40 64 103 -370 379 -75 -183 149 -146 295 -326 1 382 -399 162 -95 139 78 -484 555
$$ packed form
2339B23m71M09j05k99M92m40L22j43j55M84o03M14q9j84L86n34N10k09k06M79
2359B81n35M38k24r4M14n67M75k23p5L45n02M93k79n1L45n05M68k80jK94m73M75
2381B19l14L5K47m36M61l31Q0K00l95M53l28R9J37l30M22l57J37J40l03L35k93
2402a22J65L5k54L63k83J20K2j60K85l00J62L8j80K17k05J67n6j26K39k11J19
2423C5m8k0J32k19J69l6m6P4r9J28j10PR9j23R1p1P0j4p3J11r0N2k1j0N6j09J24
2450E9o8mM7q6J26j41Q5L6j38J49j19J10o7p3K16k30J28j6m8J32k60K75q5j44
2474a16K26k02K17k07RK93m11K63p7%J16l64M81k40j29K79k68L31l95J50L49n67
2496b62L68j46J04L9m73P49m54j08L32k95M41o21L27L81p81N61k57K34o1n62J039
$$ plain form
2517 555 -148 -180 179 -156 409 -511 108 451 -515 248 -161 275 -4 -564 736 -283 -140 148 -116 499
2537 499 -726 277 434 -585 286 -252 457 -181 -585 909 -444 -78 35 -24 532 -986 515 366
2555 366 -626 313 -322 673 -422 -550 1076 -601 26 -53 127 535 -1171 768 266 -623 320 -348 867
2574 867 -673 -401 1159 -762 151 -196 314 423 -1309 1059 48 -557 272 -335 991 -998 -157
2591 -157 1140 -878 246 -350 576 198 -1334 1292 -202 -407 120 -227 1081 -1303 174 1009 -886
2608 -886 296 -473 874 -110 -1233 1454 -425 -225 -36 -45 1040 -1518 511 785 -874 310 -524
2625 -524 1058 -433 -1013 1499 -619 -63 -183 152 879 -1614 822 505 -751 287 -499 1163 -757
2642 -757 -691 1411 -759 104 -348 413 613 -1579 1062 200 -540 154 -397 1208 -1047 -304 1204 -764
$$ packed form
2517E55p03l2L59l35N65r20O19L43r66P63m09M36k79n60J300j019J43K88k64O15
2537D99j225J003J57j019Q71n38P09o38m04J494j353L66J13n9N56j518J501j49
2555C66r92R39o35R95j095j28J626j677O27p9J80M08j706J939n02q89R43o68J215
2574H67j540K72J560j921R13l47N10J09j732K368j011o05Q29o07J326j989Q41
2591a57J297k018J124n96R26l78j532K626j494k05N27l47J308k384J477Q35j895
2608h86J182p69J347r84j123K687j879K00J89rJ085k558K029K74j659J184q34
2625e24J582j491n80K512k118N56j20L35P27k493K436l17j256J038p86J662j920
2642g57O6K102k170Q63m52P61K00k192K641q62p40O94n51J605k255P43J508j968
$$ plain form
2660 -764 198 -482 670 291 -1392 1183 -77 -319 -1 -232 1102 -1196 58 896 -703 224 -519
2677 -519 787 -32 -1098 1165 -299 -136 -108 -63 908 -1196 329 605 -580 231 -470 824 -286 -767
2695 -767 1032 -403 14 -208 120 659 -1091 532 315 -402 156 -367 803 -468 -423 817 -411 99
2713 99 -301 272 372 -883 569 70 -210 42 -255 665 -558 -136 547 -357 153 -289 330 139 -605
2732 -605 540 -77 -76 -5 -119 488 -490 58 320 -259 143 -228 308 -7 -375 401 -117 1 -42 -36 293 -374
2754 -374 124 137 -158 79 -152 244 -89 -169 241 -128 48 -79 48 138 -229 139 25 -47 32 -69 149 -108
2776 -108 -27 109 -78 58 -50 63 10 -84 94 -22 2 10 5 39 -55 36 -4 -11 2 1 11 -34 27 4 -28 3 -13 34
2804 34 -48 23 19 -42 25 -29 40 -26 -38 85 -61 26 -6 -8 50 -105 81 -11 -50 56 -46 80 -62 -11 103 -91
$$ packed form
2660g64R62o80J152l79j683K575j260k42L18k31J334k298J254Q38j599R27p43
2677e19J306q19j066K263j464J63K8M5R71k104J525K76j185Q11p01J294j110m81
2695g67J799j435M17k22L28N39j750J623k17p17N58n23J170j271M5J240j228N10
2713I9m00N73J00j255J452m99k80K52k97R20j223M22O83r04N10m42O19j91p44
2732f05J145o17JP1j14O07r78N48K62n79M02l71N36l15l68P76n18J18m3OL29o67
2754c74M98J3k95K37k31L96l33q0M10l69J76j27J27R0l67L68j14p2P9j01K18k57
2776a08Q1J36j87J36j08J13n3r4J78j16K4QnL4r4R1m0pJ3jJ0m5O1k3l2L1j6M7
2804C4q2P1mo1O7n4O9o6j2J23j46Q7l2kN8j55J86r2l9J06j02J26j42N1J14j94
$$ plain form
2830 -91 60 -24 14 42 -111 136 -48 -33 63 -60 92 -99 17 68 -105 74 -58 31 11 -102 131 -69 3
2853 3 32 -75 103 -108 45 41 -97 103 -73 56 10 -72 125 -99 32 18 -58 102 -109 65 15 -69 96 -74
2877 -74 62 2 -53 83 -96 45 -1 -50 72 -89 52 -14 -55 77 -95 49 -26 -41 75 -94 52 -15 -43 74
2901 74 -80 62 -31 -20 77 -83 51 -23 -22 53 -70 79 -29 -31 68 -68 66 -38 -19 74 -86 62 -19 -3 41
2926 41 -85 76 -41 -29 64 -59 55 -63 -1 60 -78 59 -29 4 16 -61 79 -48 -14 38 -44 53 -61 23 35
2951 35 -71 56 -37 25 8 -45 74 -61 22 17 -25 33 -53 46 -5 -49 40 -34 32 -26 -7 55 -65 24 -16 -11 9 -58 53
2980 53 -43 -8 30 -39 19 -40 27 6 -30 50 -28 18 -6 -2 45 -55 47 4 -6 23 -25 60 -52 -5 42 -39 20 -57 46
3009 46 0 -74 76 -46 4 -27 -2 72 -125 53 25 -47 12 -60 111 -83 -65 124 -64 29 -64 56 60 -164 133
$$ packed form
2830i1J51q4L8K8j53K47j84J5R6j23J52j91J16N1j73J79j32Q9k0j13K33k00P2
2853CK9j07J78k11J53mj38K00j76J29m6q2J97k24J31j4p6J60k11J74n0q4J65j70
2877g4J36o0n5J36j79J41m6m9J22j61J41o6m1J32j72J44p5j5J16j69J46o7k8J17
2901G4j54J42r3J1R7j60J34p4JP5j23J49j08kR9j36J34j04J9R3j60J48q1J6M4
2926D1j26J61j17J2R3j23J14j18O2O1j38J37q8L3J2p7J40j27L4N2q2R7j14Q4J2
2951C5j06J27r3O2j7n3J19j35Q3nm2N8q6R9n1m4Q9p4O6n8J9O2j20Q9m0NK0o7J11
2980E3r6L5L8o9N8n9O7k1l6Q0p8M6k4MM7j00J02m3j0K9m8Q5j12M7M7q1N9p7J03
3009D6m6p4J50j22N0l1K5P4j97J78k8p2N9p2J71j94J8J89j88R3r3J20Mk24K97
$$ plain form
3034 133 -1 -18 -8 -51 179 -154 -6 129 -90 40 -108 146 4 -200 198 -49 12 -65 -8 200 -255 77
3056 77 94 -79 21 -152 251 -97 -177 231 -81 37 -142 82 190 -329 166 63 -32 -14 -126 333 -228 -109
3078 -109 250 -99 62 -208 206 112 -384 263 -14 6 -81 -88 370 -345 -3 228 -121 64 -246 311 -8 -359
3100 -359 326 -77 39 -163 14 360 -458 126 160 -96 21 -259 446 -173 -277 355 -114 96 -261 167
3120 167 286 -508 255 70 -23 -55 -207 510 -339 -146 317 -128 100 -329 297 140 -506 338 -26 32 -154
3141 -154 -117 504 -459 -2 249 -121 78 -346 418 -18 -430 385 -109 89 -219 6 439 -530 161 159 -79
3162 -79 43 -317 504 -183 -299 362 -145 131 -305 165 312 -545 268 24 -11 -48 -246 529 -352 -145 296
3183 296 -162 139 -350 297 137 -492 332 -72 76 -121 -141 485 -439 30 211 -131 125 -325 377 -3
$$ packed form
3034A33j34j7J0m3K30l33J48J35k19J30j48K54j42k04L98k47O1p7N7K08m55L32
3056G7J7j73J00j73M03l48q0M08l12J18j79K24J08n19M95j03r5J8j12M59n61J19
3078a09L59l49J61k70M14r4m96O47k77K0q7pM58p15L42K31l49J85l10N57l19l51
3100c59O85m03J16k02J77L46q18N84L4k56J17k80P05o19j04O32m69K10l57M28
3120A67J19p94P63j85r3l2j52P17q49J93M63m45K28m29O26j57o46Q44l64N8j86
3141a54L7O21r63M57K51l70J99m24P64m36m12Q15m94J98l08K25M33r69O91kk38
3162g9J22l60Q21o87j16O61n07K76m36M70J47q57Q13k44l5l7j98P75q81K07M41
3183B96m58L01m89O47j60o29Q24m04J48j97k0O26r24M69J81l42K56m50P02l80
$$ plain form
3203 -3 -369 364 -131 113 -177 -12 395 -450 172 110 -75 87 -277 427 -138 -230 319 -157 142 -231 91
3224 91 260 -441 233 -3 -25 9 -212 396 -260 -81 232 -161 148 -254 182 114 -342 270 -79 47 -37 -120
3246 -120 339 -300 39 145 -126 127 -219 225 0 -236 258 -135 84 -77 -52 251 -286 116 49 -84 97
3267 97 -187 226 -82 -128 200 -139 90 -103 15 154 -246 152 -15 -32 54 -127 203 -129 -36 139 -122 102
3289 102 -94 74 61 -170 159 -45 4 19 -73 139 -135 21 77 -98 72 -87 74 5 -106 116 -76 20
3311 20 -7 -36 85 -129 51 25 -55 56 -60 57 -27 -51 86 -64 35 3 -9 45 -80 59 8 -36 50 -31 55
3336 55 -20 -17 61 -43 29 -8 2 24 -55 41 -14 -18 18 -25 28 -33 -9 27 -40 23 0 9 7 -27 42 -17 -8 12 -16 21 -23 8
3368 8 29 -29 23 -11 -2 7 -27 34 -9 -8 17 -20 17 -15 9 11 -29 24 -15 -1 15 -21 28 -24 -4 14 -27 18 -25 -4 -6 -16 29
$$ packed form
3203cl66P33m95K44k90J65M07q45O22o2j85J62l64P04n65r2N49m76K99l73L22
3224I1J69p01O74k36k2L4k21O08o56J79L13l93L09m02M36o8m56O12l49J26q4q3
3246a20M59o39L39J06k71K53l46M44k25k36M94l93K19j61K5L03n37M02o7j33J81
3267I7k84M13l08m6L28l39K29j93J18J39m00L98j67j7Q6j81L30l32R3J75k61K24
3289A02j96J68j3k31L29k04M9J5r2K12k74J56N6j75J70j59J61o9j11K22j92R6
3311B0k7k9J21k14J80k6q0J11j16J17q4k4J37j50R9l2j2N4j25J39n1m4Q6q1Q6
3336E5p5LP8j04P2l7J0K2p9R6n5mL6m3N3o1K4L6o7O3k3Rkl4O9n9RK0k8L7m4L1
3368HK1n8N2l4RRl4O1m3JK5l7L7l2K4Km0N3l9J4J6l6M9n2K0J8m1M5m3K1kj0M5
$$ plain form
3401 29 -21 0 10 -11 31 -25 25 5 -30 30 -19 21 -6 -13 40 -44 21 -5 -2 29 -25 54 -3 -16 27 -30 42 -36 -9 43 -52
3432 -52 37 -19 -4 18 -58 51 -32 -27 24 -40 46 -50 -2 31 -63 49 -30 17 14 -69 79 -43 12 15 -42 73 -67 39
3460 39 38 -55 60 -50 40 -2 -67 98 -71 8 9 -42 82 -99 53 20 -73 91 -68 77 -29 -66 112 -87 28
3485 28 -14 -32 87 -131 72 25 -68 67 -96 100 -35 -77 135 -100 57 -31 -8 114 -155 99 23 -61 72
3508 72 -131 152 -60 -74 159 -108 66 -66 -7 126 -207 122 3 -54 66 -147 182 -108 -86 163 -114 82
3530 82 -104 18 144 -245 162 -15 -30 71 -168 259 -139 -72 189 -150 133 -148 83 162 -301 207 -45
3551 -45 -5 35 -186 327 -230 -69 191 -162 158 -232 140 143 -366 269 -69 58 -26 -186 401 -290 -7 215
3573 215 -209 178 -272 218 101 -350 312 -91 38 -48 -147 471 -353 -18 112 -120 203 -435 394 11 -414
$$ packed form
3401B9n0K1J0k1M2n6N0k0l5O0m9M0k7pN3q4O5k6LL1n4P9n7j3M3n7P2p8K7N2r5
3432e2Q9n6J5K2p6J09q3NN1o4Q6r6M8L3r4J12p9M7lq3J48j22N5Ln7J15j40J06
3460C9jr3J15j10R0m2o5J65j69P9Jn1J24j81J52l3r3J64j59J45j06l7J78j99J15
3485B8m2j8J19k18K03m7r3J35j63J96j35m2K12k35J57q8K3J22k69K54p6q4J33
3508G2k03K83k12j4K33k67J74j32N9J33l33L29j19n7J20k13L29k90K2K49k77J96
3530H2j86J22J26l89M07j77j5J01k39M27l98O7K61l39K83k81K31P9m63N08k52
3551d5M0M0k21N13n57J61K60l53L20l90L72Ln09O35l38J27q4j60N87o91K83K22
3573B15m24L87m50M90j17m51O62m03J29q6r9O18q24L35J30k32L23o38Q29l83m25
$$ plain form
3594 -414 385 -205 165 -198 -74 494 -533 151 121 -104 157 -440 492 -95 -399 421 -228 211 -327 -7
3614 -7 502 -616 240 64 -55 119 -457 639 -221 -327 438 -228 265 -427 113 457 -642 368 -10
3633 -10 21 -37 -417 730 -420 -189 407 -160 230 -505 311 331 -708 392 -136 121 -101 -367 765 -514
3653 -514 -76 310 -219 297 -600 464 187 -643 486 -176 197 -214 -264 750 -658 74 273 -170 254
3672 254 -575 589 3 -572 498 -229 295 -350 -48 683 -711 206 111 -76 162 -603 683 -150 -441
3691 -441 459 -252 308 -437 67 567 -724 306 10 14 64 -502 732 -296 -270 391 -232 320 -490 217
3711 217 404 -665 383 -83 113 -16 -396 702 -411 -121 301 -193 298 -516 323 245 -569 386 -141
3730 -141 155 -118 -298 630 -495 10 182 -124 194 -513 426 81 -439 363 -174 198 -173 -138 521 -461
$$ packed form
3594d14P99n90L70l63J24N68j027O84l0k25K61n97R32n87l04Q20o49M39n38L20
3614gN09j118Q56j76j19J74n76J096q60j06P65o66M93o92N40L44j099J010l78
3633a0L1n8l80J147j150K31N96n67L90p35Q16K0j039J100n28K57k22k66J132j279
3653e14M38L86n29N16q97J064k77q30J129o62L73m11n0J014j408P32J99m43M24
3672B54q29J164n86n75J070p27N24o45L02P31j394R17r5j87K38p65J286q33k91
3691d41R00p11N60p45N04N00j291J030k96MN0n66J234j028K6O61o23N52q10P07
3711B17J87j069J048m66J96j29l80J098j113K90M22m94M91q14Q39p8q14R55n27
3730a41K96k73j80R28j125N05J72l06L18p07R39l45n20Q02n37L72l71L5O59r82
$$ plain form
3750 -461 121 94 -66 168 -415 416 -52 -295 309 -188 212 -226 -24 372 -424 180 11 -25 108 -323 390
3771 390 -134 -179 235 -180 177 -234 42 262 -359 183 -47 13 55 -246 327 -165 -92 165 -142 156 -192
3792 -192 59 215 -255 207 -61 33 15 -157 261 -170 -18 116 -106 129 -160 90 76 -177 148 -81 46
3813 46 -6 -109 179 -148 14 61 -84 98 -129 89 13 -118 117 -73 29 -2 -62 127 -116 26 41 -70
3835 -70 77 -80 20 5 -103 99 -68 28 1 -43 82 -89 26 23 -58 54 -73 45 3 -53 63 -62 14 -4
3859 -4 -48 59 -58 16 18 -55 61 -56 21 13 -47 58 -70 3 16 -45 50 -46 19 10 -44 51 -41 28 12 -34 41 -44 33
3888 33 16 -33 52 -42 17 -1 -21 47 -50 12 -2 -31 31 -41 33 -13 -25 40 -41 22 -19 -17 38 -42 26 -8 -11 31 -38 38 -16
3919 -16 -5 34 -25 36 -25 1 27 -37 47 -17 6 12 -31 40 -38 8 24 -24 31 -45 25 1 -34 19 -32 28 -17 -17 34 -42 5
$$ packed form
3750d61N82k7j60K34n83Q31m68k43O04m97M00m38K02L96p96O04j69l6J33m31P13
3771C90n24m5M14m15L57m11K76K20o21N42k30O0M2l01N73m92P3K57l07K98l48
3792a92K51J56m70M62k68R4j8j72M18m31J52J34k22K35k89K50j4k53L25k29J27
3813D6n2j03K88l27J62M7j45J82k27K18p6j31K35j90J02l1o0J89k43J42J5j11
3835g0J47j57J00j5j08K02j67R6k7m4J25j71J15lq1J12j27J18m2n6J16j25P6j8
3859dm4J07j17P4Kp3J16j17P7qo0J05j28P3J3o1R5r6O5rn4R5r2O9j6m6P5q5P7
3888C3j7m9Q5r4N9j8k0O8r7O2j4k9O2p2P4m6j2O5q1O3m1KN5q0O8l4lM2o9P6n4
3919a6J1L9n9O1o1K6K6o4Q4o4K3Om3P1p8M6J6m8N5p6P0k4l5N3n1O0m5%N1p6M7
$$ plain form
3950 5 -13 -17 31 -48 52 -7 -30 31 -35 53 -34 4 53 -52 41 -27 24 31 -69 66 -38 12 18 -46 69 -66 10 42 -53
3979 -53 56 -58 49 3 -84 74 -59 21 1 -43 90 -110 39 34 -57 59 -93 74 -7 -84 108 -55 50 -26
4003 -26 -28 132 -129 67 37 -31 78 -120 125 -5 -97 135 -89 83 -59 -20 151 -184 80 -2 -29 57 -168
4026 -168 183 -69 -104 147 -120 118 -121 3 179 -242 129 -24 -3 53 -192 254 -105 -100 149 -120 164 -195
4048 -195 74 212 -278 177 -55 59 32 -224 342 -178 -64 156 -131 199 -281 126 176 -334 215 -115 102
4069 102 -51 -244 413 -284 -21 128 -121 229 -390 247 141 -372 270 -153 196 -122 -221 501 -376 39
4089 39 96 -77 235 -463 381 72 -356 290 -181 281 -250 -137 527 -467 122 20 8 173 -535 509 -52
4110 -52 -328 290 -208 334 -380 -38 502 -544 192 -64 80 112 -556 617 -186 -252 272 -204 392 -515
$$ packed form
3950Ej8mM8p9J00n9k3O1o6Q8q7L8M9j05R3o8N1Pj00J35j04N0Oo4J15j35P6L2r5
3979e3J09j14J07m6q7J58j33Q0k0m4J33k00J49nr1J16j52J67q1p7J92j63J05p6
4003b6kJ60k61J96l0o8J09j98K45j30r2K32k24J72j42L9J71l35K64q2k7Q6k25
4026a68L51k52l5K51k67K38k39J24J76m21L71j53K1N6k45M46l59NK49k69K84l59
4048a95K69J38m90M55k32J14k7k56N66n20J14K20k87L30m80M07N0n10N49l30K17
4069A02j53j93O57o97K63J49k49L50o19O37j06n13O42m23L49l18r9P22q77M15
4089C9N7j73L12o98Q44l09m28O46m71M62n31J13O64r94N89j02j2J65p08J044n61
4110e2k76O18m98N42p14L42N40j046P36k56J44L2o68J173q03o6N24m76N96r07
$$ plain form
4130 -515 119 476 -575 282 -128 205 -6 -523 729 -321 -163 217 -167 409 -631 276 361 -595 329
4149 329 -196 301 -151 -432 748 -444 -54 132 -81 355 -701 426 217 -523 329 -220 397 -295 -292
4168 -292 739 -531 74 47 15 294 -695 560 70 -429 319 -230 438 -409 -143 678 -573 164 -51
4187 -51 99 185 -684 651 -103 -328 263 -231 453 -532 6 546 -577 223 -123 191 63 -580 679 -229
4207 -229 -199 189 -163 416 -563 172 410 -500 262 -173 270 -45 -449 641 -310 -76 113 -100 357 -551
4227 -551 275 235 -435 256 -198 292 -154 -312 575 -366 3 23 -47 263 -530 332 114 -343 219 -199 301
4248 301 -213 -183 481 -365 87 -19 27 189 -450 373 7 -231 194 -161 283 -246 -65 358 -319 129 -60
4269 -60 44 112 -345 326 -74 -135 113 -145 232 -241 5 227 -263 126 -93 70 41 -259 279 -109 -68 88
$$ packed form
4130e15O34L57j051Q57m10L33k11n17J252j050J58L80l84N76j040R07Q5r56R24
4149C29n25M97m52k81J180j192L90J86k13M36j056J127k09p40Q52n49O17o92L
4168b92J031j270O05k7l2K79r89J255m90m99P48n49O68q47K66Q21j251P37k15
4187e1J50Q6q69J335p54k25N91m94O84r85N38N40j123Q00l46L14j28o43J259r08
4207b29L0L88l52N79r79P35K38r10P62m35M43l15m04J090r51K34J89k13M57r08
4227e51Q26m0o70O91m54M90m46j58Q87r41L69K0p0L10p93Q62k18m57N62m18N00
4248C01n14L0O64q46M52j06M6J62o39Q23l66k38M25l55M44n29J81M23o77M48j89
4269f0J04O8m57O71m00o1K48k58L77m73K46K22m90L89k19J63k9l00N38l88M1J56
$$ plain form
4291 88 -109 151 -216 49 179 -191 119 -83 80 12 -162 228 -116 -22 61 -74 141 -174 71 79 -152 114
4313 114 -83 67 -14 -119 165 -111 0 34 -53 101 -146 53 32 -123 78 -126 55 -16 -80 112 -77 23
4335 23 29 -50 79 -79 45 31 -63 73 -38 33 11 -43 82 -61 21 25 -47 54 -63 39 27 -67 50 -54 22
4360 22 5 -44 67 -65 12 9 -46 55 -55 17 16 -49 48 -49 12 22 -47 55 -39 22 20 -43 60 -31 16 17 -38 43 -39
4389 -39 24 17 -44 50 -34 28 14 -43 43 -32 9 22 -23 39 -51 14 19 -48 31 -43 10 -5 -34 39 -41 18 1 -26 38 -47 25
4420 25 11 -37 49 -26 24 2 -24 47 -31 30 12 -3 39 -30 53 -3 -15 26 -21 37 -16 -10 29 -36 23 -14 -3 14 -40 26 -28
4451 -28 -9 15 -35 19 -29 -6 22 -34 36 -41 22 14 -36 44 -17 17 9 -18 42 -39 29 0 -17 30 -29 40 -16 -24 36 -40 25 -19
4483 -19 -6 33 -76 28 -21 -8 21 -63 64 -44 -12 43 -48 52 -54 17 23 -79 60 -47 24 -2 -55 97 -69
$$ packed form
4291H8j97K60l67K65J30l70L10k02J63o8j74L90l44R4Q3j35K15l15K45Qk31K66
4313A14j97J50q1j05K84k76J11L4q7J54k47J99k1j55K01k04J81p1o4J92j89J00
4335B3Op9J29j58J24j4r4J36j11P1k2n4J25j43Q2Mp2J01j17J02j2r4J17j04P6
4360B2j7m9J11j32P7ln5J01j10P2jo5R7r7O1J0o9J02r4O1ko3J03r1M7Jn5Q1q2
4389c9O3po1R4q4O2j4n7Q6p5M1J3m5O2r0O5No7P9p4N3j5k9P3q0N9j7k7O4q5P2
4420B5j4m8Q6p5N0k2k6P1p8O1j8j5M2o9Q3n6j2M1m7N8n3OL9o5N9l7J1J7n4O6n4
4451b8J9K4n0N4m8K3K8n6P0p7O3qn0Q0o1L4qk7O0q1O8k9j7M7n9O9n6qO0p6O5m4
4483a9J3L9j09J04m9J3K9q4J27j08L2N5r1J00j06P1Oj02J39j07P1k6n3J52j66
$$ plain form
4508 -69 17 16 -49 85 -89 75 12 -91 82 -57 42 -47 -65 144 -129 15 5 -31 86 -152 119 -6 -79 82
4532 82 -97 106 -86 -43 161 -162 62 -36 -2 78 -201 182 -51 -69 88 -94 159 -158 5 170 -179 108
4554 108 -70 69 43 -218 258 -95 -43 72 -92 198 -232 34 150 -219 129 -116 158 -10 -227 312 -171
4575 -171 -9 30 -76 224 -335 147 126 -227 155 -162 228 -95 -207 377 -234 50 -23 -22 228 -391 261 71
4597 71 -193 140 -189 304 -195 -140 382 -280 92 -93 67 188 -446 352 -10 -161 120 -182 346 -322 -57
4618 -57 355 -308 119 -167 158 101 -442 407 -103 -104 59 -129 370 -395 56 309 -297 162 -190 259 12
4639 12 -391 470 -166 -26 16 -76 373 -459 150 237 -269 153 -225 330 -103 -340 474 -234 29 -79 -1 321
4661 321 -517 262 144 -240 132 -219 368 -202 -232 439 -258 64 -116 76 229 -483 324 54 -169 87
$$ packed form
4508f9Q6jo5J34j74J64o3j03J73j39R9q9j8K09k73J44j0l6J17k38K71j25p3J61
4532H2j79K03j92M3K04l23K24r8L4Q0k79L83k33j8J57j82K53l17J63J65l49K87
4554A08j78J39k6k61M76l53N2J15j64K90m30K66J16l69L48k45K74j68k17N39m83
4575a71J62L9j06L00n59M82k1l53L82l17L90l23j12N84o11K84p3JK50o19O52j90
4597G1k64L33l29M93m99N5N22o62L72j85J60J21o34P98l62j51K81l02N28o68K65
4618e7M12o63M27k86L25n7n43Q49n10jJ63j88M99p65M51K53o06M59l52M49k47
4639A2m03Q61o36J40M2r2M49q32O09Q7n06M22l78N55m33k37Q14p08K63j08P8L22
4661C21q38P79j18l84L72l51N87n70l0O71o97L22j80J92J53p12Q07k70k23K56
$$ plain form
4681 87 -174 384 -280 -115 373 -241 113 -149 151 151 -441 335 -24 -101 44 -145 350 -325 -37 285 -250
4702 -250 108 -181 190 54 -382 344 -87 -47 8 -95 323 -352 45 224 -194 112 -162 224 -3 -290 332
4723 332 -119 -1 -18 -48 250 -322 113 145 -153 92 -150 210 -62 -205 270 -120 19 -53 -2 197 -292 125
4745 125 78 -127 68 -141 204 -86 -137 223 -113 32 -51 16 157 -234 127 43 -79 73 -101 184 -95 -85
4767 -85 182 -112 46 -55 21 110 -189 113 15 -58 61 -77 151 -92 -45 132 -98 44 -58 15 66 -152 102
4790 102 -6 -47 37 -75 112 -73 -37 104 -64 51 -30 26 68 -117 87 -4 -9 49 -54 100 -46 -24 84 -67
4814 -67 46 -36 13 63 -106 66 -23 -22 32 -61 86 -51 -23 60 -68 46 -43 10 44 -79 53 -14 -16 27 -55 69
4840 69 -42 -11 60 -54 57 -45 14 50 -57 68 -12 -6 42 -47 72 -32 -13 47 -54 56 -22 7 27 -59 41
$$ packed form
4681H7k61N58o64J65M88o14L54k62L00%n92P76l59p7J45j89M95o75K88L22n35
4702b50L58k89L71j36m36P26m31M0N5j03M18o75L97J79m18L06k74L86k27k87O22
4723C32m51J18j7l0K98n72M35L2k98K45k42L60k72j43M75l90J39p2N1J99m89M17
4745A25m7k05J95k09L45k90n1L60l36J45q3O7J41l91L61q4j22J52j74K85k79J0
4767h5K67k94J58j01P6Q9k99L02r8p3J19j38K28k43M7J77k30J42j02P3N1k18K54
4790A02j08m1Q4j12J87j85L6J41j68J15q1N6M2j85K04r1nN8j03J54j46K2J08j51
4814f7J13q2M9N0j69J72q9JN4r3J47j37K8Q3j28J14q9N3L4j23J32o7kM3q2J24
4840F9j11L1P1j14J11j02N9L6j07J25q0OM8q9J19j04J9O0j01J10p8K9K0q6J00
$$ plain form
4865 41 -22 -5 18 -52 52 -48 -16 31 -47 38 -34 0 20 -63 56 -30 -2 21 -48 53 -36 -3 29 -39 46 -24 12 21 -34
4894 -34 58 -26 6 27 -43 43 -25 0 32 -40 43 -31 -2 14 -45 32 -26 -5 11 -39 35 -34 0 26 -34 39 -33 11 5 -31 41
4925 41 -26 15 16 -25 42 -30 12 15 -14 42 -31 16 14 -17 45 -35 16 -6 -21 40 -26 30 -1 -10 37 -37 18 -12 -24 34 -46 24
4957 24 -12 -11 34 -32 21 -9 -9 23 -51 33 -31 -2 17 -33 58 -20 -1 23 -22 39 -31 12 8 -32 37 -33 10 -4 -30 50 -50
4988 -50 25 1 -26 43 -53 39 -12 -38 30 -44 33 -26 -19 46 -65 37 -21 8 23 -73 73 -30 -5 40 -38 62 -67 14
5016 14 56 -61 63 -31 39 15 -61 102 -60 18 14 -45 81 -105 48 32 -65 58 -77 71 -21 -72 113 -96 45
5041 45 -29 -11 84 -136 89 -16 -48 52 -81 129 -73 -42 125 -99 73 -66 36 74 -165 144 -31 -19 32
5064 32 -87 179 -137 -5 121 -116 92 -112 96 41 -189 177 -72 6 -5 -72 190 -200 36 88 -105 84
$$ packed form
4865D1o3J7K3p0J04j00L2M7p8Q5p2L4K0q3J19q6K8K3o9J01q9L3L2o8Q5p0L6Rn5
4894c4R2q4L2K1p0Q6o8K5L2p2Q3p4K9J6n9P7n8K1J6n0P4o9L4K6o0P3p2M4ol6P2
4925D1o7M1Jm1O7p2M2Lk9N6p3M7kl1O2q0N1k2j5O1o6N6l1rM7p4N5l0j2N8q0P0
4957B4l6JM5o6N3l0%L2p4Q4o4K9J9n0R1p8J9K4m5O1p0M3mm0O9p0M3j4k6Q0j00
4988e0P5k4k7O9r6R2n1k6O8p4P7n9PO5j11J02n8K9J5r6J46j03K5M5p8J00j29Q1
5016A4M2j17J24r4P0k4p6J63j62P8mn9J26j86J53j6r7J23j35J48r2n1J85k09J41
5041D5p4J8R5k20K25j05l2J00j33K10k02L1J67k24J72j39J02L8k39L09j75J2N1
5064C2j19K66l16J32J26k37K08k04K08n5k30L66k49P8j1o7K62l90K36N2j93J89
$$ plain form
5086 84 -144 151 -2 -166 199 -94 53 -52 -26 207 -245 103 60 -83 77 -167 220 -66 -141 216 -122
5107 -122 80 -100 17 188 -272 151 17 -54 55 -173 259 -146 -107 196 -133 94 -158 79 128 -297 185
5128 185 -32 -14 -7 -141 282 -199 -39 182 -125 110 -178 149 91 -275 213 -41 43 -32 -92 280 -249 14
5150 14 128 -92 95 -203 202 20 -237 220 -96 52 -89 -61 258 -288 63 85 -82 71 -211 246 -41
5171 -41 -194 213 -106 78 -126 -13 229 -291 106 60 -45 51 -181 256 -83 -135 192 -94 98 -139 55
5192 55 182 -263 127 19 -15 18 -147 252 -139 -102 154 -95 84 -158 83 120 -243 137 -15 10 -8 -122
5214 -122 232 -146 -37 125 -88 75 -160 109 80 -209 144 -32 25 -24 -86 225 -162 -7 101 -57 76
5235 76 -144 132 42 -172 128 -55 46 -48 -67 176 -158 -1 67 -47 62 -137 112 8 -142 112 -57 43
$$ packed form
5086H4k28K95j53j64L65k93J47j05K6K33m52L48m3j43J60k44L87k86p5L57l38
5107a22K02j80J17J71m60M23j34p1J09k28M32m05L9L03l29K27k52K37M9m25M82
5128A85k17J8Pj34M23m81J60K21l07K35k88L27n8l66M88k54Q4p5o0L72n29K63
5150A4J14k20J87k98M05j82k57M57l16J48j41K8L19n46L51K2j67J53k82M57k87
5171d1j53M07l19J84k04J13K42n20L97m6j05R6k32M37l39n2L27k86J92k37J94
5192E5J27m45L90j08l4L3j65L99l91L7K56k49J79k42K41L7l63L80j52K5j8j14
5214a22L54l78J09J62k13J63k35K69k9k89L53j76N7m9o2L11l87J55J08j58J33
5235G6k20K76r0k14L00j83J01r4j9K43l34J57O8j14J09j99K49j04j50K54j69J00
$$ plain form
5257 43 -50 -42 146 -129 37 43 -30 55 -113 116 1 -98 101 -49 56 -56 -17 133 -136 37 33 -14 42 -101 109
5282 109 -17 -77 84 -55 53 -62 -15 97 -121 40 -3 -20 32 -103 90 -28 -64 67 -47 59 -50 -10
5304 -10 87 -91 47 -5 8 42 -64 100 -14 -33 64 -41 51 -49 18 61 -86 42 -18 7 24 -70 75 -30 -28
5329 -28 31 -41 39 -50 6 39 -74 39 -24 6 17 -62 57 -33 -23 24 -41 28 -46 9 30 -65 44 -19 2 24 -47 62
5357 62 -29 2 37 -31 41 -38 0 16 -48 50 -23 -6 7 -39 52 -36 -6 19 -43 22 -43 9 21 -33 39 -21 -2 13 -27 37
5387 37 -27 -3 13 -30 33 -38 5 14 -32 33 -19 15 11 -27 42 -16 23 3 -28 22 -22 6 6 -38 38 -24 17 11 -28 24 -33 9
5419 9 11 -43 25 -20 10 8 -13 22 -17 6 12 -14 42 -68 50 33 -43 104 22 28 14 -25 -1 -49 -23 -11 -57 22 -61 14 24
5450 24 -11 15 -16 27 8 -26 25 -21 18 -7 -15 20 -23 12 24 -7 15 -20 29 19 9 -2 -10 46 -7 11 31 -10 30 -14 8
$$ packed form
5257D3r3QJ88k75J66Op3Q5j68K29j15r9J99j50J05j12L9J50k69J73mm7N6j43K10
5282A09j26o0J61j39J08j15M7J12k18J61m3j7N2j35J93j18l6J31j14J06j09M0
5304a0R7j78J38n2J3L4j06J64j14j9R7j05R2j00O7M3j47J28o0K5J7r4J45j05K
5329b8N9p2Q0q9N6L3j13J13o3L0J1p9J19r0J0M7o5O9p4N5K1r5J09o3K1K2p1J09
5357F2r1L1L5o8P2p9L8J6o4R8p3J7J3m6R1q8L0K5o2O5o5N2J2n4P2o0J9J5m0O4
5387C7o4K4J6m3O3p1M3Rm6O5n2L4ml8O9n8L9k0l1N0m4K8%m4P6o2M1ol9N2n7M2
5419IKn4O8m5L0kk1L5l9K3Ok6N6j10J18j7p6J47q2Oj4l9K4m8K6J2m6P9q3P5J0
5450B4l5K6l1M3j9l4N1m6L9k5qL5m3L5J2l1K2l5M9j0j0j1qN6n3J8K0m1M0m4K2
$$ plain form
5481 8 23 -17 29 -17 13 11 -18 21 -19 6 13 -36 0 -13 1 -17 19 31 -60 -7 -58 -18 24 -32 13 -15 0 -6 -24 58 -29 11
5513 11 -14 15 0 -60 -73 84 -72 59 -13 48 7 -4 74 -15 37 11 -15 46 -49 61 21 -41 3 -39 29 -28 -34 70
5541 70 -16 38 -60 56 20 -60 27 -46 -82 77 -110 56 12 -45 47 -94 40 -47 7 139 26 49 3 11 25 -54 95
5568 95 -64 0 48 -26 44 -57 52 27 -93 81 -27 21 -43 -55 86 -100 27 11 -9 21 -114 59 -14 -75 73
5593 73 -57 47 -44 -11 114 -112 50 16 -18 36 -100 107 -25 -61 80 -53 62 -61 8 100 -107 50 -8
5616 -8 12 13 -94 126 -55 -46 65 -46 64 -104 35 64 -123 73 -33 17 -4 -92 141 -90 -18 38 -42 67 -118
5641 -118 70 47 -112 82 -27 61 -28 -58 141 -95 -4 35 -20 51 -120 85 22 -109 74 -43 57 -56 -47 115
5665 115 -109 4 4 -12 29 -128 104 2 -90 60 -47 59 -60 -23 113 -119 37 -3 -3 26 -111 113 -27
$$ packed form
5481HJ5m0M6m6L0kk9L9m0K5Pm9L6j3J4j8L6J2r1N3n1M0M2n6M5k8J5oj8Q2q7M0
5513A1k5K9j5o0j3J57j56J31p2O1m1j1P8q9N2k6k6O1r5J10m0o2M4m2O8n7oJ04
5541G0q6N4r8J16l6q0Q7p3l6J59j87J66m4n7R2j41J34q7N4J32j13K3m6QJ4p9J49
5568I5j59O4M8p4P0j01J09k5j20J74j08M8o4j2J41j86J27j6k0L0j35J73p3o1J48
5593G3j30J04r1L3J25k26J62l4l4N4j36K07j32l6J41j33J15j23O9R2k07J57n8
5616hK0Jj07K20j81RJ11j11J10j68J39K9j87J96j06N0k1q8K33k31P2N6q0J09j85
5641a18J88k3j59J94j09Q8q9l0J99k36R1L9n5P1j71K05o3j31J83j17J00j13RJ62
5665A15k24J13%j6M1j57K32j02r2J50j07J06j19L7J36k32J56m0%K9j37K24j40
$$ plain form
5688 -27 -51 59 -40 73 -80 16 99 -100 45 -4 22 17 -87 107 -40 -41 33 -37 56 -87 14 67 -92 39 -22
5713 -22 10 -7 -82 103 -44 -33 34 -25 40 -83 23 50 -84 37 -8 39 -5 -70 91 -43 -18 33 -26 55 -84 43
5739 43 42 -69 56 -21 39 -10 -50 93 -45 -2 15 -19 44 -95 28 29 -56 33 -24 39 -24 -51 77 -41 1 -3 -8 36
5767 36 -78 29 36 -47 32 -24 43 -10 -33 78 -38 8 -2 -2 40 -69 40 13 -48 35 -32 44 -16 -28 70 -47 16 -2
5795 -2 -10 34 -63 40 -3 -37 18 -35 39 -45 -29 57 -47 12 -10 -5 28 -53 50 -1 -25 25 -19 41 -15 1 44 -45 10 -20
5825 -20 8 26 -49 44 -7 -25 10 -25 41 -42 -14 38 -39 27 -14 9 22 -46 43 -12 -12 17 -21 35 -26 5 37 -33 14 -10 18
5856 18 10 -29 48 -9 -11 6 -8 25 -24 6 22 -23 22 -14 12 5 -24 36 -19 -9 0 -25 27 -25 9 4 -29 13 -17 8 4 -22 27
5889 27 -15 12 15 -12 18 -20 16 2 -15 21 -17 10 -2 -11 27 -18 7 17 -7 19 -13 10 11 -13 16 -9 -5 4 -11 34 -19 -1 -1
$$ packed form
5688b7k4J10r9J13j53R6Q3j99J45m9K6nj04J94j47jP4p0R3j43J01N3j59J31o1
5713b2L2j7p5J85j47J1O7n9O5j23J06K7j34J21m5M7m4o5J61j34K5N1n9Q1j39J27
5739D3jj11J25p7O0m9m0J43j38M3J7l4O3j39J23Jq5Q9n7O3o3k7J28j18M2mnM4
5767C6j14J07Pq3P9n6O7n3k3J11j16M6j0%M2j09J09k7o1Q3o7P6o0j2R8j17O3j8
5795bqM4r7J03m3l4N5n3P4q4J6Q6j04N9k2NL3q1J03n1k4N0m4O0n6J6M3q9N5l0
5825b0K8J8p5R3n1j8L5l5O6q3K8N2p7O6m1K3J3o8Q9n5%K9l8N6o1L1L2p0M7k4K8
5856A8ql9P7n7kJ7j4L3m9L0J6m5M5l6K6pk9O0n5J0Rk5N2n2L4nl3M2l0K5mk6M9
5889B7m2K7Lk7L0l8L6j4j7L6l8K7j2rL8m5K5J0k4K6l2K3Jk4K9k5MRj5M5n3J8%
$$ plain form
5922 -1 -25 12 -13 2 -2 -17 12 -14 7 0 -14 11 -5 5 -4 -18 16 -21 9 4 -17 23 -8 7 6 -1 10 -14 9 5 -9 14 -24 10
5956 10 4 -2 12 -17 14 6 -1 14 -22 4 -14 -11 6 -29 12 -12 12 4 -21 11 -12 3 14 -16 21 -11 13 24 -12 30 -4 12 7 -8
5990 -8 21 -13 11 -5 -12 16 -20 20 12 -11 13 -17 11 2 -8 12 -21 16 -10 2 15 -31 19 0 -1 15 -17 13 -11 -6 11 -19 18
6023 18 -18 3 7 -26 26 -12 5 2 7 39 -13 15 9 -8 16 -31 21 -6 -13 17 -28 16 -19 -10 22 -50 13 -7 -8 17 -23 39 -20 -5
6057 -5 19 -12 38 -22 16 28 -31 23 -21 5 1 -21 41 -26 -4 13 -4 28 -31 18 12 -35 32 -19 23 -11 -20 48 -36 9 -2 -11 15
6090 15 -58 36 -10 -28 21 -24 36 -26 -9 50 -46 26 -14 10 21 -44 50 -12 -7 22 -23 30 -46 8 34 -46 24 -13 14 -9 -41
6121 -41 64 -28 -13 8 -15 34 -43 15 19 -43 28 -23 27 -5 -43 38 -36 -8 -5 -10 28 -57 36 21 -40 18 -23 34 -9 -23 50
6152 50 -31 11 -2 4 29 -59 35 15 -27 18 -21 26 -25 -20 41 -42 0 -19 4 15 -49 30 1 -19 7 -30 31 -27 -17 37 -31
$$ packed form
5922ak4L7k5J5mj5K9k6K1pj4K5j6J0rj4L4l7L0nk1M0l1J5jpJ1k4K3mj4K3l8L4
5956A0ooJ4k9L1qpJ5l6K6j8LJ7l5M1k4K4qk5L2k3J5J1l0L7l2K4J1l6M2l4J6nj5
5990hK9l4K4j6pK8l6M0qk3K4l0K8rj0K0l3L7k6J2J3m6N0j9jJ6l2L0k4NJ7l0L7
6023A8l6K1Ml3N2l8J7lNL2n2K8oj7K4m7N2k7pL0m5M4l5RL2p2O3k0jK5m0O2n9J5
6057eK4l1N0o0L8J2n9N4m4K6mk2O2o7K2J7j7L2n9M9om7O7n1M2l4rO8q4M5j1rK6
6090A5p3R4m6j8M9m5O0o2J7N9r6P2m0K4J1o5R4o2NK9m5N3p6N4K6q0P0l7K7k3l2
6121d1J05r2J5K1k3M9p7N8Mo2P1n1N0l2l8Q1p4K8LnL8q5R3j5o1N8m1N7m3j4P3
6152E0q1M2j3OK5q8R4k0m2M5l9M7n1NO1q3M2j9K3J1o4P9k9k0K6l7O1n8J0N4o8
$$ plain form
6183 -31 -1 -9 12 15 -43 35 0 -21 8 -21 35 -20 -9 40 -18 13 -9 -6 21 -54 40 -17 -44 17 -25 33 -34 -18 16 -21 14 -25
6215 -25 1 13 -46 24 -14 -5 5 -18 35 -25 -6 35 -27 19 -16 7 18 -48 35 3 -15 -7 -40 43 -20 -13 30 -35 2 -27 12 24
6247 24 -49 41 -9 -9 6 -7 32 -40 -8 27 -36 9 -37 26 15 -55 36 -11 -9 -1 -21 56 -40 2 28 -26 27 -40 40 7 -50 42
6279 42 -15 10 -7 -18 48 -46 11 15 -29 27 -41 35 -6 -41 47 -24 7 -30 -10 40 -64 14 21 -27 7 -40 48 -19 -44 32 -39
6310 -39 11 -29 2 39 -56 33 -1 -2 20 -29 52 -25 -29 39 -36 17 -23 10 27 -54 45 -10 -9 5 -33 47 -47 -11 31 -26 10 -32
6342 -32 23 18 -40 24 -27 -4 -13 -15 27 -42 -1 14 -26 14 -28 25 4 -34 26 -22 5 1 -12 40 -42 16 12 -22 20 -31 22 -11 -25
6375 -25 21 -41 6 -5 -1 20 -38 11 5 -11 25 -28 23 -21 -20 31 -24 -3 -4 10 15 -31 19 -2 -18 17 -22 18 -23 -6 17 -21 10
6408 10 -9 -2 13 -16 16 -8 3 8 -16 17 -16 -3 10 -11 2 -8 0 5 -25 2 -24 -2 8 -15 15 -17 -6 4 -7 15 -8 8
$$ packed form
6183c1L0qK1Ln8P8l5k1K9k9N6n5J1M9n8L1k2LK7p5R4n7k7O1m2N8o7J6L4l7L5l9
6215b5K6J2n9P0l8RJ0k3N3o0J9M1o2M6l5K3J1o6Q3l2j8Ql3Q3o3PM3o5L7k9L9J2
6247B4p3R0n0%J5j3L9p2L2L5o3M5m6O3j1p0R1m7KQk0P7r6M2K6n4N3o7Q0l3n7R2
6279D2n7K5j7j1O6r4N7Mm4N6o8P6m1l5Q8p1L1l7K0N0j04P8Pm8L4m7Q8o7k5P6p1
6310c9N0m0L1L7r5Q9l4jK2m9Q1p7mO8p5N3m0L3J7q1R9n5JJ4l8Q0r4L6M2n7L6m2
6342c2N5nn8O4n1K3rkM2o9M1J5m0M0m2N3k1l8O0m8K7mj3N2q2N8ml4M2n1N3l3j4
6375b5M6o2M7j1MK1n8M9oj6L6n3N1m4JN1n5K1jJ4Nm6N0k1j6L5l9M0m1J7K3l8L1
6408A0j9PJ5k9L2k4J1Nk4L3l3J3J3k1J3j0QNl0K7k6K2J0k3L0l2J1J0j1K2k3J6
$$ plain form
6440 8 -9 -10 5 -5 12 8 -19 24 -14 14 -1 -11 20 7 0 7 -24 -24 10 29 1 -31 32 -28 4 9 1 24 -14 9 2 -11 10 -15 5
6475 5 -3 -12 10 -6 9 -10 -16 19 -14 13 0 -4 9 -12 16 -9 4 21 -2 19 -13 0 4 -9 14 -13 -1 7 -5 15 -23 1 16 2
6509 2 32 -7 18 14 4 21 -14 16 -11 -5 12 -20 13 4 3 5 -19 30 -14 -4 21 -11 17 -15 6 24 -16 28 0 5 -5 -15 21 -23
6543 -23 -2 6 -24 33 -5 -19 5 -5 23 -27 1 15 -54 9 -15 13 -2 -2 11 -26 24 -2 -6 1 -36 16 -50 2 8 -30 9 -1 -15
6576 -15 25 -84 42 -20 -31 61 10 13 -9 -18 48 -23 19 -20 5 8 -46 38 -21 -5 5 -29 26 -28 10 16 -30 22 -24 15 3
6607 3 -20 47 -21 17 -2 -8 29 -45 17 14 -29 20 -25 25 -20 -78 63 -10 17 -32 25 38 11 -9 -13 -15 20 -43 25 -26 -2 28
6639 28 -25 22 -24 6 21 -46 19 -7 -12 9 -21 29 -33 -2 34 -29 24 -28 21 27 -37 32 -12 -4 -4 -24 43 -23 -21 28 -32 17 -37
6672 -37 12 10 -45 27 -27 -12 0 -13 39 -35 -2 11 -24 14 -30 16 5 -32 36 -13 2 -4 -23 27 -46 -4 21 -18 8 -25 30
$$ packed form
6440Hj7jJ5j0J7mk7M3l8K8j5j0L1j3pPl1%L4J9k8l2O3o0L2NqK3l8K3pj3K1k5K0
6475EqrK2j6J5j9oL5l3K7j3mJ3k1K8k5J3J7k3K1l2J3Mj3K3k7J2Qj2K0l8K4J5j4
6509BL0l9K5mj0J7l5L0k7OJ7l2L3rjKk4M9m4J0K5l2K8l2K1J8m0M4k8Nj0j0L6m4
6543b3K1Ql0N7l8j4K4j0K8n0K8J4o9O3k4K8j5%J3l7N0k6mPl7N2o6N2Ol8L9j0j4
6576a5M0j09J26o2j1R2n1Lk2rO6p1M2l9K5Ln4Q4n9J6J0l4N5n4L8Om6N2m6L9j2
6607Ck3O7o8L8j9oL7p4O2lm3M9m5N0m5n8J41p3K7m9N7J3k7k0mkL5o3O8n1K4L0
6639B8n3M7m6L0J5o7O5k6nK1l0N0o2L1L6o3N3n2M9Oo4O9m4Q%k0O7o6KM9o0M9n4
6672c7M9kn5P2n4J5J2j3N2p4L3J3l5L8m4M6j1l7O8m9J5oj9N0p3M2K5l9K6l3N5
$$ plain form
6703 30 7 -38 30 -16 18 -7 -20 33 -33 1 18 -23 21 -33 7 -3 -47 34 -30 6 -16 -6 45 -28 7 13 -14 21 -41 32 6
6734 6 -38 47 -14 10 -14 -20 45 -46 10 13 -10 27 -46 42 -6 -34 34 -27 25 -25 0 39 -54 24 3 -14 6 -39 58 -26 -32 37
6766 37 -21 23 -47 -3 40 -56 24 3 9 12 -32 50 -25 -17 31 -32 31 -33 19 36 -51 34 -18 7 1 -47 57 -47 -17 39 -32
6797 -32 23 -48 27 13 -59 39 -30 5 -10 -26 47 -51 0 12 -16 32 -43 38 2 -45 50 -27 23 -17 -20 49 -46 13 8 -16 23
6828 23 -38 57 -12 -43 29 -33 15 -17 -5 37 -57 25 -14 -9 11 -40 48 -29 -20 29 -29 26 -33 10 51 -13 36 53 -27 15 -26
6859 -26 48 -49 -16 -19 -30 4 11 50 -44 7 56 -36 31 -1 -13 40 -30 12 26 -19 14 -26 20 -7 -28 24 -14 -1 -7 -15 36 -40
6891 -40 11 6 -27 23 -16 22 -2 -13 29 -18 14 5 -9 34 -31 18 7 -13 9 -21 26 0 -13 26 -23 15 -4 -2 15 -28 10 -6
6923 -6 -18 7 -21 19 0 -15 58 -15 -35 28 -22 -22 -18 56 32 28 58 -7 17 11 -55 -36 27 18 34 -36 18 -29 20 18 52 1 -14 9
$$ packed form
6703C0k3m5O8m6L4k5j3N3o6L4J7m1M4n4M0j0m4Q1o4L6k2J0N1p3L5Ok7L5o2P3k6
6734Fm4Q5o1K4k4oO5r1N6Lk3L7p3Q8m8k8O8o1N2n0K5L9r3P8k1j7K0m5R7q4oO9
6766C7n8M4p0M4M3r6Q0k1OLm4Q2p5QM8o3O3o4N2J7q7Q5n2K5om8J04j04L0N6p1
6797c2N5p1P5j4p2R8o9L5j5j6P3r8N1J2k8M8p5Q1l6m7R5p7N0m0lO9r5N9nk4L9
6828B3o1R5o9l1P2o2M8l2J2M2r4Q2l9NK0n1Q8p7RM9n8N5n9M3M1o4M9J7q0M2m1
6859b6P4r7L3lj1L4PL9r4N1M9r2O7l2j2N3p0M2J4m5L3m0M6k7k1N2l8J3oqN1p6
6891d0N1nl3N0l9L8k4j1M2m7L2rj4M3o5M9j1k0K2l0M7k6j3L9m9L8j9KJ7m3L8j6
6923fj2K5k8M0j9j5P3p3k0O3n0%MP4k4mL0o5K4oo6J9O3rJ6p0N4m7M9kL4n1j5K3
$$ plain form
6957 9 -7 -8 11 -19 13 -12 2 -2 -20 15 -24 7 4 19 31 20 15 78 -34 19 16 -98 -2 -20 43 11 20 78 -11 -15 -3 -8 25 -61
6991 -61 -1 7 13 2 -14 18 -27 12 -5 -16 18 -13 8 -11 -9 10 -20 11 -11 -5 -5 -27 12 -8 -19 8 -21 15 -7 31 17 -24 23
7024 23 -16 1 12 -14 10 -19 8 2 -16 17 -16 3 7 -12 11 -21 8 -2 -21 43 -3 5 -12 -13 10 -20 12 -6 -21 4 -29 18
7056 18 -18 -11 31 -29 11 6 -4 9 -27 22 -9 6 4 -9 10 12 -11 74 2 6 29 -14 31 -114 -11 1 -17 -24 -20 31 -65 9 9
7089 9 -17 21 -22 20 4 -25 36 -21 5 -13 -2 20 -21 19 76 -79 -25 -3 7 -3 -50 61 13 84 -50 5 22 -86 10
7118 10 32 1 8 -32 33 -23 -15 18 -65 1 -2 -6 36 -44 32 5 -4 -40 -24 33 -28 -1 13 -24 23 -22 26 12 -39 32 -9 12 4
7151 4 -23 43 -18 4 28 -27 27 -34 43 -57 -12 36 55 9 -27 -30 77 -49 -16 25 -2 28 -16 -9 -4 -66 104 -15 19 0
7181 0 -23 55 -48 30 7 0 14 -44 36 -13 -26 31 -22 30 -23 -2 51 -48 21 -5 -14 8 -42 43 -18 -18 39 -34 30 -35 -4 28
$$ packed form
6957Ij6jJ9l0L2k5J4mj8L5l9L1lJ5J2j1nO3j12N3lj14R6j8O3l2RN8q9mJ2nL3q6
6991f1O0QOj1j6L2m5L9j7j1L4l1K1j9KJ9l0L1k2O%k2L9k0j1K7k9L6k2L8j4m1M7
7024B3l9J7J1k6K4k9K7oj8L3l3J9Mj9K3l2K9j0j9O4m6Qj7jK3l0L2j8j5K5l3M7
7056A8l6PM2o0M0nj0J3l6M9l1J5kj3J9Kk3Q5p2MK3m3M5j45J03J2j8pMN1r6P4%
7089Ik6L8m3M2j6k9O1n7K6j8J1K2m1M0N7j55N4K2J0j0m7J11m8P1j34N5J7j08R6
7118A0K2l1Pm0O5n6QL3q3O6lmM2q0P6k7rl6J6N7o1K7J4l7M7m5M8j4n1P1m1K1q
7151Dk7O6o1K2K4n5N4o1P7j00M5M8J9m6l6lJ07j26L3M1k7L0m4PNo2J70j19L4j9
7181@k3P8j03P8k3pJ4n8Q0m9j3N7n3N2n3K1N3r9O9k6rK2n0Q5o1%N7p3O4o5L1L2
$$ plain form
7213 28 -56 21 4 -7 29 -5 41 -15 -34 26 -23 38 -43 -2 34 -54 31 -19 2 -3 -38 50 -27 -9 21 -21 40 -48 27 21 -58
7244 -58 92 -20 11 -4 -39 56 -51 14 37 17 38 -58 22 51 -55 69 -7 56 -52 -73 19 -69 38 5 -7 47 -44
7271 -44 49 6 -35 22 5 10 3 -37 77 -50 30 22 -20 39 -55 43 -15 -41 2 6 45 -66 -20 23 -63 44 -10 2 18 -45
7301 -45 50 -19 -26 22 -38 33 -34 -2 53 -48 31 -9 11 21 -59 72 -75 -76 18 -18 52 -93 15 100 -95 -16 -44 63
7329 63 7 5 48 -14 -28 -8 -43 17 -38 25 28 -41 32 -22 18 -20 -31 103 -31 28 23 -5 2 -105 7 -15 -28 -5 -2 4 1 -48
7361 -48 63 -36 14 17 18 57 -76 16 5 -34 -11 -23 28 16 -11 28 -31 9 -21 11 27 -43 18 -14 -14 22 -23 32 -23 -6 10
7392 10 -16 1 2 -18 38 -75 65 55 13 61 -4 44 -39 -1 5 14 -1 -6 -7 16 -27 34 -28 0 2 -16 9 -19 3 10 -29 24 -21
7425 -21 2 -5 -11 22 19 46 -8 -61 -38 50 3 15 -4 -57 41 10 5 0 6 13 -53 -9 -16 -7 -36 32 53 -40 27 17 4 -6 25 -5 -37
$$ packed form
7213B8q4P7j7j1L6l4M6n6j9O0m9O1q1M1L6q8Q5n0K1nl5Q8p7J8L0m2O1q8P5op9
7244e8J50j12L1j5l5R5j07O5K3k0K1r6Q0K9j06J24p6O3j08k1R2q8J07l3j2N4r1
7271d4R3m3m1N7j7Npm0J14j27Q0qm2N9r4R8n8k6M3ML9j11M6M3q6J07n4J2J6o3
7301d5R5o9pM8o0P1o7L2N5j01P9m0K0J0q0J31j47jR4l6P0j45J08Q5j95P9k8J07
7329F3n6kM3o2j4K0l5O0n5O3Lo9P3n4M0l8j1J34j34N9nk8Pj07J12k2j3K3LOlm9
7361d8J11r9N0LJL9j33R2j1l9K3j2N1j2k7L9n9M0l0L2J6p0O1l2%L6m5N5n5J7J6
7392A0k6J7Jk0N6j13J40j0m2M8o5M8q3L8ORj5njK3m3O1o2K8Kj8K5k8K2Pl9N3m5
7425b1K3poL3lK7n4n3K3Q8m7J2j9n3R8l1nnOPo6M4pRk9O8K1r3O7j0j3j0L1l0l2
$$ plain form
7460 -37 21 6 7 -18 23 57 19 28 17 3 -23 -45 -10 -17 -20 9 -39 60 -19 -71 -38 4 -50 -18 -36 2 3 -6 12 -24 13 -10 -4 17
7494 17 -13 31 -4 -24 -3 27 24 -37 -3 2 -6 -3 -44 16 19 -43 17 42 -51 -73 -3 -29 1 4 16 -8 7 -16 7 2 54 11 44 53
7528 53 21 -22 30 -12 -30 32 21 25 -80 -19 4 -18 -12 -6 42 22 -22 -5 -40 16 -2 23 45 -24 -18 -27 -46 7 -20 -9 5 -5
7560 -5 26 1 17 -26 -2 6 -41 42 -40 10 -47 -48 9 -4 10 -9 -23 15 -28 -46 -20 18 -24 -27 24 -5 26 51 -17 23 -16 -16 84
7593 84 -47 -46 13 14 -56 8 -1 10 -3 11 41 36 -16 -51 18 -2 -19 -4 17 12 -1 -2 -61 56 -34 -83 62 42 25 35 -15 14
7625 14 -2 -18 22 -39 41 -33 -17 -12 -73 62 -9 24 19 -1 -13 -41 15 -2 6 18 34 44 -18 -27 12 -15 -7 4 -10 -7 -71 -40 8
7658 8 17 -16 -5 107 56 -103 14 0 27 -2 -30 38 -54 2 3 -28 9 -51 58 -29 4 8 -5 38 4 -12 70 -14 -1 22
7688 22 -60 25 -61 42 -25 -20 -5 -45 23 -27 -48 56 -15 5 5 1 22 -40 32 -8 -23 21 -25 29 -22 -14 24 -36 -30 -35 -34 11 -44
$$ packed form
7460c7N8j5Jk5M1L4l8Rj1j4k6k2L5plK9m8R9p9n2L3M2n4L2j8L8JrJ8l6L7k3OK1
7494A7l0M4l5k0K1L0lo1L4NqLm1O0Lo2O0K5r3k2P0k6L0LJ2k4J5k3K3nN2m3L3R
7528E3l2m3N2m2j8O2j1Mj05O1K3k2OOM8k0m4J7l5N6j8K5K2o9Orj9N3k7J1J4j0
7560eL1k5J6m3K4Qm7Q3q2N0n7jN7j3J4j9j4L8m3j8K6L8m2lN1k9L1K5o8M0l9%J00
7593H4j31JN9Jp0O4rJ1j3J4L0nn2l5O9k0j7J5K1nj3jn9J17r0m9J45k0j7J0n0K9
7625A4j6j6M0o1Q0p4J6No1J35p1L3nk0j2k8N6j7QJ2J6J0o2rL9k7QJ1j4Lo4L1M8
7658HRl3J1J12n1j59J17j4K7k9k8O8r2N6Jl1L7o0J09q7L3Mj3M3l4j6Q2q4J3K3
7688B2q2Q5q6J03o7NJ5m0O8n0k1J04p1K0%mK1o2P2m0j5M4m6N4n1QL8o0OnJM5n5
$$ plain form
7721 -44 19 -6 -41 50 -15 43 -22 -25 26 -43 35 -13 -4 3 -34 18 -36 -12 -7 -24 75 10 9 14 -38 25 -13 11 -2 -53 63 -21 -11
7754 -11 -9 -25 -3 -101 23 49 -39 12 -41 -10 1 -23 34 -49 -8 -3 -17 36 -62 37 18 -11 24 25 21 -25 -30 84 12 11 -15 -29
7786 -29 41 -61 8 -18 -75 67 -66 92 -46 15 21 -48 -13 -70 29 18 -69 44 -14 -3 -2 -63 58 2 10 38 -60 1
7814 1 -19 26 37 -68 57 -13 -5 -4 -15 55 -25 -18 63 -1 -15 -28 19 21 -52 39 -65 58 29 -24 40 -43 -17 -8 -34 -22 -2
7845 -2 120 34 30 -5 -57 1 7 -30 34 -56 12 14 -31 22 -29 32 -17 -32 37 -36 17 -5 -12 12 -53 73 0 -49 34 -30 44 -28
7877 -28 -29 27 -36 5 -14 -2 16 -59 27 -35 29 20 -84 52 -36 31 40 -89 41 -42 -13 20 -43 35 0 -15 25 -36 34 -26
7907 -26 37 63 -2 33 -16 7 10 -35 31 -14 -4 20 -30 26 -35 3 10 -44 23 -43 15 -3 1 22 -23 47 51 -6 -10 -13 53 -9 -19
7940 -19 48 -53 13 -5 -12 20 -16 3 -6 -11 18 -23 23 6 -20 21 -9 50 49 4 0 -32 4 -4 -12 6 -21 7 -7 -19 15 -18 11
$$ packed form
7721d4O3k5l5R1o5N8o5lN1o9P8m8RPl7N2n4K4Nj7R9o5jNn2O3l8K4j3n1J16q4J0
7754a1Kj6K2r8J24K6q8N1n3L1J1k4N7q3M1Nj4N3r8R9j9k9L5Jmm6nJ14p2jk6j4
7786b9P0j02O9k6n7J42j33J58j38O1Oo9L5n7R9j1q7J13n8J1Jo1J21n6QK8r8O1
7814Ak0M5J1j05J25p0QJj1P0q0PQ1o4j4j3M7Kp3R1j04J23k9n3O4q3K6Rk6J2K0
7845bJ22q6ml5n2N8Ol7O4r0O8Km5N3n1O1m9j5O9p3N3k2pK4o5J26p3m9Q3o4P4p2
7877b8jN6o3M1j9J2J8p5Q6o2O4rj04J36q8O7Rj29J30q3K9L3o3P8l5j5M0o1P0o0
7907b6O3K6o5L5m9K3Lm5O6m5J0K4n0N6o1L8Pn4O7o6N8j8MK1m5P0Mn7mlO6o2j0
7940a9O7j01O6j8pL2l6J9rnK9m1M6j7k6M1l0N9jm5ml2L6qqJ8k7K8j4j2L4l3K9
$$ plain form
7973 11 -1 -16 14 -33 12 -11 -11 12 -18 -5 7 -30 66 -6 -14 14 32 20 -49 51 -32 -22 67 -19 3 -11 -9 52 -17 25 -54
8004 -54 -56 14 -19 9 -11 9 -15 -22 14 -23 30 -3 27 9 -25 25 30 -64 61 7 42 -10 -3 -58 -38 25 8 -11 5 -5 13 3
8036 3 -15 21 -10 18 6 7 -12 -68 8 -7 -11 99 -2 13 -30 19 18 -14 54 -2 -60 10 -39 13 -5 -23 16 -17 8 -8 -5 4
8068 4 -15 14 -6 0 8 -16 15 -15 6 3 -36 -3 52 -33 31 -28 13 -9 -5 -2 -29 5 -28 -5 -3 -21 -1 -19 3 -2 -25 5 -24 13
8102 13 21 22 24 -13 13 9 -7 14 -19 17 7 -13 2 -16 30 -12 -16 9 -23 18 0 -1 -1 -12 18 15 -27 34 -15 80 -8 -5 34 -84
8136 -84 16 -26 1 -7 -29 19 -7 -20 3 -20 17 -32 -7 19 -30 10 -12 7 4 -36 30 -15 3 -1 5 43 -65 22 17 -61 2 -25
8168 -25 30 -3 -15 6 -45 2 -25 -8 14 -29 -14 8 -10 22 -13 9 -55 8 57 -7 11 35 -3
$$ packed form
7973A1j2j5L0m7M5k3%K3l0J3J2l7R6p2qK8J8j2o9J00q3J0Q9q6K2j4KO1o9M2p9
8004e4kP0l3K8k0K0k4pL6l7N3l3L0j8l4N0Nr4J25n4L5n2Pn5K0O3j7j9J6j0J8j0
8036Cj8L6l1K8j2Jj9n6P6j5mJ10j01J5m3M9jl2O8n6n8P0m9N2j8j8L9l3K5j6LR
8068Dj9K9k0OQk4L1l0K1ll9L3N5q5O4n9M1k2MLk7L4l3K3Kj8K0j8K2nk3L0k9L7
8102A3QJKl7K6mj6K1l3L6j0k0J5j8M6m2mK5l2M1j8j%j1L0lm2O1m9R5q8LL9j18
8136h4J00m2K7qk2M8k6j3K3k3L7m9K5K6m9M0k2J9lm0O6m5J8mOL8j08Q7np8O3k7
8168b5N5l3j2K1n1M7k7J7K2m3J5K2j8L2l5K2o4O3M9o4J8K4l8
8191c
$$ Imaginary data points
##PAGE= N=2
##DATA TABLE= (X++(I..I)), XYDATA
$$ plain form
0 0 0 0 0 0 0 0 0 0 0 0 0 0 0 0 0 0 0 0 0 0 0 0 0 0 0 0 2 -4 4 -4 10 -12 12 -19 22 -25 32 -37 42 -50 57 -66 76 -87 99
45 99 -110 125 -138 154 -170 188 -207 227 -246 266 -285 301 -317 325 -329 313 -278 200 -53 -224 756
66 756 -1845 4376 -12010 66965 283548 -112740 38784 -105012 32411 59399 -212397 310790
78 310790 -43422 -155154 -2299 -34328 251875 -190351 8778 131248 -219313 89330
88 89330 -12955 163110 -47540 -262912 229681 -53233 9449 36701 -49525 103262 -257599
99 -257599 133635 168233 -142534 25547 -119668 143118 -35460 -92768 231628 -156775
109 -156775 -44664 -9011 63754 146117 -234736 95896 21835 -104718 97232 -35818 135436
120 135436 -157494 -94613 207354 -83267 44880 -53267 10302 44344 -170102 192115 14879
$$ packed form
0@%%%%%%%%%%%%%%%%%%%%%%%%%%KoQqJ4k2K4l1M1m7N7o9P9r2J07j23J42j63J86
45I9k09K35k63K92l24L58l95M34m73N12n51N86o18O42o54O42n91M78k53j71R80
66G56k601O221j6386P8975K16583l96288J51524j43796J37423K6988k71796N23187
78C10790l54212j11732J52855l2029K86203m42226J99129J22470l50561L08643
88H9330j02285J76065k10650k15372M92593k82914O2682K7252q6226J52787l60861
99b57599L91234L4598l10767J68081j45215K62786j78578n7308L24396l88403
109a56775J12111L5653P2765Q2363l80853L30632p4061j26553K01950j33050J71254
120A35436k92930O2881L01967k90621J28147r8147O3569L4042k14446L62217j77236
$$ plain form
131 14879 -97187 1712 -58155 157880 -98520 -4824 109626 -143600 34101 -17209 96118
142 96118 18588 -170344 118006 -31195 -7552 41730 -30610 75695 -150936 34855 112741
153 112741 -68426 29419 -72955 55605 -4416 -67723 137442 -61755 -35414 -11835 7521
164 7521 99212 -103819 34560 19886 -70041 48827 -17746 74578 -51854 -75034 91035
175 91035 -34881 27714 -9921 -10932 28818 -88849 73796 29511 -39941 5749 -46264 61380
187 61380 -23078 -9757 57772 -62057 4605 -10315 31136 33932 -68905 32388 -12442 -9886
199 -9886 29087 -13659 33169 -51899 -9465 45805 -17344 19585 -25746 2432 5771 -27424
211 -27424 48433 -8226 -16499 -5985 -11942 37705 -17480 4065 7807 -29158 13064 -2195 21774
$$ packed form
131A4879j12066R8899n9867K16035k56400R3696J14450k53226J77701n1310J13327
142I6118p7530j88932K88350j49201K3643M9282p2340J06305k26631J85791P7886
153A12741j81167R7845j02374J28560o0021o3307K05165j99197K6341K3579J9356
164G521R1691k03031J38379j4674q9927J18868o6573R2324j26432k3180J66069
175I1035j25916O2595l7635j011L9750j17667J62645m4285o9452M5690n2013J07644
187F1380q4458J3321O7529j19829O6662j4920M1451K796j02837J01293m4830K556
199i886L8973m2746M6828q5068M2434N5270o3149L6929m5331K8178L339l3195
211b7424P5857n6659q273J0514n957M9647n5185K1545L742l6965M2222j5259K3969
$$ plain form
224 21774 -712 -30780 15438 -7313 9992 8248 -9213 6170 -23777 9659 16831 -5335
236 -5335 3751 -17558 4163 3944 -1174 15771 -11800 -6210 -2767 1921 15628 -6605 -1906 -4495
250 -4495 -6153 9702 2134 4509 -5154 -10307 4260 2645 6501 578 -7660 -1692 -2142 5347 6280
265 6280 -2631 -3249 -5778 797 7205 1495 -232 -4892 -4053 3101 2276 4719 -924 -6912 -781 640
281 640 5500 2261 -4153 -780 -4268 1943 5316 293 127 -6792 -255 4069 385 3813 -3750 -2577
297 -2577 -734 -328 7245 -1573 -2604 -1658 -2532 5020 24 1795 -838 -5987 2357 872 3635 418
313 418 -4787 1006 -2439 2705 3467 -1752 -212 -4739 1593 3323 -206 1818 -3897 -1014 429 1001
329 1001 4228 -2524 -1820 -1322 -144 3719 -108 364 -2254 -2490 2024 1456 2147 -1524 -2540 -309 253
$$ packed form
224B1774k2486l0068M6218k2751J7305j744j7461J5383k9947L3436P172k2166
236e335R086k1309K1721k19n118J6945k7571N590L443M688J3707k2233M699k589
250d495j658J5855p568K375r663n153J4567j615L856n923q238N968m50P489R33
265F280q911o18k529O575O408n710j727m660Q39P154q25K443n643n988O131J421
281F40M860l239o414L373l488O211L373n023j66o919O537M324l684L428p563J173
297b577J843M06P573q818j031R46q74P552m996J771k633n149Q344j485K763l217
313D18n205N793l445N144P62n219J540m527O332J730l529K024n715K883J443N72
329A001L227o752P04M98J178L863l827M72k618k36M514n68O91l671j016K231N62
$$ plain form
346 253 2709 741 -804 -2269 -1459 1967 1694 1318 -2038 -1705 -260 367 3115 -325 -644 -2359 -1406
363 -1406 3642 -2 1319 -1889 -2380 1775 -1497 4335 -313 -3252 544 -2720 5110 -602 -1382 2319
379 2319 -5788 3169 40 1717 2566 -8102 4442 -1153 120 4186 -5255 4839 -6515 324
393 324 8031 -6133 4210 -5937 1721 4288 -8172 10937 -5237 -2934 2510 -4755 12463 -10171
407 -10171 516 6350 -10382 8940 -5911 6828 456 -14942 15909 -6379 1561 1734 -7288
420 -7288 13608 -17346 7443 9926 -12880 8082 -11963 12947 -712 -14636 21348 -13519
432 -13519 1406 -469 -2034 18469 -25880 10741 7062 -13151 11808 -13199 18733 -10088 -16053
445 -16053 28000 -15482 5682 -6317 -198 18294 -31820 21472 4717 -14792 8910 -15942
$$ packed form
346B53K456j968j545j465Q10L426k73l76l356L33J445O27K748l440l19j715R53
363a406N048l644J321l208m91M155l272N832m648k939L796l264P830n712p80L701
379B319q107Q957l129J677Q49j0668J2544n595J273M066r441J0094j1354O839
393C24P707j4164J0343j0147P658K567j2460J9109j6174K303N444p265J7218k2634
407a0171J0687N834j6732J9322j4851J2739o372j5398L0851k2288P940J73r022
420g288K0896l0954K4789K483k2806K0962k0045K4910j3659j3924L5984l4867
432a3519J4925j875j565K0503m4349L6621l679k0213K4959k5007L1932k8821n965
445a6053M4053m3482K1164j1999O119J8492n0114N3292j6755j9509K3702k4852
$$ plain form
457 -15942 28563 -16952 -12772 30091 -22852 9123 -9839 9288 16306 -40946 29130 -187
469 -187 -10844 8343 -16088 33715 -30259 -5994 34130 -25123 11096 -17687 17617 11162 -42640
482 -42640 39347 -7360 -9603 2592 -11427 40081 -40524 1671 30381 -27155 13423 -20065
494 -20065 28063 647 -43844 45305 -12322 -3182 -3220 -6800 39103 -50008 13807 27076 -26425
507 -26425 11508 -24248 37857 -9284 -38419 49581 -20320 598 -9724 3306 37841 -58609
519 -58609 23917 19344 -23334 10790 -23975 45745 -24130 -31352 52054 -23973 5517 -17424
531 -17424 12318 30744 -61419 35650 11217 -19704 5167 -21301 51273 -34782 -20447 47717
543 47717 -26984 8392 -21383 22940 20913 -60430 41077 3077 -12549 528 -16162 49997
$$ packed form
457a5942M4505m5515M180M2863n2943L1975j8962J9127P018n7252P0076k9317
469a87j0657J9187k4431M9803o3974K4265M0124n9253L6219k8783L5304o455n3802
482d2640Q1987m6707k243J2195j4019N1508q0605M2195K8710n7536M0578l3488
494b0065M8128k7416m4491Q9149n7627R140l8l580M5903q9111O3815J3269n3501
507b6425L7933l5756O2105m7141k9135Q8000o9901K0918j0322J3030L4535r6450
519e8609Q2526m573m2678L4124l4765O9720o9875p222Q3406p6027K9490k2941
531a7424K9742J8426r2163R7069k4433l0921K4871k6468P2574q6055J4335O8164
543D7717p4701L5376k9775M4323k027q1343J01507l8000j5626J3077j6690O6159
$$ plain form
555 49997 -43883 -8635 42198 -25518 8889 -25269 30471 10312 -53577 44964 -4684 -7658
567 -7658 -5668 -8569 47998 -49868 2031 33663 -23654 9070 -25445 37451 -1790 -46872 46129
580 46129 -10021 -1633 -11064 -1678 41763 -52616 12638 25247 -19789 6655 -24849 40811 -10886
593 -10886 -35905 42601 -14208 2342 -14761 5824 33695 -50126 18203 15784 -14074 4391
605 4391 -20918 39480 -18221 -25223 36644 -14186 4843 -17154 10815 24250 -44177 21892
617 21892 8666 -9611 512 -16108 36929 -22203 -15606 29614 -13894 5763 -17350 15346
629 15346 15642 -38191 22817 2851 -4821 -1921 -11700 32185 -24384 -7347 22958 -12016 6103
642 6103 -17215 16841 8754 -29995 21574 -1639 -1406 -3954 -7515 26669 -22809 -1877 15601
$$ packed form
555D9997r3880L5248N0833o7716L4407l4158N5740k0159o3889R8541m9648k974
567g658J990k901N6567r7866N1899L1632n7317L2724l4515O2896l9241m5082R3001
580D6129n6150Q388r431R386M3441r4379O5254J2609m5036K6444l1504O5660n1697
593a0886k5019P8506n6809J6550j7103K0585K7871q3821O8329k419k9858J8465
605D391k5309O0398n7701p002O1867n0830J9029k1997K7969J3435o8427O6069
617B1892j3226j8277J0123j6620N3037n9132O597M5220m3508J9657k3113L2696
629A5346K96n3833O1008j9966p672K900r779M3885n6569J7037L0305l4974J8119
642F103k3318L4056q087l8749N1569k3213K33k548l561L4184m9478K0932J7478
$$ plain form
655 15601 -9366 5739 -14831 16195 3458 -22463 17991 -3169 1005 -4884 -4360 20160 -19515
668 -19515 1396 10588 -6681 4104 -12216 14352 537 -15921 14311 -3909 1808 -4931 -1852
681 -1852 15190 -16110 2755 6545 -4528 3411 -9709 11970 -1360 -11084 11026 -3881 2704
694 2704 -4736 -985 11095 -12426 3482 3594 -2949 2734 -7852 9524 -1559 -7359 7789 -3669
708 -3669 2891 -3776 -543 8015 -9146 2898 1854 -1744 2357 -6045 6807 -1335 -5015 5580
722 5580 -2773 2452 -2809 -710 5777 -6337 2190 1065 -1396 1959 -4521 4868 -688 -3527 3839
737 3839 -2376 2137 -1888 -872 4337 -4504 1555 565 -854 1933 -3739 3301 -257 -2496 2698
752 2698 -1961 1849 -1292 -1108 3403 -2992 1060 203 -820 1798 -2889 2165 254 -1963 1940 -1557
$$ packed form
655A5601k4967J5105k0570L1026j2737k5921M0454k1160M174n889N24K4520l9675
668a9515K0911R192j7269J0785j6320K6568j3815j6458L0232j8220N717o739L079
681a852J7042l1300J8865L790j1073P939j3120K1679j3330r724K2110j4907O585
694B704p440L751J2080k3521J5908J12o543N683j0586J7376j1083n800J5148j1458
708c669O560o667L233Q558j7161J2044j044l598M101q402J2852q142l680J0595
722E580q353N225n261K099O487j2114Q527j125k461L355o480R389n556k839P366
737C839o215M513m025J016N209q841O059r90j419K787n672P040l558k239N194
752B698m659L810l141J84M511o395M052q57j023K618m687N054j911k217L903l497
$$ plain form
768 -1557 1484 -517 -1325 2579 -2107 585 367 -799 1704 -2279 1164 727 -1606 1530 -1197 985
784 985 -50 -1525 2270 -1357 184 471 -1025 1732 -1781 648 951 -1676 1301 -1033 697 401
800 401 -1718 1946 -1071 -64 769 -1176 1624 -1481 228 1146 -1643 1386 -987 338 651 -1711
816 -1711 1936 -999 -141 799 -1328 1675 -1302 178 1033 -1678 1499 -956 321 649 -1601 1753
832 1753 -1115 125 804 -1357 1512 -1258 387 766 -1437 1508 -1078 332 500 -1154 1525 -1217
848 -1217 377 511 -1047 1277 -1059 540 179 -951 1288 -964 446 91 -599 957 -991 642
864 642 27 -551 660 -640 607 -286 -182 522 -622 457 -251 140 56 -369 504 -452 294 -114 -12
883 -12 163 -511 756 -579 184 185 -444 674 -966 916 -148 -791 1118 -1026 920 -687 -146 1431
$$ packed form
768a557L041k001q08L904m686K692k18j166K503l983L443m37k333L136k727K182
784I85j035j475L795l627J541K87j496K757l513K429L03k627K977k334J730k96
800D01k119L664l017J007Q33j945K800l105J709R18k789L029k373J325L13k362
816a711L647k935Q58R40k127L003k977J480Q55k711L177k455J277L28k250L354
832A753k868J240O79k161K869k770J645L79k203K945k586J410J68j654K679k742
848a217J594J34j558K324k336J599l61j130K239k252J410l55o90J556j948J633
864F42o15n78J211j300J247q93J04P04j144J079p08L91q4m25Q73r56P46m08J02
883a2J75o74J267j335P63Jo29J118j640J882j064o43J909k144J946j607N41J577
$$ plain form
901 1431 -2035 1372 -317 -231 813 -1926 2543 -1465 -589 1837 -1837 1868 -2124 1006 1681 -3522
917 -3522 2925 -1277 429 311 -2415 4460 -3561 187 2165 -2348 2698 -3854 3040 995 -4755
932 -4755 4653 -2378 1486 -1011 -2115 6156 -6089 1624 2031 -2420 2910 -5399 5673 -498 -5393
947 -5393 6069 -3377 2560 -2831 -870 7137 -8546 3326 1478 -1877 2475 -6527 8352 -2670
961 -2670 -5264 7030 -4064 3602 -5031 1159 7347 -10662 5306 488 -854 1309 -6960 11098
975 11098 -5584 -4313 7472 -4471 4440 -7459 4118 6467 -12399 7453 -764 576 -624
988 -624 -6452 13349 -8862 -2577 7288 -4331 4588 -9528 7445 4606 -13103 9028 -1911
1001 -1911 1997 -2920 -4991 14443 -11491 -644 6444 -3526 4097 -10708 10223 2300 -12688
$$ packed form
901A431l466L407j689Q6J044k739M469m008Q76K426l674L705l992L130O75n203
917c522O447m202J706j18k726O875q021L748J978m513N046o552O894k045n750
932d755R408p031L864k497j104Q271j2245P713M07m451N330q309J1072o171m895
947e393J1462r446N937n391J961Q007j5683J1872j848l355M352r002J4879j1022
961b670k594J2294j1094P666q633O190O188j8009J5968m818j342K163q269J8058
975A1098j6682J271J1785j1943Q911j1899J1577K349j8866J9852q217J340j200
988f24n828J9801k2211O285R865j1619Q919j4116J6973k839j7709K2131j0939
1001a911L908m917k071J9434k5934J0847P088r970P623j4805K0931p923j4988
$$ plain form
1014 -12688 9755 -2632 3243 -5175 -2963 14471 -13394 1338 5230 -2420 3070 -11188 12764
1027 12764 -439 -11634 10059 -3173 4214 -7452 -323 13718 -14995 3459 3793 -1071 1578
1040 1578 -11039 14909 -3484 -9903 9888 -3435 4887 -9461 2429 12164 -15601 5165 2238
1053 2238 390 -47 -10143 15885 -5783 -7838 8883 -3130 5071 -10558 4581 10139 -14995
1066 -14995 5947 1024 1646 -1555 -8770 15765 -7265 -5883 7640 -2545 4717 -11016 6341
1079 6341 7977 -14003 6402 106 2598 -3000 -7092 15295 -8614 -3931 6381 -1897 4229 -11206
1093 -11206 7954 5690 -12743 6684 -806 3516 -4302 -5426 14387 -9414 -2032 4843 -1160
1106 -1160 3781 -11050 8852 3714 -11007 6362 -1497 4256 -5103 -4041 12973 -9322 -716
$$ packed form
1014a2688K2443j2387N875q418K212J7434k7865J4732L892p650N490j4258K3952
1027A2764j3203j1195K1693j3232P387j1666P129J4041k8713J8454L34m864K649
1040A578j2617K5948j8393o419J9791j3323Q322j4348J1890R735k7765K0766k927
1053B238j848m37j0096K6028k1668k055J6721j2013Q201j5629J5139N558k5134
1066a4995K0942m923O22l201p215K4535k3030J382J3523j0185P262j5733J7357
1079F341J636k1980K0405o296K492n598m092K2387k3909M683J0312q278O126j5435
1093a1206J9160k264j8433J9427p490M322p818j124J9813k3801P382O875o003
1106a160M941j4831J9902n138j4721J7369p859N753r359J062J7014k2295Q606
$$ plain form
1119 -716 3414 -434 3212 -10379 8977 2215 -9299 5728 -1744 4473 -5516 -2774 11444 -8959
1133 -8959 226 2386 139 2521 -9496 8980 878 -7747 5164 -1888 4580 -5856 -1519 9936
1147 9936 -8563 1169 1264 767 1912 -8683 8881 -382 -6037 4398 -2081 4815 -6121 -495
1161 -495 8373 -7832 1903 104 1397 1380 -7782 8400 -1270 -4433 3525 -2046 4786 -6030 284
1176 284 6813 -6892 2237 -598 1768 840 -6658 7654 -1839 -3160 2799 -1817 4371 -5692 959
1191 959 5334 -5964 2394 -1074 1993 295 -5475 6812 -2307 -1962 2001 -1542 3945 -5315 1526
1206 1526 3856 -4882 2438 -1559 2259 -215 -4310 5819 -2558 -821 1135 -1205 3476 -4757 1868
1221 1868 2528 -3710 2225 -1785 2324 -558 -3188 4692 -2463 -86 528 -842 2792 -3952 1861
$$ packed form
1119g16M130l848L646j3591J9356o762j1514J5027p472O217r989K742J4218k0403
1133h959R185K160k247K382j2017J8476q102q625J2911p052O468j0436M337J1455
1147I936j8499R732R5m97J145j0595J7564r263n655J0435o479O896j0936N626
1161d95Q868j6205R735j799J293j7r162J6182r670l163P958n571O832j0816O314
1176B84O529j3705R129k835K366r28p498J4312r493j321N959m616O188j0063O651
1191I59M375j1298Q358l468L067j698n770J2287r119L45L963l543N487r260O841
1206A526K330q738P320l997L818k474m095J0129q377J737J956k340M681q233O625
1221A868O60o238N935m010M109k882k630P880p155K377O14j370L634o744N813
$$ plain form
1236 1861 1523 -2681 1873 -1649 2029 -679 -2220 3546 -2117 296 183 -598 2102 -3014 1590 839
1252 839 -1828 1455 -1402 1624 -582 -1482 2470 -1626 466 -50 -425 1559 -2144 1172 421 -1126
1268 -1126 1056 -1139 1199 -355 -1006 1607 -1087 440 -95 -387 1155 -1391 674 310 -732 765
1284 765 -852 713 -6 -845 1039 -651 218 87 -532 949 -834 178 442 -649 662 -627 288
1301 288 396 -880 813 -385 11 315 -740 923 -562 -136 636 -736 709 -549 43 631 -992
1318 -992 798 -306 -84 482 -886 972 -509 -204 696 -855 811 -575 -4 678 -1041 888 -453
1335 -453 -51 543 -945 1014 -600 -65 612 -910 920 -664 81 532 -943 961 -637 136 446
1352 446 -825 950 -708 195 351 -799 951 -695 241 247 -685 865 -728 323 206 -623 744
$$ packed form
1236A861l38m204M554l522L678k708j541N766n663K413j13p81K700n116M604p51
1252H39k667L283k857L026k206r00L952m096K092n16l75J984l703L316p51j547
1268a126K182k195K338j554o51K613k694J527n35k92J542k546K065l64j042J497
1284G65j617J565p19q39J884j690Q69j31o19J481j783J012K64j091J311j289R15
1301B88J08j276J693j198L96L04j055J663j485M26P72j372J445j258N92N88j623
1318i92J790j104K22N66j368J858j481L05R00j551J666j386N71O82j719J929j341
1335d53M02N94j488J959j614N35O77j522J830j584P45M51j475J904j598P73L10
1352D46j271J775j658R03J56j150J750j646R36Or32J550j593J051j17q29J367
$$ plain form
1369 744 -666 445 -10 -483 734 -649 373 -83 -220 534 -696 504 -110 -205 346 -451 508 -365
1387 -365 -4 319 -414 355 -320 272 -11 -319 498 -401 235 -139 -9 287 -582 555 -251 -25 179 -356
1407 -356 624 -690 321 263 -581 591 -598 581 -235 -530 1068 -923 460 -131 -142 757 -1350 1174
1425 1174 -210 -613 811 -925 1230 -1035 -114 1389 -1610 1018 -593 377 529 -1866 2194 -976
1441 -976 -391 823 -1034 1801 -2098 709 1413 -2201 1554 -1116 1133 -94 -2082 3170 -1890 -6
1457 -6 621 -859 2122 -3164 1747 1169 -2573 1930 -1513 1929 -973 -2001 3948 -2747 423 269
1473 269 -411 2190 -4093 2861 727 -2732 2098 -1745 2733 -2030 -1581 4497 -3530 905 -186 275
1489 275 1941 -4829 4114 -21 -2635 2098 -1829 3470 -3356 -726 4725 -4289 1480 -780 1181
$$ packed form
1369G44j410J111m55m73J217j383J022m56j37P54j230J200o14r5N51p97R59q73
1387c65L61L23p33P69o75N92k83l08Q17q99O36l74J30K96q69J137q06K26K04n35
1407c56R80j314J011n8q44J172j189J179q16k95J598j991J383n91j1Q99k107K524
1425A174j384m03J424j736K155k265R21J503k999K628j611R70J52k395M060l170
1441i76N85J214j857K835l899K807P04l614L755k670K249j227j988N252n060J884
1457fO27j480K981n286M911n78l742M503l443L442k902j028N949o695L170j54
1473B69o80K601o283O954k134l459M830l843M478m763M49O078q027M435j091M61
1489B75J666o770Q943m135k614M733l927N299o826K630N451r014N769k260J961
$$ plain form
1504 1181 1276 -5295 5368 -998 -2279 1862 -1664 4013 -4682 370 4640 -4762 1901 -1336 2188
1519 2188 404 -5389 6295 -1799 -1870 1422 -1294 4286 -5748 1403 4319 -4910 2087 -1733 3083
1534 3083 -533 -5222 6933 -2601 -1331 931 -746 4305 -6646 2551 3727 -4909 2201 -2020
1548 -2020 3929 -1693 -4667 7364 -3425 -679 318 -13 4030 -7343 3805 2844 -4614 2171 -2228
1563 -2228 4752 -2907 -3871 7468 -4034 9 -465 812 3596 -7748 4755 1962 -4074 1915
1577 1915 -2292 5350 -3884 -3008 7225 -4251 474 -1078 1583 3040 -7790 5402 1171 -3538
1591 -3538 1567 -2150 5601 -4718 -2097 6770 -4436 869 -1544 2302 2232 -7541 6004 241 -2846
1606 -2846 1159 -1830 5708 -5540 -942 6084 -4438 1269 -2098 3084 1314 -7060 6353 -667
$$ packed form
1504A181R5o571J0663o366j281M141l526N677q695N052M270r402O663l237L524
1519B188j784n793J1684q094p1L292k716N580j0034P151K916r229O997l820M816
1534C083l616m689J2155r534J270K262j677N051j0951R197J176q636P110m221
1548b020N949n622k974J2031j0789K746R97l31M043j1373J1148r61p458O785m399
1563b228O980p659r64J1339j1502M043m74J277K784j1344J2503k793o036N989
1577A915m207P642r234Q76J0233j1476M725j552K661J457j0830J3192m231m709
1591c538N105l717P751j0319K621Q867j1206N305k413L846p0r773J3545n763l087
1606b846M005k989P538j1248M598P026j0522N707l367N182j770q374J3413p020
$$ plain form
1620 -667 -1973 538 -1466 5704 -6146 115 5107 -4130 1481 -2589 3759 442 -6376 6337 -1334
1635 -1334 -1163 -51 -1007 5415 -6362 994 4175 -3716 1511 -2752 4152 -365 -5440 6163 -1866
1650 -1866 -547 -446 -502 4828 -6343 1734 3189 -3251 1479 -2690 4346 -1182 -4461 5704 -2235
1665 -2235 96 -1005 91 4145 -6122 2468 2117 -2515 1250 -2716 4525 -1903 -3260 4931 -2412
1680 -2412 703 -1490 665 3402 -5632 2853 1080 -1726 951 -2484 4394 -2400 -2234 4173 -2339
1695 -2339 1051 -1765 1108 2494 -4857 3004 340 -1088 683 -1998 3825 -2630 -1280 3296 -2140
1710 -2140 1137 -1786 1337 1687 -4025 2879 -236 -584 329 -1581 3374 -2600 -501 2374 -1779 1186
1726 1186 -1774 1504 947 -3059 2517 -647 -75 1 -1100 2747 -2356 136 1461 -1279 1087 -1557
$$ packed form
1620f67j306K511k004P170j1850O261M992r237N611m070O348l317o818J2713p671
1635a334J71J112r56O422j1777P356L181p891N227m263O904m517n075J1603q029
1650a866J319J01n6N330j1171Q077J455o440M730m169P036n528l279J0165p939
1665b235K331j101J096M054j0267Q590l51m632L765l966P241o428j357Q191p343
1680b412L115k193K155K737r034Q485j773k806K677l435O878o794J66O407o512
1695b339L390k816K873J386p351P861k664j428J771k681N823o455J350M576n436
1710b140L277k923L123L50n712O904l115l48R13j910M955n974K099K875m153K965
1726A186k960L278n57m006N576l164N72P6j101L847n103K492J325k740K366k644
$$ plain form
1742 -1557 1380 367 -2133 1951 -689 300 -178 -748 2004 -1909 347 831 -874 853 -1281 1162
1758 1162 100 -1439 1463 -710 282 -207 -521 1391 -1343 383 480 -624 704 -882 765 26
1774 26 -889 955 -583 277 -91 -390 942 -803 229 209 -432 509 -606 380 83 -575 576 -344
1792 -344 117 -13 -380 567 -391 65 202 -331 427 -383 147 252 -472 404 -186 19 233 -444 482 -213
1812 -213 -139 259 -425 413 -310 -117 436 -510 342 -180 -58 344 -594 505 -100 -173 380 -497 457 -286
1832 -286 -166 561 -608 437 -148 -49 395 -649 544 -182 -136 392 -533 519 -254 -94 501 -623 523
1851 523 -288 -28 368 -618 603 -300 -37 341 -525 561 -361 15 345 -538 536 -374 81 251 -456
1870 -456 528 -363 83 205 -392 467 -439 201 83 -361 487 -467 239 58 -283 402 -435 137 -18 -312
$$ packed form
1742a557K937j013k500M084k640R89m78n70K752l913K256M84j705J727k134K443
1758A162j062j539K902k173R92m89l14J912k734J726R7j104J328j586J647p39
1774B6r15J844j538Q60l68k99J332j745J032k0o41R41j115R86k97o58J151r20
1792c44M61j30l67R47r58M56J37n33P58q10N30J05p24Q76n90K05K14o77R26o95
1812b13P4L98o84Q38p23J93N53r46Q52n22J22M02r38J099o05p3N53q77R54p43
1832b86J20P27j169J045n85R9M44j044J193p26M6N28r25J052p73J60N95j124J146
1851E23q11K60L96r86J221r03K63L78q66J086r22L76L30q83J074r10M55J70p07
1870d56R84q91M46J22n97Q59r06O40j18m44Q48r54P06j81l41O85q37N72j55k94
$$ plain form
1890 -312 377 -326 270 -75 -85 283 -337 179 -30 -39 129 -261 306 -172 2 124 -146 222 -187 100 -1
1911 -1 -139 169 -165 158 -139 -28 193 -235 238 -165 60 75 -194 330 -332 133 104 -246 223 -373 324
1932 324 -119 -318 474 -381 229 -257 22 495 -696 491 -41 -159 305 -478 712 -488 -178 622 -600
1951 -600 472 -516 338 389 -926 844 -299 -81 142 -492 926 -935 115 661 -778 585 -766
1968 -766 709 166 -1118 1214 -572 118 -28 -413 1216 -1405 414 633 -786 626 -956 1130
1984 1130 -166 -1198 1522 -760 272 -310 -178 1412 -1849 766 542 -754 576 -1102 1551 -558
2000 -558 -1204 1743 -940 412 -620 128 1413 -2232 1132 392 -678 456 -1157 1965 -1036 -1013
2016 -1013 1873 -1090 575 -939 561 1283 -2510 1518 161 -496 236 -1131 2322 -1531 -772 1883
$$ packed form
1890c12O89p03N96l45j0L68o20N16k09rJ68l90N67m78J74J22k70L68m09K87j01
1911aj38L08l34L23k97J11K21m28M73m03K25J5k69N24o62M65k9l50M69n96O97
1932C24m43j99P92q55O10m86K79M73j191J187n32j18M64p83J190j200L10Q00j222
1951f00J072r88Q54N1j315J770j143K18K23o34J418j861J050N46j439J363j351
1968g66J475n43j284K332j786O90j46l85J629k621J819K19j419J412j582K086
1984A130j296j032K720k282J032n82J32J590l261K615k24j296J330j678K653k109
2000e58o46K947k683J352j032P48J285l645L364p40j070J134j613L122l001K3
2016a013K886k963J665j514J500P22l793M028j357o57P32j367L453l853P59K655
$$ plain form
2032 1883 -1135 650 -1274 1009 1096 -2702 1811 -26 -289 -25 -1055 2597 -1956 -550 1864 -1140
2048 -1140 688 -1541 1412 865 -2820 2052 -187 -126 -281 -889 2784 -2367 -233 1783 -1124 704
2064 704 -1741 1855 515 -2807 2295 -422 102 -609 -623 2867 -2767 170 1562 -996 655 -1956
2080 -1956 2333 52 -2672 2401 -621 395 -1032 -286 2870 -3107 545 1269 -774 513 -2092
2095 -2092 2754 -384 -2467 2428 -762 607 -1384 73 2755 -3327 901 1005 -581 365 -2085
2110 -2085 3058 -832 -2157 2423 -865 767 -1664 514 2496 -3435 1275 668 -340 145 -1967
2125 -1967 3287 -1364 -1691 2257 -928 911 -2012 1015 2059 -3405 1581 246 35 -224 -1760 3408
2141 3408 -1862 -1150 1914 -819 980 -2268 1514 1550 -3198 1762 -90 381 -547 -1405 3354 -2189
$$ packed form
2032A883l018J785j924K283Q7l798M513j837k63K64j030L652m553J406K414l004
2048a140J828k229K953n47l685M872k239O1j55o08L673n151K134K016k907J828
2064G04k445L596j340l322N102k717N24p11j4L490n634K937J392k558J651k611
2080a956M289k281k724N073l022J016j427P46L156n977L652P24k043J287k605
2095b092M846l138k083M895l190J369j991J457K682o082M228J04j586R46k450
2110b085N143l890j325M580l288J632k431K178J982n931M710o07j008M85k112
2125a967N254m651l27L948l185J839k923L027J044n464M986j335k11k59j536N168
2141C408n270P12L064k733J799l248L782L6m748M960j852M71r28q58M759n543
$$ plain form
2157 -2189 -609 1576 -698 922 -2309 1864 970 -2851 1851 -354 585 -835 -985 3051 -2408 -106
2173 -106 1191 -575 785 -2234 2122 375 -2371 1793 -559 780 -1122 -500 2639 -2437 359
2188 359 714 -262 568 -2042 2277 -177 -1751 1549 -633 938 -1340 -11 2086 -2266 692 276
2204 276 22 295 -1715 2196 -620 -1152 1234 -610 905 -1375 360 1468 -1949 851 -20 167
2220 167 70 -1300 1911 -842 -641 921 -533 775 -1243 574 947 -1533 855 -203 286 -94 -882
2237 -882 1551 -885 -240 584 -375 620 -1057 665 486 -1077 731 -298 369 -245 -528 1116 -803
2254 -803 17 268 -216 429 -805 607 146 -656 522 -302 320 -237 -253 700 -589 124 114 -131 271
2273 271 -500 418 30 -357 350 -216 223 -126 -150 383 -335 102 54 -112 189 -268 186 35 -193 189 -131
$$ packed form
2157b189J580K185k274J620l231M173q94l821M702k205R39j420j50M036n459K302
2173a06J297j766J360l019M356j747k746M164k352J339j902O22L139n076K796
2188C59L55r76Q30k610M319k454j574L300k182J571k278J329K097m352K958m16
2204B76k54K73k010L911k816n32K386j844J515k280J735J108l417K800q71J87
2220A67r7j370L211k753K01J562j454J308k018J817L73k480K388j058M89l80p88
2237h82K433k436O45Q24r59R95j677J722j79j563J808j029O67o14k83J644j919
2254h03Q20K51m84O45j234J412m61q02J178q24O22n57j6R53j289P13j0k45M02
2273B71p71R18l88l87P07n66M39l49k4N33p18M37m8j66L01m57M54j51k28L82l20
$$ plain form
2294 -131 96 -14 -131 199 -142 24 53 -113 146 -117 2 93 -127 111 -81 -9 111 -184 107 -8 -48
2315 -48 107 -150 163 -36 -118 201 -137 92 -54 -58 222 -249 119 32 -106 172 -211 206 -36 -167 259 -211
2337 -211 141 -66 -72 264 -321 187 -4 -118 184 -268 249 -84 -141 264 -267 188 -104 -73 228 -323 239
2358 239 -65 -79 190 -264 277 -126 -61 221 -266 236 -139 -7 187 -280 265 -135 -4 158 -245 259 -171
2379 -171 10 142 -242 249 -181 11 102 -209 237 -183 41 102 -195 209 -154 80 60 -180 225 -148 43
2400 43 44 -114 192 -173 87 46 -125 142 -127 100 -10 -93 171 -125 63 -9 -49 104 -134 89 -1 -63 68
2423 68 -88 81 -56 -37 89 -88 47 -32 17 30 -79 74 -29 0 11 -14 52 -57 34 14 -23 30 -33 60 -31
2448 -31 -2 58 -45 55 -24 25 2 -40 95 -91 25 9 -34 57 -107 97 -20 -80 94 -89 76 -89 -14 147
$$ packed form
2294a31K27j10j17L30l41J66K9j66K59k63J19R1k20K38j92P2J20k95K91j15m0
2315d8J55k57L13j99q2L19l38K29j46mK80m71L68q7j38K78l83M17k42j31M26m70
2337b11L52k07oL36n85N08j91j14L02m52N17l33n7M05n31M55k92L1L01n51N62
2358B39l04j4K69m54N41m03O5K82m87N02l75J32J94m67N45m00J31J62m03N04m30
2379a71J81J32l84M91m30J92R1l11M46m20K24O1k97M04l63K34k0k40M05l73J91
2400D3Jj58L06l65K60m1j71K67k69K27j10q3K64k96J88p2m0J53k38K23r0o2J31
2423F8j56J69j37J9J26j77J35p9M9J3j09J53j03K9J1k5O6j09R1k0l7N3o3R3r1
2448c1K9O0j03J00p9M9k3m2J35j86J16j6m3R1j64K04j17o0J74j83J65j65P5J61
$$ plain form
2472 147 -177 88 -5 0 60 -159 209 -85 -86 142 -113 132 -156 59 180 -263 162 -33 32 21 -208 344 -180
2495 -180 -91 183 -115 183 -285 145 213 -383 231 -79 94 -39 -264 504 -303 -79 195 -136 226 -437 287
2516 287 220 -501 338 -122 181 -126 -290 676 -464 -22 204 -122 274 -592 478 154 -577 430 -174
2535 -174 315 -283 -235 815 -655 82 154 -39 269 -767 729 36 -610 475 -235 448 -532 -119 905
2554 905 -842 182 68 97 187 -904 1006 -137 -598 500 -244 589 -777 78 944 -1022 328 -13
2572 -13 240 70 -948 1253 -368 -509 495 -228 658 -1032 345 874 -1129 474 -143 423 -186 -905
2590 -905 1444 -643 -344 394 -145 654 -1272 682 656 -1154 540 -248 666 -495 -715 1554 -896
2607 -896 -144 230 46 554 -1428 1033 389 -1050 564 -278 827 -798 -440 1533 -1082 63 86
$$ packed form
2472A47l24K65r3NO0k19L68k94jK28k55K45k88K15J21m43M25j95O5j1k29N52n24
2495a80Q9K74k98K98m68M30O8n96O14l10J73j33k25P68q07K24K74l31L62o63P24
2516B87o7p21Q39m60L03l07j64R66j140M42K26l26L96q66J070l24p31J007o04
2535a74M89n98M8J050j470P37P2j93L08j036J496o93o46J085p10O83r80M13J024
2554I05j747J024j14K9R0j091J910j143m61J098p44Q33j366Q55Q66j966J350l41
2572a3K53j70j018K201j621j41J004p23Q86j690J377N29k003J603o17N66o09p19
2590i05K349k087K99P38n39P99j926J954k6j810J694p88R14j161k20K269k450
2607h96P52L74j84N08j982K461o44j439J614q42J105j625L58J973k615J145K3
$$ plain form
2624 86 221 387 -1438 1283 72 -905 550 -309 871 -1046 -115 1364 -1198 250 -67 385 137
2641 137 -1327 1466 -251 -680 446 -215 867 -1259 254 1097 -1165 371 -199 604 -161 -1086 1510
2658 1510 -535 -388 267 -60 765 -1339 601 742 -1023 406 -269 731 -445 -761 1396 -714 -148
2675 -148 91 74 565 -1281 809 374 -833 390 -298 732 -630 -431 1176 -790 50 -13 193 341
2693 341 -1096 913 77 -586 333 -224 680 -726 -107 898 -722 168 -129 319 115 -848 901 -157
2711 -157 -328 184 -137 551 -755 139 566 -583 204 -190 373 -96 -567 746 -297 -138 66 -52 387
2730 387 -650 279 276 -415 199 -162 339 -181 -295 552 -294 3 18 19 232 -458 304 107 -244 150 -130
2751 -130 260 -207 -112 351 -242 61 -38 65 84 -294 234 -21 -111 71 -79 171 -182 12 162 -154 60
$$ packed form
2624H6J35J66j825K721j211r77J455q59J180j917R31J479k562J448l17M52k48
2641A37j464K793j717m29J126o61J082k126J513Q43k262J536n70Q03p65r25K596
2658A510k045J47O55l27Q25k104J940J41j765J429o75J000j176l16K157k110N66
2675a48K39j7M91j846K090m35j207J223o88J030j362J99J607j966Q40o3K06J48
2693C41j437K009q36o63R19n57R04j406O19J005j620Q90k97M48k04r63J749j058
2711a57j71N12l21O88j306Q94M27j149P87l94N63m69m71J313j043J59K04j18M39
2730C87j037R29lo91O14l61N01n20j14Q47q46K97J5JK13o90P62j97l51L94k80
2751a30L90m67R5M63n93L03r9J03J9l78N28k55r0J82j50K50l53J94J50l16K14
$$ plain form
2772 60 -55 64 -15 -114 143 -59 -20 17 -7 66 -89 68 26 -49 36 -24 44 -27 4 40 -31 19 -8 17 -14 -7 38 -35
2800 -35 9 -19 10 -20 -26 46 -47 12 8 0 21 -67 72 -25 -39 51 -46 60 -55 13 75 -93 75 -7 21 21 -74 122 -66
2829 -66 -9 61 -48 75 -94 45 63 -103 100 -53 39 -2 -67 125 -103 15 38 -57 83 -122 74 11 -97
2852 -97 96 -79 46 -28 -54 121 -118 42 7 -45 79 -105 95 -3 -61 101 -89 81 -23 -39 96 -105 74
2875 74 -25 -37 71 -93 80 -22 -21 85 -92 66 -52 -28 63 -96 71 -47 -37 61 -96 77 -54 -15 66 -91
2899 -91 70 -39 -8 48 -79 83 -57 -12 74 -65 92 -32 25 61 -84 80 -34 1 28 -63 79 -61 -14 51
2923 51 -59 54 -54 22 30 -71 74 -48 5 10 -55 70 -63 10 36 -48 52 -54 49 15 -61 77 -41 9 3
2948 3 -17 74 -62 35 26 -22 49 -46 58 0 -38 59 -47 39 -23 -2 41 -77 46 -6 -16 13 -47 55 -45 -13 24 -49
$$ packed form
2772F0j15J19p9r9K57k02L9L7k4P3j55J57m2p5Q5o0O8p1L1L6p1N0k7K5l1PM5p3
2800c5M4k8K9l0oP2r3N9mqK1q8J39r7j4R0r7J06j15O8O2j68J68q2K8%r5J96j88
2829f6N7P0j09J23j69J39J8j66K03j53R2m1o5J92k28J18K3r5J40k05J96o3j08
2852i7J93j75J25p4k6J75k39J60l5n2J24j84K00r8n8J62j90J70j04j6J35k01J79
2875G4r9j2J08j64J73j02JJ06j77J58j18K4R1j59J67j18J0R8j57J73j31L9Q1j57
2899i1J61j09L1N6j27J62j40M5Q6j39J57j24N7L6j45J64j14L5K7r1J42j40M7O5
2923E1j10J13j08P6Qj01J45j22N3No5J25j33P3K6q4J00j06J03l4p6J38j18N0o
2948Ck0R1j36R7rm8P1r5J04n8l8R7j06Q6o2K1M3j18J23n2j0K9o0J02j00L2L7p3
$$ plain form
2976 -49 21 -35 22 9 -44 53 -29 12 3 -12 51 -62 39 2 -18 32 -22 50 -23 11 38 -42 47 -15 32 1 -49 72 -34
3005 -34 -12 4 -12 39 -80 63 19 -42 20 -33 67 -82 -21 88 -82 8 -47 38 11 -123 127 -24 -34 23 -17 108
3031 108 -149 52 102 -116 58 -64 120 -38 -115 198 -90 2 -14 13 115 -234 127 54 -126 40 -77 180
3053 180 -150 -95 223 -151 19 -70 91 70 -305 226 -9 -104 6 -54 239 -273 8 229 -183 54 -103 200
3075 200 -13 -294 337 -71 -47 -17 11 259 -366 120 200 -194 68 -142 287 -131 -250 380 -173 -10 -81 82
3097 82 207 -462 258 115 -194 35 -138 349 -287 -142 385 -228 36 -145 200 128 -479 375 1 -115 -3
3118 -3 -76 402 -423 21 342 -240 78 -191 334 -28 -422 462 -102 -43 -90 2 370 -534 163 236 -234 62
3140 62 -220 405 -198 -324 470 -212 20 -139 115 275 -568 313 112 -184 54 -178 455 -332 -161 437
$$ packed form
2976d9P0n6N7j3n3R7q2M1rj5O3j13J01l7k0N0n4P2p3L4K7q0Q9o2M7l1n0J21j06
3005c4K2J6j6N1j19J43m4o1O2n3J00j49O1J09j70R0n5Q5k7j34K50j51j0N7m0J25
3031A08k57K01N0k18J74j22J84j58p7L13k88R2j6K7J02l49L61p3j80J66j17K57
3053A80l30N5L18l74J70q9J61k1l75N31k35r5J10o0K93n12K81K21m12K37j57L03
3075B00k13k81O31m08K4L0K8K48o25M86Q0l94K62k10M29m18j19O30n53J63p1J63
3097H2J25o69P20j43l09K29j73M87o36J45N27o13K64j81L45p2o07Q54l74j16J12
3118cp3M78q25M44L21n82L18k69N25l62l94Q84n64N9m7R2L68r04O97P3m70K96
3140F2k82O25o03j26P94o82K32j59K54J60q43Q81k01k96K38k32O33p87J71N98
$$ plain form
3160 437 -255 79 -198 240 149 -535 421 -19 -103 -12 -117 460 -456 5 324 -264 96 -247 339 -14 -445
3181 -445 448 -148 -18 -98 -25 370 -542 178 200 -213 101 -232 385 -185 -285 443 -221 64 -138 90 278
3202 278 -516 300 74 -152 85 -198 405 -278 -134 385 -251 121 -178 163 151 -449 353 -57 -85 25 -133
3223 -133 373 -364 0 256 -232 138 -211 231 -3 -333 370 -148 14 -29 -64 301 -380 133 133 -176 131
3244 131 -179 277 -97 -178 329 -187 80 -61 9 185 -325 209 19 -126 101 -158 230 -166 -70 233 -198
3265 -198 79 -112 55 101 -259 221 -62 -60 68 -114 194 -192 5 144 -163 100 -101 91 19 -174 203
3286 203 -91 12 30 -53 155 -170 69 64 -115 98 -90 99 -19 -79 151 -113 37 -4 -27 80 -139 91
3308 91 -5 -80 60 -73 72 -55 -45 105 -107 38 -21 -13 45 -102 80 -19 -36 47 -53 56 -48 1 58 -64
$$ packed form
3160D37o92L34k77M38r1o84R56m40q4R1j05N77r16M61L19n88L60l43N86l53m31
3181d45Q93n96J30q0P3L95r12P20K2m13L14l33O17n70j00P28o64K85k02K28J88
3202B78p94Q16k26k26K37k83O03o83J44N19o36L72k99L41j2o00Q02m10k8J10j58
3223a33N06p37L64K56m88L70l49M42k34l30P03n18J62m3l5L65o81N13%l09L07
3244A31l10M56l74q1N07n16K67j41P0J76n10N34j90j45K27k59L88l96R6L03m31
3265a98K77j91J67M6l60M80k83KJ28j82L08l86J97J39l07K63k01J92p2j93L77
3286B03k94J03J8q3K08l25K39nj79K13j88J89j18o0K30k64J50m1k3J07k19K30
3308I1r6p5J40j33J45j27J0J50k12J45n9QN8j47J82r9j7Q3j00J09j04M9N7j22
$$ plain form
3332 -64 52 -15 3 29 -58 67 -33 -19 28 -32 41 -42 12 18 -56 27 -27 -8 -17 -31 34 -47 -7 12 -29 21 -23 13 11 -33
3362 -33 27 -15 3 6 -13 23 -26 9 22 -18 17 -18 16 8 -23 31 -13 6 14 -21 19 -25 12 4 -19 30 -10 4 -8 -13 24 -23 -2
3395 -2 3 -22 -1 -29 13 -12 -17 29 -29 27 -5 -13 39 -44 21 -9 -16 18 -32 46 -19 -10 43 -26 27 -15 7 24 -52 40 -23 -3 15
3428 15 -28 55 -42 3 30 -33 41 -50 22 9 -57 48 -36 18 -7 -43 55 -51 15 13 -37 57 -68 42 8 -50 66 -54
3456 -54 33 -14 -32 79 -77 38 7 -31 57 -97 65 -4 -62 65 -60 51 -44 -43 85 -71 61 4 -20 46 -117
3481 -117 88 -21 -54 69 -78 84 -64 -27 108 -115 57 -33 0 69 -134 125 -25 -47 63 -85 112 -87
3503 -87 -16 135 -150 59 -56 8 65 -165 152 -57 -56 59 -98 143 -121 -12 129 -159 88 -98 56 54 -225
3526 -225 192 -83 -25 52 -105 192 -184 15 141 -167 120 -124 122 67 -231 262 -95 -4 32 -93 257 -249
$$ packed form
3332f4J16o7J8K6q7J25j00J4M7o0P3q3N4Op4Q3n4J9rj4O5q1M0J9m1N0m4L6km4
3362c3O0m2J8Lj9L6m9L5J3m0L5l5L4ql1N4m4J9Ql5M0m4L7qk3M9m0J4j2nL7m7K1
3395bNk5K1k8M2k5nM6n8N6l2qN2q3O5l0pL4n0P8o5RN3o9N3m2K2J7p6R2o3K0J8
3428A5m3Q3r7M5K7o3P4r1P2j3o6J05q4N4k5l6R8j06O6kn0R4j25J10l4n8J16j20
3456e4Q7m7j8J11j56J15l1l8Q8j54J62o9n8J27j25J11r5JJ28j56J32n7k4O6j63
3481a17K05j09l3J23j47J62j48L7J35k23J72r0L3O9k03K59j50k2J10j48J97j99
3503h7P1J51k85K09j15O4N7k30L17k09JJ15j57K41k64J09J41k88K47j86J54kk79
3526b25M17k75N8P7j57K97l76J99J26l08K87k44K46n5k98M93l57R1L6j25L50n06
$$ plain form
3548 -249 54 171 -187 136 -163 167 18 -290 291 -137 25 11 -97 298 -351 118 150 -183 125 -215 255
3569 255 -64 -264 382 -143 85 -54 -66 363 -458 241 93 -185 149 -218 399 -191 -257 402 -282 128 -125
3590 -125 -51 318 -528 242 66 -146 72 -314 462 -257 -184 438 -293 149 -227 136 295 -592 417 -20
3610 -20 -72 73 -292 578 -426 -129 450 -327 204 -314 274 218 -636 523 -84 -46 21 -222 645 -535 23
3631 23 416 -343 285 -389 397 18 -679 568 -182 1 -68 -94 604 -660 165 291 -282 196 -434 550
3651 550 -88 -563 618 -278 109 -219 -25 585 -765 303 199 -219 186 -428 662 -234 -499 549
3669 549 -331 247 -282 128 529 -792 428 80 -148 108 -420 700 -439 -274 560 -357 224 -387 248
3688 248 345 -775 510 -53 -74 3 -331 707 -540 -106 464 -327 239 -422 379 171 -660 563 -147
$$ packed form
3548b49L03J17l58L23k99L30j49l08N81m28J62j4j08L95o49M69L2l33L08l40M70
3569B55l19k00O46n25K28j39j2M29q21O99j48k78L34l67O17n90o6O59o84M10k53
3590a25P4L69q46P70j76k12K18l86P76p19P3O22p31M42l76L63J59q87J009m37
3610b0n2J45l65Q70j004K97N79p77N31n18N88n6q54J159o07L8O7k43Q67j180N58
3631B3L93p59O28o74P86l79o97J247p50J83o9k6O98j264Q25J26n73M78o30R84
3651E50o38m75J181q96L87l28J94O10j350J068j04m18M05o14J090q96k65J048
3669E49q80N78n29M10M01j321J220l48k28K56n28J120j139J65Q34r17N81o11O35
3688B48R7j120J285n63k1P7l34J038j247M34N70p91N66o61Q01k08q31J223p10
$$ plain form
3707 -147 46 -67 -210 644 -611 71 318 -279 231 -422 467 10 -543 551 -219 96 -141 -107 554 -644
3727 -644 201 196 -211 190 -408 507 -130 -410 506 -258 115 -232 -80 432 -601 296 80 -134 123 -345
3747 -345 494 -228 -236 405 -250 179 -226 99 289 -500 321 -15 -60 74 -254 430 -282 -93 290 -229 172
3768 172 -228 142 150 -411 307 -92 -12 22 -185 355 -292 1 199 -180 145 -213 165 64 -286 280 -118
3789 -118 34 -11 -98 251 -270 50 136 -133 135 -166 168 4 -184 219 -122 54 -24 -57 179 -203 77 46
3811 46 -102 90 -145 125 -34 -121 145 -119 50 -28 -39 118 -151 78 13 -70 68 -103 102 -25 -65 111
3833 111 -83 51 -4 -18 75 -150 106 -4 -42 72 -71 65 -24 -37 79 -80 42 -1 -27 62 -77 48 -11
3856 -11 -52 47 -64 34 -25 -35 53 -69 42 4 -25 46 -56 38 -10 -28 53 -45 47 -6 -24 59 -46 39 0 -23 49 -49
$$ packed form
3707a47J93j13j43Q54j255O82K47n97N10o53Q89m57n53J094p70L15k37L4O61j198
3727f44Q45nm07M01n98R15o37k80R16p64L73l47J52N12j033Q97k16k14K57m68
3747c45Q39p22qO41o55M29m05L25J90p89Q21l36m5J34l28O84p12J89L83n19M01
3768A72m00L70Qn61P18l99Q0L4k07N40o47K93J98l79L25l58L78j01l50N66l98
3789a18J52m5q7L49n21L20Q6k69K68l01L34j64j88M03l41J76p8l3K36l82K80l1
3811D6j48J92k35K70j59q7K66k64J69p8j1J57k69K29o5q3J38j71K05j27m0J76
3833A11j94J34n5j4R3k25K56j10l8J14j43J36q9j3J16j59J22m3k6Q9j39J25n9
3856a1m1R9j11R8n9j0Q8j22J11l8k9P1j02R4m8j8Q1r8R2n3j8Q3j05Q5l9k3P2r8
$$ plain form
3884 -49 40 -20 -25 56 -54 36 -8 -16 36 -40 41 -7 -29 31 -54 29 -28 -4 35 -61 34 -28 -11 26 -41 35 -22 -1 28 -28 40
3915 40 -29 15 31 -30 38 -13 27 19 -25 46 -27 6 13 -30 37 -39 15 -1 -31 30 -35 12 -6 -23 34 -47 21 -9 -21 17 -49
3946 -49 48 -23 -22 38 -23 39 -34 7 38 -58 44 -15 21 14 -35 75 -39 11 18 -24 56 -54 24 28 -55 54 -51 40 -17
3975 -17 -62 79 -72 20 -3 -29 61 -92 47 2 -56 50 -67 73 -26 -55 90 -78 48 -29 -4 85 -129 88
3999 88 -4 -43 57 -79 112 -74 -48 120 -93 66 -52 17 93 -160 129 -39 -37 51 -127 157 -122 -48 126
4022 126 -133 94 -110 41 74 -222 164 -65 -13 24 -130 220 -172 -13 137 -139 118 -163 120 72 -246
4043 -246 209 -88 28 -1 -121 285 -253 31 152 -139 148 -221 206 38 -282 271 -134 69 -73 -116 344
4064 344 -346 79 113 -136 146 -296 301 -34 -298 320 -184 131 -149 -61 384 -438 172 92 -103 151 -335
$$ packed form
3884d9Q9o0nQ1j10R0m4qN2p6Q1m8k2O0q5Q3n7K4L9r6R5o2J7L7o7P6n7K1K9n6O8
3915D0o9M4J6o1O8n1M0qm4P1p3L3Pm3O7p6N4j6l0O1o5M7j8j7N7q1O8l0j2L8o6
3946d9R7p1JO0o1O2p3M1L1r6J02n9L6pm9J10j14N0Pm2Q0j10P8Mq3J09j05R1n7
3975a7m5J41j51R2k3k6R0j53J39m5n8J06j17J40r9k9J45j68J26p7K5Q9k14K17
3999H8r2l9J00j36J91j86K6J68k13J59j18O9P6k53K89j68KQ8j78K84k79P4J74
4022A26k59K27k04J51L3k96L86k29N2L7j54L50l92J59J50k76K57k81K83m8l18
4043b46M55k97J16k9j20M06n38K84J21k91K87l69M27j68l20N53m05K03j42m3M60
4064C44o90M25L4k49K82m42N97l35k64O18n04L15k80Q8M45q22O10q0j95K54m86
$$ plain form
4085 -335 424 -115 -265 356 -189 202 -252 45 382 -525 239 35 -43 84 -359 538 -250 -223 358 -224 232
4106 232 -372 147 330 -581 329 -51 35 -8 -345 621 -379 -130 322 -219 263 -448 303 257 -587 420
4126 420 -125 123 -86 -298 693 -508 -10 281 -191 269 -540 460 142 -572 476 -184 203 -227 -198
4145 -198 686 -631 100 184 -117 215 -570 603 -38 -508 480 -217 280 -348 -42 633 -687 229 85
4164 85 -28 134 -545 707 -187 -377 436 -232 326 -448 110 538 -695 331 -9 55 53 -490 756 -332
4184 -332 -244 371 -231 320 -536 245 386 -682 386 -105 129 -74 -392 740 -464 -107 290 -182 292
4203 292 -555 375 228 -579 416 -143 209 -165 -248 688 -507 52 200 -106 235 -510 474 62 -452 383
4223 383 -170 250 -257 -120 551 -518 134 76 -50 160 -471 486 -67 -331 340 -196 257 -302 -8 451
$$ packed form
4085c35P59n39j50O21n45L91m54K97L37r07P64k04p8J27m43Q97p88K7N81n82M56
4106B32o04N19J83r11R10l80Q6m3l37R66j000K49M52n41M82p11P51m6q44J007
4126D20n45K48k09k12R91j201M98K91m72M60q09J000l18p14J048o60L87m30K9
4145a98Q84j317P31Q4l01L32p85J173o41m70R88o97M97o28L06O75j320R16j44
4164H5j13J62o79J252q94j90Q13o68N58p74N58M28j233J026l40O4kn43J246j088
4184c32Q8O15o02N51q56P81J41j068J068m91K34k03l18J132j204L57L97m72M74
4203B92q47R30j47q07R95n59L52l74q3R36j195N59J48l06L41p45R84m12n14Q35
4223C83n53M20n07J37O71j069O52n8j26K10o31R57n53k64O71n36M53n59K94M59
$$ plain form
4243 451 -492 196 -2 6 94 -393 491 -166 -205 278 -172 244 -308 98 313 -427 239 -40 60 41 -287 439
4265 439 -203 -79 180 -137 210 -286 142 184 -330 206 -95 77 -31 -194 340 -219 -20 114 -96 161
4285 161 -236 149 92 -249 191 -105 92 2 -161 277 -199 19 80 -70 119 -189 152 39 -163 156 -89
4306 -89 79 -38 -69 202 -167 51 31 -57 81 -153 116 -8 -118 123 -86 57 -80 -44 119 -121 42 20
4328 20 15 44 -91 71 -3 -71 96 -71 60 -30 -27 81 -74 45 8 -32 66 -70 61 -14 -41 64 -65 37 -1
4353 -1 -32 66 -71 39 1 -34 49 -59 40 -6 -39 45 -56 26 0 -35 45 -58 38 7 -15 52 -45 33 7 -19 56 -44
4381 -44 39 3 -27 57 -43 31 6 -28 51 -48 29 -3 -21 36 -48 29 8 -34 46 -49 31 -8 -34 26 -52 21 -8 -20 32 -42
4411 -42 21 3 -26 39 -53 21 -10 -15 43 -40 30 -5 -14 30 -22 41 -12 -7 37 -33 26 -24 -6 22 -42 28 -11 -3 18 -28 17 -26
$$ packed form
4243D51r43O88j98QQ8m87Q84o57l9M83m50M16n52M06K15p40O66k79J00j9l28P26
4265D39o42J24K59l17L47m96M28M2n14N36l01J72j08j63N34n59J99J34k10K57
4285A61l97L85n7l41M40k96J97r0j63M38m76K18O1j50J89l08L41j13k02L19k45
4306h9J68j17l1K71l69K18k0q8J38k34K69j24j10K41k09J43j37L6J63k40J63k2
4328B0nK9j35J62p4o8J67j67J31r0LJ08j55J19l7m0R8j36J31p5k7J05j29J02l8
4353al1R8j37J10l8l5Q3j08R9m6l3Q4j01Q2k6l5Q0j03R6l1k2O7r7P8k6k6P5j00
4381d4Q3l6l0Q4j00P4k5l4P9r9P7l2j8N7q4P7k1m2Q0r5Q0l9k6O0p8P3k9j2N2p4
4411d2O3j8k9O5r2P4l1nN8q3P0l5rM4n2O3n3NM4p0N9n0J8K8o4P0l9QK1m6M5m3
$$ plain form
4443 -26 -10 18 -33 32 -36 -9 7 -40 26 -26 -2 -1 -23 36 -24 18 9 -11 33 -37 27 -2 -23 28 -22 44 -12 0 43 -32 33
4474 33 -15 4 30 -61 46 -23 -12 15 -45 45 -40 1 28 -57 38 -50 22 6 -70 62 -45 20 -6 -33 77 -66 30 22
4502 22 -34 63 -65 77 -5 -56 89 -61 55 -32 -11 88 -109 73 9 -12 44 -85 112 -62 -69 88 -78 73
4526 73 -77 0 111 -161 97 -38 -17 33 -133 167 -105 -48 106 -98 114 -139 67 110 -173 147 -66 61
4548 61 13 -141 257 -154 -9 89 -86 154 -196 133 87 -209 170 -104 121 -56 -122 291 -242 42 45 -48 147
4571 147 -284 224 30 -209 191 -142 161 -155 -86 319 -294 94 13 -11 133 -321 322 -41 -180 193 -143
4592 -143 226 -240 -21 332 -342 160 -58 65 69 -352 414 -137 -136 161 -142 262 -352 88 267 -389 191
4613 191 -104 142 -22 -319 462 -235 -83 108 -99 262 -419 216 195 -363 214 -135 220 -106 -249 499
$$ packed form
4443b6J6K8n1O5o8K7J6m7O6n2K4Jk2N9o0M2rk0M4p0O4k9k1N1n0O6n6J2M3p5O5
4474C3m8J9K6r1J07o9J1K7o0R0q5M1K7q5R5q8P2j6p6J32j07O5k6k7J10j43R6q
4502B2n6R7j28J42q2n1J45j50J16q7K1R9j97J82o4k1N6j29J97j74pJ57j66J51
4526G3j50P7J11k72K58j35K1N0j66L00k72N7J54k04K12k53K06M3k83L20k13J27
4548F1m8j54L98m11J45R8j75K40l50L29m6k96L79k74K25j77o6M13n33K84Lr3J95
4571A47m31N08j94k39M00l33L03l16O9M05o13L88q1k4J44m54O43l63j39L73l36
4592a43L69m66K19L53o74N02k18J23Mm21P66n51JK97l03M04o14M40J79o56N80
4613A91k95K46j64k97P81o97J52J91k07L61o81O35k1n58N77l49L55l26j43P48
$$ plain form
4633 499 -304 13 63 -43 238 -455 316 118 -318 222 -153 283 -213 -176 476 -379 67 -20 24 178 -477
4654 -477 400 7 -263 193 -164 311 -315 -63 430 -389 122 -69 89 93 -428 449 -83 -183 157 -129 314
4675 314 -356 59 347 -364 142 -92 171 9 -360 458 -148 -104 98 -81 278 -393 132 248 -321 142
4695 142 -131 193 -78 -293 422 -218 -50 46 -49 233 -392 202 146 -275 155 -121 230 -127 -204 386 -232
4716 -232 21 16 11 175 -349 249 79 -206 131 -117 214 -160 -116 314 -215 40 -21 22 119 -299 221 22 -149
4739 -149 99 -99 189 -177 -55 225 -190 56 -39 59 67 -241 197 -23 -106 77 -71 157 -165 -9 185 -158
4761 -158 74 -46 63 51 -191 203 -50 -69 58 -61 143 -136 12 144 -139 62 -43 39 8 -147 144
4782 144 -54 -52 33 -65 104 -117 13 81 -100 53 -49 40 11 -124 122 -45 -11 36 -51 86 -91 23 80 -78
$$ packed form
4633D99q03L17N0j06K81o93P71j98m36N40l75M36m96L7O52q55M46q7M4J54o55
4654d77Q77l93k70M56l57M75o26K52M93q19N11j91J58Mn21Q77n32j00L40k86M43
4675C14o70M15K88p11N06k34K63j62l69Q18o06M4K02j79L59o71N25J16n69M63
4695A42k73L24k71k15P15o40J68R6r5K82o25N94n6m21M30k76L51l57p7N90o18
4716b32K53nnJ64n24N98j70k85L37k48L31l74M4M30n29K55o1M3R7m18N20j99j71
4739a49K48j98K88l66J22K80m15K46r5R8Ql08M38k20q3J83j48K28l22J56J94l43
4761a58K32j20J09j2k42L94k53j9J27j19K04k79J48J32k83K01j05Q2l1j55K91
4782A44j98KQ5r8J69k21J30O8j81J53j02Q9k9j35K46j67L4M7q7J37j77J14N7j58
$$ plain form
4806 -78 70 -40 37 10 -89 107 -38 -7 23 -43 83 -82 14 56 -76 57 -52 26 14 -80 82 -49 -12 23 -58
4831 -58 78 -60 5 39 -65 51 -50 19 22 -62 83 -36 12 25 -34 69 -50 23 34 -46 55 -37 21 13 -63 69
4857 69 -46 2 12 -44 56 -55 7 32 -55 43 -42 15 7 -61 54 -41 4 6 -47 57 -43 9 19 -47 55 -34 16 14
4885 14 -34 52 -31 27 7 -29 58 -39 19 8 -43 46 -42 16 9 -32 49 -37 13 8 -36 37 -38 13 1 -41 26 -44 7 -2 -27 33
4917 33 -39 25 -1 -30 27 -34 19 6 -26 33 -46 22 0 -13 43 -30 37 -4 -7 35 -38 31 -1 -28 32 -42 17 -15 -24 28 -41
4948 -41 34 -21 -16 38 -38 15 -18 -11 31 -35 35 -17 -5 28 -37 42 -30 3 35 -38 38 -20 22 5 -30 56 -24 20 12 -19 49 -43
4980 -43 29 1 -23 40 -38 48 -11 -29 36 -38 34 -20 -12 33 -69 36 -20 0 12 -55 63 -40 -6 35 -46 52 -43 33 31
5009 31 -70 62 -40 25 1 -45 96 -66 28 25 -21 65 -80 67 12 -54 59 -59 61 -47 -38 91 -93 34
$$ packed form
4806g8J48j10P7k7r9J96j45L1L0o6J26j65R6M2j32J33j09P8j2r4J62j31L7L5q1
4831e8J36j38O5L4j04J16j01O9Lq4J45j19M8J3n9J03j19P3J1q0J01r2N8qp6J32
4857F9j15M8J0n6J00j11O2K5q7R8q5N7qo8J15r5M5Kn3J04j00N2J0o6J02q9N0k
4885A4m8Q6q3N8k0l6Q7r7N8j1n1Q9q8N8pm1Q1q6N0nm4P3p5N1j2m2O7p0N1rk5O0
4917C3p2O4k6k9N7o1N3j3l2N9p9O8k2j3N6p3O7m1lM2p3O9l2k7O0p4N9l2rN2o9
4948d1P5n5NN4p6N3l3PM2o6P0n2J2L3o5P9p2L3L2p3P6n8M2j7l5Q6q0M4ql1O8r2
4980d3P2k8k4O3p8Q6n9j8O5p4P2n4QM5j02J05n6K0J2o7J18j03L4M1q1R8r5P6k
5009C1j01J32j02O5k4m6J41j62R4lm6Q6j45J47n5o6J13j18J20j08RJ29j84J27
$$ plain form
5033 34 -16 -10 50 -110 101 -32 -45 59 -82 97 -95 -10 91 -122 80 -52 42 44 -128 147 -67 -15 43 -75
5057 -75 125 -137 54 83 -122 102 -88 99 4 -138 182 -119 8 9 -51 140 -189 111 65 -118 98 -107
5079 -107 140 -66 -111 208 -146 39 -33 4 133 -233 160 15 -100 95 -111 186 -126 -60 213 -169 71
5100 71 -69 62 108 -250 224 -45 -72 61 -98 229 -215 -13 186 -189 93 -116 107 43 -265 247 -85
5121 -85 -41 20 -75 226 -255 47 159 -171 101 -145 174 -18 -225 283 -116 3 -14 -34 224 -289 113 117 -135
5144 -135 94 -140 219 -83 -176 266 -141 22 -60 10 179 -305 157 52 -126 62 -150 233 -145 -130 255
5165 255 -160 59 -95 67 135 -310 205 13 -71 56 -122 266 -184 -49 227 -149 93 -115 121 107 -271
5186 -271 220 -21 -42 14 -85 242 -204 -8 180 -132 66 -125 129 29 -241 197 -66 -20 -19 -60 206 -226
$$ packed form
5033C4n0OO0j60K11j33j3J04j41J79j92Q5J01k13K02j32R4Kj72K75k14N2N8j18
5057g5K00k62J91K9k05K24j90J87r5j42L20l01J27Jo0J91l29L00m6j83K16k05
5079a07K47k06m5L19l54J85p2L7J29l66L93j45j15J95k06K97l12O6K73l82K40
5100G1j40J31M6l58M74k69k7J33j59L27m44K02J99l75K82k09K23o4l08N12l32
5121h5M4O1r5L01m81L02J12l30K72k46L19j92k07N08l99J19j7k0K58n13M02Mk52
5144a35K29k34L59l02r3M42m07J63q2P0J69m84M62j05j78J88k12L83l78J5L85
5165B55m15K19j54J62O8m45N15j92q4J27j78L88m50J35K76l76K42k08K36j4l78
5186b71M91k41k1N6r9L27m46J96J88l12J98j91K54j00k70M38k63M6Jm1K66m32
$$ plain form
5208 -226 22 124 -122 56 -131 149 -5 -189 204 -72 2 -33 -29 190 -216 79 96 -88 68 -114 162 -40
5230 -40 -145 183 -87 18 -48 -2 148 -201 88 51 -69 44 -116 157 -61 -112 147 -78 26 -67 5 110
5252 110 -184 86 28 -44 44 -96 140 -68 -70 132 -67 52 -37 27 85 -145 90 10 -25 29 -79 130 -67 -40
5276 -40 100 -76 43 -56 19 59 -137 69 -23 -28 15 -82 101 -87 -40 85 -60 52 -65 30 49 -114 78 -11
5300 -11 -7 5 -51 103 -71 -11 65 -46 49 -58 42 37 -86 78 -23 3 17 -37 95 -50 -1 55 -46 41 -57 36
5326 36 23 -81 56 -36 5 1 -60 75 -63 4 34 -29 44 -43 33 16 -51 62 -34 4 9 -22 64 -58 21 31 -35 36
5354 36 -40 39 9 -57 53 -33 18 0 -37 52 -41 12 9 -28 25 -46 23 -7 -35 37 -36 2 -12 -27 42 -44 17 7 -30 33
5384 33 -26 24 -8 -18 51 -29 14 8 -9 32 -23 24 7 -23 27 -24 27 -2 -12 32 -25 11 -7 -20 26 -30 14 -2 -26 37 -26
$$ packed form
5208b26K48J02k46J78j87K80j54j84L93k76P4l5MK19m06K95J7j84J56j82K76k02
5230d0j05L28k70J05o6M6J50l49K89l7j20J13j60K73k18n1K59k25J04r3P2J05
5252A10k94K70n8p2Q8j40K36k08kK02j99J19q9O4N8k30K35q0l5N4j08K09j97K7
5276d0J40j76J19r9P5M0j96K06r2nM3r7J83j88M7J25j45J12j17R5J9j63J92q9
5300a1MJ2n6J54j74O0P6j11R5j07J00nj23J64j01K6J4n4J32j45M9N6j01Q7r8R3
5326C6j3j04J37r2M1mo1J35j38O7L0o3P3q7P6j7o7J13r6L8Nl1Q6j22P9J0o6P1
5354C6p6P9l0o6J10q6N1j8l7Q9r3N3ll7N3p1O9l0k8P2p3L8j4j5O9q6O1j0l7O3
5384C3n9N0l2j0O9q0M3oj7M1n5M7j7l0N0n1N1k9j0M4n7L6j8j3M6n6M4j6k4O3o3
$$ plain form
5415 -26 14 -15 -19 26 -27 6 -1 -15 27 -24 22 10 -10 28 -28 6 21 29 70 -63 -5 -3 -45 62 -38 45 20 -19 16 -35 11
5446 11 8 -23 31 -31 27 -20 -14 9 -23 35 0 -7 19 -20 16 -14 -1 15 -5 9 13 4 60 61 71 -6 -20 52 -16 7 -29 12 11 -14
5480 -14 45 -20 7 12 -22 27 -21 17 -5 -14 34 -34 5 -43 -10 44 -9 25 -34 34 57 -4 46 -26 -5 8 -54 26 -49 43 53
$$ packed form
5415b6M0k9mM5n3L3pj4M2n1M6j2k0L8n6L4J5QM1j33N8Km2J07j00Q3k5l9L5n1M6
5446A1ll1N4o2N8m7OK3l2N8l5pK6l9L6l0J3J6k0J4MrN6JJ0p7j4P2o8K3l6M1jk5
5480a4N9o5K7Nl4M9m8L8k2rM8o8L9m8L3N4n3L4n9O8K3o1N0p2K1J3o2Q0p5R2J0
$$ [...]
8191f
##END NTUPLES=NMR FID
##END=
