##TITLE=1H_Pr EtOH-1
 200.13MHz,.
 8 sc
 
 19.1.2026
##JCAMPDX= 6.0         $$ Bruker NMR JCAMP-DX V2.0
##DATA TYPE= NMR FID
##DATA CLASS= NTUPLES
##ORIGIN= UXNMR, Bruker Analytische Messtechnik GmbH
##OWNER= pz
$$ XWIN-NMR		Version 3.5
$$ Wed Jan 21 15:28:53 2026 Russian Standard Time (UT+4h)  she@DPX200
##.OBSERVE FREQUENCY= 200.1313
##.OBSERVE NUCLEUS= ^1H
##.DELAY= (6, 6)
##.ACQUISITION MODE= SIMULTANEOUS
##.ACQUISITION SCHEME= undefined
##.AVERAGES= 8
##.DIGITISER RES= 18
##SPECTROMETER/DATA SYSTEM= spect
##.PULSE SEQUENCE= zg30
##.SOLVENT NAME= CDCl3
##.SHIFT REFERENCE= (INTERNAL, CDCl3, 0, 14.3821)
##AUDIT TRAIL= $$ (NUMBER, WHEN, WHO, WHERE, WHAT)
$$ ##TITLE= Audit trail, XWIN-NMR		Version 3.5
$$ ##JCAMPDX= 5.01
$$ ##ORIGIN= Bruker BioSpin GmbH
$$ ##OWNER= she
$$ F:/spectra/data/she/nmr/H-C/1/audita.txt
$$ ##AUDIT TRAIL=  $$ (NUMBER, WHEN, WHO, WHERE, WHAT)
(   1,<2026-01-21 15:27:33.59 +0400>,<she>,<DPX200>,
      <created by zg, POWCHK disabled, PULCHK disabled
       configuration hash MD5:
       00 E9 B6 7A A2 85 ED C7 34 08 36 98 17 FE 4E 26
       data hash MD5: 16K
       3B 0C 0C 58 2B 38 2C FF E8 09 C3 12 D9 F3 9C C0>)
$$ ##END=
$$ 
$$ hash MD5
$$ 41 69 52 E8 D8 A1 20 3D D4 E3 38 EC 05 AD 95 37
##$RELAX= 
##$RELAX= 
##$RELAX= 
##$RELAX= 
##$RELAX= 
##$RELAX= 
$$ Bruker specific parameters
$$ --------------------------
##$DU= <F:/spectra>
##$EXPNO= 1
##$NAME= <H-C>
##$PROCNO= 1
##$TYPE= <nmr>
##$USER= <she>
##$AMP= (0..31)
100 100 100 100 100 100 100 100 100 100 100 100 100 100 100 100 100 100 
100 100 100 100 100 100 100 100 100 100 100 100 100 100 
##$AQSEQ= 0
##$AQ_mod= 1
##$AUNM= <au_zg>
##$AUTOPOS= <>
##$BF1= 200.13
##$BF2= 200.13
##$BF3= 200.13
##$BF4= 200.13
##$BF5= 200.13
##$BF6= 200.13
##$BF7= 200.13
##$BF8= 200.13
##$BYTORDA= 1
##$CFDGTYP= 0
##$CFRGTYP= 5
##$CHEMSTR= <none>
##$CNST= (0..31)
1 1 145 1 1 1 1 1 1 1 1 1 1 1 1 1 1 1 1 1 1 1 1 1 1 1 1 1 1 1 1 1 
##$CPDPRG= <>
##$CPDPRG1= <>
##$CPDPRG2= <>
##$CPDPRG3= <>
##$CPDPRG4= <mlev>
##$CPDPRG5= <mlev>
##$CPDPRG6= <mlev>
##$CPDPRG7= <mlev>
##$CPDPRG8= <mlev>
##$CPDPRGB= <>
##$CPDPRGT= <>
##$D= (0..31)
0 0.7 0 0 0 0 0 0 0 0 0 0.03 0 0 0 0 0 0 0 0 0 0 0 0 0 0 0 0 0 0 0 0 
##$DATE= 1768994853
##$DBL= (0..7)
120 120 120 120 120 120 120 120 
##$DBP= (0..7)
150 150 150 150 150 150 150 150 
##$DBP07= 0
##$DBPNAM0= <>
##$DBPNAM1= <>
##$DBPNAM2= <>
##$DBPNAM3= <>
##$DBPNAM4= <>
##$DBPNAM5= <>
##$DBPNAM6= <>
##$DBPNAM7= <>
##$DBPOAL= (0..7)
0.5 0.5 0.5 0.5 0.5 0.5 0.5 0.5 
##$DBPOFFS= (0..7)
0 0 0 0 0 0 0 0 
##$DE= 6
##$DECBNUC= <off>
##$DECIM= 32
##$DECNUC= <off>
##$DECSTAT= 4
##$DIGMOD= 1
##$DIGTYP= 9
##$DL= (0..7)
0 120 120 120 120 120 120 120 
##$DP= (0..7)
150 150 150 150 150 150 150 150 
##$DP07= 0
##$DPNAME0= <>
##$DPNAME1= <>
##$DPNAME2= <>
##$DPNAME3= <>
##$DPNAME4= <>
##$DPNAME5= <>
##$DPNAME6= <>
##$DPNAME7= <>
##$DPOAL= (0..7)
0.5 0.5 0.5 0.5 0.5 0.5 0.5 0.5 
##$DPOFFS= (0..7)
0 0 0 0 0 0 0 0 
##$DQDMODE= 0
##$DR= 18
##$DS= 0
##$DSLIST= <SSSSSSSSSSSSSSS>
##$DSPFIRM= 0
$$ [...]
##$SUBNAM0= <"">
##$SUBNAM1= <"">
##$SUBNAM2= <"">
##$SUBNAM3= <"">
##$SUBNAM4= <"">
##$SUBNAM5= <"">
##$SUBNAM6= <"">
##$SUBNAM7= <"">
##$SUBNAM8= <"">
##$SUBNAM9= <"">
##$SW= 18.0517328524113
##$SWIBOX= (0..15)
0 0 2 0 0 0 0 0 0 0 0 0 0 0 0 0 
##$SW_h= 3612.71676300578
##$TD= 16384
##$TD0= 1
##$TE= 0
##$TE2= 300
##$TE3= 300
##$TEG= 300
##$TL= (0..7)
0 120 120 120 120 120 120 120 
##$TP= (0..7)
150 150 150 150 150 150 150 150 
##$TP07= 0
##$TPNAME0= <>
##$TPNAME1= <>
##$TPNAME2= <>
##$TPNAME3= <>
##$TPNAME4= <>
##$TPNAME5= <>
##$TPNAME6= <>
##$TPNAME7= <>
##$TPOAL= (0..7)
0.5 0.5 0.5 0.5 0.5 0.5 0.5 0.5 
##$TPOFFS= (0..7)
0 0 0 0 0 0 0 0 
##$TUNHIN= 0
##$TUNHOUT= 0
##$TUNXOUT= 0
##$USERA1= <user>
##$USERA2= <user>
##$USERA3= <user>
##$USERA4= <user>
##$USERA5= <user>
##$V9= 5
##$VALIST= <valist>
##$VCLIST= <CCCCCCCCCCCCCCC>
##$VD= 0
##$VDLIST= <DDDDDDDDDDDDDDD>
##$VPLIST= <PPPPPPPPPPPPPPP>
##$VTLIST= <TTTTTTTTTTTTTTT>
##$WBST= 1024
##$WBSW= 4
##$XGAIN= (0..3)
0 0 0 0 
##$XL= 0
##$YL= 0
##$YMAX_a= 324686
##$YMIN_a= -328673
##$ZGOPTNS= <>
##$ZL1= 120
##$ZL2= 120
##$ZL3= 120
##$ZL4= 120
##$ABSF1= 10
##$ABSF2= 0
##$ABSG= 5
##$ABSL= 3
##$ALPHA= 0
##$AQORDER= 0
##$ASSFAC= 0
##$ASSFACI= 0
##$ASSFACX= 0
##$ASSWID= 0
##$AUNMP= <proc_1d>
##$AZFE= 0.1
##$AZFW= 0.1
##$BCFW= 1
##$BC_mod= 2
##$BYTORDP= 1
##$COROFFS= 0
##$CY= -3
##$DATMOD= 1
##$DC= 2
##$DFILT= <>
##$DTYPP= 0
##$F1P= 0
##$F2P= 0
##$FCOR= 0.5
##$FTSIZE= 0
##$FT_mod= 4
##$GAMMA= 1
##$GB= 0.15
##$INTBC= 1
##$INTSCL= 1
##$ISEN= 128
##$LB= 0.25
##$LEV0= 0
##$LPBIN= 0
##$MAXI= 10000
##$MC2= 0
##$MEAN= 0
##$ME_mod= 0
##$MI= 1.114404
##$NCOEF= 0
##$NC_proc= 0
##$NLEV= 6
##$NOISF1= 3.799351
##$NOISF2= 2.8
##$NSP= 1
##$NTH_PI= 0
##$NZP= 0
##$OFFSET= 14.38212
##$PC= 1
##$PHC0= -3780.103
##$PHC1= 7.192311
##$PH_mod= 1
##$PKNL= yes
##$PPARMOD= 0
##$PSCAL= 0
##$PSIGN= 0
##$REVERSE= no
##$SF= 200.129724274929
##$SI= 16384
##$SIGF1= 3
##$SIGF2= 2
##$SINO= 400
##$SIOLD= 16384
##$SREGLST= <1H.CDCl3>
##$SSB= 0
##$STSI= 0
##$STSR= 0
##$SW_p= 3205.1282051282
##$SYMM= 0
##$S_DEV= 0
##$TDeff= 0
##$TDoff= 0
##$TI= <>
##$TILT= no
##$TM1= 0
##$TM2= 0
##$TOPLEV= 0
##$USERP1= <user>
##$USERP2= <user>
##$USERP3= <user>
##$USERP4= <user>
##$USERP5= <user>
##$WDW= 1
##$XDIM= 8192
##$YMAX_p= 0
##$YMIN_p= 0
$$ End of Bruker specific parameters
$$ ---------------------------------
##NTUPLES= NMR FID
##VAR_NAME=  TIME,          FID/REAL,        FID/IMAG
##SYMBOL=    X,             R,               I
##VAR_TYPE=  INDEPENDENT,   DEPENDENT,       DEPENDENT
##VAR_FORM=  AFFN,          ASDF,            ASDF
##VAR_DIM=   8192,          8192,            8192
##UNITS=     SECONDS,       ARBITRARY UNITS, ARBITRARY UNITS
##FACTOR=    0.0002768,     1,               1
##FIRST=     0,             0,               0
##LAST=      2.2672688,     0,               0
##MIN=       0,             -328673,         0
##MAX=       2.2672688,     324686,          0
$$ Real data points
##PAGE= N=1
##DATA TABLE= (X++(R..R)), XYDATA
$$ [...]
1689b552L574l554K173N367q800N254j983r48L385m475O796n235k163N411m032
1704a782M471l707M05K973o560O023r98p69J193m788N855l002j86L689m652K822
1720I87k998J823L166n175L634k303k1K005k763M497l626p44K536k488L442k587
1736f15N07J266l713L741j099L03N40l059L297j834M99J758k663J829k005R79
1752b69J805k508K010j673K8J256j570K441j715n47J159j461K120j085j73Q10
1768F28j978J816m03K6P24j906J393n26RJ176j504R25p94j46J392j143Q34o75
1786a52m64J072r46J075l07p89P78r27J058m1o94Q39j120O26J93m19R60j244L92
1805a10K41n58J096r21L44M7q78J307p08K92R7r32J156q21M21M50j062R41q67
$$ plain form
1689 -2552 1022 -2532 -359 5008 -3792 1462 -521 -1469 1916 -2559 4237 -998 -3161 2250 -1782
1704 -1782 2689 -1018 -613 2360 -4200 1823 825 56 1249 -3539 2316 -686 -872 2817 -1835 987
1720 987 -2011 -188 2978 -2197 1437 -866 -887 1118 -1645 2852 -774 -1518 1018 -1470 1972 -615
1736 -615 -108 1158 -2555 1186 87 390 930 -2129 1168 -666 -167 1591 -1072 757 -1248 -269
1752 -269 1536 -972 1038 -635 -607 649 -921 1520 -195 -742 417 -1044 1076 -9 -182 628
1768 628 -1350 466 63 89 813 -1093 300 -226 -217 959 -545 380 -414 -560 832 -311 523 -152
1786 -152 -616 456 -490 585 278 -511 267 -660 398 357 -337 502 -618 8 201 -218 742 -502 -110
1805 -110 131 -427 669 -252 92 139 -739 568 -140 152 249 -683 473 -348 73 523 -539 402 -465
1824d65M54N11j015J106r42J79M98q21J234j017J03N22r49J207q07J92L84j109
1842g35J255p17J97M42j075J129q49K83N74j032J027q82K75N43r53J110q81J50
1860a39M57q43J131q46J74L75q80J078p39K69K95q84R81p24L38K97p72Q33p41
1879c40L42L02o38P46p47L17K04n04P41o91K97N9l88O59n70L08n6l16N20m41L63
1900A67j26k24L30l82M24j54r3J45l08L66j92J39k5k31K72k66L27j51p1J88m13
1921b78M75k78J45J52n72O04m89L52J41o01P12p66N00J41n59Q40j067O70M8n81
1941d11J102j243P88k39n57J417j444R70m04n95J449j628J441n56p97J477j726
1958i56J784p99o57J624k206J910p57k81J503k662K301r59l15J710k553K374j690
$$ plain form
1824 -465 -11 500 -515 591 -351 -172 326 -495 739 -278 -175 347 -602 605 -202 -10 374 -735
1842 -735 520 -197 0 442 -633 496 -353 -70 504 -528 499 -383 -108 435 -518 592 -289 -139
1860 -139 318 -525 606 -240 -66 309 -571 507 -232 37 332 -552 429 -295 43 340 -432 401 -340
1879 -340 2 304 -334 412 -335 -18 186 -318 423 -268 29 88 -300 359 -211 97 41 -275 245 -196 167
1900 167 41 -183 147 -235 189 35 -58 87 -221 145 -47 92 67 -164 108 -158 169 18 -53 135 -278
1921 -278 197 -81 64 216 -356 248 -241 111 252 -349 363 -403 97 238 -321 519 -548 122 170 -411
1941 -411 691 -552 236 -3 -560 857 -587 383 -21 -616 833 -795 646 90 -707 770 -956
1958 -956 828 29 -628 996 -1210 700 -57 -338 1165 -1497 804 -155 -470 1240 -1313 1061 -629
1975f29n8K231k821K400j815J47J879l054L323j937l87J702k718L666k571P6K046
1992A480l484L396k148R28J421m142M161k321N26J623l344M039l808J120K580
2007B027l755L617l563J739J348m000N283l610O18Q89k846N405m863J701J576
2022A566m080M464l789L234O6m809N801m025K151L48k872N181o370L188J869l607
2038a684M163n318M086m10l934O737n078J957r16j851O336o887L630M93l797M485
2054B012m834N627j822m607O504n076L516j253j453N281q238M996Q30k635L705
2069B553o166O068k681k827P137n786L061l100J58N917q011N563j206k522L340
2084A498m997P782m303l081N897n397M681l280J050M071r046O408o89p07K219
$$ plain form
1975 -629 -687 1544 -1277 1123 -692 -545 1334 -1720 1603 -334 -721 981 -1737 1929 -642 -566 1480
1992 1480 -2004 1392 -756 172 1593 -2549 1612 -709 -183 1440 -1904 2135 -1673 -553 2027
2007 2027 -1728 1889 -1674 65 1413 -2587 2696 -914 -296 593 -2253 3152 -1711 -10 1566
2022 1566 -2514 1950 -1839 1395 1461 -3348 2453 -1572 579 927 -1945 3236 -3134 54 1923 -1684
2038 -1684 2479 -2839 1247 837 -3097 3640 -1438 519 -397 -2248 4088 -2799 831 1324 -2473 2012
2054 2012 -2822 2805 983 -3624 2880 -2196 1320 67 -1386 3895 -4343 653 1483 -1152 2553
2069 2553 -3613 2455 -226 -3053 4084 -1702 1359 -1741 -1583 4334 -3677 1886 680 -1842 1498
2084 1498 -3499 4283 -20 -3101 2796 -2601 2080 -1200 -150 3921 -5125 1283 594 -113 2106
2099B106n970P338m954j056O379n355L525m941K217M607p837O522k446j193J639
2114E81m153Q584n765j531M583m872M772m177L024K370q557O657j675Q88O97m758
2130c332P190o375P38M954m159L278n963L897K578o389O565l390L21m49k607Q235
2146E092o462K76K473l568M200m579M693L93o953N801k247K349p89l093O019o648
2162c043J991L287k539K525n890M388R02m434N718l392Q97j632j239O811n728
2177a378J225Q85k485L152l783M951q68n056M307k190K876j380j541M131n880
2192c034K515J777r31J585n045L994m28k247M243k841J224k513k7M912m228J694
2208F50n60j316J925k628M443j465l133K492j768K806j341m62K275m434K200Q92
$$ plain form
2099 2106 -3864 3474 -1480 -2536 3843 -1512 2013 -2928 -711 3896 -3941 2581 135 -1058 581
2114 581 -3572 5012 -753 -2284 2299 -2573 2199 -1978 1046 3416 -5141 1516 -159 729 1426 -3332
2130 -3332 3858 -2517 -1779 3175 -984 2294 -3669 228 2806 -3583 2982 -408 -87 -536 -3143 5092
2146 5092 -1370 -1094 1379 -2189 2011 -2568 2125 2518 -4435 1366 -881 1468 679 -2414 3605 -3043
2162 -3043 -1052 2235 -304 2221 -3669 719 1621 -2813 2905 -487 410 -1222 -2461 4350 -1378
2177 -1378 -153 732 -1753 1399 -2384 2567 1699 -3357 950 -1240 1636 256 -1285 2846 -3034
2192 -3034 -519 1258 327 1912 -3133 861 433 -1814 2429 -412 812 -1701 -1728 3184 -1044 650
2208 650 90 -1226 699 -1929 2514 1049 -2084 408 -1360 1446 105 -357 1918 -2516 -316 576
2224E76J9R30l664K673q47p68K956j970P93k206K18L224k430J401r81r18J090
2241I6j389L213j132j875J047j204K154o73j5R02k893J384M80N99N44k384J209
2258F3p10J00J834j038K95j662J10J884q61R15r31q12N26m60J962m52j157J48
2276b46q26J357K00m5K30j771N22N40M84O32j430Ok45J25J394m64j27q74m66J265
2296B61J7M75m46j054L75q2J017L35r73j41o66O98Q22k63J48j103j45O56K14Q23
2316I68q52o26Q8j35J172p9l35k93r02R40L46K44J8j223L32n4N34P87r12o2o72
2337g16K67J081m10L58q54m52O60o3J005n82p05J84m62J141Nk34m7j113Q07K69
2357A39K34K99j204L07k27L85Q95p80Q7p16N9R42l19N38p69m63M86j76J016m13
$$ plain form
2224 576 595 1525 -2139 534 -313 -1081 1875 -95 698 -1508 -1290 1934 -496 905 -76 -994 96
2241 96 -1293 1920 788 -1087 -40 -1244 910 237 222 1124 -1769 -385 95 694 1238 -1146 63
2258 63 -647 -547 1287 249 544 -1118 -1008 876 15 930 -1 -813 -287 -747 1215 763 -394 -246
2276 -246 -1072 285 485 440 670 -1101 -579 -39 445 1077 -353 -347 -592 -467 927 463 336 -538 -1004 261
2296 261 278 753 307 -747 -372 -454 563 898 -75 -216 -882 -184 638 375 523 -580 -725 -69 145 968
2316 968 116 -510 -422 -557 615 536 201 -92 -994 -54 292 536 554 -669 -337 -391 143 930 18 -44 -716
2337 -716 -449 632 222 580 -274 -726 -66 -129 876 294 -411 -227 -689 452 457 223 176 -937 -130 139
2357 139 373 672 -532 -225 -452 -67 828 48 135 -581 -522 420 101 639 -130 -593 -107 -283 733 320
2377C20n04M7n63R82N9n1k6r87N80Q3L57L21r12J72l63L65P15m69J23o96JN92
2399A46q0N08o00l53J61o8P82k22k45j69m09O25R9J89j46o26J87M0M40J66m21
2420Dr0l28K99L83K2p5n13J7J75K55K05k45k24k68K33L50Q5j17m17N0J0K62L06
2443C79k92j01m22K97L83j60K08m85j2P0J8O92n76j06m2j78O90m37L73j71o97
2464e69O81k70N85k43n90P05q25O49J77l44M35j168Q99R6m56Q14j009O25m62j56
2484d26J340j314N98l77j99R88j280J341n55p85J064r89J380q87l66J262j725
2501i30J308l64n3P97j991J850o09m10J218j581J526j328N5J723k079J471r87
2518c84J29J071k084K396j254m82J234j651K238j773K09J461k428K104j237N80
$$ plain form
2377 320 -184 -137 -700 282 341 290 264 -723 -143 -60 297 618 -294 -122 -485 -120 595 126 249 -447 -446 146
2399 146 66 574 -26 -379 -218 -286 496 274 29 -140 -549 76 175 364 218 -408 -221 -181 259 425 4
2420 4 -86 -414 -115 268 290 215 -298 -281 -106 149 354 109 -115 -383 -150 200 285 168 -249 -199 -189 73 379
2443 379 87 -14 -436 -139 244 84 292 -193 -205 -135 -117 575 -1 -107 -149 -327 363 -74 299 128 -569
2464 -569 112 -158 427 184 -406 299 -526 123 300 -44 391 -777 122 218 -238 576 -433 192 -270 -426
2484 -426 914 -400 198 -179 -378 610 -670 671 116 -669 395 -594 786 -101 -467 795 -930
2501 -930 378 14 -39 758 -1233 617 8 -402 816 -765 761 -567 -512 1211 -868 603 -384
2518 -384 -255 816 -1268 1128 -126 -608 626 -1025 1213 -560 -351 1110 -1318 786 -451 129
2534A29P65k505K816j652J51J132j914K434k428Q45J452k477K359j958J029N78
2550G56k377L266k296M99P20j818K933k859J249R69k526K734k301J570K07k466
2566a740L424k701J148M73j847L019l310J783O70k325K932k850J944j23k140L567
2582A924l143J603j9j642L160l520K271jk026K983l125K508o66j761L317l396
2598a533K290o08j225K941l713K749o56j381K818l393K853j195j135L009l480
2613a659K714j213q12K719l585L038j280q80K566l401L100j519o97K568l460L079
2629A278j567m69K383l455L140j703l00K272l368L126j805j52K090l248L233k006
2645e51m2J963l041L137k158K71J757l069L151k039L96J325k838L293k254M28
$$ plain form
2534 129 894 -1611 1205 -447 -296 836 -1078 1356 -1072 -227 1225 -1252 1107 -851 178 756
2550 756 -1621 1645 -651 -152 568 -1250 1683 -1176 73 1042 -1484 1250 -1051 519 726 -1740
2566 -1740 1684 -1017 131 604 -1243 1776 -1534 249 919 -1406 1526 -1324 620 497 -1643 1924
2582 1924 -1219 384 365 -1277 1883 -1637 634 633 -1393 1590 -1535 973 307 -1454 1863 -1533
2598 -1533 757 149 -1076 1865 -1848 901 245 -1136 1682 -1711 1142 -53 -1188 1821 -1659
2613 -1659 1055 -158 -970 1749 -1836 1202 -78 -958 1608 -1793 1307 -212 -909 1659 -1801 1278
2629 1278 -289 -758 1625 -1830 1310 -393 -693 1579 -1789 1337 -468 -620 1470 -1778 1455 -551
2645 -551 -593 1370 -1671 1466 -692 -421 1336 -1733 1418 -621 -225 1100 -1738 1555 -699 -271
2661b71J351k567K922k391Q97J253k744K866k132Q74Q01k355L084k431O71R87
2677H15k009K650k506J111Q45k336K707k023J001K79j963K908k291Q61N83j687
2693a055K275k347J414N36k002K207j893J220L9j461K473k279Q87L41j053J914
2709A216k268J389J09j438J951j593J167m69j045K121j858J001m1q06J387j866
2725a043J529k0j154J345j414J189l82o26J615j772P99m0l54J178j632J131k21
2742A28p87J274j007R21o29n56J366j205Q06j61m39P31j208J160o4o58P08r24
2760e44Q02k74k20R43j164M38p5k5O76r48O04k55l85P45m31N12m98l49P19n29
2780b58N03q6l12K63n92O76P9l51K76n54L46J8n1N08o64O1M5k8N06m19J02j13
$$ plain form
2661 -271 1080 -1487 1435 -956 -59 1194 -1550 1316 -816 58 859 -1496 1588 -843 -172 815
2677 815 -1194 1456 -1050 61 906 -1430 1277 -746 255 534 -1429 1479 -812 49 632 -1055
2693 -1055 1220 -1127 287 823 -1179 1028 -865 355 394 -1067 1406 -873 14 355 -698 1216
2709 1216 -1052 337 446 -992 959 -634 533 64 -981 1140 -718 283 242 -564 823 -1043
2725 -1043 486 466 -688 657 -757 432 50 -576 1039 -733 66 26 -328 850 -782 349 128
2742 128 -659 615 -392 529 -100 -656 710 -495 311 150 -289 442 -766 394 330 -328 380 -544
2760 -544 258 -16 -236 707 -457 -19 -94 -119 557 -391 213 -42 -427 318 -113 399 -99 -448 271 -258
2780 -258 245 159 -153 110 -482 194 273 -78 198 -356 -10 8 -43 465 -199 -138 -93 -121 385 -34 68 -45
2802d5l12N21r8J70j61m46L95j35K54J49m28J15k94K68L54k89J49m05jL30r2L56
2824C55l56k43J68j32N11j16k04J6l87M52Q8oQ9n82K29M6J37L42n04N9j97K2N45
2847C32k69J45l57k17M63j33L90k42l60J81k47N64K1k93P0m80M10J40J2K20o78
2868c28J63K9J34M62n04N8k66l9N90k08K07l81l17M32j21M64j84l72R2k83N62
2889A90Q1j87J7n30L33J58J02K07n98N5k8J54M50l36%l45m9M85l0J92l69k75K02
2912a21RM48r9k94j03k05M63J43k9j05m31J22J58K75J16l87j53r1K54L18o5j12
2934A11l52o1K69K56R6l02k37o1K05K94Q0j78l88l2K04L18J04l01j48k10J96L90
2956B53J4o0n02j2L00R6L15l39j92j53j8O97j48j22k56k98M94j22M42o6o83K01
$$ plain form
2802 -45 -357 164 66 236 75 -371 24 -111 143 292 -136 -21 -315 -47 307 18 167 -238 -239 91 -1 355
2824 355 -1 -244 -76 -208 303 187 -17 -1 -388 64 152 146 235 -347 -118 -72 65 407 -97 -38 -235 -213 332
2847 332 63 208 -149 -366 97 -36 354 112 -248 -67 -314 250 271 -22 48 -432 -22 118 130 350 -328
2868 -328 -165 -136 -2 460 -44 14 -252 -291 299 91 298 -83 -400 32 -89 375 191 -181 -89 -372 190
2889 190 271 84 101 -429 -96 62 164 371 -227 -172 -200 -46 404 68 68 -277 -326 159 129 321 -48 -323 -121
2912 -121 -112 336 237 -57 -160 -365 98 241 212 107 -324 -202 -44 231 347 -40 -193 -284 -30 288 223 111
2934 111 -241 -302 -33 223 319 17 -220 -281 -76 218 298 120 -268 -300 -96 222 326 25 -123 -333 -137 253
2956 253 267 207 -295 -307 -7 89 404 65 -127 -280 -298 399 251 129 -127 -425 69 -53 389 323 -360 -159
2978a59j69O34O1m85L07o93L25L48J2L48j068L29K07j39P10o43K23m91k53J212
2998F16n59K45m54l17P23p31J052j59q17L65o10J226l63m13P58j272O47mK99O09
3018H41j713R45j68j69R00r35R23j190j85J576j028P53q86J1P54j401J821m86
3036C63p10L97r85J873j060r8J088j783J047n68Q35O07k220J686p60O5P93j047
3054d77J618k071K51J575j299J217j462P03L53j781K563j067j80k8r79K383j992
3071f73O94R04j866J281j276J735Q1k259K241j454N93K57p39K040k908R80J135
3088G66j261J491j963J539l74j715K924j583M77n77o81K467k658J519M08j635
3104h56J322j743K456o67j784K359j957J172m60j36J963l309J713L13p64J308
$$ plain form
2978 -159 -328 306 367 -118 189 -504 -179 169 181 529 -539 -210 -3 -142 568 -75 148 -343 -596 616
2998 616 57 302 -152 -469 254 -477 575 416 -401 -36 -646 580 217 -196 562 -710 -63 -67 232 841
3018 841 -872 73 -95 -264 636 -299 624 -566 -751 825 -203 550 -336 -325 429 -972 849 363
3036 363 -347 50 -935 938 -122 -220 868 -915 132 -436 399 1006 -1214 472 -288 -223 570 -477
3054 -477 1141 -930 -679 896 -403 814 -648 55 408 -1373 1190 123 -57 -85 -1064 1319 -673
3071 -673 21 925 -941 340 -936 799 880 -1379 862 -592 1 258 -481 1559 -1349 -369 766
3088 766 -495 996 -967 572 198 -1517 1407 -176 301 -276 -957 1510 -1148 371 779 -856
3104 -856 466 -1277 1179 512 -1272 1087 -870 302 -158 -294 1669 -1640 73 386 -378 930
3120I30k117K267j318j059K655j803J138j356J00J957k829K199l87q54Q70j789
3136a396K872j469q84J926k011J555j162O18J414l123K139n09j10Q91j908K474
3152A317j931k74K028j722J479j770O88J238k472K383r62j33L62j501K758j902
3168d14J1J209j694J605j549J208O44k394K063j085N66K26j277K183k151M98J032
3185F81j174J395j865J170L46j672K074j263N03k02r35K172j873O71M20j122J330
3202F56j526J392J7j504J646j237Q70j59p36J630j881Q32L29o84J122j582J187
3219C72j79r24J510j182P47m78m28J429j474Q87j37n37Q69j184J240l65o72J000
3237D94j014Q87m31j90R01j301Q49j82j72O60j071R39m35k72Q12q19P04n27r2
$$ plain form
3120 930 -1187 1080 -238 -1297 1358 -445 693 -663 -563 1394 -1435 764 377 -477 393 -1396
3136 -1396 1476 7 -877 1049 -962 593 -569 49 1463 -1660 479 -30 -140 751 -1157 1317
3152 1317 -614 -888 1140 -582 897 -873 -185 1053 -1419 964 2 -131 231 -1270 1488 -414
3168 -414 -403 806 -888 717 -832 376 1020 -1374 689 -396 170 396 -881 1302 -849 -351 681
3185 681 -493 902 -963 207 553 -1119 955 -308 195 -7 -942 1230 -643 28 448 -674 656
3202 656 -870 522 539 -965 681 -556 314 155 -581 1049 -832 0 329 -355 767 -815 372
3219 372 193 -731 779 -403 344 -134 -562 867 -607 280 143 -394 475 -709 531 166 -506 494
3237 494 -520 367 -64 -254 647 -654 195 13 -159 501 -570 369 -66 -338 474 -345 359 -168 -260
3256b60P41r11P49l35j79M95p60Q50m01j98N22o93O39l34k8M56p47N81k54j6L72
3277B89o07N38l14m9L82m74M52l22j5L14m33M44k59k8K13l57M21k23j0J62l30
3298b06L39j61PJ54k91K62j61L4J64k56J99j24JJ44j87J65r9n1J35j53J60q3n3
3321f1J26j48J24k4n9R9j36Q4K7o8R1r7L5L1p7J30r9%O7j03J18n9oO4j47J39l8
3348A3k6R0j54J28n7m5J45j55R8n6m1J48j74J37n5p5J48j64J53m5q5J43j78J50
3372D3k2p0J38j92J37j8o2J56j94J26l8n4J68j92J28o3o5J68j69J52o4r8J59j50
3396g6J42l5r9J40j71J36pq2J42j86J01kn7J52j68P7l2l3J45j29P2l3o6J39j02
3421c2Q4k8r1J12r4Q9K4r4O9r8O6N0p6Q8j15J7M1m7J09q5k5L0n5J09k7m4L5j10
$$ plain form
3256 -260 481 -430 319 -16 -195 300 -460 390 -11 -209 313 -380 259 -75 -103 353 -394 187 -67 -83 289
3277 289 -318 220 -94 -143 239 -235 217 -105 -120 194 -239 205 -54 -82 131 -226 195 -28 -38 124 -206
3298 -206 133 -28 -21 133 -158 104 -57 -23 141 -115 84 -40 -39 105 -82 83 -16 -67 68 -85 75 -8 -61
3321 -61 65 -83 41 17 -42 57 -79 5 32 -36 55 -42 -7 24 -53 77 -22 -22 45 -58 60 1 -5 59 -88 51 13
3348 13 -13 77 -77 51 -6 -51 94 -61 37 -19 -60 88 -86 51 -4 -79 69 -95 58 13 -72 71 -107 43
3372 43 21 -49 89 -103 34 16 -46 110 -84 42 4 -50 118 -74 54 -9 -74 94 -75 77 13 -85 74 -76
3396 -76 66 31 -68 72 -99 37 30 -52 90 -96 5 3 -54 98 -70 7 -25 -58 87 -42 30 -3 -69 70 -32
3421 -32 52 24 -67 45 -49 40 64 -30 39 -59 7 57 -19 69 -46 -29 12 -35 74 -11 -36 -6 -61 48 21 -23 12 -98
3449i8J15J2k3O1j47N9Ok4J46j45J6mo6J89j18O2j8j45J71r0J13Mj89J68j51J12
3475A6Q5j65J74k52R7J33j46J98k34M4Q0j70L34k27J1K5j94L64k30P1J03l25K89
3498H1j74J56J18l96L25k38J25J66k79L47m31R7K66k80L68l99J33J08l74N78l20
3519b3K8K8l28N97m30J66J57m69M11l58L68J08n81N36m14K10J39l25N78p18J84
3540a36L31l68N19n95L08N3n42Q41m59J35p8l94Q27o95L34K07o10N37o11O52N3
3561C09p37P50o18L37M9l17Q31j065L39L16m07O49q30O05j54o40J074o01L30l14
3581i4l59J021j010O13J12n65M97q27J051j60p44Q97q19N49k47q4R56j402N89
3600b6J27k49O38j010R60m69o22J207p35N69o28j82J062j275R15n2m33M21j009
$$ plain form
3449 -98 17 29 6 67 -80 -21 -15 -39 107 -38 -22 -26 -92 97 -21 41 23 -122 49 -41 72 76 -113 55 -96 16
3475 16 101 -64 110 -142 -45 88 -58 140 -94 -50 30 -140 194 -33 -22 3 -191 173 -57 14 117 -208 81
3498 81 -93 63 181 -215 110 -128 -3 163 -116 231 -200 -103 163 -117 251 -148 -15 93 -281 297 -23
3519 -23 5 33 -295 302 -128 38 195 -274 137 -221 147 255 -326 210 -204 6 145 -180 398 -320 -136
3540 -136 195 -173 346 -249 59 112 -430 411 -48 87 9 -385 442 -253 81 288 -322 215 -396 256 309
3561 309 -428 322 -296 41 90 -227 604 -461 -122 194 -213 436 -394 211 57 -583 491 -110 220 -94
3581 -94 -453 568 -442 171 283 -282 215 -612 439 279 -465 432 -387 162 -85 -169 787 -615 -26
3600 -26 101 -148 490 -520 440 -29 -651 556 -179 390 -238 -420 642 -633 282 230 -203 218 -791
3619g91J392m40o04R31r58P24n33K08R42j603Q21j32l9N27j035J255q63m09J105
3638D98o91P44r67J69Q43j323J128k82j19J17r67J587p62k51P12q97P77q24O07
3657I9P08j545R34m12K63K73q78J358j158j33Q56n69Q37j161M70N23j225J247
3675D87m58J40j56q11J575r63R9M59p55P27r90R18L90j280Q78n95M93j9n59J241
3695H21j275J47M82k98P29j160O82R6q77J078m78L64m38n09J269r09L57J56n01
3714b64N14r00J013P6q51O60o17N71k03k38R52j155K82J91q6N65r54O60j75n50
3734e09Q75m53M42n28k91R07p31M78m9k94K90p04R02o9m93M21n36M97k38J5N92
3755E24q73K89k7Q6L65o31M91l02k30N34k69L72m83j22N05m59M47j25j46J04m56
$$ plain form
3619 -791 601 161 -443 488 -470 254 -279 -71 871 -732 89 -43 -82 445 -590 665 -198 -607 498
3638 498 -193 551 -416 -247 596 -727 401 119 0 117 -850 737 -25 -276 436 -461 316 -508 99
3657 99 807 -738 196 -216 47 320 -558 800 -358 -491 365 -204 633 -528 -58 465 -760 487
3675 487 29 169 13 -798 777 -186 -87 372 -383 344 -646 272 662 -618 260 -335 158 139 -420 821
3695 821 -454 -307 175 -123 606 -554 128 224 -653 425 -53 311 -127 -636 633 -276 81 237 -264
3714 -264 250 -650 363 439 -412 248 -369 202 -1 -239 713 -442 -160 31 -55 510 -444 216 41 -509
3734 -509 366 -87 355 -173 -464 443 -288 190 141 -153 137 -567 335 266 -227 194 -342 155 -83 -68 524
3755 524 -349 -60 -87 -1 364 -267 224 -78 -308 226 -43 329 -154 -276 229 -230 217 92 -54 50 -406
3776d06O41r4j96J95m06L40j76J10L44n73J83q9R7K85l81K86k70j18L50j41K71
3797B52l25r0K41k42L51r2j09K4k71L94l8n2O6k81J65n0J04J73l18O8p9O5J92
3820A48j42Q0j86n3J95k2J30j53j14R4p5K03oj10kj38J62O6k0L6k05N3M1M8J41
3845A71j84j9l8j4K01n6lq3r6J47j9Q7k1j64M7k5J29N2j25Pj04N2J39m6M9j44
3871f0k4Q1rJ34r2o7jo8J89j6m5pj20J18rN3M2j76N4l2O7R5j05J9r5J5J06l0O4
3900H1j15m1P3l1J23n5n8j0o8J55j1qqj26Q8oO1K8j19K0k0M2Q7p2K1p8nP9mM3
3930F6p1k8QRP5j0m3n5KO8K1j1j7n2j1L9N1ll3n2K2J4K0M0n6j5k1J9Q6n7K4n4
3962b5k3O7k8Q1o0p3P2o0J07k8n1P3j53J24Mk7O8j62J30o0k1J46j72J18j02%J64
$$ plain form
3776 -406 235 141 -55 140 -266 74 -102 8 352 -221 -38 -127 -30 255 -126 160 -110 -228 122 -19 252
3797 252 -73 -163 78 -164 187 95 -14 10 -261 133 95 43 109 -172 -7 -57 47 220 -98 -30 -109 -44 148
3820 148 6 86 -100 -153 42 20 150 -3 -117 -23 -98 105 99 -11 -13 -151 11 77 57 93 -112 -59 -18 30 171
3845 171 -13 -32 -70 -84 117 61 58 -25 -121 26 7 94 73 -91 -44 -69 60 112 -13 -6 -110 -58 81 35 84 -60
3871 -60 -84 -3 -12 122 30 -37 -38 -106 83 67 22 15 -105 13 4 57 99 -77 -23 -55 12 107 2 21 -74 -59 47 17 81
3900 81 -34 -75 -2 -33 90 35 -23 -33 -101 54 43 35 27 -99 -11 -17 44 72 -47 -27 -47 -5 82 10 31 -47 -52 27 23 66
3930 66 -5 -33 -25 -16 59 49 6 -49 -47 21 42 31 14 -38 -49 -10 41 38 5 -47 -25 -11 9 49 -7 -22 -43 -24 62 5 29 -25
3962 -25 -48 19 -9 72 12 -61 11 -49 58 30 -21 52 -101 23 27 0 68 -94 36 -24 -45 101 -71 47 -55 -55 109
3989A09j94J69j31k3J46j99K28j08p5J53k04K50j49qJ67k87K43j09J4J45l23L09
4011A23j70pJ96k93L05k53M1K41l53L26k33L1K05l87M27k64rK03l51M36l16O2
4033d0K26m44M33k86J04J80m48M90l34P5K20m17N03m39J50K26m55N20m30J72J59
4054A65m60O12m69J54J57m51O18n33K40J75n31O16n16K76J39n39O92n95K89J33
4074A72m90O88o61L33J34n05P06o79L80P4n14P70p04L95K4m84P86p45M53Qm88
4095c47P74p88N34l5m69P61q17N66o5m52P90q53N87j07l97P97r06O25j49l82Q03
4116D70r08P01k21m00Q17q96P26k89l25Q14r85P76k51l08P44j003Q70l21l05P87
4136D93r83Q27m19j71Q06j075Q45m04j42O97j025R97n21k13P25r21R35o22n1O99
$$ plain form
3989 109 -85 84 -47 -70 76 -123 105 -3 -78 75 -129 121 -28 -36 131 -156 87 -22 -8 137 -186 123
4011 123 -47 -54 142 -151 154 -99 -58 183 -170 156 -77 -46 159 -228 199 -65 -74 129 -222 214 -102 -40
4033 -40 186 -258 175 -111 -7 173 -275 215 -119 -44 176 -241 262 -177 -27 199 -256 264 -166 6 165
4054 165 -295 317 -152 2 159 -292 326 -207 33 208 -323 293 -223 53 192 -347 345 -250 39 172
4074 172 -318 370 -291 42 176 -329 377 -302 78 152 -362 408 -296 99 123 -361 425 -320 133 141 -347
4095 -347 427 -361 173 138 -331 430 -387 179 114 -338 452 -401 186 79 -318 479 -427 198 49 -333 470
4116 470 -438 263 42 -358 459 -437 289 0 -325 489 -496 280 29 -279 465 -538 332 11 -294 493
4136 493 -490 337 -82 -253 553 -522 323 -81 -223 474 -551 446 -75 -288 437 -484 451 -171 -222 477
4156D77j044R58n08%N12j014J097o25k8N80r07R47p46J96O05j038R47o60J96M05
4176C50r16J134q06P7M85p80J004q82K87M46r71J008o74L21J98r01J168q19K49
4195b2L30p48R48r75N12L51q90R24p87M59P9o69J103r48K96J76m89R05r88N59
4215A26R5o97Q82p00N52j72n73R89q45M65J8m01O81r43P13L9n54O95p58O05k11
4236Fl40Q79q96M16q5j96O67q78O61j61m42O77o00O23l67l17P43p46N40j31j69
4257a16M18q03P41j33k68M49o15N57l41m5N92p05L76k34N2L82o04N79l30j65L81
4278A68l62N17m25o4L71m86M71j98K7J29n32N70j77k8J90m06L80l02J25L18m46
4299a60K58k51J22K10l35L93l21n6K08j62L57l28j0J47k75L39j21N6j2l11L39
$$ plain form
4156 477 -567 391 -117 -117 395 -619 478 -147 -175 405 -502 445 -301 -105 500 -538 409 -251 -55 350
4176 350 -566 568 -238 -161 324 -456 548 -334 -47 399 -572 436 -238 83 281 -620 548 -271 -22
4195 -22 308 -440 508 -467 45 396 -494 430 -357 102 181 -488 615 -333 -37 139 -350 555 -433 126
4215 126 221 -476 406 -294 258 86 -487 502 -343 122 140 -261 420 -523 190 229 -325 370 -388 217 6
4236 6 -334 545 -351 65 -20 -216 451 -427 234 73 -369 308 -292 331 -36 -353 390 -356 184 53 -116
4257 -116 302 -501 240 107 -161 288 -327 230 -111 -156 436 -269 107 -127 -75 307 -297 282 -48 -213 168
4278 168 -194 323 -102 -166 205 -281 190 -8 19 148 -384 186 9 -19 171 -235 145 -157 -32 286 -160
4299 -160 98 -153 -31 179 -156 237 -84 -140 68 -94 263 -65 -75 72 -203 136 15 71 59 -252 87
4320H7j02O5O3k54J77j85J66J67k46J07j73Q0J19r8J81k17l9Q5k3K01j56l1Rj16
4344a33J99pJ0m9j72J54JO4N6j89L0n9J00J27j19Lj13NJ24nQ6j26r6N9QJ37k6
4371F9j11%o5J17O8m0j0j38N2O7M2O1j44m1K0K7J38o2m0n6o6J40K0M2n4j32M5
4398e1NJ23L5j34k3o5Q2J09l6Rj51JQ5L4R0j15o4j0J0J62l7l1p5p2J14L8N5o0
4426B8j07J7J1J12M4r1m9o5P4P7K4pj26l2O1P1M5o4n8n2L4R3L9l6j03k7M9N7O7
4455H6m5o9o8M1R3J7Lj27j1M8K7J09o5n0p1J6J38l0J9o8p2O4pJ43o9j08L0p1J56
4484E9j4k4K3j87J15M7K9O7k10Q2n9K4J77j34N8j64QK00j23J32j41m8Q4j14K77
4509A64j15q5M2j48K55j20L5J03k91J96q7J13Q7k87K19j90O3J66j71K16l21O8
$$ plain form
4320 87 -15 50 113 -141 36 -149 17 184 -62 45 -128 -48 71 -27 154 -63 -102 -17 -40 161 5 -26 -17 -133
4344 -133 66 59 69 20 -152 2 3 67 123 -66 -36 -95 5 132 13 16 -97 -92 32 27 113 -13 -109 -50 -42 95 69
4371 69 -42 -42 -107 10 78 38 28 -110 -58 9 51 112 -32 -73 -53 -26 112 50 10 -46 -112 28 48 90 36 -96 -51
4398 -51 -46 77 112 -22 -45 -110 -28 81 45 54 -97 -96 -11 23 113 -2 -66 -76 -66 96 59 28 -47 -119 -5 33 88 28
4426 28 -79 -62 -51 61 105 14 -35 -100 -26 51 75 68 -58 -90 -29 42 87 23 -35 -87 -53 40 79 43 -60 -87 -38 19 86
4455 86 41 -28 -96 -55 38 55 58 -69 -80 -32 -5 104 39 -11 -82 -66 72 42 61 -7 -79 -15 -22 121 52 -56 -26 -97 59
4484 59 45 21 44 -143 -28 19 48 115 -95 -13 -72 -48 129 -5 53 -111 -103 97 -26 106 -35 -83 1 -113 164
4509 164 49 -36 6 -142 113 -7 28 131 -160 36 -51 62 149 -138 81 -109 -46 120 -51 165 -156 -88
4531h8J91j99K60k43M7N4k29M15k19OL2k37L79k58J26J12l50K83k26K32P8l57
4553a91L62l09J13J37j91L31m61J62J69k39L38l46J86k9k94N25l19J04k5k45M57
4574B35m38K69Q4l57L29l54L73ll78M78m37K18K4j76M67o19K87R0k57M18m64L60
4596A49j15l39O13m46K54j21k08N13n90M17K2l20L56m91N31j46l19N41n43L28
4616H6j28p7N00p30M27m1k00M22n36N29k95k60O05n01L90k74q6M97o85N54j34
4637F3j92L28n67O72l10j88N08n95M65l05M9M68p77N49j94r8L87n96O66m47j29
4658b43N40n65N23m09M9M14p21O66k76o2K61n63P29m47k3M15n85N35m45K00L45
4679C38p17O29l60P3K40n31P07n60N8L67n06N68n23K12K57o34O84m12J22J22m86
$$ plain form
4531 -88 103 -96 164 -79 -32 22 -207 208 -11 -5 27 -210 169 -89 37 149 -201 82 -144 88 166 -191
4553 -191 171 -138 -25 112 -79 252 -209 -47 122 -117 221 -125 61 32 -262 263 -56 48 23 -222 235
4574 235 -203 66 150 -207 122 -232 141 138 -240 238 -199 19 43 -133 334 -285 2 92 -165 253 -211 149
4596 149 34 -305 308 -138 116 -5 -213 300 -290 127 149 -171 185 -306 225 79 -240 301 -242 86
4616 86 -42 -119 381 -349 78 37 -163 259 -277 252 -43 -303 302 -199 191 -83 -169 328 -357 197 63
4637 63 -129 199 -368 304 -6 -194 314 -281 184 -121 -72 396 -381 168 -26 -124 263 -333 333 -114 -243
4658 -243 297 -268 255 -154 -105 309 -412 254 -22 -84 177 -386 343 -104 -127 288 -297 238 -207 -7 338
4679 338 -379 250 -110 -37 203 -328 379 -181 -123 244 -262 306 -217 -5 252 -382 302 -110 12 134 -352
4700c52P26n71J61K47n10N76n36L14J96o07O40m87K33J04m26O71o21K25J89m11
4720b39N67n93L44O2m63O35m98K76ll62O04n62L02N8l50N00n52L87J0l71N25n16
4742b39L39n2k66N21n67L27qk40M57n14L63p6k67M81m70L47j13k01M61n16L75
4763A42r9j85L68m61L78j09j94L79m34L54j33j27L59m55L41j45r5L14m01L51j87
4784c9r3L21l79L20j70o2K62l55L21j47p5K30l14L08j60k7K16l29K88j47j4J74
4806A29k83K70j64KJ77k60K39j59kJ71k36K26j48j3J48k10K24j49KJ21k19K27
4828I3j30K7R3k00J92j09J1J01j68J60j17K0J10j53J35r7J5Q3j38J47q7rO3j14
4852g2J34p1j5P6j08R7m5JN6j16R2l8j1P3r5P1n9ON8o0N1l6l3P2o2O1j7n0O3p2
$$ plain form
4700 -352 374 -197 -36 211 -299 277 -259 55 251 -356 284 -203 30 134 -292 379 -242 -17 172 -239
4720 -239 328 -265 79 141 -322 313 -185 91 88 -274 330 -232 70 128 -222 278 -274 113 123 -248 277 -239
4742 -239 100 48 -218 303 -264 63 55 -185 272 -242 121 45 -222 259 -211 136 23 -178 283 -233 142
4763 142 43 -142 226 -235 143 34 -160 219 -215 139 6 -121 238 -217 124 -21 -116 198 -203 148 -39
4784 -39 -132 189 -190 130 -40 -102 160 -195 126 -21 -96 134 -180 128 -32 -59 157 -172 116 -31 -45 129
4806 129 -154 116 -48 -46 131 -129 110 -49 -51 120 -116 110 -38 -51 97 -113 111 -38 -36 85 -134 93
4828 93 -37 -10 83 -117 75 -34 -23 78 -90 70 -47 -27 83 -70 65 -32 -17 66 -72 75 -12 -21 42 -72
4852 -72 62 -9 -24 52 -56 41 -4 -3 53 -63 29 -9 -20 53 -42 29 -30 -24 34 -26 25 -11 -44 28 -34 27 10 -40 23 -49
4882d9P9k5k2N1q4O2jj4M9p1M3j8j2N6n8K9l1j7P5n7L5j0m8O0m4N0qn5M6m5M3
4913IRm1M3p0L6K2k3M9o7K4J1j3P0o6K2l0j9O6l4L9k8l6L0j3N8l1k6J6n6P3lj0
4945A1J2o3M4rJ4K5m8J1l2K7L8l2J7n4K2J5NL5n1%Nj5P1l1nk0k6N3j4L5l9rOj9
4979b1N9k0p%m7O8k5K6Lp1N3n8O1L0p1M1q2N5K0k4Q3j29L5J8j3R6j19N9l1m8J23
5010F4q7Q2o4o9J34j06J27o3m9P6j40J53k0n6P2j54J47n8jJ20j91J10o8J9J36
5035A14j96J42j04l1J51j43J88j69l0J49j74K04j12j1Q0k14K56q5j1P0k16K36
5057I4j54N2J69k75J91j72J00J52k75K55k02J5J17j78L09k82J2J62k30K86k15
5078f9Q0N9l01L62j64N7N1k63L46k86J36J54k88K47k95K14R8k95L49k86Q2N3j84
$$ plain form
4882 -49 30 5 -17 34 -50 12 11 -3 46 -25 18 0 -12 44 -14 15 -16 -33 42 -15 20 10 -38 22 -22 28 20 -35 11 -34 9
4913 9 18 -23 20 -50 -14 8 -15 34 -33 -9 2 -11 59 -7 15 -15 -34 32 -2 37 9 -27 3 -10 48 17 -9 7 -49 24 21 11
4945 11 23 -40 4 -5 9 34 -14 -3 -35 -8 30 -2 15 -39 -17 -2 3 38 -13 -13 -8 -23 48 17 12 -8 -34 19 5 40 1 -8 -2 -21
4979 -21 38 18 11 11 -36 32 7 33 36 -35 18 -40 21 51 -20 21 -61 -6 14 -10 73 -56 -21 -3 -16 80 -39 20 -11 -59 64
5010 64 -23 59 -5 -74 60 -46 81 18 -31 45 -95 58 38 -18 54 -100 47 -11 -12 108 -83 27 -41 -22 114
5035 114 -82 60 -44 -75 76 -67 121 -48 -78 71 -103 101 -11 -22 58 -156 100 15 4 74 -142 94
5057 94 -60 -8 161 -114 77 -95 5 157 -118 137 -65 -50 67 -111 198 -84 -72 90 -140 146 -69
5078 -69 11 70 -231 131 -33 24 75 -188 158 -128 8 162 -126 121 -174 40 138 -157 192 -94 -12 41 -143
5101a43M24m10J02J16k46L59l21K19rl52M42k53J71l3k63M19m22K39J17k79K80
5122A57m17L47L2l10M33m04K01o6j37M97n25K17J5j97L67m11L87j33l27M78l31
5143a27L06j71j76M32n36L61K0j91K61m90M66r5k43M33m42L03k05m2M95o02L24
5164H1j01j09L21m54N29k62k67M59l88M18l05m2L99o15M63r7n5K07n36N82k47
5185a9j10L92m57L73l57J00M24n97M08k34J1K13m18N99l93j14L21l45M63m00J04
5206c6K61n58M97k07Q7P7m52N75l41L1K63l72L75m46K27K84n01M42l39J34Q5l34
5228b48O02m65L2J67k63M49m57K37J07m56M73k76K08k3l58N11m07J73J34k79L30
5249A91m63L15J21l44L70l47J93k7j93M82m28J16L5j60L51l78K72k2l03L63k49
$$ plain form
5101 -143 281 -129 -27 89 -157 202 -119 100 91 -261 181 -72 99 66 -197 222 -200 39 156 -123 157
5122 157 -260 87 119 -191 242 -162 39 -27 -164 333 -192 25 40 -157 210 -201 186 53 -274 204 -127
5143 -127 179 8 -168 264 -272 89 109 -82 179 -311 155 60 -183 250 -192 111 -94 -136 359 -243 81
5164 81 -20 -129 192 -262 267 5 -262 197 -191 227 -78 -120 279 -336 127 30 -25 182 -354 228 -19
5185 -19 -129 263 -194 179 -178 -78 346 -251 157 -77 -66 147 -271 328 -65 -179 142 -203 260 -140 -36
5206 -36 225 -333 164 -43 44 121 -331 244 -97 -66 197 -175 200 -246 -19 265 -236 206 -133 1 86 -248
5228 -248 354 -111 -79 88 -175 274 -183 54 161 -295 178 -98 110 87 -271 240 -167 6 140 -139 191
5249 191 -272 43 164 -180 190 -157 36 9 -184 298 -130 -14 21 -139 212 -166 106 84 -219 144 -105
5270a05K47j06k19L85l74K27L0j49K26l94L09mj86K84l18K12j11q1L58l52J46
5291B5m8q6K66l06K70j01j86K72k19K52j40r8K28k83K24l8n8J32k78K31l9o6J75
5314A29k26J67j18kK16k57J51r2k9J54j87J91j20p2J52j40J67r5k9J08j85J71
5336E4m7j5P0j82J69o1j7J15j64J12p7J5J26j51J04q0oQ5r2J17p3n5P6p4J04l8
5362A5k9N0j12J03j6k0M6j06P3j5kO8r1L4l6QP8p8N0m1k3O8m9O7l9l7N9n6O2k1
5392A0j7K9o1M7Pk4M8o4K8jj1O6o9K2j4k3O5m7K3j9l4O0m0M9k1m0M5n5N0Ll5M2
5424A9n3L3J6l5N7o0K1J1j5O0n6J8j6k5N2l9L7j3m1N4l0K7km0L1m7O1j3l0M1n4
5455c1M6k2mK6l3K5k3lL8m0L3l0kL5k4L0l6JL1l3M2k9QOl3N1l4QNk7L6k4L0Jl8
$$ plain form
5270 -105 142 36 -183 202 -172 55 85 -64 162 -232 77 73 -113 171 -147 65 -46 -127 231 -121 25
5291 25 -23 -109 157 -149 121 20 -166 106 -113 139 -1 -99 129 -154 70 32 -26 106 -172 59 20 -46 129
5314 129 -97 70 -48 -50 166 -91 60 -32 -61 93 -94 97 -23 -95 57 -83 84 -11 -40 68 -117 54
5336 54 7 -8 62 -120 49 -12 -29 86 -78 34 -43 -28 98 -53 51 -29 -35 50 -42 75 2 -53 23 -51 53 15
5362 15 -14 36 -76 27 11 -9 37 -69 4 -11 -13 55 -36 -2 -38 -30 48 -30 20 -21 -44 24 -25 42 3 -34 25 -31 31 10
5392 10 -7 22 -39 8 15 -9 39 -25 3 2 -9 57 -12 10 -4 -27 38 -9 14 -5 -39 21 -19 30 9 -31 14 -41 9 12 -23 19
5424 19 -34 -1 15 -20 37 -23 -2 9 -6 54 -2 16 0 -25 27 -12 25 12 -29 25 -5 22 20 -20 11 -36 25 12 -18 23 -31
5455 -31 15 -7 -11 15 -18 7 -16 -19 19 -21 12 -18 -20 15 -9 21 -15 -14 17 -16 26 -3 5 11 -22 29 -5 3 8 -19 17 -7 23 24 -14
5490a4L6l4K7qj4K7m6L8k5JK9m7M7l4KL8n1M8m2jM0m5O0m5RK1m9O7n0L1Oo1Q4
5523D5o2L0K2p3Q0q1N4Rq2J07q8L9K8p3J03j05L7J2m7R6j14P1no8J25j13P9j3
5551A3q0J27j16R8k3p6J35j57J17nq6J39j57J19k9q3J75j94J36m7p5J76j88J48
5575F7o7n9J59j90J59n7q3J61j96J79p5p2J80k28K03q7m7J76k47K02j00k8J66
5598A16k33K12j23l0J87k51K28j43j1J72k65K64j48k1J53k51K77j72pJ71k80K80
5620A25j87L6J67l24L05j94M8J56l15L32k41L8J78k88L34k67O4J65l20L60k57
5641h5Q2J06l05M05k94P9J28k98L71l10J49J20l50L69k89J55O0k78M07l58J27
5662iJ13k50L65m00J95R0k97M01l43J80qk47M43l77J85L1k45L87m17K90K4l05
$$ plain form
5490 -14 22 -12 15 7 -7 20 -26 12 -13 -12 17 -30 17 -17 -15 23 -28 20 -22 -23 17 -28 32 -13 -4 17 -32 35 -15 16 22 -39 45
5523 45 -17 13 35 -38 42 -39 15 24 -58 49 -39 0 28 -45 58 -47 -10 2 -45 51 -63 8 3 -65 60 -53 26 13
5551 13 -67 60 -56 42 19 -57 78 -79 38 33 -53 86 -71 48 19 -64 111 -83 53 6 -69 107 -81 67
5575 67 0 -59 100 -90 69 12 -71 90 -106 73 -2 -74 106 -122 81 -6 -53 123 -124 78 -22 -50 116
5598 116 -117 95 -28 -58 129 -122 106 -37 -48 124 -141 123 -25 -46 107 -144 133 -39 -46 125 -155 125
5620 125 -62 -26 141 -183 122 -72 -24 132 -183 149 -92 -54 124 -164 170 -97 -33 132 -188 172 -85
5641 -85 -3 103 -202 203 -91 -12 116 -182 189 -121 28 148 -202 167 -122 33 93 -185 222 -136 -9
5662 -9 104 -146 219 -181 14 104 -193 208 -135 45 37 -210 233 -144 41 72 -173 214 -203 87 111 -194
5684a94L85l71K91n2k27M31m57K53nj75L61m87L49m4k36L89l92L14j52j68M50
5705B63m52K96j02j36L24m46M14j13k10L29l87L82j90q9L59m75L23j11m3K76m75
5726b63M24j71j12L09l57L64k89k5L46m15L43k02rK11m07M59k22p4K12l49M18
5747A91k86N0K46m31L57k26J09J49m00M23k80K4K00k76L61l65R9K20l37L44k63
5768i1J12N8l00M38k74L7Q9k33L44l00J58J09l28K99k24J61L5k55L31k85R7J06
5790H4j78K63l33J45R5k08K84k42J36m1j71L37k41J02k5j30K55k53J94K2k15J99
5812G9j86J86l0j43K30k58J38J0o3J87k78J44Lq7J78j77J23r0o9K04j56R3m0q4
5836h6J55j59J63l2j17J06j25J39k6o2J24j77R9mpJ04j78J05k7l8J24j01O1p6
$$ plain form
5684 -194 191 -180 111 59 -168 263 -194 59 54 -121 240 -247 102 58 -178 211 -181 133 -19 -187 263
5705 263 -189 107 5 -131 193 -253 161 48 -162 167 -220 162 -28 -117 242 -233 90 -21 -64 212 -263
5726 -263 161 -10 -122 187 -170 194 -95 -120 226 -189 154 -48 -57 154 -253 206 -16 -90 122 -227 191
5747 191 -95 -45 201 -230 127 -99 10 159 -241 182 -98 -74 126 -150 211 -154 -55 165 -172 172 -91
5768 -91 21 79 -221 217 -57 -20 69 -164 180 -120 38 147 -181 118 -106 55 90 -165 166 -119 -22 84
5790 84 -94 169 -164 -19 76 -132 152 -90 46 5 -166 171 -70 32 7 -123 132 -121 73 95 -120 79
5812 79 -107 79 49 -94 136 -122 16 26 -37 150 -128 16 19 -68 110 -67 56 -34 -103 101 -55 38 -2 -86
5836 -86 69 -90 73 41 -76 30 -95 44 18 -44 80 -97 2 -2 -9 95 -83 22 -5 -43 81 -20 41 -35
5860c5k7J39j02Q3o0n0P8q5J11j9p7N7p1Q9ql2N2j15O1OPN9j05N0k4k2J02p9L5
5889A8m6k2Q9m9M0j1o2M5l6O7J2o8L9o5N1L0l4M2q3K8K4j8N4o9OOk1P3l9Rk7m7
5921f4Q6l3L7lp9N7l8M6K5n4K8m8L2L4l1L9o0J6J7j2O3n5mj2k1P3l6Jnl8N1j8
5953fK6Lm9L3m4M0J5l2K3n2L0K1pL1o2K0pON3n0Pk1lM8k8K6k2l0M4k5N7l6j9J5
5987El8M2j1OMn8M5j1K6K1n3K0m4K8L8k4J4n5K3J7JK9m7J2j4jN8m2J4k0k2N5k7
6020iM1k7k8M0m4P1k0k1J8o9O5j4J3L1r1O8m3J7M1o0N0p3L1N1o3O3o8J6K5o4J10
6051E7q0NK5n7J07q2M0J8j01J15q2N6J1r9J19q9N5K8q0J13j49P6M0r0J14j32P4
6078A2%q0J72j36M0Lp1J51j52J00j4j04J35j33J37l6j08J66j68J36k7o7J42k09
$$ plain form
5860 -35 -62 77 -25 58 -2 -52 26 -59 52 33 -44 13 -58 31 23 -9 43 -72 -11 -5 2 61 -44 6 -18 -40 62 -17 18
5889 18 -28 -50 39 -10 30 19 -43 2 -34 33 45 -23 16 -49 2 32 -2 40 -43 -15 9 -9 45 -24 -18 -12 -33 40 1 10 -17 -64
5921 -64 22 -11 26 23 -56 1 -37 9 34 -20 8 -40 -8 26 -5 34 -26 -10 7 -5 58 3 -1 -13 -34 39 3 4 -1 -39 12 -6
5953 -6 20 23 -26 7 -37 3 18 -14 9 -43 -13 8 1 32 -30 -10 -17 -11 42 -8 -1 -22 -25 23 -5 21 -1 -31 13 -12 45 9 -10 5
5987 5 -33 9 -2 4 8 -50 -5 -16 10 31 -22 -2 -46 -18 20 -4 10 -45 -22 -5 -4 25 -22 -10 -24 -25 33 -9 5 -15 -37 18 -9
6020 -9 32 5 -23 17 -27 44 24 3 21 -48 17 3 16 47 -44 24 -19 -2 39 -21 29 -44 -13 38 -25 38 -30 -14 11 -53 57
6051 57 -23 -18 7 -50 57 -25 15 33 -68 47 -35 21 32 -67 52 -37 18 46 -34 79 -70 6 46 -44 70 -62 12
6078 12 12 -68 104 -32 8 11 -60 91 -61 39 25 -79 56 -77 60 24 -84 82 -86 50 23 -44 98 -111
6102a11J55j7p8J56k00J67o4o9J90j99J33q1l6J68k16J79o4q1J44j81K08j14o4
6125g5J77k12J83r0j8J62k70K17q0l1J33k34K43j52k9J97k31K20j68K0J60k52
6147a30K40j35j0J25k28K99k06lJ58k47K63k03O3J28k88K91j91N3J19k45K93k40
6169i4N3J44k35K67k47J00J13k57K98k22P7P3k24L27k52P4J00k37K96k55J43N3
6191I5k59L12k52J32N0k23L18k95J39P2k14K87l04J87K2k21L20k79J55oj84L31
6213A83l20J82pj77L02l10K17k5j87L03l02K17n1j41K92l17J97k0j35K71l27K36
6235H1m6j50K79k99K26q7j11K79l25K47p2j17K46k95K42r1j02K27k99K67j09p9
6257h8K28l01K61j12n8K14l05K75j38l4J99k86K51j34l4J93k60K47j51j9J82k60
$$ plain form
6102 -111 44 27 -51 105 -95 72 8 -61 129 -70 63 -18 -54 114 -102 77 13 -68 76 -105 103 -11 -75
6125 -75 102 -110 73 -17 -35 127 -143 74 -6 -37 96 -138 105 -47 -76 121 -110 110 -58 -38 122 -130
6147 -130 110 -25 -35 90 -138 161 -45 -48 110 -137 126 -77 -14 114 -174 117 -74 -21 98 -147 146 -94
6169 -94 -41 103 -132 135 -112 -12 101 -156 142 -80 -3 70 -154 173 -79 -5 95 -142 154 -101 42 95
6191 95 -164 148 -104 28 78 -145 173 -122 17 89 -125 162 -142 45 67 -154 166 -113 42 36 -148 183
6213 183 -137 45 38 -139 163 -147 70 45 -142 161 -141 76 25 -116 176 -141 56 36 -99 172 -155 81
6235 81 35 -115 164 -135 91 4 -107 172 -153 94 22 -95 151 -144 98 7 -95 132 -167 100 -9 -88
6257 -88 140 -161 100 -12 -70 144 -161 114 -24 -58 141 -145 106 -28 -62 131 -129 118 -33 -52 130 -130
6279a30K49j56%J61k61K60j69J6J43k50K47j65J1J48k35K36j59K5J22k23K33j53
6301e0J8J03j85K30j75L1J11j87K12j63M3Q1j83K20j57N8O8j74K12j65N6P5j74
6324i5J70j41P2N1j43J87j58N9K9j13J84j66N9M5j19J50j30P0K2j37J78j22M5
6347cM3j17J34j23P5M1j09J21j14O8L6r7J25j18M1L2p3J11j08N1K0q7J11r8N5
6372A7J0q5J12q1L2J4p2R4r0N7J6o1O8p3M1J7m9R1q5K3J1l9Q5p5K3Om0P4n2K4
6402A3Mo1Q0o0L6Rm5M5o2M8K0m2L5n6L6Rl8N7m5J4rk1O9o2K2Ll6O1l4K0J0n3N0
6435A7l5M2Nm6M0m5L5J7m8M2m9K7J2j9M4m9J0Mj7M5l1Qmm1M8k5K9ol1L0k9K8J2
6468B0l2L2m4K1J2j2L5n2J0K1j8M1k9qOk0N7l4J0j3rJ6k6L7qk8K4l1M4j4%Lm6
$$ plain form
6279 -130 119 -37 -37 124 -137 123 -46 -30 113 -137 110 -55 -44 104 -131 105 -54 -29 93 -130 103 -50
6301 -50 -32 71 -114 116 -59 -28 83 -104 108 -55 -12 69 -114 106 -51 7 75 -99 113 -52 4 79 -95
6324 -95 75 -66 6 57 -86 101 -57 2 31 -82 102 -64 -5 40 -79 71 -59 11 33 -104 74 -48 -3
6347 -3 40 -77 57 -66 9 50 -59 62 -52 16 52 -45 80 -38 3 35 -38 73 -35 16 36 -51 60 -38 17
6372 17 27 -58 54 -27 5 19 -53 41 -49 8 24 -37 31 -42 -1 16 -33 58 -27 -4 7 -32 53 -22 1 7 -33 41 -11 13
6402 13 17 -44 36 -24 12 21 -24 21 -41 7 27 -15 20 -36 0 9 -29 28 -17 -3 -12 -33 36 -26 -4 -1 -37 24 -10 10 20 -33 17
6435 17 -18 24 29 -17 23 -22 13 30 -18 24 -25 2 14 -5 39 -10 0 4 -13 32 1 9 5 -36 12 -13 16 10 -21 9 -20 8 20
6468 20 -12 20 -24 -3 9 -3 32 -20 -10 11 -7 34 5 -3 3 -17 40 6 16 3 -6 10 -16 21 13 -15 9 -22 22 8 8 11 -35
6501c5M2j7J7Nl0K3k5J7K4k0J2m1QL3k1L0l9K0mk1O0l9Rj1j8M7l0J9j0j4K8l8
6533a9N1j2l2K7n1N5j3j3L2o7N2k5J0M5q0N7m3NO4o3M9n7%N6n0P5n7kK3o7R9m6
6565CoK7p1R3n6K4M0r9P0m3L7L4r0P9p0K8L8p4R5r9J9N4p5R6q8L8Pr3J36p2L1
6596A3kq6J37j03O3L4j15J11j14R7J3j11J42j32P2Nn1J37j80Q4J1o5J35j62J13
6621D6l2j02J77j42R8l8q1J67j85J36rr3J16j77J75k5j03J65j81J20l6l8J64k19
6645i7J33l9m6J58k03J77q6p7J88j70J51j20l2J74k31J88n0n2J12k11K43j19n3
6668f2J65k18J87j29K4J67k66J87r2OJ11k03K55j69m5J69j75K04j83K4J49k59
6690a53K53j12J7O7k31L01j82K3J05k10K34k09J04J21k52K13j60P2O7j99K83k44
$$ plain form
6501 -35 7 -10 7 12 -18 5 -20 -3 21 1 13 -28 -20 13 -8 22 -17 3 -1 -22 38 -1 8 -3 -21 26 -4 15 5 -9 19 -19
6533 -19 32 20 -12 15 -36 19 6 -7 25 -42 10 -15 -5 40 -40 17 -26 -21 43 -20 29 -28 -28 28 -22 53 -4 -6 17 -50 49 3
6565 3 -3 24 -47 46 -10 14 54 -45 25 -18 19 53 -37 42 -28 0 38 -36 59 -40 -21 33 -42 54 -34 4 11 -82 54 -18 13
6596 13 11 -75 62 -41 22 56 -59 52 -62 35 48 -63 79 -53 19 24 -27 110 -70 14 25 -40 95 -67 46
6621 46 14 -88 89 -53 45 7 -74 93 -92 44 35 -58 58 -119 56 31 -72 93 -88 32 -4 -42 122 -97
6645 -97 36 -3 -49 109 -94 83 -3 -80 108 -62 89 -31 -63 111 -120 68 18 -34 78 -133 110 -9 -62
6668 -62 103 -115 72 -57 -33 134 -132 55 -37 -31 80 -123 132 -37 -82 87 -88 116 -67 -43 106 -153
6690 -153 100 -12 5 72 -159 142 -40 -17 88 -122 112 -97 7 128 -124 89 -71 1 68 -131 152 -92
6712i2M3J09j64K41k38J04Q8k37K59j71J00qj90K97k26R7N9j61K06k45J78M3k02
6735a10K25k17J46oj39K78k75J10K5j18K28k69J78j3j65K32j91J47o9j29K62k44
6757a14J61j6j11J86k53K11j6j40J93k21J85o8o9K22k65J48l2n0J74k40J98p4
6779Ij00K07k04J89j33m4K02k31J78o8m0J22k18K25q0o0J28j97J88j18JJ64k27
6802a07J62q9PJ17j97J93j18k5J24j35J71j39j1J33j80J85j00LQ0j79J86q4k1
6825b4R1j52J66j28K5R4j49J44j16K7Q3j42J57j28L0P0j15J47j36N0N3j28J53
6848G2j01L0L5j14J54j03M1K6j07J17r7M8N1j08J08q7N0L0q7J13j05K6L4o7J01
6873F0j09M9K0p6J08r0L7J8p3R9p1L2Pn4P4q3O2J0n2P5p9M1J6m7O3p3L6J5m6P4
$$ plain form
6712 -92 -49 60 -104 137 -101 3 91 -146 113 -58 42 34 -156 141 -85 12 71 -90 116 -129 49 92 -110
6735 -110 115 -102 44 38 -101 177 -98 12 37 -81 147 -122 56 43 -122 110 -81 66 -3 -132 130 -114
6757 -114 47 31 -80 106 -147 64 48 -92 101 -120 65 -3 -72 150 -115 33 1 -49 125 -115 83 9
6779 9 -91 116 -88 101 -32 -76 126 -105 73 5 -35 87 -131 94 14 -46 82 -115 73 -45 -44 120 -107
6802 -107 55 -34 -27 90 -107 86 -32 -57 67 -68 103 -36 -47 86 -94 91 -9 -6 74 -105 81 -3 -24
6825 -24 67 -85 81 -47 -22 72 -77 67 -49 -22 61 -81 76 -52 -22 48 -67 80 -56 -6 47 -81 72
6848 72 -29 1 36 -78 76 -27 14 40 -67 50 -47 1 52 -56 52 -35 15 45 -42 71 -34 -8 26 -41 60
6873 60 -49 0 20 -56 52 -38 -1 17 -56 43 -28 4 11 -43 31 -52 10 20 -32 43 -36 5 21 -26 37 -36 0 15 -31 43
6903D3o2L4ll5N8n3K8Ml9N8n1K4J4n7O0n9M0Pl9M4m9L5mk0M4n7K6Rl4N3l0RKl4
6937c4N6m0J5J3l6M1k2J4Ll1M4l7L4ok5L5l5J0J3k6L3k8J0%k6M6l5K1oj8L8m2
6969b1K8mk7L7k1J0Nj9K5l5K2J4j9L1m7K8LnNj3RpoK5l3K7j3qK3k6J5j3j4K5l2
7004c1L7j8QJj5K2j1jJ4k5K7j6RJ4k8J4j0J4j0JJ8l4L4j5mL9m4J1mjK3l5L2j4
7038Bj7M1m6L4j8j5K6l0L8j7mJ9l7M1k6KK5n3N3l9J1L7n0M3m5K4K1l9N9n9J4L2
7070B7n4O2n5K6Ql9O2m4K5Km7O2n1K5Pm7O0o9N2Qn7O5o9M4Rl9O7p1M4j2l3O9p4
7103c7M6Jm5Q3p7M9j4l5Q4j01O9Pn4P3r0P5k5l1P9r7O5l0k6Q7j03P1k2l2P8j04
7133e6Q7m7k7R4j04J00n9j2P6j19J05l8k3O8j12J14m8j6O4j01R9n5kQ2j21R7o2
$$ plain form
6903 43 -19 15 12 -23 35 -18 10 14 -25 33 -18 6 20 -37 23 -36 4 11 -28 16 -33 2 -2 -22 22 -35 -9 0 -34 19 -11 -2 0 -34
6937 -34 22 -18 -3 10 -26 15 -7 7 10 -21 23 -14 20 14 -11 24 -11 -1 12 -14 19 -9 1 1 -25 21 -14 7 1 -17 21 -21
6969 -21 7 3 -24 13 -8 2 7 -12 13 -22 0 14 -5 26 -21 7 10 5 10 -3 6 -1 -7 18 -15 12 -1 -9 14 -12 3 -10 -24 1 -31
7004 -31 6 -12 -4 -3 -18 4 -7 -8 6 -19 8 -8 1 15 -13 1 -9 5 -5 -4 14 -20 14 -1 -5 34 -10 1 -3 -4 19 -16 16 2
7038 2 -15 26 -20 14 -4 -19 7 -23 15 -2 -6 13 -24 17 -9 -7 18 -35 18 -21 -10 27 -23 20 -25 -1 20 -19 40 -19 -5 27
7070 27 -27 35 -20 6 14 -25 37 -7 18 20 -27 35 -16 9 16 -31 29 -40 12 20 -37 28 -41 3 12 -27 40 -31 13 1 -32 37 -37
7103 -37 9 10 -35 48 -29 20 6 -29 55 -46 23 30 -24 49 -41 34 9 -22 57 -40 25 -5 -31 56 -47 24 2 -30 48 -56
7133 -56 31 -16 -43 51 -53 47 -12 -24 52 -67 38 0 -23 45 -67 47 -1 -17 47 -54 45 -10 -12 70 -51 46 -16
7160a6MN7j06J25p5lO5j05J18q9NQ4j42J25o3NN7j27J37p8lP5j21J20j02L5P4
7187E6j24J18q6L1M9j09J52j12OO6j11J38j14M0N5j34J51j06M3L7j38J64j12L0
7211a0M3j01J40j34N6O3j28J23j13O6J9j02J65j33M6K2r0J59j53Q3K3j27J56j14
7235d1Q2mj06J60j42P6J1p9J34j79J22Nr8J32j47J08k6p0J65j79Q2lm8J26j58
7260g7J05j0r2J36j31J25n2p9J50j48J20l6m7J20j89J46j1o5R9j42J31o8l1J50
7284A04j64R3m7j3J02j63J42m8n7J03j22J47r4l8J18j46J16o2J3P9j73J62n6j4
7308a8P0j19J30j09J8J09j40J00q3K5P3j19J42r8MM7q0J27j05J4O3j13J11o5L5
7333A9J6j16J32o7K4J5p0R9j01L7N5q8Q4r2N3K5q0J16j04K9K5n1J03q9L4J5o3
$$ plain form
7160 -16 -12 45 -61 64 -11 -14 51 -54 64 -25 -20 64 -78 47 -16 -11 46 -81 56 -22 -25 50 -71 49 -53 -18 56
7187 56 -68 50 -36 -5 44 -65 87 -25 -19 47 -64 74 -40 0 55 -79 72 -34 9 46 -92 72 -40 -10
7211 -10 33 -68 72 -62 -6 57 -71 52 -61 5 24 -78 87 -46 0 22 -68 91 -62 21 44 -83 73 -41
7235 -41 41 37 -69 91 -51 25 36 -43 91 -88 34 39 -59 73 -74 34 8 -62 103 -76 6 3 -45 81 -77
7260 -77 28 18 -74 62 -69 56 4 -75 75 -73 47 11 -36 84 -105 41 30 -35 64 -78 53 -15 -46 104
7284 104 -60 33 -14 -27 75 -88 54 6 -51 52 -70 77 -17 -55 63 -83 33 -29 -16 63 -110 52 -4 -18
7308 -18 52 -67 63 -46 -28 81 -59 41 -42 -17 56 -63 79 -19 -15 32 -48 79 -26 -12 51 -62 49 -16 19
7333 19 35 -81 51 -16 8 23 -47 52 -49 -12 43 -45 39 -53 0 25 -55 61 -43 -14 11 -40 63 -26 8 23 -40
7360d0Q3o0M4j7o8J03p7M6pk7O4r0N5J4m4N6p6N8ol5P0p0J8Qk9P4q1L5Om2N7k9
7392gL1k6l7N2l9L9Ol5M1o4L7J1j6L7n5L7qk0L8l6Qj2J2L0m3L1k2k3L6k6M5l2
7424a0k1L7k8K7Qk1J3m2M6Kj8K3l5K0j1lL8l8NJ5j8K9j7Kkj9L3j8J7kk7K0j6K4
7458A3nj0Rl4K4J5j4J1k1JPoK5k1KpjL5m1RlOJ0j2J7j0qJ3j9L4nj2J6k3J5qoJ0
7496Fj0kOQRk0J3k2jPJ0Mk3lK2k0K9qj4Rk6M1j0rLk3K5qJ1Qk6J7j2J9MpPl9L0
7535EkkJ1k1K1j0qJ3pLj1JPj8L0k8JJ4j3K5mj2Rj6K8k9J4J5m1L8k7RJ8l4L4j2
7571ALQj6K1l1J6Rj8K5l9K5lj0K5k9K2nk5L8l6L0nk6M2n1M1pk6M4m5L8qrK9n7
7606b9M7k7qM1m7L9k1rN2n8M4k2j0M7n6L4j7j9O0p2O4m3j0M5o4O2k8LL0p0O0k7
$$ plain form
7360 -40 43 -17 27 10 -58 45 -32 14 7 -20 44 -46 9 23 -21 35 -41 17 11 -24 46 -24 -6 2 -27 47 -34 1 7 -35 22 -7
7392 -7 24 -2 -39 13 -26 13 19 -16 25 -39 -2 9 -7 30 -25 12 4 -16 22 -14 -6 -18 -6 24 -19 12 -10 -33 3 -23 22 -10
7424 -10 -31 6 -22 5 13 -8 5 -37 9 11 -7 16 -19 1 -10 -13 25 -13 -8 7 -11 18 1 3 1 -18 15 -3 14 12 -15 5 -11 13
7458 13 8 -2 7 -27 -3 12 -2 9 -12 -11 -4 -10 15 -6 -4 -11 -12 23 -18 -9 -12 -6 4 -8 9 -1 -9 4 -15 19 14 2 18 -5 10 2 -4 6
7496 6 -4 -6 0 8 17 -3 10 -12 -13 -6 4 8 -15 -18 4 -16 13 5 -9 0 -26 15 5 -4 -1 -24 1 -7 4 12 -14 3 -9 10 14 7 14 -25 5
7535 5 3 1 12 -9 12 2 -6 7 0 3 -8 -7 0 -18 12 -16 -15 -1 -14 11 7 -5 4 -12 16 -13 1 16 -25 13 -14 -5 13 -21 13 1
7571 1 4 12 -4 17 -14 2 11 -7 18 -21 4 1 -9 16 -13 9 4 -21 17 -19 11 6 -20 22 -29 12 5 -21 23 -22 16 8 -1 28 -29
7606 -29 18 -9 -17 24 -23 16 -5 -14 38 -20 24 2 -8 39 -17 17 0 -19 41 -31 33 -10 -20 25 -39 23 -5 -2 28 -42 18 -9
7638ik0O2o6N1l3%M0n3N9n0J9K7n8O4n8J4L5n9P6m3qL8n5O6o1L2K3p6Q3n9J9K2
7670B2n1O4o5J6M8p2P4o7L1J3n9P8o6K7J9n9Q0o4L2J1m9Q0p6M6Po2Q4o5L8Mn3
7701c4Q8q3L7On1R5r8O2Ln7Q5q5N0nn4Q9q5N9l2l2Q2q6N7ql8P4q1P4l4k9Q2r8
7733d7P3k9j9O9q4O4k3k3P9r9P1l2l0P4q9P1k4l6P8j01Q5l0k5O4q8Q2l9j6O8r2
7763d8O9l4KN2r3Q1m0lN3q0P5l5rN4p5P9o7KN2q1Q7n9RN2r6R6n0jM6p1Q9p4NM8
7797C5p5P0n8K1L3p2Q1n2QK4o4R3o3J6K9p3P4n9M2J7o7R1o1K8Pn4P6p2L1K0m8
7828b2N9o2K6J6m7Q3o6J2Rm2O9o7L4J2n4P7o5L4Pn7O9o1N4ql9O6p3L7J2l1M7m4
7860a5J9Ql1N2n6L2jl4O7o7M3pk5M5o2M6Kl6L8m5L5jk0L3n0L4nj4K0l7L9j9%L5
$$ plain form
7638 -9 -29 33 -33 18 -15 -15 25 -28 31 -19 0 27 -31 33 -25 -11 24 -35 41 -2 -10 28 -27 39 -22 10 33 -43 40 -19 0 22
7670 22 -29 35 -30 -14 34 -38 36 -31 0 13 -46 32 -34 -7 12 -47 33 -31 1 12 -37 43 -33 13 20 -42 42 -23 15 19 -34
7701 -34 54 -29 8 14 -37 58 -40 22 25 -32 53 -32 18 13 -41 48 -37 22 -10 -42 40 -46 11 3 -35 39 -42 32 -2 -31 51 -47
7733 -47 26 -3 -22 47 -37 27 4 -19 60 -39 32 0 -30 44 -45 26 2 -34 44 -57 28 -2 -27 37 -51 31 -8 -24 44 -48
7763 -48 21 -13 -11 41 -52 29 -11 -14 39 -41 34 -1 -10 44 -31 48 -19 -17 35 -46 41 -18 -9 43 -53 43 -7 -8 38 -33 56 -18 -13 35
7797 35 -40 30 -28 -7 26 -46 35 -17 -9 15 -49 44 -19 -3 26 -47 27 -32 10 27 -40 51 -10 18 25 -29 47 -25 6 26 -22
7828 -22 37 -25 1 17 -30 53 -13 -1 8 -34 35 -32 2 14 -40 37 -28 6 13 -44 25 -36 18 10 -29 37 -36 1 13 -18 29 -15
7860 -15 4 12 -19 33 -23 9 8 -26 41 -26 17 10 -15 30 -32 14 16 -20 18 -27 8 7 -13 20 -30 4 -1 -15 5 -32 7 -12 -12 23
7894B3m2K9j4j5M8n2L7j2j7M5k8K2j7j0J6k3K5mpJ8l6L0j4oJ8l0K7j8oL4l4J6
7926CmrJ9l0K8qj4K1k5L8k4oJ8k3K3j2j0L1l5K4oJK3l6L0k1KK4k6J7j5lJ8j8L2
7961B7k9qJ7j7K3j3j3J5k3L2j1nJ1k0J8JkJ2k9RoLK0k7K2j2KJ8j6K2j8j0K4j2
7995EJ9k4kJ9k2PnP%j7J9nQmk0J9j3jJ0oJ9k7jJ4rJ8k7K2j0lJ5j5J3klJ9j8J5
8033A4j5oJ1rK6j3j5K4k6J1NLJ1l4J4kkJ6k9J0rnK2j9K9l0QJ0j3K3j0j3J7k6L2
8068A0k2OJ9l0K5j1K2Ll0K2k5K7kk4K6k3OOj5K6l2K0nj4K6j8Mmj6M0l6K0j5nL3
8103A4m9M6j2lJ2l1L9j5j2L5m8L7j0oL7n5L6j7kM7n7M2l1j0M3n1M5m8J6L0n2N2
8135B2l3MJ9n8P5l4j3N5o7O1l4RK3o7P2m3LL1n6O7n4J9L2n6O2n6K5J7n9Q0n7J4
$$ plain form
7894 23 -19 10 -4 -19 29 -23 14 2 -15 30 2 24 7 -3 13 -10 15 11 4 22 -14 16 2 -4 14 -16 11 -7 -13 21 -13 3
7926 3 -1 -10 9 -21 7 -1 -15 6 -19 19 -5 -11 7 -16 7 -5 -15 16 -19 5 -1 0 23 -13 17 -4 -2 22 -4 13 -2 -5 13 -5 27
7961 27 -2 -10 7 -10 13 0 -13 2 -21 11 0 -5 6 -14 4 5 3 15 -14 -5 -11 -8 12 -15 7 -5 -3 15 -1 21 3 -7 17 5
7995 5 24 0 -2 17 -5 2 -3 4 4 -13 6 1 9 5 -15 4 -9 -10 0 -6 13 -14 -15 -1 -10 8 -19 3 -7 -10 5 -10 3 1 -2 17 -1 14
8033 14 -1 -7 4 -5 21 8 -7 17 -9 2 7 10 21 -13 1 -1 -3 13 -16 -6 -15 -20 2 -17 12 -18 -10 0 -13 10 0 -13 4 -22 10
8068 10 -12 -6 13 -17 8 -3 19 22 -8 14 -11 16 14 -10 16 -7 -1 5 -10 16 -16 4 -1 -15 11 -7 -3 -7 -23 17 -19 1 -14 -19 14
8103 14 -35 11 -1 -4 8 -23 16 1 -11 24 -24 13 3 -3 34 -21 15 -2 -4 43 -14 28 -3 -13 30 -21 24 -24 -8 22 -30 22
8135 22 -11 -7 12 -46 29 -5 -18 37 -30 31 -3 6 29 -38 34 -9 -6 25 -31 36 -18 1 33 -23 39 -17 8 25 -34 46 -11 3
8167CJ3m3P8p2K8K7o8O7o3M1J7o1P3p1L7Qm5P5q2M5Pl5O7p8
$$ plain form
8167 3 16 -27 51 -21 7 34 -34 33 -30 11 28 -33 40 -31 6 14 -31 44 -38 7 14 -21 46 -32
8191c2
$$ Imaginary data points
##PAGE= N=2
##DATA TABLE= (X++(I..I)), XYDATA
0@%%%%%%%%%%%%%%%%%%%%%%%%%%KoQrJ6k3K7l5M3n0N9p2Q5r7J13j32J52j73J97
45A05k22K48k78L09l41L77m19M61n00N42n85O24o58O87p00O87o38N21k91j48R90
66G71k682O469j7112Q2757K26271m18987J67350j46721J31852L2198l05158N67678
78C24686l37339j45606J51636o4722L29028m31275J85175J62772m24640K98990
88D8705p4641K11288j58369l18544M90147k68525N0770J05495j13671J65700m35811
99b97456L39459J66952l18386J83077j97075K09550j26192j09599M46092l68408
109g1986l60J9532K7403K22235l75089K79573l2197k59594K37960q6169K38579
120A99887k49987j30015L41956k71530J46644n843r423O3173l44120L53761K306
$$ plain form
0 0 0 0 0 0 0 0 0 0 0 0 0 0 0 0 0 0 0 0 0 0 0 0 0 0 0 0 2 -4 4 -5 11 -12 15 -20 23 -27 32 -40 45 -52 61 -71 81 -92 105
45 105 -117 131 -147 162 -179 198 -221 240 -260 282 -303 321 -337 350 -350 337 -301 220 -71 -219 771
66 771 -1911 4558 -12554 70203 296474 -122513 44837 -101884 29968 62166 -242992 324686
78 324686 -12653 -158259 -6623 -71345 257683 -173592 11583 174355 -250285 48705
88 48705 -25936 185352 26983 -291561 198586 -69939 -19169 86326 -27345 138355 -297456
99 -297456 42003 208955 -109431 73646 -123429 86121 -40071 -149670 296422 -71986
109 -71986 -72346 -52814 -25411 196824 -178265 101308 69111 -190483 47477 -38692 199887
120 199887 -50100 -180115 161841 -109689 36955 31112 21689 84862 -259258 94503 96809
131I6809j49814J18477j72676J97449j86048M0307K75560l02128O7260o5747R2497
142A1946J06346k46470K51506j31768j03227J35796n3492J93869k38583k118J62465
153H6270j85564J54901n3640N0101k5460k05756K66322o2501k2628L6067j09588
164g1476J32582j60984J08044J21513j86437O4564q6721J06947K3261j18365J69728
175A02656j41188j3760M9845j1056J27817j74783M4262L9582r1889J18850n5695
186e359N9192o1404r4672J57713o1578L4908j2442n4929O6340r9748J00478L0701
198E9200q1621L3724o9937P7697n738k8858P7661r7250J3702N327J6812O2322
210F3041r1618L1151j3193k2855O3093k8989L5360n1197k9949O4223k7307L6155
$$ plain form
131 96809 -53005 65472 -107204 90245 -95803 -55496 220064 -82064 -14804 -80551 11946
142 11946 118292 -128178 123328 -8440 -111667 24129 -29363 164506 -74077 -76195 86270
153 86270 -99294 55607 1967 52068 26608 -179148 87174 24673 2045 38112 -71476
164 -71476 61106 -99878 8166 129679 -56758 7806 -78915 28032 51293 -67072 102656
175 102656 -38532 -52292 -2447 -13503 114314 -60469 -16207 23375 -68514 50336 -5359
186 -5359 53833 -7571 -102243 55470 -6108 28800 16358 -38571 27769 -71979 28499 59200
198 59200 -22421 11303 -58634 19063 13325 -15533 62128 -35122 -21420 -16093 719 63041
210 63041 -28577 2574 -10619 -33474 29619 630 35990 -15207 -45156 19067 -8240 27915
222B7915k0403k1623J6616m1401N8906M069k2907L728l9480L8160j155N227K0928
235B8580m7799Q179l139J7768K5035l3225O798j7136N28K6329o620J2139k3646
248f209j1544J5349q47K0338q555j3399k797p617K1145O421m855p122j5574Q415
262f851J0264N678N97j3841m631K259O032J0794k916r272n279j405J0364N769
276G562k051k847j1639J102R043N029L368j2757l473K894J123J1063m156l761
290E00m730m699J2777q99J230j491r382M996k556Q436M035j0892J593n854O465
305d71N910m627M300j0832J007N963r13O767r275J49J205l756R371l608R83k473
321c00n971Q077k358L778j31o714L108l397O091K108n303J647m603L629J969j365
$$ plain form
222 27915 7512 -14111 2505 -38896 20010 24079 1172 4900 -34580 3580 2425 7652 28580
235 28580 -19219 -11040 -14179 3589 28624 -4601 2197 -14939 -14411 11918 5298 17437 -6209
248 -6209 -17753 -2404 -3251 17087 8532 -4867 -7664 -15281 5864 12285 7430 308 -15266 -6851
262 -6851 3413 9091 9688 -4153 -8784 -6525 -493 10301 7385 -1887 -7166 -8571 1793 7562
276 7562 5511 2664 -8975 -7873 1170 6199 9567 -3190 -6663 -3769 -2646 8417 4261 500
290 500 -4230 -8929 3848 2949 4179 2688 -6694 -1698 -4254 4182 8217 -2675 -1082 -6936 -471
305 -471 5439 812 5112 -5720 -4713 1250 337 7104 -2171 -2022 -817 -4573 4798 1190 2173 -300
321 -300 -6271 1806 -552 3226 3095 -3619 -511 -3908 2183 4291 -1012 635 -3968 -339 1630 265
337B65K860n185O83O00J85L365k641M44j855j004K811O10J085k706j266M99J353
354A03J663j201j1k376J070J184l26J944l411J741q78j235L938l200L199k820
370f16k150M939m372N175k823k377M543o537P507k778k487N255q135Q319m316
385h53j422P501j0276Q578n382n92Q363j1933J1134o833j784R190j2265J3410
399F836r178j456J0662j4837J4829r493L6J0351j7893J7865j0536m0J1172j8798
413a0480J9611j3781J250J3350k1007K0743j5254K802J2961k3146K4377j6828
425e402K451J2777k3695K6952j9649L909J3546k5933K8489k1056O203J2905k8090
438a6593L1157k3079P532J2697k9039L3490k6113R274J2560k9938L5996k9364
$$ plain form
337 265 3125 -2060 -1377 -777 -592 2773 132 576 -1279 -2283 528 1138 2223 -483 -1749 -1250 103
354 103 1766 565 554 -1822 -752 432 106 2050 -1361 380 -498 -1733 2205 -995 2204 -616
370 -616 -2766 2173 -2199 2976 153 -2224 2319 -4218 3289 511 -1976 3279 -4856 3463 -853
385 -853 -2275 5226 -5050 3528 -1854 -2446 5917 -6016 5118 -1715 -3499 5691 -6574 6836
399 6836 -2342 -3798 6864 -7973 6856 -2637 -2601 7750 -10143 7722 -2814 -2854 8318 -10480
413 -10480 9131 -4650 -3400 9950 -11057 9686 -5568 -2766 10195 -12951 11426 -5402
425 -5402 -2951 9826 -13869 13083 -6566 -2657 10889 -15044 13445 -7611 -1408 11497 -16593
438 -16593 14564 -8515 -983 11714 -17325 16165 -9948 -674 11886 -18052 17944 -11420
450a1420J1121J2283l0780L8171l2422J4127J0976l2724M1461l4228J5878Q106
462A0549l2367M5499l8904J7615Q557l2161M5042m2384K4115O588l5969M7701
474B3881m1893K5555J257l2542N2245m9261K5772M432k9333M7619n3223L4688
486I197J379l4467N1159m8697L3218q462k7602N8094n7256L1689l482k3816M8577
499B9531n9558M6253p612l3656N1159n1122M4385j9493k2812N8292o5268M1248
511A1347q949j5104M3656o9401N8486j5118k6453N0220n5995N1146l3970j1030
523b1165O1615p1034M6446k1247n244L9842p0295P1676k8699k3830M4378n1757
535b9314O2314m6422k545N3362p4283N4153k4368P856K6393p4122P7660l4395
$$ plain form
450 -11420 -299 11984 -18796 19375 -13047 1080 12056 -20668 20793 -13435 2443 10549
462 10549 -21818 23681 -15223 2392 10949 -21212 23830 -18554 5561 12149 -23820 23881
474 23881 -18012 7543 8800 -23742 28503 -20758 5014 9446 -19887 27732 -25491 9197
486 9197 10576 -23891 27268 -21429 11789 3327 -24275 33819 -23437 8252 4770 -19046 29531
499 29531 -30027 16226 8614 -25042 26117 -25005 19380 -113 -22925 35367 -29901 11347
511 11347 2398 -12706 30950 -38451 20035 4917 -21536 28684 -27311 23835 -10135 -21165
523 -21165 40450 -30584 15862 -5385 -10629 29213 -41082 30594 1895 -21935 22443 -29314
535 -29314 33000 -13422 -15967 37395 -36888 17265 -7103 753 27146 -46976 30684 -3711
547c711j0941L8055m9487N9362n9052J3013N1714o9556N1242l6134J6984J8363
559A9852o2960Q3924m6099r314K6308l7415O5802o5521K1176L6032o8337N4853
571A8301l3643L1354J232o3677Q2753m9291P060K0414l2550N5076p6809L7781
583a999L4311n8028M7917m5250L6574p136m5161Q4990n7803N675N640j7798N8008
596C9940p3183M1937J3826n3881M5901l4245M7552k1730m3731P1055n2362K0935
608B014L415j1662L7916p5754N0236J5096l6899L3760m1018M2210k5912k1036
620b7634O8923n2944J2529j0955J255L9511o2098M9158n344l5509K9753k4553
632a7908N0678l5622k2090N0170m5607K6830p594N684J8078o3568N1450n24j6187
$$ plain form
547 -3711 -14652 23403 -26084 33278 -25774 -12761 38953 -30603 20639 -15495 1489 19852
559 19852 -43108 40816 -5283 -14597 11711 -25704 40098 -25423 -4247 31785 -36552 18301
571 18301 -15342 16012 17244 -46433 36320 -12971 -5911 14503 -18047 37029 -39780 -1999
583 -1999 32312 -25716 22201 -23049 13525 6389 -38772 46218 -11585 -5910 -270 -18068 39940
596 39940 -33243 8694 22520 -31361 14540 -19705 27847 6117 -37614 33441 -18921 2014
608 2014 5429 -6233 31683 -44071 6165 21261 -15638 18122 -22896 19314 -6598 -27634
620 -27634 41289 -11655 874 -10081 -8826 30685 -31413 17745 12401 -23108 6645 -17908
632 -17908 32770 -2852 -24942 25228 -20379 6451 -1143 4541 22619 -40949 10501 9977 -6210
645f210J9691l1769L7859l5443l66M8617m0957J4038k1008J2647K2089m2291M4087
658B0984j7015j8661J4287j2709M2326l4918o477K6124l1222K3462r253J3781
670A0709K275m2983L7435n402r98Q123j9122K2739l0613J0196K9109k3895P800
683E373k0214J3903R411k0890L0612j7545r236L354k930K9092k4524N57Q098j8539
697a3478J6826n295J4144n210k5946K1194m639P056K686j1157R394k0393J1395
710c423J5682j0096K800j5704Q100M327n676J6975j1933o090j736J198J7343j0034
724A733n11j404r734R514J462Q394m731j4605O758J29O879L078o471k84r588N672
740c709J0145j726m80r496l38M116J710Q248n210o979k208R49J0253L98l321l707
$$ plain form
645 -6210 13481 -18288 19571 -15872 -16238 32379 -8578 5460 -15548 -2901 19188 -23103 20984
658 20984 3969 -14692 -405 -13114 29212 -5706 -12183 13941 -17281 6181 -3072 10709
670 10709 12984 -29999 7436 2034 1036 9159 -9963 12776 -17837 -7641 21468 -2427 5373
683 5373 -14841 -938 8473 -12417 18195 650 -8586 -5232 -8162 20930 -3594 -3037 5061 -13478
697 -13478 3348 -1947 12197 6987 -18959 2235 -2404 4652 7338 -3819 5575 -14818 -3423
710 -3423 12259 2163 4963 -10741 -2641 1686 -3990 12985 1052 -5038 -6774 -5576 11767 1733
724 1733 1222 -182 -9916 -402 1060 9454 4723 -9882 -3124 -2995 3884 6962 491 207 -9381 -3709
740 -3709 6436 4710 4230 -5266 -5604 -1488 222 8470 3260 -3719 -5927 -4978 5275 5673 2352 -1355
756a355o200M891N043L391o93r368j208K360M662N558m712l802l842o4Q623J702
772D986o68n623o039N088L041M684m74p898j046j351O603N571m652k046o120J918
788d026O052Q36L325p498m198K358K024P833l542l927k168l530Q082K237N53l231
804A180p994M417J749M248J998p062o94l422M676O553l208l30o619j8M939R98
820A411N028o070m408P04N95P898j773k512k532m535O255K198K059j727p245K000
836b654K99M570L089m862j363m376L099N679n92M28o243j363K906K035M879l918
852A613l709j373Q5O270M11q74l232m124L208K463L355r41n193j059k07M443K984
869D120j707k652m147J557L910K428k28m447k137K83L312L456p92l063l779R35
$$ plain form
756 -1355 -7555 -2664 2379 5770 5077 -4291 -5499 -3139 1523 7081 2369 -1433 -5275 -5339 3284 4986
772 4986 4318 -1305 -7344 -2256 785 5469 4995 -2903 -3949 -5300 1303 6874 2222 176 -5944 -4026
788 -4026 2026 2862 6187 -1311 -5509 -3151 -1127 6706 3164 -763 -2931 -6461 1621 3858 4411 1180
804 1180 -6814 -2397 -648 3600 5598 -1464 -2158 -5580 -904 5649 2441 2111 -4508 -4526 413 1411
820 1411 6439 369 -4039 -3335 -2740 5158 3385 873 -1659 -6194 61 2259 4318 2591 -4654 -2654
836 -2654 -2355 2215 5304 442 -921 -5297 -2198 3481 2889 3317 -2926 -4289 -1383 652 5531 1613
852 1613 -2096 -3469 -3384 2886 3297 2423 -809 -4933 -1725 738 4093 3152 -2041 -3100 -3307 1136 4120
869 4120 2413 -239 -4386 -2829 1081 3509 3281 -1166 -3303 -3020 292 3748 2956 -107 -3886 -2951
885b951L346K696K87l740k358j075L508M220j096k348m304R24L148J607K508m453
901h1k843l73K092N788k746j200k397k561M694O51L706l400o117L468o54N168
917C195j10l378R27o933N959L880j568Q48q076M681k64k89P707p345K71l891J656
934b730R236p955M302l546m133N761l688J0449o528o981P186n660Q470l400n87
949A96M318j4028J0448J387q45K860j1635J0844o348o52J1833j0370M599r219
963f612M123J0817j3919J0947o139k876M864p755J7832j2195m743R428j0001J2205
977E976r343N389N345k0041J6242l802K603J908j3690J8338j5182K547J2611j2516
991c615R793j6360J0585Q290j8510J8307j1037K045O68r477K4402k0016J446Q135
$$ plain form
885 -2951 395 3091 3378 -362 -2720 -3795 -287 3933 2837 489 -3815 -2891 257 1864 4372 -81
901 -81 -2924 -3297 -1205 4583 1837 637 -1760 -4321 373 1024 4730 1330 -4787 -1319 -1973 3195
917 3195 3085 -293 634 -6299 -340 3540 1972 2820 -5256 -575 -839 -1128 6579 -766 -495 -4386 -2730
934 -2730 6506 -1449 2853 -693 -4826 935 -2753 7696 1168 -5813 1373 -4287 4183 783 196
949 196 4514 -9514 934 2321 1476 4336 -7299 3545 -2803 -3455 8378 -1992 2607 -6612
963 -6612 -2489 8328 -5591 5356 -783 -3659 1205 -6550 11282 -913 -5656 3772 -6229 5976
977 5976 -3367 2022 7367 -12674 3568 -234 2369 4277 -9413 8925 -6257 -3710 8901 -3615
991 -3615 6178 -10182 403 8693 -9817 8490 -2547 -502 166 -9311 15091 -4925 -3479 4656
1005D656j1802J5113j6240J3612K260k1868K0781r927P933k401j1978K2914k2739
1018i686P899Q853j1202J2723k1641J7446K162j7973K1811j5314Q365n594p213
1031i364K6124k5711R178K990r458J5298k1331K1461m374j7937K1979j5583J4168
1044G440r127o281K3065k8000J5031J163o516J2696k4512K3992o717j2307K0996
1057A0923j8475J4908j2489j707K2550k7486J6134m180l990J2348k2339K5273
1069A1470j0737r959J8026j7348J7749j3965J28J7927k6398J8433n980o68R416
1082H094k2088K4873j2592m695J5417j7401J7668j6171L753J5045k3817J9124
1094G210j0118K024P371j9214K4761j5342j019J1324j5859J8856j7037O136J0276
$$ plain form
1005 4656 -7146 7967 -8273 5339 7599 -14269 6512 -3415 4518 2117 -9861 13053 -9686
1018 -9686 -1787 7066 -4136 8587 -13054 4392 6554 -11419 10392 -4922 3443 -2151 -9364
1031 -9364 16760 -8951 227 3217 -6241 9057 -12274 9187 4813 -13124 8855 -6728 7440
1044 7440 -1687 -7968 15097 -12903 2128 3291 -3225 9471 -15041 8951 2234 -10073 10923
1057 10923 -7552 7356 -5133 -6840 15710 -11776 4358 178 -3812 8536 -13803 11470
1069 11470 733 -9226 8800 -8548 9201 -4764 -4636 13291 -13107 5326 -654 -1322 8094
1082 8094 -13994 10879 -1713 -6408 9009 -8392 9276 -6895 -3142 11903 -11914 7210
1094 7210 -2908 -884 6487 -12727 12034 -3308 -4327 6997 -8862 9994 -7043 -907 9369
1107I369k0934J9356j2053N104M751j6971K2444j5994K906P955j3887J7567j7002
1120g389P503O946j6714J7803j3150O268K840j3625J9573j5289M897M669j1598
1133g266J5900j5442Q039L802j3098J5663j3102P320J337j0688J6211j4400O658
1146I34K088r164J4020j4214Q243J099r419J3646j2833P966l22q009J3215j2906
1160e656P897l26p119J1863j2391Q159p31o441J1021j1805P881r32n695J0072
1174E797j0985P645j407n218R708j0100O753j578m207Q852r849O659j096m277
1188c303P578q485O755j823m212P700p764N534j664k896O731q138N678q04l130
1203b243N473o813N769j785l028O092o166M220j764j611N370o553M364r36k194
$$ plain form
1107 9369 -11565 7791 -4262 842 5593 -11378 11066 -4928 -2022 5933 -7954 9613 -7389
1120 -7389 114 7060 -9654 8149 -5001 1267 4107 -9518 10055 -5234 -337 4332 -7266
1133 -7266 8634 -6808 1231 5033 -8065 7598 -5504 1816 3153 -7535 8676 -5724 934
1146 934 3022 -6142 7878 -6336 1907 3006 -6413 7233 -5600 2366 2044 -5965 7250 -5656
1160 -5656 2241 1915 -5204 6659 -5732 2427 1696 -4745 6276 -5529 2352 1420 -4275 5797
1174 5797 -5188 2457 1050 -4168 5540 -4560 2193 615 -3592 5260 -4589 2070 974 -3303
1188 -3303 4275 -4210 2545 722 -3490 4210 -3554 1980 316 -2580 4151 -3987 1691 887 -2243
1203 -2243 3230 -3583 2186 401 -2627 3465 -2701 1519 -245 -1856 3514 -3039 1325 389 -1805
1218a805M218n003M623j851k527M748m319L338j471j453L908m923L463k07j891
1233a152K860l939L373p27j934L656l493J801o03j006L492l723J719K5j715K813
1249A447k500K035n23k305L066j990J426p0j783K400k592J487R69j764J743k400
1265a354J260Q08j571K351k118K12M94j095K674j912K4N12j668K349j119N23M41
1282H11k387J981p80O58R28k206J469j377M57J774j691J260j777p1J799j365J855
1299A338j465p77J128j409K483p92q75P23k017K205k36r9R96k704J350k32M49
1316F6J663k484Q70r70J4K249j489J080j611q05K038j022J852j118j290R77j445
1333a425K495j11r88M18k250J960K83Q2R92k775Q05j73O86J881k176M20j213l9
$$ plain form
1218 -1805 2413 -2590 2033 182 -2345 2403 -1916 1422 -49 -1502 2406 -2517 946 739 -1152
1233 -1152 1708 -2231 1142 415 -1519 2137 -1356 445 -158 -1164 2328 -1395 324 349 -1366 1447
1249 1447 -1053 982 459 -1846 1220 -770 656 586 -1197 1203 -1389 98 1067 -697 1046 -1354
1265 -1354 -94 714 -857 1494 -624 -412 82 -1013 1661 -251 -227 285 -1383 966 -153 370 811
1282 811 -1576 405 -375 283 1211 -995 474 -903 -446 1328 -363 897 -880 -951 848 -517 1338
1299 1338 -127 -904 224 -1185 1298 506 -369 354 -1663 542 306 207 1203 -1501 -151 -383 66
1316 66 1729 -755 115 -855 -841 1408 -81 999 -612 -1417 621 -401 1451 333 -957 20 -1425
1333 -1425 1070 959 -29 389 -1861 99 382 464 1456 -1319 -514 -687 -1 1880 -296 124 -1089 -1128
1351a128K263q92J031j749j047J520m63K079r22j316J64j174K448K53m49k97k176
1368a855J464M78Q64N65k340J09n03J242J622j156j51j751K44J547L55Q95j936
1385c07r47K25O98J972p32p74j282m37J828P17O21j609j412M13N62J936k98q74
1403C00j311r24K130P96O51j335j851O66p4K396L31j704q30j621K671Q85j61K10
1421A225l048P57Q8J919J869l516K01j348J073K505j318J753l777r25K845j84
1437A19K944l519n82O57k401N066r16k81j589l385N502j771J470Q58m371K103
1453i6l082M769K150n372K511l864K713J399j630N199p466K98K521n58M955o495
1469b048K638o38m551P613k421K286l815m044Q245n313L850P19m375K738o752
$$ plain form
1351 -1128 1135 243 1274 -475 -1522 -2 -465 1614 692 -624 -460 -1634 814 1067 618 321 -1855
1368 -1855 -391 87 951 1516 -824 -715 -1218 24 1646 490 339 -1412 -1168 379 734 1629 -307
1385 -307 -1254 -1029 -331 1641 909 135 -1147 -1584 244 961 1582 -27 -1439 -1026 -464 1472 1174 300
1403 300 -1011 -1935 195 991 1642 307 -1544 -878 -952 1444 1775 71 -759 -2380 291 1176 1015 1225
1421 1225 -1823 -1066 -978 941 2810 -706 -505 -1853 -780 1725 407 2160 -1617 -2542 303 119
1437 119 3063 -456 -1038 -381 -2782 2284 1368 1087 -502 -3887 1615 -156 1314 2172 -2199 -96
1453 -96 -3178 1591 3741 -1631 880 -2984 -271 1128 -502 4697 -2769 -2471 50 -508 4447 -2048
1469 -2048 590 -48 -4599 3014 593 2879 -936 -4980 3265 -2048 1802 2521 -1854 884 -5868
1484e868Q761J121o398M515o097M940j526n62Q342j1310K267R51M05N740r335
1499d054P273l583n490R176l697N651p795k422R764r193P111q48k319J831j0025
1514h620J3666k048n470N438p598P441o235K697R733j4323M718j819K941M549
1528E070j0881J1881p342m742Q834l879Q478j1915O84R354j1547R400k634R69
1542A730n61j1424J7033n345l215M760p401Q669j0603O798Q967j5251O467m550
1556c926O037J494j0209J5169j1229k359O557k749R976j5387N206O438j1983J0878
1570C913m705N106m311j0460J8377q640M48K355n586Q659j3844J0706O233j3542
1584e291O902o743Q751k021p817J5779j3084J36L255p46R668j6253Q217K921j0301
$$ plain form
1484 -5868 2893 4014 -2384 2131 -3966 974 -552 -1114 7228 -4082 -1815 -864 -459 5281 -4054
1499 -4054 3219 -364 -5854 3322 -375 5276 -2519 -4941 4823 -4370 2741 1893 -426 1405 -8620
1514 -8620 5046 2998 -2472 2966 -4632 2809 -3426 -729 9004 -5319 -601 -2420 521 5070
1528 5070 -5811 6070 -1272 -6014 2820 -1059 7419 -4496 -3812 5542 -6005 3395 761 1730
1542 1730 1169 -10255 6778 1433 -1782 2978 -4423 4246 -6357 441 9408 -5843 624 -3926
1556 -3926 2111 3605 -6604 8565 -2664 -5023 1534 -1215 8761 -6626 -1420 5018 -6965 3913
1570 3913 -792 4314 3 -10457 7920 -720 -272 2083 -3503 5156 -8688 2018 8251 -5291
1584 -5291 1611 -5132 3619 1598 -6219 9560 -3524 -3388 -133 -879 8789 -7464 753 3674 -6627
1599f627J0272n394P694p173p910J6834j0016L321j2l010O904j4485J2968K698
1613F064j0126O150p580J0093n305l957J3945j3435K745m38J757P787j5154J0322
1627B868j255o817Q219n530R459r368m270J3079r730N658k623j57M462j3065J3010
1642C940m05n822M271p149R771o760p04J0478j1456L813k682L120N346j1906R786
1657C641l501l784N675m425Q788r066j494Q634p912O153l576J491K065j0027J1058
1672C720k322k083K281n764Q114o790J705O480q355M033m158L898K938q033P974
1687C638m675r08K926l043P303p665M16M452n307N459l745K274M37o652P914k737
1703H7J96R16m092N624n248K301L551n274L161l775L063J607m630N334l993J84
$$ plain form
1599 -6627 3645 -1749 5945 -1228 -9138 7696 -2320 1001 989 -2021 4883 -9602 3366 6064
1613 6064 -4062 2088 -5492 4601 -704 -4661 9284 -4151 -1406 -1844 -87 7700 -7454 2868
1627 2868 1613 -5204 3015 -2515 6944 -2424 -6694 6385 -3345 2313 -310 -467 3995 -9070 3940
1642 3940 3535 -2287 1984 -5165 4606 -2154 -2858 7620 -3836 -23 -2705 415 5761 -6145 3641
1657 3641 140 -3644 2031 -2394 6394 -2672 -4166 4468 -3444 2709 -867 624 2689 -7338 3720
1672 3720 1398 -685 1596 -4168 3946 -2844 -1139 5341 -3014 1019 -3139 759 3697 -4336 3638
1687 3638 -1037 -1945 981 -2062 5241 -2424 -2008 2444 -2863 2596 -1149 1125 1562 -5090 2824 87
1703 87 283 1199 -2893 2731 -2517 -216 3335 -1939 1222 -2553 510 2117 -2513 2821 -1172 -988
1719i88J421j893M998n118Q11J818l110L983k799J863j76l870M714k160J171J75
1735H40k606L318l344J947J575k695K032k868J983Q63k185K930k685N14N24j113
1751i70K978k679M79N34j661K446j531R31M5k178K289j095Q09L86j796J636j491
1768h68P82J055j471J195j519M86R81j170J439j238m3O03r83J650q47k64M58j100
1786h54J373n04ON79j404R39k51J19P51j321P66l87j90J011r30P02n42m70J122
1805E15q71P44k52o10Q52j005R33N6p48P96j045Q03P1o19J056j183M84J39n14
1824c98J144j171N18O5p60J205r27N93m8q98J230r39N85J19q44J056j085O78K60
1843C83q59J028j062N71J78p49J188j096M42J36o94J180j024N05O8p80J119q98
$$ plain form
1719 -988 433 -1460 3538 -1580 -769 1049 -2061 1922 -877 986 810 -3060 1654 -506 665 840
1735 840 -1766 1552 -1792 155 1730 -965 1067 -1801 182 1045 -1140 1790 -895 -381 143 -970
1751 -970 2008 -671 -192 342 -1319 1127 -404 527 572 -1606 683 -412 397 783 -1013 623 -868
1768 -868 -86 969 -502 693 -826 -340 641 -529 910 -328 -371 232 -751 899 52 -212 246 -854
1786 -854 519 15 21 600 -804 135 -116 3 754 -567 199 -188 -378 633 -297 405 -137 -607 515
1805 515 -356 388 136 -474 378 -627 306 362 -386 410 -635 168 239 -380 676 -507 -23 116 -398
1824 -398 746 -425 93 158 -602 603 -324 269 221 -677 553 -386 199 318 -526 530 -555 123 383
1843 383 -476 552 -510 61 239 -510 678 -418 24 160 -534 646 -378 127 195 -585 534 -364
1861c64N70K2p70J040r31N96J02o67R06r73N90R6n54Q82r39M87J0m46Q56q36M72
1882A49j12l80P91p34M87j62l50O28o24N22j77k41M39n65N23j86r8K96n06M26
1902A26j94P9J78l93L13k45J93O4k10K33l44K64n9J3J65l90L53l06J94J43l36
1923a59M30n86L47P8k89N63p71M96j15k61P90r33O32l46k42R47j080R12n10k97
1943c94R29j215J326o83l66R66j415J557q41r9J001j845J735q79J26R66k056K032
1961H45j304K02J232j993K071j878N28J379k260K393j920N17R28k218L158k296
1977f16L40R48k162L150k623J089R62k970L219k284J475M63k991L782l029J275
1993B8J057k444L348l966K075J256l021L648l499J998J8k657M995m114J432K00
$$ plain form
1861 -364 206 228 -542 498 -433 163 265 -402 504 -469 121 217 -337 545 -394 93 103 -343 513 -323 149
1882 149 37 -343 448 -286 201 39 -311 317 -307 215 38 -203 236 -329 194 8 -90 206 -300 126
1902 126 -68 11 189 -204 109 -136 57 121 -89 144 -200 64 5 18 183 -207 146 -160 34 177 -159
1923 -159 271 -315 32 110 -179 384 -387 109 -6 -267 523 -410 222 -124 -366 581 -499 413 -97 -394
1943 -394 535 -680 646 -37 -403 563 -852 705 -136 -235 766 -1079 656 -223 -97 869 -1187 845
1961 845 -459 -257 975 -1018 1053 -825 -297 1082 -1178 1215 -705 -188 740 -1478 1680 -616
1977 -616 -276 672 -1490 1660 -963 126 1088 -1882 1337 -947 528 991 -2000 1782 -1247 28
1993 28 1085 -1359 1989 -1977 98 1354 -1667 1981 -1518 480 498 -2159 2836 -1278 154 354
2009C54k139M346m650L054J98l567M174l633L552j113l034N158m963K906m5j677
2025a079L866o241M425J01k786M171m817M070k226j878O181n741K896j515q67
2040a440M515o382N508j367l203M070m318N725l384k094N610o233M214j459J0
2055b28L378p769O442j285j919L795n129N564m655m34O430o434L837l239J007
2070f39L513p016P495l081k158K947l985P226n777j13M834o635N032k993K546
2085A196J641q042P820l040r9K329m325O360p149J795N400n921M152m819L208
2100E06J561o419Q452m380p41J041k804P619p227J784L407o065M809l639M503
2115B407k05p232P842l917J244R40k864N832q232L399L981m691L709n309M518
$$ plain form
2009 354 -1785 2561 -2089 965 1163 -2404 1770 -1863 1689 576 -2458 2700 -2263 643 598 -1079
2025 -1079 2787 -3454 971 1072 -1714 2457 -2360 1710 -516 -2394 3787 -1954 942 -573 -1440
2040 -1440 3075 -3307 2201 834 -2369 1701 -2617 3108 -276 -2370 3240 -2993 1221 -238 -228
2055 -228 3150 -4619 1823 538 -1381 2414 -2715 2849 -1806 -2240 4190 -2244 1593 -1646 -639
2070 -639 2874 -4142 3353 272 -1886 1061 -2924 4302 -1475 -1588 3246 -3389 1643 -1350 1196
2085 1196 2837 -5205 2615 -425 -524 1805 -2520 3840 -3309 -1514 3886 -2035 2117 -2702 506
2100 506 2067 -4352 4100 -280 -1021 20 -2784 4835 -2392 -608 2799 -3266 1543 -2096 2407
2115 2407 2202 -5030 2812 -1105 139 1079 -1785 4047 -4185 -786 3195 -1496 2213 -3096 1422
2130A422n17m834Q240m899M55q68j198O821p506L450J363m621L836l739N985k130
2146A260n377O631m223K575p06r41M519q222M361K138k702K725n079M959k173
2161b55k840O993m482J132k236J20N340o456M009j13l260K630l004N936k881l529
2177b896M835l818K854j219L62K865p019M188Q26j021J765m153M267k944j018
2192b126N195l446J331k962J013L534m628L823j221j732J172k028N233k913j770
2207a525K638k914K697j370J287J290n214L257j1K76R79k931K898k780J11L452
2223B140k188J058k703R19K116k635K978j391j124M11j149L825j973q75J090k064
2239a565K035p45J239M41l442J887j67Q19O49j858J448k041M57K111r60O41k098
$$ plain form
2130 1422 905 -3929 4311 -588 -133 -1001 -2199 4622 -2884 566 1929 -2692 1144 -2595 3390 1260
2146 1260 -4117 2514 -1709 866 160 -781 3738 -4484 -123 2015 -687 2038 -3041 1918 -255
2161 -255 -3095 3898 -584 548 -1688 -1568 3772 -2684 1325 1212 -2048 582 -2422 3514 633 -2896
2177 -2896 1939 -1879 975 -244 118 2983 -4036 152 978 -43 1722 -2431 1836 -1108 -2126
2192 -2126 3069 -377 954 -2008 -995 2539 -2089 1734 513 -1219 -47 -2075 3158 245 -1525
2207 -1525 1113 -1801 896 -474 813 2103 -3111 146 135 411 1390 -1541 1357 -1423 -1312 2140
2223 2140 -48 1010 -1693 -774 1342 -1293 1685 294 -830 -419 -1568 2257 284 -591 499 -1565
2239 -1565 470 -275 964 1405 -2037 -150 -317 502 1151 -707 741 -1300 -843 1268 308 949 -1149
2256a149M23J153r88J938j091p51j34n14K409q13m27N8j348J252o4Q68J47k051
2274a082O52n5P51P66j110K84j156K10J458k58L05j248l89Q23j30J158m67r03
2292c91o5m06J394K03m84j40j084O41N10L10L80j321j55J63L95J018p15l03m91
2311e41k65J187N6J75n79r73P12J40O86Q6j013O9m90P66Q00n46j1r89K14P51n2
2332A83O96r95m51K27OJ212n27l84j79o56J099N4K36j89j189O49qN95L67j002
2352b56J89o61N31Q95n31K45r91K9O67j41Q67q47m21J56k30J187l83j79j74p71
2372h19R43%L62n0j070M81j95N90M38p58J36p02M15O77k88L28q83m6L72j2P94
2393G13o43k77q0j96R05j89K9k80o22N85L8M48o9o96J68k29N45K87l22k6n83K76
$$ plain form
2256 -1149 -726 427 -561 1377 286 -465 -599 -1113 1296 483 56 114 -1234 18 -46 822 969 -1082
2274 -1082 -430 -485 266 1032 -78 206 -950 -740 718 460 765 -483 -872 -49 -179 979 512 -391
2292 -391 -456 -862 532 735 251 111 -973 -332 178 488 868 -453 -608 -445 -50 968 253 -50 -541
2311 -541 -806 381 437 612 33 -940 -228 -88 598 684 -329 -260 -750 16 816 270 259 -730 -516 235 183
2332 183 879 -116 -567 -340 -334 878 351 -33 -212 -868 231 285 521 332 -857 -208 -216 379 746 -256
2352 -256 -67 -728 -197 698 167 412 -579 -550 117 -24 843 -4 -425 -269 -499 688 305 126 -48 -819
2372 -819 124 124 486 436 -634 -153 -348 242 680 -78 58 -644 -229 448 160 488 -395 -441 -69 -81 713
2393 713 70 -207 -287 -483 422 233 262 -18 -640 -55 -17 431 362 -334 -166 -395 150 437 115 89 -494 -218
2415b18L64J08J42n82p4K3K08M61k27k12l30M1M23J15N7l49k06j6K21L97j35k11
2437@l27R3K80P3K38l79k16l6J61N43l30n0j92k14M68j24M36l35n40M54k03N48
2459C48j75k66K99q09O69J75j41K30r31P41k09j08P91q70M12n90J71R70j092P41
2479C56n17j81O14q10J346q50m42P90q79J192q30J62O75j625J369m22J90L71j462
2498i53J676j099J07J035j304J230j465O41J049j791J647j142K86M60j423K354
2514A308j693K3Q78j400J906j770Q96P05k211K159j304Q27J93j796K591k148P05
2531a31Q51j527K005k450J478O27k087K449k022J186j44j523L038k692J058K91
2547D07j392K404k794K024K8k092K649k321J868n79j501L045l114J730Lj233K415
$$ plain form
2415 -218 146 254 396 -186 -260 -237 -29 432 205 -7 -337 -296 127 242 299 -50 -256 -272 -51 346 211 0
2437 0 -327 -234 46 119 357 -22 -238 -274 -113 430 100 50 -142 -356 112 -12 424 89 -451 3 -200 348
2459 348 173 -93 206 -603 66 241 100 330 -601 140 -69 -177 614 -256 156 -434 -263 707 -385 356
2479 356 -161 -342 272 -538 808 -42 -484 306 -573 619 -211 -49 626 -999 370 -52 138 509 -953
2498 -953 723 -376 -269 766 -538 692 -773 -132 917 -874 773 -369 -83 377 -1046 1308
2514 1308 -385 -362 516 -884 1022 -748 148 853 -1358 801 -503 324 517 -1279 1312 -836 -131
2531 -131 720 -807 1198 -1252 226 853 -1234 1215 -807 379 235 -1288 1750 -942 116 407
2547 407 -985 1419 -1375 649 677 -1415 1234 -1087 781 202 -1299 1746 -1368 362 365 -868 1547
2564A547l294K510l03j735K767k818K236r80j202L201l420K160n73j020K542l437
2580a819K957q95j448K702l048K771j415q45K888l597K725j114n42K300l598L294
2596A316j470p43K422l210L098j974k29K491l490L100j825k0J977l392L516k050
2612d83j34J975l160L408k328K51J943l322L357k234M38J654l229L481k409M74
2628c18J629l079L422k546O39J496k985L429k623P63J313k852L396k688R90J060
2644A046k789L403k638J061P88k513L355k857J244Q16k377L011k810J604M87k355
2660a524L097k682J439K01j844L068l012J499L67j765K648k768J839n0j895K843
2676A461k474J558l08j416K759k843J676P2j443K167k580K076k70j582K418k330
$$ plain form
2564 1547 -1747 763 460 -1275 1492 -1326 910 -70 -1272 1929 -1491 669 96 -924 1618 -1819
2580 -1819 1138 243 -1205 1497 -1551 1220 -195 -1040 1848 -1749 976 -138 -680 1620 -1978 1316
2596 1316 -154 -897 1525 -1685 1413 -561 -790 1701 -1789 1311 -514 -534 1443 -1949 1567 -483
2612 -483 -617 1358 -1802 1606 -722 -471 1472 -1850 1507 -727 -289 1365 -1864 1617 -792 -318
2628 -318 1311 -1768 1654 -892 -253 1243 -1742 1687 -936 -173 1140 -1712 1684 -1004 -14 1046
2644 1046 -1743 1660 -978 83 871 -1642 1713 -1144 100 916 -1461 1550 -1260 344 831 -1524
2660 -1524 1573 -1109 330 531 -1313 1755 -1257 242 609 -1156 1492 -1276 563 513 -1382 1461
2676 1461 -1013 545 237 -1179 1580 -1263 413 485 -958 1209 -1371 705 435 -1147 1271 -1059
2692a059J580m73q92K365k752J593j52r02J830k313J951o44j151K115j886J511
2708G21q82n51J904k296J657l75o17J197j946K012p08p37J470j666J371q48m9
2725c43J449k082J308m38j69R86j563J601r08m89J311j172J156r49r4J097j518
2742h17J307l90k62N43j270J513n75l27Q36j131Q99o10K09Q60j374P82l70N4N87
2761D64r00R80p27k61P82n63P23o80p0N47q03Q46k09j49J32o94Q53k16q3L41o55
2782c42L86k45K14M99p40K61k05L2M50l87L78m01k67M89j73L83k67k83K76l68
2802c10M84R6k72P7m76L99J64j24K47n05N5Q1J1M87m17p8n4j51N21j41N7j25m26
2825d00M09j1K18M7n08J77j65K66L34l74J10l96Q4M20j38K60m40j72K56j31N40
$$ plain form
2692 -1059 521 48 -844 1521 -1231 362 210 -692 1138 -1175 776 132 -1019 1096 -790 721
2708 721 -161 -712 1192 -1104 553 178 -439 758 -1188 824 116 -621 849 -817 554 -294 -343
2725 -343 1106 -976 332 -106 -275 711 -852 749 -159 -648 663 -509 647 -302 -396 701 -817
2742 -817 490 100 -162 381 -889 624 49 -278 558 -573 326 -284 -75 785 -589 193 -177 -123 464
2761 464 -436 544 -183 -444 338 -225 498 -182 -252 295 -508 338 129 -20 112 -582 271 55 -28 313 -342
2782 -342 44 -201 13 512 -228 33 -172 -140 310 -77 301 -100 -367 122 -51 332 65 -218 58 -310
2802 -310 174 270 -2 75 -401 -2 162 38 285 -220 -165 -84 -73 414 -3 -81 -135 -286 235 94 151 26 -400
2825 -400 9 -2 216 263 -245 -68 -233 33 367 -7 103 -293 -209 211 73 333 -107 -279 -23 -154 386
2846C86k25k53Ql23N88j4m4K0n59L51J2K20K18o14J54k00K01M50l63J59m56l4
2868c18M77j33L63m28k41K20j72O02j54k37k6m02N86K6K7K5o03K80j0K72K78n56
2890a24O7k63J78M70k26J16m76q5L77k2L84l67k47M4r3N70o9j50j62l47M28J12
2912A15J51l0n02P5oL47K38l37r9k88J65L64M0L9m49j29J78K01K88k33k10j89
2934b71K4L88J38o4l27k07J40K42K22r0k47k79P5L67J74m2l61j44Q5J61L87j56
2956B15k31k89mN05LO6k44l42J80J2N34o6n15J7k14M98J10j00J38p70K59K65J86
2979B13K76q08K57j76l2P71m05J55o58r4Q85m58M98l99l45K90n12J171k74n74
2999b19K49o30R39l32J32M91j342O08p0M48L92j259R09o80k3R24n86P22j352J90
$$ plain form
2846 386 161 -92 -84 -407 181 167 123 143 -416 -65 -53 167 385 -229 -75 -275 -74 376 13 172 -284 -318
2868 -318 159 26 389 -39 -280 -60 -232 370 216 -21 -47 -449 137 163 190 215 -388 -108 -118 154 432 -124
2890 -124 -57 -320 -142 328 102 218 -258 -343 34 12 396 29 -218 -174 -267 303 234 84 -78 -425 3 115
2912 115 266 236 -266 -191 -197 150 388 51 -48 -336 -171 193 233 272 -177 -306 -128 73 361 128 -82 -271
2934 -271 -247 141 279 215 -112 -319 -179 63 285 195 -52 -331 -256 111 285 243 -118 -262 -177 -16 371 215
2956 215 -16 -305 -309 196 199 265 21 -321 -141 -129 405 339 -176 -159 -373 125 235 135 273 -497 -238 27 213
2979 213 489 -319 -62 -238 -270 501 96 251 -407 -501 384 -74 424 25 -320 -30 -542 629 355 -219
2999 -219 30 -600 339 7 139 630 -712 -104 -174 274 666 -593 316 -364 -387 537 -49 673 -679 -489
3019d89J056r59J010p31K1J10j003J941p68l67K94q94J399j075O74O80j840J034
3037I3n85R46K02j528J667j379K07Q49o06J243k147P46R42j308J508j185O71m26
3055i0j194K609j433J74l6p86J657j924J556L83j913J260j137J712m81j325K178
3072A210k109P48K70j91J449k866J625L25j192J648j530J477j271r12K858j989
3088d50Q35n81l49J578k523K420k09j579J246j513K337j283p49K241k557J275
3104A39m00L83J259l128K351n02p32J457j613K075k114k06K476k151J401j267
3120e72M59R67k543K954r87p47P14j407K642k090K33J656k428J586j122J194N78
3137A087k761K647j294M0Q40j295K223k645O12J663j901J664j696J075K61k116
$$ plain form
3019 -489 567 -392 618 -113 -92 18 -985 956 188 -179 115 -779 620 -455 219 899 -941 93
3037 93 -492 454 656 -872 795 -584 -377 472 -134 1109 -1038 -292 650 -658 850 -335 336 -90
3055 -90 -1284 1325 -108 66 30 -756 901 -1023 533 916 -997 263 -874 838 357 -968 1210
3072 1210 -899 -151 119 -72 1377 -1489 136 461 -731 917 -613 864 -407 -1319 1539 -450
3088 -450 385 -196 -545 1033 -1490 930 721 -858 388 -1125 1212 -71 -820 1421 -1136 139
3104 139 -261 122 1381 -1747 604 102 -630 827 -786 1289 -825 -1031 1445 -706 695 -572
3120 -572 -113 854 -1689 1265 278 -469 245 -1162 1480 -610 -377 1279 -1149 437 -685 509 1087
3137 1087 -1674 973 -321 -281 559 -736 1487 -1158 -546 1117 -784 880 -816 259 520 -1596
3153a596K958j509M3K04j130K464k366R62R25j976J596j488J632n8k013K432j691
3170f11O74J53p54J944k643J200O83j235J454j748J490n01j274K391j636O98m60
3187a75m97J832k182J427N6j135J197j461J751o12j065J763j632J030l52k32J358
3204A071k182J376n3n94J113j500J431q14n58J636j420R53p12j25J181j656J389
3221E36m09m95P85j178J488q00l38J044j271J022o13J75P20j477J177m66l3N73
3239D40r92J126q68%Q04r16Q48p25J70N17r57J035n57k4L40p23J001o70N7M48
3259C54p91P56n17K43L06q03P54m68J24K97n80O74n87J42L55n35N86n05J48K27
3279A80m77N98m11Q8J37l96N37l72J34J24l72M24l15J70R7l32L47k74J34J16k61
$$ plain form
3153 -1596 1362 -147 -104 100 -1030 1434 -932 30 955 -1021 575 -913 719 661 -1352 1080 -611
3170 -611 63 216 -538 1406 -1237 -37 646 -589 865 -883 607 106 -1168 1223 -413 285 -175
3187 -175 -672 1160 -1022 405 461 -674 523 -938 813 201 -864 899 -733 297 -55 -287 1071
3204 1071 -1111 265 212 -382 731 -769 662 -152 -710 926 -494 459 -253 -378 803 -853 536
3221 536 127 -368 417 -761 727 -73 -411 633 -638 384 -229 -54 666 -811 366 -100 -133 440
3239 440 -552 574 -294 -294 510 -406 442 -283 -113 404 -553 482 -75 -99 241 -482 519 -151 -94 354
3259 354 -437 319 -198 45 351 -452 302 -166 -42 255 -325 349 -238 -96 259 -276 310 -195 -47 180
3279 180 -297 301 -110 -22 115 -281 256 -116 18 142 -230 194 -121 49 146 -186 161 -113 21 137 -124
3300a24K80k65J02J02j96K54k25N5P9j59K20j67L2P2j81J88r2K1O0j61J57p8K
3323b4J00j43J02o1j4J29j43P9j9n9J13r9Q7mj10J26q6M0M0j00J06j02M2P1j13
3348d2J02r9K0Q5j37J37p1l7R2j26J52r0k7R9j66J51o5QJ01j91J56q2QJ17j79
3373h4J55j00oJ42j68J54j13k5J37j75J89j04l4J03j68J94j00l3J13j90J76p4
3395a1nR8j83J53q7mJ28j72J25q4j0J32j40J24q1l5J12j31J42o5m8Q5j20J33k3
3420C3l9O8j29J05Jm1R5j46N1jj9J10j01L2j2p3J24n5L8k7j05J13m8M8L6j07N9
3447A0p3L6J05j04N7p3j1J06p2J02p3q2J03q9J38l3p9R2j67J41L8p3J15k31J23
3472FK7o4J79k23Q6m1p3K70k16Q7m9j30K54j99J90j9k56K40k02K27%k34K78l16
$$ plain form
3300 -124 156 -109 -7 95 -101 153 -72 -17 62 -97 123 -44 -12 60 -121 67 -25 -4 56 -105 52 -26 -24
3323 -24 76 -67 35 -26 -40 89 -54 25 6 -53 60 -39 48 44 -66 60 -26 14 54 -46 60 -42 0 71 -42
3348 -42 60 -39 -19 66 -71 66 -5 -42 50 -76 76 -14 -41 58 -108 43 -22 -14 87 -104 52 -30 -22 95 -84
3373 -84 71 -29 -35 107 -61 93 -20 -45 92 -83 106 2 -32 71 -97 97 -3 -36 77 -113 63 -11
3395 -11 -16 82 -101 52 -35 -39 89 -83 42 -42 -52 80 -60 64 -17 -52 60 -71 71 6 -42 43 -77 56 33
3420 33 -6 62 -67 38 39 -2 93 -53 -2 -3 -22 88 -13 19 7 -66 58 3 41 14 -91 22 -26 22 58 -49 10
3447 10 -63 -27 78 -26 31 -42 -53 53 -19 83 10 -72 31 -58 80 47 -32 60 -107 34 72 -1 114 -117 6
3472 6 33 -31 148 -75 11 -30 -103 167 -49 38 -11 -141 113 -86 104 85 -171 69 -133 94 94 -140 138 -178
3496a78J65J08j46K64m14J93Q0j93L73l52J64o8k27N20l52J41n0k46M35m05L39
3517A51K0m03L63l74M20n0l39M86n47K79M1j25M38o99L45O3k74N25n13L61k21
3538e3l17P61n24K84j63k41N70o75N88J8n17M50n54O71j84l90O99p61L61k7p4
3559g8O19j035N61J6l41O41o82O39m66l64R89p06M47l35j44O34r78R14q1n02M28
3580A76p09R97m63k89Q48r89N25k71K08O30j314Q70k20k33N95p14R68q77k49J066
3600E55q28O57n93Q9N51j222J260k80l45K94p91J269p97p1Q89j141O57n45N25
3619A33N53j446J126n00m9M80o82J203j261j9R86q35Q20q81M59K74j257J490m89
3638A05p0No83J392j137L08O69j033O49p96R28K37j320J203p39K21J63m35J245
$$ plain form
3496 -178 -13 95 -51 213 -201 -8 72 -121 252 -100 64 -4 -231 289 -63 78 28 -218 217 -188 151
3517 151 171 -232 131 -243 177 127 -212 274 -273 6 47 -78 360 -339 6 69 -205 320 -193 168 -53
3538 -53 -370 391 -133 151 -12 -253 317 -358 230 248 -269 181 -373 298 114 -276 423 -338 23 -4 -78
3559 -78 541 -494 67 83 -258 383 -299 340 -126 -490 499 -207 240 -95 -239 395 -583 331 250 -252 176
3580 176 -533 464 1 -288 560 -429 96 -175 33 663 -651 219 -1 -234 361 -353 615 -262 -511 555
3600 555 -273 384 -209 -120 431 -791 469 189 -156 138 -653 616 -181 -252 637 -504 153 -392 133
3619 133 686 -760 366 -134 -183 297 -385 818 -443 -462 524 -311 509 -372 87 361 -896 594 105
3638 105 35 40 -643 749 -388 -80 589 -444 205 -591 337 574 -746 457 -282 -61 102 -333 912
3657I12j524L13O60o50Q17r97P64r7j078J500o31K08k69n09J327j262O22L98q69
3676c65N93r21J154m3j021J121q83M20j14j32J098j561N23L06l85O88r53R09m43
3695ip32J274o25M26n59j82R84j164Q28P3n03L20q23J203l15n67Q25q39N12l11
3715a84J63P73j324N81j8j01N09p62Q53o28m01R42n18N09o21rO36r34Q27j00k64
3736g1J44o62J019l70k30N22o97M45l66L33M87r75M89j97P4L06m62O49o17j58
3756c37N68k97M37n47Q4K74n65O67j68o4l2m41P00k91K1K32m78K86k85L24K76
3777C64n97K99k48J18K22k67M15m90m0L19j57L41l72L2J03l12M67j06j8o6k88
3798b81M14j50Q2J14l22J47j64K33J45l00J21k01R2J61r1J88k81o4J60m2K24j81
$$ plain form
3657 912 -612 -299 361 -289 528 -469 295 198 -880 620 -11 197 -72 -581 746 -516 106 504 -365
3676 -365 228 -693 461 418 -603 518 -365 55 -59 -191 907 -654 -131 175 -210 478 -475 434 -9
3695 -9 -741 533 -92 334 -225 -407 577 -587 241 314 -189 131 -692 511 196 -371 454 -385 127 -184
3715 -184 -21 752 -572 9 -9 -110 399 -363 490 -138 -539 403 -115 394 -227 -236 400 -534 293 193 -71
3736 -71 73 -589 430 60 -170 352 -345 100 -266 67 554 -421 68 -129 -55 251 -211 438 -179 -337
3756 -337 231 -66 371 -176 -92 182 -383 284 116 52 20 -421 279 -12 9 241 -237 49 -236 88 364
3777 364 -233 66 -182 -64 158 -109 306 -184 -224 95 -62 279 -93 -61 42 -270 197 91 73 7 -281
3798 -281 133 -17 65 179 -143 4 -160 73 218 -82 39 -162 -70 91 0 188 -93 -157 3 -39 185 4
3820Dn6J0j38K70mk3o2j74J69mP4N7k07M1n0J11J42j57L4j32PJ66l7Q0j29j10
3846a18J14l1J59l9j21Oq6J60M4m9Rj70O1P3K2Q9j74k0K1LJ50o7l0n3p6J67j1
3873C3L9m3j35R0j4J02L8j49M1p9P7R4o9M9j58J9R2j7J02j18m0J9l8J56m3k7m4
3900b3q6J30j5M8j5j33O8k4P9N6j13K3q3O8P2k9L4j18LO2J0Q3q7l7Ok0R9j3j2
3929C3l9m7N8RL8j1p0k3L2L5L2m3j5l4J3M6L1l0m0l0L2L7LJ3m3l0K3J3O9m0o1
3960c9M2n1Q2lqOj07R8j0J1M4j10P8p3L1J03j30Q5j09K1J07j43J58j15j3O8j15
3987i2K15j67PP2j60K11j45P0P0k30K29j28N5R6k40K62k11O7J37k13K45k65J10
4010eJ34k74L22k60P4R3k54L80l01P4J13k87L84l34J69J01l66M18l21J85O4l29
$$ plain form
3820 4 -52 -42 -180 90 86 63 1 -173 -4 -8 66 123 -84 -43 -93 18 160 3 37 -95 -88 78 41 121 -8 -118
3846 -118 -4 -35 124 85 -36 -30 -116 44 88 39 48 -122 -61 12 34 123 -51 -71 -50 -47 103 36 6 -47 -123 44 33
3873 33 72 29 -106 -16 -30 72 110 -39 2 -77 0 94 25 74 -84 -65 27 10 112 -6 -46 -27 -65 91 48 21 -23
3900 -23 -109 21 6 54 39 -94 -26 -50 29 85 -28 -5 -88 -20 52 23 57 -61 -58 4 14 97 10 -27 -21 -41 58 45 33
3929 33 -6 -53 5 14 52 41 -29 -52 -20 15 47 4 -11 -45 -32 14 45 15 -25 -55 -23 14 17 30 -13 -43 -20 -7 62 22 -39
3960 -39 3 -48 34 31 23 29 -78 20 10 21 65 -45 33 -40 -9 94 -36 49 -60 -39 68 -75 83 -32 -45 23 -92
3987 -92 123 -44 -37 35 -125 86 -59 11 81 -149 80 -48 7 103 -137 125 -86 -19 118 -95 150 -115 -5
4010 -5 129 -145 177 -83 -9 84 -170 210 -91 -17 96 -191 193 -141 28 129 -237 181 -140 45 109 -220
4032b20M53m05J81J02l05M37m52K43Q2l46M94m35K40Rl18N53n12K64K3l10N19
4053B97n42L74j5l78N57n50L84l5l46N93o27L87ql37N90o74M54m8l57O31o64M66
4075A52j21l32O89p19N08j41l13O69p55N85j72l32O59p61O29k15k79O55q09O58
4095B55k44k37O45q49O96k82k09O61q72P30l58j69O41q55P83m21j64O45q72Q31
4115C55m63r5O04r23Q78m53p0N61r27R33n46l3O14r32Q88n82O8N78r82R71o19
4136a75M9N06r03J052p53P4N44q96R81p40K13M37r84J076o96J95L25q60J090q50
4156c15K56M16q38R43q63M34L27r02J043q05L27J83p00J109r80L41K85o93R71
4175E39r50N70J16q40J079q14M73j3o59J098j039N30J78o38Q41j013P45M6p21
$$ plain form
4032 -220 233 -172 9 111 -194 243 -209 34 116 -230 264 -171 69 78 -240 313 -199 65 88 -222 297
4053 297 -245 129 114 -264 293 -257 127 92 -254 339 -288 99 91 -246 344 -330 124 76 -281 350 -314 152
4075 152 31 -301 388 -331 177 36 -277 392 -363 222 50 -282 377 -384 245 30 -249 406 -403 255
4095 255 11 -226 419 -430 266 -16 -225 436 -436 294 -64 -233 408 -447 336 -85 -249 396 -476 355
4115 355 -108 -203 401 -522 356 -97 -167 394 -533 400 -146 -179 435 -497 391 -191 -123 455 -527 444 -175
4136 -175 -126 380 -523 529 -224 -150 394 -502 479 -261 -48 389 -595 481 -215 -20 305 -555 535 -315
4156 -315 -59 357 -481 462 -401 33 360 -542 501 -304 23 206 -494 615 -365 -24 261 -432 539
4175 539 -411 159 275 -565 514 -300 173 160 -499 599 -440 90 268 -370 471 -542 203 249 -472
4194d72R89r10N54j39m32J063j128N67km27Q25r82Q06k01n90R24p89O61l45l23
4214c51Q98j045P01q2l11N84r55Q96k59l66P30q20O45m09p0P80r98O15k41j11
4234a69N32q15Q55m65k80O39o29P02n21l2N67q78P35k45n0L08p83Q70m04q2M73
4255C28o42N63n00J84N05p73N54l61Q1K74n27P18n31o3L52l93N82n10J27K22n73
4276c83N91k50J22L2m88O22l82J28K04l95L63m39K94K18m27L59l42J47R6k43N08
4297C35m60L2J43j89M05l58J40L0l40M16j62J32n0l03L67k63J94Q6k51J64k92
4318b24K52J17k08J75k51R7L9o4K82k98J8K1m5K45j67O8p0j67K42n0R7p0j58J37
4342A8r2J44O3j47J1j27J24J05o3N2j58nO9K2J25j43o6J8l6J65k4k9l7j33J34
$$ plain form
4194 -472 517 -393 161 22 -410 653 -475 92 90 -337 488 -494 312 111 -479 445 -344 317 -28 -351
4214 -351 547 -498 203 121 -190 394 -561 335 76 -290 440 -380 265 -144 -214 566 -432 183 -58 -169
4234 -169 363 -452 403 -62 -342 297 -332 370 -151 -183 384 -494 241 -4 -54 254 -529 341 -63 -145 328
4255 328 -314 249 -251 -67 438 -335 219 -142 -61 213 -314 404 -127 -190 162 -231 351 -159 -32 190 -383
4276 -383 208 -42 80 112 -376 246 -136 -8 196 -199 164 -275 19 237 -190 169 -173 -26 70 -173 335
4297 335 -125 -93 50 -139 266 -92 48 78 -262 154 -8 124 74 -229 138 -125 69 155 -96 68 -224
4318 -224 28 145 -63 112 -139 -42 -3 -67 215 -83 -65 -44 -89 156 -11 57 -13 -180 62 12 109 39 -119 18
4342 18 -74 70 133 -14 -3 -130 -6 99 36 88 -70 -75 -6 16 141 -2 -68 -50 -86 79 55 26 -11 -144 -10
4367a0M7L6j6j48K4PP7J08j25l1p4M3J35pJ2j21o6J04KJ18n0j14J0l2J24N9p5
4394C7m4j03P8P1J1M6j63k1K8N4J17j08j9o4j2J43JJ0q5r6Q6K1R1j6j01on6J34
4422C4N7m2l9j14N1P8M9K7j34k7NO2R4m7m1q9oR7N7mq3n1jM2Q1Oo3q2kQ5O3Kp1
4455fn8rM4J05pp0p7OR3K7M0o5q2J0L0J21j8q5j9p0J07L1L3j8j72P2J9O2N2j34
4485c8N0j06M4J50q7N5j80K7J14o8J66j41l5jo8K60j17k2Qj45J91r5J27L0k55
4510a36J55r7J39N5j89J85k42R4J31r8J71l10J11Q1j55K90k22O2n6j55L76k39
4532d9Q3j6j93K85k57K53K1l14K62k39K57rk12L37l94J66Q1j07K88m39K29J7j88
4555a38L67l22K23j66j85M73l61K09p8j67L09m18M13m4k91K82l39L87j33j67M21
$$ plain form
4367 -10 37 73 57 -91 -67 -60 17 125 0 -31 -105 -62 73 66 78 -43 -109 -5 -3 115 65 -49 -39 -71 53 112 37
4394 37 -7 -110 -32 39 50 96 -67 -88 -60 -6 111 3 -16 -80 -92 51 52 62 -23 -119 -33 -12 79 63 -38 -44 -100 34
4422 34 91 49 10 -104 -53 25 74 101 -33 -60 -55 7 101 54 13 -76 -82 15 72 68 -15 -66 -67 -25 56 62 -1 -83 -85 0 63 65 -6
4455 -6 -64 -73 -29 76 69 -1 -78 -72 21 48 88 23 -59 -49 -19 102 84 -1 -20 -90 17 48 81 63 -109 -37 -18 44 96 -38
4485 -38 12 -94 -50 100 13 68 -112 -85 29 -39 127 -14 -49 -50 -118 142 25 3 11 -134 57 -38 89 119 -136
4510 -136 19 -78 61 116 -73 112 -130 -36 95 -3 168 -142 -31 50 -105 185 -37 25 -31 -186 190 -49
4532 -49 34 18 -175 110 -147 106 127 -187 75 -164 93 84 -128 209 -185 -19 62 -45 243 -196 33 50 -138
4555 -138 229 -93 130 -36 -221 252 -109 100 22 -145 164 -254 159 115 -176 106 -233 154 21 -146 275
4576B75n29K69k4m6L35n74L99r5j89M03l84L72k89j51N35m89L47j85r0L31n54
4597c33N72j45k41L10m52N37k95r6M73o14L77j71L9L49o66N44k17j45L78m46N33
4618B91m44o3N07n39M53l11N3K72o09O74k73j03K51m73O21m44N0M12o17M73l42
4639a61J90K62o54O41l70JK75m38O43o10R1M08n78N72m48J95J82o49P78m16N9
4660b7J68m84O99o00K17L14n87N32m99L54J33n91P08n13J63J41l70O57o89K50
4680b4K39m74N69n42L51K2n19P26n15K39Ol61O62o66L58J20m64N35n61M37nm57
4702c24O64n98L20rk80O25p19L97K4l40N58o06M66j19l52O40n72L73j13k44N55
4723C46o60M72o1k76M54n84N01j53k42N06n71M11j64j25M66o20M42j50j48M02
$$ plain form
4576 275 -254 15 -9 -55 280 -294 105 10 -179 224 -160 212 -77 -228 307 -182 165 -20 -110 221 -333
4597 -333 239 94 -147 163 -289 248 -47 -143 330 -284 93 -78 -39 310 -356 188 -29 -174 204 -242 291
4618 291 -153 -216 291 -248 205 -106 -53 219 -390 284 11 -92 159 -314 307 -137 -87 325 -292 181 -161
4639 -161 29 291 -363 278 -92 -91 184 -254 389 -221 -130 278 -300 272 -176 19 201 -448 330 -86 -27
4660 -27 141 -343 356 -244 -27 287 -300 232 -267 87 220 -371 337 -176 -13 128 -242 415 -274 -24
4680 -24 215 -259 310 -232 119 141 -378 348 -167 72 78 -283 379 -287 71 191 -273 262 -299 138 133 -324
4702 -324 340 -258 62 53 -227 398 -321 76 100 -240 318 -288 178 59 -293 347 -225 148 35 -209 346
4723 346 -314 158 97 -179 275 -309 192 39 -203 303 -268 143 -21 -146 320 -300 142 -8 -156 246
4743B46n27M94k52j45M41m91M13k44o8L78n18M60k06r4L21m71M73k55o5L53m82
4764b39M22k34qK87m73M40k52j4K64m11M18k85kK63l88L86k57J8K05l61L91k47
4786g7L0J77l45L73k42M2J68l15L43k33O0J49k80K94k37P9J33k57L02k31P1J08
4808A12k36K82k37P1Q7j99K69k13P2P5k17K42j82Q3O0j98K38j92P8O0j68K08j76
4831h1P4O4j43J75j46O0L0j06J72j48N6L2j10J60j19M4M2j17J25r1N2K1r8J13
4855F1r4L1M6p3O9q0K4N1p4P7o2jL4n5R7o8jK8o4Q8n1J0M1r1P6k8JN6q7P2n4R
4887a2P0o9M5m6MM2n1O4m5j7L1n2Q2l6k2L4o2O5k0qL4q9O6j8rM7o3L3k9QO0n2
4919a5K9k5k3N5l5N9l2k5K8m0P1k1j7J6p2P0joK0n2L1l0K5L7n5K5n5L6K0k2K5
$$ plain form
4743 246 -281 213 -39 -184 257 -234 179 -65 -133 245 -273 187 -19 -113 208 -263 210 -45 -110 243 -239
4764 -239 183 -51 -59 228 -245 195 -57 -71 193 -218 200 -85 -87 176 -212 174 -83 -65 140 -221 170 -77
4786 -77 -47 130 -215 158 -84 -42 126 -189 154 -79 -19 130 -150 144 -93 -14 119 -138 164 -67 4 112
4808 112 -124 158 -79 -8 79 -120 149 -64 8 83 -134 108 -74 9 69 -129 109 -83 -5 55 -113 95 -81
4831 -81 -7 57 -86 89 -57 3 33 -73 99 -49 7 39 -71 89 -30 14 56 -61 64 -27 25 46 -52 61
4855 61 -33 -2 44 -29 40 -40 -16 35 -39 38 -24 -25 9 -46 51 -17 -18 10 -54 34 -17 -7 34 -57 19 -9 -8 48 -39 33 -21 -12
4887 -12 58 -11 34 -12 -8 34 -17 47 2 -15 16 -36 46 10 -12 22 -40 25 5 -3 31 -58 8 -10 -19 28 -35 -2 -31 -23 37 -15
4919 -15 14 -11 -34 21 -14 45 13 -12 16 -24 47 26 9 25 -47 23 22 16 36 -16 15 -15 10 47 -8 17 -38 -2 18 -4 21
4950B1m4j4K4kN8n6loj9O4k0K0l8k7M9k2N8k9k2J4l3O1qLj5m4M1oL0No2K9m3N0
4984A4K2n8N2p3K7K5k6P6j05K9j6kQ7q5N5n9k8J02n7Q4p2l8P5r3J26m0k1M7j32
5013h4J52m9mM6j39J17p1N1Q9j60R1r3N2Q3j32J39j46nJ02j07J78j62J5O9j52
5038a20K07j09L7J1j81K44j19M0O6j85J96j78J15J12k30J78j86J20P4j82K63k52
5060g9N6P1j28K69k74Q6N6k02K88k21J45l1k40L41k22J27J0j89K60l20K29Q5k20
5083a03K19k95K30kj80L56l51J27j2q9L41l88K13rk15L17k69K73j37k34L99l20
5105a29K40q5j28L01m64L51J8k01K56l98L57j30j50M30m31K18j32l4L67m94L58
5126A20j13j69L14l42M24k60j92M17l78L24j63m1K74n36M60p4j07K13m46M82k69
$$ plain form
4950 21 -23 -37 -13 -15 43 -13 -16 -22 -41 23 3 23 -15 -42 7 -15 43 14 -8 6 -27 34 26 29 14 -30 11 5 35 40 -22 7 -36 14
4984 14 36 -22 30 -43 -16 9 -17 59 -46 -17 -33 -35 52 -33 22 -37 -65 37 -20 64 -8 -46 29 -64 62 22 1 48 -84
5013 -84 68 19 15 61 -78 39 -32 19 108 -52 39 -54 -2 81 -51 88 -58 -63 39 -68 110 -52 -37 32 -120
5038 -120 87 -22 15 26 -155 89 -30 10 76 -109 87 -91 24 136 -94 84 -102 18 92 -90 173 -79
5060 -79 -23 48 -80 189 -85 1 57 -145 143 -78 67 36 -204 137 -85 42 52 -137 123 -197 32 117 -103
5083 -103 116 -179 51 49 -131 225 -126 1 -11 -100 241 -147 66 57 -158 159 -110 163 26 -208 191 -129
5105 -129 111 26 -102 199 -265 86 104 -97 159 -239 118 -12 -162 268 -163 55 -77 -111 256 -238 120
5126 120 7 -162 152 -190 234 -26 -218 199 -179 145 -18 -59 215 -321 139 65 -42 171 -275 207 -62
5147f2o3M14m69L00k71R0L42n51M51k25q3K42l55N62m13q5L54m19M26k90J05K05
5169B05n94N69k02K3J45m43N67m22O4L69m49L48m04K37K37n22N40l40K3J34l15
5190b30O08n22O1K27l68M52l92K55O4n17N58k83J40K7l48N35n02K08K30l56L31
5211A78m63L51J05m27N23m06J55j5k02N71n52J78J07k88M14m17L72p9m09N33l44
5232a15K57j02k37M65n22L08P1k33K89m78M10m8k64M41m09K34j35p3M65n23K46
$$ plain form
5147 -62 -125 289 -180 120 -151 -61 281 -270 181 -44 -127 115 -240 322 -91 -176 178 -241 185 -105 0 205
5169 205 -389 180 -22 1 146 -297 270 -152 -88 281 -168 180 -224 13 250 -272 268 -72 -49 85 -230
5190 -230 378 -144 -83 144 -224 228 -164 91 155 -362 196 -87 53 80 -268 267 -235 -27 203 -153 178
5211 178 -285 66 171 -256 267 -139 16 1 -201 370 -182 -4 103 -185 229 -188 184 105 -304 229 -115
5232 -115 142 40 -197 268 -254 54 125 -108 181 -297 113 65 -199 242 -167 67 -68 -141 324 -199 47
$$ [...]
8191c0
##END NTUPLES=NMR FID
##END=
