##TITLE=1H_Pr EtOH-1
 200.13MHz,.
 8 sc
 
 19.1.2026
##JCAMPDX= 6.0         $$ Bruker NMR JCAMP-DX V2.0
##DATA TYPE= NMR FID
##DATA CLASS= NTUPLES
##ORIGIN= UXNMR, Bruker Analytische Messtechnik GmbH
##OWNER= pz
$$ XWIN-NMR		Version 3.5
$$ Mon Jan 19 14:52:43 2026 Russian Standard Time (UT+4h)  she@DPX200
##.OBSERVE FREQUENCY= 200.1313
##.OBSERVE NUCLEUS= ^1H
##.DELAY= (6, 6)
##.ACQUISITION MODE= SIMULTANEOUS
##.ACQUISITION SCHEME= undefined
##.AVERAGES= 8
##.DIGITISER RES= 18
##SPECTROMETER/DATA SYSTEM= spect
##.PULSE SEQUENCE= zg30
##.SOLVENT NAME= CDCl3
##.SHIFT REFERENCE= (INTERNAL, CDCl3, 0, 14.3821)
##AUDIT TRAIL= $$ (NUMBER, WHEN, WHO, WHERE, WHAT)
$$ ##TITLE= Audit trail, XWIN-NMR		Version 3.5
$$ ##JCAMPDX= 5.01
$$ ##ORIGIN= Bruker BioSpin GmbH
$$ ##OWNER= she
$$ F:/spectra/data/she/nmr/H-C/1/audita.txt
$$ ##AUDIT TRAIL=  $$ (NUMBER, WHEN, WHO, WHERE, WHAT)
(   1,<2026-01-19 14:50:49.15 +0400>,<she>,<DPX200>,
      <created by zg, POWCHK disabled, PULCHK disabled
       configuration hash MD5:
       00 E9 B6 7A A2 85 ED C7 34 08 36 98 17 FE 4E 26
       data hash MD5: 16K
       9B E4 22 48 7E 20 9C 2C 91 C1 F5 A3 0B 52 7D 5F>)
$$ ##END=
$$ 
$$ hash MD5
$$ 9C F4 06 A4 FA E8 C3 04 A0 53 8B 61 E4 93 6F D2
##$RELAX= 
##$RELAX= 
##$RELAX= 
##$RELAX= 
##$RELAX= 
##$RELAX= 
$$ Bruker specific parameters
$$ --------------------------
##$DU= <F:/spectra>
##$EXPNO= 1
##$NAME= <H-C>
##$PROCNO= 1
##$TYPE= <nmr>
##$USER= <she>
##$AMP= (0..31)
100 100 100 100 100 100 100 100 100 100 100 100 100 100 100 100 100 100 
100 100 100 100 100 100 100 100 100 100 100 100 100 100 
##$AQSEQ= 0
##$AQ_mod= 1
##$AUNM= <au_zg>
##$AUTOPOS= <>
##$BF1= 200.13
##$BF2= 200.13
##$BF3= 200.13
##$BF4= 200.13
##$BF5= 200.13
##$BF6= 200.13
##$BF7= 200.13
##$BF8= 200.13
##$BYTORDA= 1
##$CFDGTYP= 0
##$CFRGTYP= 5
##$CHEMSTR= <none>
##$CNST= (0..31)
1 1 145 1 1 1 1 1 1 1 1 1 1 1 1 1 1 1 1 1 1 1 1 1 1 1 1 1 1 1 1 1 
##$CPDPRG= <>
##$CPDPRG1= <>
##$CPDPRG2= <>
##$CPDPRG3= <>
##$CPDPRG4= <mlev>
##$CPDPRG5= <mlev>
##$CPDPRG6= <mlev>
##$CPDPRG7= <mlev>
##$CPDPRG8= <mlev>
##$CPDPRGB= <>
##$CPDPRGT= <>
##$D= (0..31)
0 0.7 0 0 0 0 0 0 0 0 0 0.03 0 0 0 0 0 0 0 0 0 0 0 0 0 0 0 0 0 0 0 0 
##$DATE= 1768819848
##$DBL= (0..7)
120 120 120 120 120 120 120 120 
##$DBP= (0..7)
150 150 150 150 150 150 150 150 
##$DBP07= 0
##$DBPNAM0= <>
##$DBPNAM1= <>
##$DBPNAM2= <>
##$DBPNAM3= <>
##$DBPNAM4= <>
##$DBPNAM5= <>
##$DBPNAM6= <>
##$DBPNAM7= <>
##$DBPOAL= (0..7)
0.5 0.5 0.5 0.5 0.5 0.5 0.5 0.5 
##$DBPOFFS= (0..7)
0 0 0 0 0 0 0 0 
##$DE= 6
##$DECBNUC= <off>
##$DECIM= 32
##$DECNUC= <off>
##$DECSTAT= 4
##$DIGMOD= 1
##$DIGTYP= 9
##$DL= (0..7)
0 120 120 120 120 120 120 120 
##$DP= (0..7)
150 150 150 150 150 150 150 150 
##$DP07= 0
##$DPNAME0= <>
##$DPNAME1= <>
##$DPNAME2= <>
##$DPNAME3= <>
##$DPNAME4= <>
##$DPNAME5= <>
##$DPNAME6= <>
##$DPNAME7= <>
##$DPOAL= (0..7)
0.5 0.5 0.5 0.5 0.5 0.5 0.5 0.5 
##$DPOFFS= (0..7)
0 0 0 0 0 0 0 0 
##$DQDMODE= 0
##$DR= 18
##$DS= 0
##$DSLIST= <SSSSSSSSSSSSSSS>
##$DSPFIRM= 0
$$ [...]
##$SUBNAM0= <"">
##$SUBNAM1= <"">
##$SUBNAM2= <"">
##$SUBNAM3= <"">
##$SUBNAM4= <"">
##$SUBNAM5= <"">
##$SUBNAM6= <"">
##$SUBNAM7= <"">
##$SUBNAM8= <"">
##$SUBNAM9= <"">
##$SW= 18.0517328524113
##$SWIBOX= (0..15)
0 0 2 0 0 0 0 0 0 0 0 0 0 0 0 0 
##$SW_h= 3612.71676300578
##$TD= 16384
##$TD0= 1
##$TE= 0
##$TE2= 300
##$TE3= 300
##$TEG= 300
##$TL= (0..7)
0 120 120 120 120 120 120 120 
##$TP= (0..7)
150 150 150 150 150 150 150 150 
##$TP07= 0
##$TPNAME0= <>
##$TPNAME1= <>
##$TPNAME2= <>
##$TPNAME3= <>
##$TPNAME4= <>
##$TPNAME5= <>
##$TPNAME6= <>
##$TPNAME7= <>
##$TPOAL= (0..7)
0.5 0.5 0.5 0.5 0.5 0.5 0.5 0.5 
##$TPOFFS= (0..7)
0 0 0 0 0 0 0 0 
##$TUNHIN= 0
##$TUNHOUT= 0
##$TUNXOUT= 0
##$USERA1= <user>
##$USERA2= <user>
##$USERA3= <user>
##$USERA4= <user>
##$USERA5= <user>
##$V9= 5
##$VALIST= <valist>
##$VCLIST= <CCCCCCCCCCCCCCC>
##$VD= 0
##$VDLIST= <DDDDDDDDDDDDDDD>
##$VPLIST= <PPPPPPPPPPPPPPP>
##$VTLIST= <TTTTTTTTTTTTTTT>
##$WBST= 1024
##$WBSW= 4
##$XGAIN= (0..3)
0 0 0 0 
##$XL= 0
##$YL= 0
##$YMAX_a= 305063
##$YMIN_a= -309046
##$ZGOPTNS= <>
##$ZL1= 120
##$ZL2= 120
##$ZL3= 120
##$ZL4= 120
##$ABSF1= 10
##$ABSF2= 0
##$ABSG= 5
##$ABSL= 3
##$ALPHA= 0
##$AQORDER= 0
##$ASSFAC= 0
##$ASSFACI= 0
##$ASSFACX= 0
##$ASSWID= 0
##$AUNMP= <proc_1d>
##$AZFE= 0.1
##$AZFW= 0.1
##$BCFW= 1
##$BC_mod= 2
##$BYTORDP= 1
##$COROFFS= 0
##$CY= -3
##$DATMOD= 1
##$DC= 2
##$DFILT= <>
##$DTYPP= 0
##$F1P= 0
##$F2P= 0
##$FCOR= 0.5
##$FTSIZE= 0
##$FT_mod= 4
##$GAMMA= 1
##$GB= 0.15
##$INTBC= 1
##$INTSCL= 1
##$ISEN= 128
##$LB= 0.25
##$LEV0= 0
##$LPBIN= 0
##$MAXI= 10000
##$MC2= 0
##$MEAN= 0
##$ME_mod= 0
##$MI= 1.114404
##$NCOEF= 0
##$NC_proc= 0
##$NLEV= 6
##$NOISF1= 3.799351
##$NOISF2= 2.8
##$NSP= 1
##$NTH_PI= 0
##$NZP= 0
##$OFFSET= 14.38212
##$PC= 1
##$PHC0= -3778.113
##$PHC1= 3.99231
##$PH_mod= 1
##$PKNL= yes
##$PPARMOD= 0
##$PSCAL= 0
##$PSIGN= 0
##$REVERSE= no
##$SF= 200.129724274929
##$SI= 16384
##$SIGF1= 3
##$SIGF2= 2
##$SINO= 400
##$SIOLD= 16384
##$SREGLST= <1H.CDCl3>
##$SSB= 0
##$STSI= 0
##$STSR= 0
##$SW_p= 3205.1282051282
##$SYMM= 0
##$S_DEV= 0
##$TDeff= 0
##$TDoff= 0
##$TI= <>
##$TILT= no
##$TM1= 0
##$TM2= 0
##$TOPLEV= 0
##$USERP1= <user>
##$USERP2= <user>
##$USERP3= <user>
##$USERP4= <user>
##$USERP5= <user>
##$WDW= 1
##$XDIM= 8192
##$YMAX_p= 0
##$YMIN_p= 0
$$ End of Bruker specific parameters
$$ ---------------------------------
##NTUPLES= NMR FID
##VAR_NAME=  TIME,          FID/REAL,        FID/IMAG
##SYMBOL=    X,             R,               I
##VAR_TYPE=  INDEPENDENT,   DEPENDENT,       DEPENDENT
##VAR_FORM=  AFFN,          ASDF,            ASDF
##VAR_DIM=   8192,          8192,            8192
##UNITS=     SECONDS,       ARBITRARY UNITS, ARBITRARY UNITS
##FACTOR=    0.0002768,     1,               1
##FIRST=     0,             0,               0
##LAST=      2.2672688,     0,               0
##MIN=       0,             -309046,         0
##MAX=       2.2672688,     305063,          0
$$ Real data points
##PAGE= N=1
##DATA TABLE= (X++(R..R)), XYDATA
$$ [...]
2297H60q49l01N84p98J577k137J433K88j518J523j422J904j989M57J791k817K272
2314H58j562J262n34j306L188l255J690l27j06Q84k535L649k828P27Q85j603K378
2331A465l397L340j375j299K802k855K738k689J623O36k826L612l152K352j325
2346c50l60K558m067L808k323N83J047k491L662l766K453l99j407K539l288L518
2362A717k762Q53J375l053L833l477K207m46j428L034l738L273j960K66J305k623
2378a624L488l510K425l06j796K989l322K981k044K90J883l247L268k402J509
2393E82n01j192K988l647K707j125j01J100k404L497l081J066Q05j429J711k461
2409a485K754j636l38J778j959J812j964J702r2k005K713j905J002p39K93J018
$$ plain form
2297 860 11 -290 294 -504 1073 -1064 369 657 -861 662 -760 1144 -845 -388 1403 -1414 858
2314 858 -704 558 24 -1282 1906 -1349 341 14 -92 792 -1743 1906 -922 -195 690 -913 1465
2331 1465 -1932 1408 33 -1266 1536 -1319 1419 -1270 353 989 -1837 1775 -1377 975 -350
2346 -350 -710 1848 -2219 1589 -734 -151 896 -1595 2067 -1699 754 355 -1052 1487 -1801 1717
2362 1717 -1045 -192 1183 -1870 1963 -1514 693 247 -1181 1853 -1885 1388 -572 -306 999 -1624
2378 -1624 1864 -1646 779 473 -1323 1666 -1656 1325 -719 -429 1454 -1793 1475 -927 582
2393 582 81 -1111 1877 -1770 937 -188 -289 811 -1593 1904 -1177 -111 694 -735 976 -1485
2409 -1485 1269 -367 -705 1073 -886 926 -1038 664 572 -1433 1280 -625 377 -362 -69 949
2425I49k272K096q53Q6r0l27J438k128J507o8o75N77o92J274j442M52O41o80L74
2444A67m80Q76q30j7O59n30K42m59O55k78k78M08k1r4k77N48l57R5j64J98K49
2465C12p47Q18n00K67k92j06Q41j297R84m78M85l32p43J972j934P81L1J7L59j753
2485a315K619j631j26P44m51J123k785L073q96j561J954j260J836l090K148J238
2501A620l612K827j170J483k416O10L256m921K856m43O06j017j622N373n429J474
2517e25J562j090N17l117O078m409q69L773k404J427l983N827k177m008N941l036
2533d93J417l533M074R71o870O770k142K70k394J917M078q963O346n3j848l56
2549h09p67O625r269L817L392m314J151k077P091p484J03O977o174J809k406O154
$$ plain form
2425 949 -1323 773 -80 6 -84 -411 1027 -1101 406 338 -337 240 -452 822 -620 -168 473 -207 167
2444 167 -313 563 -267 -284 375 -155 87 -372 283 5 -273 135 114 20 -257 291 -66 29 -135 63 312
2465 312 -435 383 -117 150 -142 -248 593 -704 280 -198 287 -45 -788 1184 -750 31 62 79 438 -1315
2485 -1315 1304 -327 -453 291 -160 963 -1822 1251 355 -1206 748 -512 1324 -1766 382 1620
2501 1620 -1992 835 -335 1148 -1268 -658 2598 -2323 533 90 696 -321 -1943 3430 -1999 -525
2517 -525 1037 -53 464 -2653 3425 -984 -1853 1920 -484 943 -3040 2787 610 -3398 2543 -493
2533 -493 924 -2609 1465 2436 -4434 2336 194 464 -1930 -13 4065 -4898 1448 1395 -453 -809
2549 -809 -1576 5049 -4220 -403 2989 -1325 -174 -2251 4840 -2644 -2541 4436 -1738 71 -2335 3819
2565C819m139m532J0055o472N17o81L686m62p929J0862m466k236J569J140K744
2580C475r921R649q60n799L823n50M389r734O351L796q832M737r75M453p966K197
2596a767Q110j0647M242L9L042m791k364J1193j0211J544K650P75j702n636J2110
2611F587p811k222N670j602Q60p299J0632l314o856Q209k591J263o320P149J563
2626C918j0183Q713j652K26m255L151N878j2000P245J105k226j529l68Q311j1089
2641d755L690M548m277K23k404Q927q676n11P737n636J036k948P552m737m777
2656e008R717n354K07j893N082r16p711R973l745j548nK097K433r061Q374p51
2672A891m173K157r9L869q196N190K731o290L167p73L752o057J403N866p221K736
$$ plain form
2565 3819 -320 -4852 5203 -1269 -752 -1433 2253 1791 -6138 4724 258 -1978 -409 731 3475
2580 3475 -6446 3203 2343 -3456 367 -183 4206 -5528 823 4619 -4213 524 -451 4002 -3964 -1767
2596 -1767 6343 -4304 -62 -23 3019 -1772 -4136 7057 -3154 -1610 1040 1815 113 -5523 6587
2611 6587 -1224 -3446 2224 622 1482 -5817 4815 1501 -5355 2854 263 1526 -4794 2355 3918
2626 3918 -6265 2448 796 1022 -3233 -82 5796 -6204 1041 2146 -80 -1609 -1977 6334 -4755
2641 -4755 -1065 3483 -794 -571 -2975 5952 -2724 -3235 4502 -1134 -98 -3046 4506 -231 -5008
2656 -5008 4709 -645 -438 -2331 2751 1835 -5876 4097 352 -1196 -1201 896 3329 -5732 2642 1891
2672 1891 -2282 -125 -224 3645 -4551 639 3370 -2920 247 -526 3226 -2831 -1428 4438 -2783 -47
2688d7j02K256l128j870P384o393R72J324P42p64l930P438m526j248K963p98Q37
2705A110m485N979j812l378L855j245J156l842L946N24m629M085j259Q80k445
2720a560J524K516n152L384k11l00q62j17L178m338J929R55j274K35j098L167
2736A976l012K54K194k012P97j044K058j366j083K571j785M91n44J157k41j791
2752a380K540j322o1J79J54N17j662J648n04m81M58j00M82j235J168k22o05O21
2770A95l33L95o35N64O8n56L92j3o2k78N69k75l54N17j64l3k71N54k95k56L72
2791A01J5j09m48R44o44j75N65k91K15o33R15l33o96J019n48K96o57P53J02j238
2811h47J487p95K48l22J22Q61j754J472l23l88L50m82J288j827J105K48r76R07
$$ plain form
2688 -47 -149 2107 -1021 -2891 4493 -1900 -928 396 1138 374 -3556 3882 -644 -1892 1071 273 1110
2705 1110 -3375 2604 792 -2586 1269 24 1180 -2662 1284 1808 -2821 1264 5 885 -1560
2720 -1560 -36 2480 -2672 712 501 201 -661 -778 2400 -1938 -9 946 -328 -93 -1191 1976
2736 1976 -1036 -782 1412 -600 197 -847 1211 -155 -1238 1333 -452 39 -505 652 411 -1380
2752 -1380 1160 -162 -223 -44 110 627 -1035 613 109 -372 86 -14 468 -767 401 179 -426 195
2770 195 -138 257 -378 186 254 -302 90 77 15 -263 306 31 -323 194 30 -3 -274 280 -15 -271 101
2791 101 116 7 -441 503 -141 -316 249 -42 173 -460 455 122 -574 445 -103 193 -464 289 391 -847
2811 -847 640 -155 93 -229 -107 754 -1000 472 149 -239 111 -371 917 -910 195 443 -533 374
2829C74j013J549j462K31J240j724J297r89J034n69p02J890j852J103o45L62L46
2846D70j596K316j779N73K88p65J378k018J966r75l45J190j522J732j838J288
2862C63P4j382J977j913J561r68j9J219k015K080j552P52J85j028J735k115J759
2879G13q27l29J297j884J988j577P30L91j425J983j859J267n61k36J172j964K072
2896I51j362L36M88j137J757k070J521k52q86J323j390J533j446N73Q03j636J548
2913F54j183J052o96m01J693k014J282m95J96J36j018J826j510L60L37l52N77
2930D44j282J653r19m21J069q47P56j119J018P5j196J241n84L13n77L76O28j414
2948g86J069k18n9j04k06J006j228L59N30n11J39k55P63p36r4P77n34Q3k46N50
$$ plain form
2829 374 -639 910 -552 -321 919 -805 492 -497 537 -32 -734 1156 -696 407 -238 124 470
2846 470 -1126 1190 -589 -16 272 -493 885 -1133 833 -142 -487 703 -819 913 -925 363
2862 363 437 -945 1032 -881 680 -288 -307 912 -1103 977 -575 177 362 -666 1069 -1046 713
2879 713 -114 -443 854 -1030 958 -619 111 502 -923 1060 -799 468 -93 -329 843 -1121 951
2896 951 -411 -75 413 -724 1033 -1037 484 232 -654 669 -721 812 -634 -61 742 -894 654
2913 654 -529 523 -173 -574 1119 -895 387 -108 88 224 -794 1032 -478 -118 219 -133 444
2930 444 -838 815 -104 -525 544 -303 453 -666 352 427 -769 472 -112 201 -376 0 628 -786
2948 -786 283 65 6 -98 -304 702 -526 -167 363 -148 -9 -264 499 -237 -331 446 -88 -5 -251 299
2968B99j65n96P52j64k76R4Q9K43n98K64M17n50R4J14K06k94k47P52n41j4J25
2989DM3K22q80R80k44m95O00m73O52r51M87N20r65N87l41Q69r49j49J380j430
3009e33O68m03O70j19j253K061j346O1J42K10M38j933K268p28q70R44m10J079
3027I46k298J726O03k156J580o32J116j831N54K011k922J496k22P22j101p57L263
3044B098l224Q03O95p8q9j954L858k573n95J842p07N39k647L786j334k233K885
3061A072j136Q85k724K821O06l966L438q26M20j995J368K425m976L137J55n49
3077A55q39l22L938n175J841K018k045K89j356M273l989k81L682k757N94j556
3093a530L738k234k681N202k870J39r47K505q5m615N579j805j115RJ191J638n579
$$ plain form
2968 299 134 -462 290 126 -150 -56 33 276 -322 -58 359 -191 -97 17 223 -71 -318 434 -107 -121 4
2989 4 47 269 -611 369 125 -370 230 -243 409 -542 -55 465 -500 87 -254 615 -334 -483 897 -533
3009 -533 135 -268 402 283 -970 1091 -255 -194 -52 158 596 -1337 931 203 -667 277 -133 946
3027 946 -1352 374 977 -1179 401 -231 885 -946 -392 1619 -1303 193 -29 693 -408 -1165 2098
3044 2098 -1126 -323 372 294 205 -1749 2109 -464 -1059 783 76 615 -2032 1754 420 -1813 1072
3061 1072 -64 821 -1903 918 1524 -2442 996 170 590 -1405 -37 2388 -2588 549 704 155
3077 155 -684 -1006 2932 -2243 -402 1616 -429 -140 -1496 2777 -1212 -1493 2189 -568 26 -1530
3093 -1530 2208 -26 -2707 2495 -375 -236 -1183 1322 1237 -3378 2201 396 -719 -710 481 2119 -3460
3110c460M909j95k537R75N6K775n558L291K126m156J669l70K850m365Q77M199
3126C086m741J470j90K264k734j533N816m752N70Q94R16q31l170O073l448j305
3142a615K351k73N53m015N191j252l387L491r51J074l698L487J159m945L624m24
3158C70N15k634J513L162n654K989N32l44j341l24M353n222J514J905j268l13
3174b47j382M534m111j42L044j982M21j828L879k206k097M071k228L44j339K503
3190A234k98l503M252j562m43l23R56J312m150L651m03j449N50r7K019l710K155
3207A91J261k494J100m90J971k757N75K450k877J148m15J407j486p97L093k656
3223g76N62J99O17m80j521L054k073o8P65j24L33j893K574j119q66J312o26O41
$$ plain form
3110 -3460 1449 1254 -1283 -308 -252 2523 -3035 256 2382 -1774 -105 -475 2375 -1990 -1113 3086
3126 3086 -1655 -185 -375 1889 -845 -2378 3438 -1314 -744 150 1066 235 -2935 3138 -310 -1615
3142 -1615 736 463 1016 -2999 2192 940 -2447 1044 93 1167 -2531 956 2115 -2830 794 370
3158 370 885 -1749 -236 2926 -2728 261 793 449 -892 -1216 3137 -2085 -571 1334 66 -247
3174 -247 -1629 2905 -1206 -1348 1696 -286 135 -1693 2186 -20 -2117 1954 -274 70 -1269 1234
3190 1234 936 -2567 1685 123 -320 -643 313 1625 -2525 1126 723 -726 -176 -273 1746 -1964 191
3207 191 1452 -1042 58 -432 1539 -1218 -643 1807 -1070 78 -337 1070 -416 -1213 1880 -776
3223 -776 -214 -15 602 122 -1399 1655 -418 -486 279 155 488 -1405 1169 50 -816 496 -130 511
3241E11j592J710j59j497J685p91N95j191Q30P09j804J523m33L3l58K3J010j604
3259h00R63Q2m05J46l09J098j322M72N12p68M18l24P22p41J3P51p48K86j84M81
3279C43n19n5O91p56K67l1K14k99j84P55o29J56J40M5k49j53P16o39R0J84M1j62
3301c4k65P44n73m2L07k2j75k31P34n75n4L30n4o1m08Q20m77k82N04j81Q7m80
3323c88P75l32m22O21k99K17n48N93L3p50Q21l89J13k63K70M33j090Q61j82k8
3343D6j82q1P80j134P77pl51K91n09R44r72L29M34p07N72o26Q60n92k02R00r98
3364d28P38n48L67L1p41J185r96M98j69p3M94r60J136p89K03K80o09Q84j031Q22
3384B94k62l62P92r64R37o99L08K16p20J008r88O64j76l02O95r97J044p01P7M88
$$ plain form
3241 511 -1081 629 470 -1027 658 -133 462 -729 101 810 -994 529 96 129 -229 -206 804 -800
3259 -800 163 245 -160 -14 -323 775 -547 -75 437 -331 87 -237 485 -256 -243 508 -240 46 -138 343
3279 343 -176 -231 460 -296 -29 -60 154 -145 -329 426 -203 -47 93 138 -111 -264 452 -187 -97 87 128 -34
3301 -34 -299 445 -128 -170 137 115 -60 -291 443 -132 -186 144 90 29 -379 441 -36 -318 186 5 92 -388
3323 -388 387 55 -367 254 -45 172 -376 217 250 -500 321 -68 45 -218 52 485 -605 256 74 46
3343 46 -136 -217 563 -571 206 199 -152 139 -370 574 -398 -69 365 -342 230 -396 464 -128 -330 570 -428
3364 -428 310 -238 129 160 -581 604 -392 106 -63 -136 358 -602 534 -255 -52 228 -381 503 -528 294
3384 294 32 -330 462 -502 435 -264 44 260 -460 548 -440 224 48 -254 441 -556 488 -213 -136 352
3404C52p51Q09q20O82k12m65Q97q85O81n26K72L14r54J102o87K10mj98O59j052
3424e76Q74k21k65L45m11P61r62M93L23p13N77m52O04n70n3P67q38L82j62L05
3444B08k12m21R54p24Q9J44J4J27o82Q88l14l94M78j52J75n50N24J25o61M86o8
3465C4J07l72J48N44q16L23K26j84n1j94O49n36j25N17k58j8k19N02j52n55P19
3486B89l10Rm9Q5K67p52N22J83l85J13q3M91o56J21N50o04K66k86O00m15m11R93
3508E38p28K18j88K98J90j005J152m38j39N0l8P12j376J018N3o08M36m78J092
3527G59j344M10Q48j145O24n68J059q60m37J584j384N34l93P14j36j362K108j230
3545b19j7K21K7O67j915J980m41r10Q24m20J120k085J409O50j838J259n95J171
$$ plain form
3404 352 -399 410 -410 272 60 -405 492 -393 288 -238 34 348 -606 496 -191 19 15 -183 476 -576
3424 -576 298 77 -188 157 -254 507 -455 38 361 -352 225 -227 377 -193 -246 521 -317 65 -97 208
3444 208 -4 -425 529 -195 -106 38 52 179 -503 385 71 -323 155 3 178 -372 152 277 -384 102 34
3465 34 141 -231 -83 461 -355 -32 194 10 -41 -235 414 -122 -247 270 12 -6 -225 277 125 -430 289
3486 289 -21 -12 -61 24 291 -461 61 244 -141 -28 -111 380 -276 -155 395 -209 57 -229 371 -44 -455 538
3508 538 -190 28 -160 138 328 -677 475 37 -102 -52 -90 622 -754 264 317 -291 145 -333 759
3527 759 -585 -175 673 -472 152 -416 643 -217 -654 930 -454 80 -313 401 265 -1097 1011 -219
3545 -219 -236 -15 12 679 -1236 744 303 -607 217 -203 917 -1168 241 891 -947 312 -283 888
3563H88j675L44J866k428J151k78Q46j000p77K777k527N23M76J68r2j767L190
3580A685j988m68J292n11N98k268K911q56j703K041q16Q40k197K041O27l007K563
3597G84p26M63j418O75K075l640K103J69l53m95n25L028l569J044J439j306L01
3614D9j301L232k641n80K731j853N11j389K740j307k129L569j862K52j021J814
3630H15K34l414L787j196n70j78O59J478l932L176k8j570O23k49K220l769J951
3647C7J505k645J233o71K177k764K29K939l167J095l36J521j451j390L926l034
3663g96L36N03N08p6k560M000j977j015J522l11P43k924L294m94k303K219p19
3680e0R86k549K052J052l278K373n32O34j679O62K223l568J941P5l3o83n52K933
$$ plain form
3563 888 -787 -443 1423 -1005 146 -132 714 -286 -1063 1714 -813 -290 186 354 262 -1505 1685
3580 1685 -303 -771 521 10 608 -1660 1251 395 -1308 733 -83 757 -1440 601 1228 -1779 784
3597 784 58 521 -897 -222 1853 -1787 316 485 132 -363 -888 2140 -1429 -385 1054 -252 49
3614 49 -1252 1980 -661 -1241 1490 -363 148 -1241 1499 192 -1937 1632 -230 22 -999 815
3630 815 1049 -2365 1422 226 -344 -522 137 1615 -2317 859 831 -739 -116 -365 1855 -1914 37
3647 37 1542 -1103 130 -541 1636 -1128 -899 2040 -1127 -32 -368 1153 -298 -1688 2238 -796
3663 -796 -460 43 551 475 -2085 1915 -62 -1077 445 134 877 -2047 1247 753 -1550 669 -50
3680 -50 936 -1613 439 1491 -1787 586 54 688 -991 -329 1894 -1674 267 342 309 -374 -926 2007
3698B007l304J014J041q71J98j254K895k349k66J980j422N96j353K299j079j555
3714a423K682j530M16q31J213K69k463K720r76k59j15L12J090k660K195j46r86
3731d92N52l83J486k300J200Q54j641R37n46J204j526K68J411j764Q98m08Q05
3748E55p74n25J888j792N48J66J25l1j096J939j283J0M53k34L47j131J482n97
3766E0n91J002o01L98q23Q14J64j142J201m93J71l88K67M87j198J041k85j32K6
3785c2j28O89j052O11J81n07K82k07N44p34L02M33o11K29j01L54m11RN76o25K51
3806E3j4J11k36r1N41n20R2J20O6j84j36N16l96q4K74qj69r4L86k48j37J97J00
3829A39k25p3L85k33j53J95J15k12j15L75j88j41J21J58j63k18M64k33j35J67
$$ plain form
3698 2007 -1297 -283 758 -113 85 -1169 1726 -623 -889 1091 -331 265 -1088 1211 132 -1423
3714 -1423 1259 -271 145 -686 527 796 -1667 1053 77 -182 -297 15 1105 -1555 640 494 -492
3731 -492 60 -323 1163 -1137 63 917 -724 213 -333 871 -655 -387 1024 -740 158 -250 555
3748 555 -219 -744 1144 -648 -100 66 191 160 -936 1003 -280 -270 183 -51 296 -835 647 50
3766 50 -541 461 -140 258 -565 249 413 -729 472 -21 150 -238 29 516 -682 359 74 -58 -32
3785 -32 -160 529 -523 88 269 -238 44 -163 381 -353 -51 382 -229 0 -101 253 -158 -149 427 -198 53
3806 53 39 150 -86 -177 364 -156 -64 56 122 -62 -198 318 -78 -162 112 104 -65 -159 227 -21 -158 39 139
3829 139 -86 -159 226 -7 -160 35 150 -62 -177 198 10 -131 -10 148 -15 -233 231 -2 -137 30
3849C0M2kl09M41j22k37K41n6J14l88L98ll87L71j75J68k91J53K61n32M18j66
3871c1R0j10p3M22n76L72p0n9J41l17N24m94J66J63l00L21l83M27k85m0L29m38
3893b21M26l58K41%l03N21n21L52j31p9K59m11M74m01J82R4l13M02m12L83k36
3914e2p8L88n10L98k26J03L7k73M87m52K03J3o9J55l74N22l39n0K80k39K01l17
3936a92L41n8l03L62j57Q3k19K16J04m34L66o6l0j02P6K37m42K00J66j82m9M6
3958c7K35l17j2K96j59j20P3K01j92j56L47o3k75J92J02p8k02J99J93m14J52J70
3980A35q4j54J7M02m94P6K67j64kk19N38l50k34N18k93R0k71L98j1n66O62k81
4002b0O3k20J49M36r28P19j12j63P8k75Q31r70L65L47m73L27n33R52p61j48Q50
$$ plain form
3849 30 72 70 -239 202 80 -157 84 28 142 -246 152 149 -238 133 -42 126 -165 -12 249 -283 135 -31
3871 -31 59 -51 -124 298 -278 94 24 -35 106 -211 313 -181 -15 148 -152 169 -214 213 -72 -112 217 -221
3893 -221 205 -153 88 88 -215 306 -215 137 6 -73 186 -225 249 -152 30 124 -189 213 -199 184 -52
3914 -52 -130 258 -252 146 -80 23 60 -213 274 -178 25 38 -31 124 -250 272 -67 -117 163 -76 125 -192
3936 -192 149 91 -212 150 -7 76 -143 73 177 -257 109 43 13 -89 -13 224 -218 -18 148 -34 -83 -37
3958 -37 198 -119 -131 165 6 -114 -41 160 -32 -188 159 96 -179 13 115 37 -165 34 227 -187 -35 135
3980 135 51 -103 -86 316 -178 -102 165 1 -1 -220 318 -32 -266 252 -41 49 -222 176 165 -401 261 -20
4002 -20 43 -177 -28 408 -520 199 87 -76 2 -273 558 -412 -47 300 -173 154 -379 573 -188 -336 514
4023E14p73N06o77Q33k22q62J298q25L65m77M36M26j442J444n88M3j40q7J092
4042H64j813J227K8n57L71o19J473j697N49Q64j150P09q54J484j160m38J752j573
4060e40P72p15J010k08j521K343j453K55j37K99P14k284K414q05o17O13m32J432
4078A140k555J829L64j674J223p67J574k171P72J603k414J382p01J321j393n17
4094i84K724k737J021j13N81l17j672L271k335Q7P74k19N81k398L190j330j201
4111a077J755r09J139k483K353J87k572K410j004R64j871J044J746l516K409m62
4127A13K65q62l66K972l733J579P22p74J36j356L409l086J88J990j569P38j767
4144a401L090j808j438L097j967P61j474K110k10k822L532j620J94p29R19J198
$$ plain form
4023 514 -259 247 -430 403 181 -681 617 -208 157 -320 116 542 -900 544 -44 -1 -141 -228 864
4042 864 -949 278 306 -251 120 -499 974 -723 -174 690 -460 249 -605 879 -281 -719 1033 -540
4060 -540 232 -483 527 319 -1202 1141 -312 -57 -194 105 819 -1465 949 144 -473 140 -292 1140
4078 1140 -1415 414 778 -896 327 -440 1134 -1037 -265 1338 -1076 306 -395 926 -467 -984
4094 -984 1740 -997 24 -89 492 175 -1497 1774 -561 -474 300 81 662 -1736 1454 124 -1077
4111 -1077 678 -231 908 -1575 778 965 -1607 803 -201 763 -1108 -64 1682 -1834 575 113
4127 113 378 -484 -850 2122 -1611 -32 690 -84 52 -1304 2105 -981 -793 1197 -372 366 -1401
4144 -1401 1689 -119 -1557 1540 -427 334 -1140 970 760 -2062 1470 -150 44 -685 234 1432
4160A432l647L289o93q17K78k40K180l710K241P68j959J041q47K378k984P30K254
4177A694k797J336q55J896j702r64L435k972Q56j47Q81l10k215L784k331j59Q01
4194B31j27P71k820L355j105j434J711q07J227k612K250L62k471K121q94J068
4210H26j876R32J643l067K006m59M27q40l39K492l032J309M02m16O6j148K713
4227A639k395K15J385j146O58j432K276j251j034K181j458O68j080J381n5j950
4243a398K424j209K29m00L78R38k375K126n23n20L66l62J353k123J331L49j160
4260e76Q23o71J296j543M45J096j554R50n68Q44p38l94J558j516O16j21K66q2
4278A31q84J618j195J61L69k70M14j061J328n95m70Q21n40M71q15P99%q85J004
$$ plain form
4160 1432 -2215 1074 381 -436 -158 -398 1782 -1928 313 1081 -878 163 -684 1694 -1290 -560 1694
4177 1694 -1103 233 -622 1274 -428 -1392 2043 -929 -73 -220 661 351 -1864 1920 -411 -570 231
4194 231 104 875 -1945 1410 305 -1129 582 -225 1002 -1610 640 1002 -1469 652 -242 826
4210 826 -1050 -118 1525 -1542 464 5 432 -408 -747 1745 -1287 22 424 8 74 -1074 1639
4227 1639 -756 -541 844 -302 356 -1076 1200 -51 -1085 1096 -362 306 -774 607 552 -1398
4243 -1398 1026 -183 46 -354 24 962 -1413 713 190 -330 36 -326 1027 -1096 235 584 -576
4260 -576 247 -424 872 -671 -226 870 -684 266 -302 542 -196 -590 968 -548 68 -53 213 131
4278 131 -753 865 -330 -169 200 -70 344 -717 611 16 -454 367 -173 298 -517 282 282 -603 401
4297D01n47K90m03K59M46j047Q89k47r8N9j54O07q85N30J08l86K64k56N32o19
4317b57J92L89n64L10j55K78k78r7N09m87J35N6N1r8j74M62l64k1K04o6j9j69
4339a63L25j40k26L06n5j01k9J65lk70K63K6j81O1O8N0k23J20J90l17J32P1l2
4362C7p2m6K71k80J9J81j43M2j15K62j71j37L34k63J12r7R6O4l16L85k03JN4n7
4386d2J79l45L18q8j32K07k16K84l13J61J30l17L40k75K12j24n6K64l52L08k08
4407f5Q2O3k35L72l90K60n6j47K81l41L27k54R0J28l02L51k96K04q8o6K74m14
4429b22L44j44k2J05j81L20l74K13L3j63J66j70K80k93P2J99k80J68j08J83j48
4450b2r6K92k39O5l5J25r2j40K95j89j1MJ17n2j99K86q3j10K7J36m2j88K40m5
$$ plain form
4297 401 -146 144 -259 0 446 -601 288 41 -57 2 -152 455 -430 100 208 -178 86 -170 362 -257
4317 -257 -65 324 -240 70 -85 193 -85 -182 327 -160 -25 31 82 -16 -190 272 -92 -113 91 25 6 -163
4339 -163 162 22 -204 102 47 -54 -83 82 79 -191 72 98 -83 -22 46 96 -127 -7 183 -134 -2 69 37
4362 37 -35 -81 190 -90 -71 110 -33 9 -106 156 -15 -152 182 -81 31 -66 30 94 -222 163 -40 -39 15 -42
4386 -42 137 -208 110 22 -110 97 -119 165 -148 13 143 -174 166 -109 103 -21 -77 187 -165 143 -65
4407 -65 17 80 -155 217 -173 87 31 -116 165 -176 151 -103 -13 115 -187 164 -132 72 -16 -82 192 -222
4429 -222 122 -22 -44 61 -120 200 -174 39 72 -91 75 -95 185 -108 -36 163 -117 51 -57 126 -22
4450 -22 -118 174 -65 0 -35 90 -2 -142 153 -36 -47 -43 74 22 -177 109 26 -84 -57 79 37 -151 89 44
4474D4p1o1J62K6k86K59po3j13J60J11l53K48onj47O4L02m89K58L1l2o8j19M64
4499C09m87J23J52j00N4l23O04m33p1L46k65K50m95N74j51m11N64l56L28n05L81
4520H8K27p74P42l93K85l31j6P25j063O93j41kRm67J114j112L68K68l39L75q64
4541f08J274q38k02Q03o83N85r56J069k41r02J242q02N79q10O14M88j537J438
4559E13o13K64l77n7J217j862J187p4k70J37o50J666j806N90O87q73O15j050J750
4578I94j285l92J595j372P65r90J328l70j449K217j383M56n35O02O52k304K388
4595I17q84k91J91j98J444k606J903J04j188Q10p15J772k347R21J299j976J157
4612C13q50J596j557l46K336k325R60m56R79n31j489K958k120K81K53J81M64k314
$$ plain form
4474 44 -27 -88 74 100 -186 73 66 3 -110 50 161 -192 56 50 45 -102 -38 264 -225 33 64 32 -36 -155 309
4499 309 -178 -55 97 -3 51 -272 332 -101 -172 174 -91 159 -336 238 87 -324 240 -116 212 -293 88
4520 88 315 -459 283 -110 175 -156 -172 553 -510 183 42 40 49 -418 696 -416 -48 220 -119 256 -608
4541 -608 666 -172 -374 429 -254 331 -625 444 203 -699 543 -259 320 -490 124 612 -925 513
4559 513 -100 164 -213 -270 947 -915 272 198 -72 65 -585 1081 -725 -135 552 -321 294 -756 994
4578 994 -291 -683 912 -460 305 -685 643 273 -1176 1041 -342 114 -421 181 833 -1471 917
4595 917 33 -258 -67 -265 1179 -1427 476 580 -608 202 -513 1259 -1088 -167 1132 -844 313
4612 313 -537 1059 -498 -844 1492 -833 127 -329 650 119 -1370 1588 -532 -251 2 183 647 -1667
4630a667L002j301q11J169n59J102k511K350l4k003J861q79J202k108J212J418
4646A443k965K058o18O87j177j14K543l252J506K19j32k10j190L108k836M28J276
4663G74r61N67j748K912j745r51K210j384P53j632K140l85k170K740j326M74j070
4680h02J057R36k998K672o68l12k06NJ852l163J964L86j224N75p28K207k686P64
4698c69J622k013R87r04J881j632o24K601k262P98n20J120m50j735L008j909J27
4715b74K15K06N86k331K719r77q24R62m61J089k266J922J19j667J432p10J073
4732H13j713Q41J194k223J441m43N94q94j70J893k266J009J20n0j01r12K143j854
4750e78K19Q78o94M76j201J838j024o77J469r78N92j014J166p9j394J728r15L30
$$ plain form
4630 -1667 1335 34 -777 392 -167 935 -1576 774 740 -1263 598 -281 921 -1187 25 1443
4646 1443 -1522 536 -82 605 -572 -686 1857 -1395 111 330 198 -12 -1202 1906 -930 -502 774
4663 774 -187 380 -1368 1544 -201 -1152 1058 -326 427 -1205 935 550 -1620 1120 -206 268 -802
4680 -802 255 1191 -1807 865 197 -115 -321 -316 1536 -1627 337 723 -501 74 -654 1553 -1133 -369
4698 -369 1253 -760 227 -677 1204 -428 -1052 1549 -713 85 -435 685 235 -1500 1508 -401 -274
4715 -274 -59 147 733 -1598 1121 144 -680 282 -179 910 -1356 566 685 -982 450 -260 813
4732 813 -900 -59 1135 -1088 353 -90 504 -390 -560 1333 -933 76 196 146 45 -867 1276 -578
4750 -578 -359 519 -175 301 -900 938 -86 -763 706 -272 320 -694 472 393 -1001 727 -188 142
4768A42m77L68O74j704J516m28j99Q4k21J035j568R73J65o96N17n18R92j109K98
4787a56P33j007O04m13O42n44k67J061j008M12j34K24m2o36J106p82N9K62j79
4806f5K85o92Q48l47l25N35l64L38n37M82O3o21O77l51J68k05P2L58o81N27j03
4827F2j20Q6j36L98n57K96J46l32K23j79K92k93kL59m18J74pN1o2j39L76l06J0
4850g8J59j00N6j67K59j17j81L21j85K6m3R7N9k90L03q0r5P9n1J70l16K23P7k65
4874a39K30j48J69j89RK60l70K38p8L2j1j51L63l69J47Q0j51J80k78L49k13p1
4896a11K83k99K48k25J81Jk52L73l22K08j14kK00l86M09k43L8J11k43L40l69K66
4918I2n5j55K78l28L27k56Q8J28l00L77l47K16n2j22K62l55L63k30K5J56k49L10
$$ plain form
4768 142 -335 33 707 -997 519 91 -108 -24 -245 790 -778 195 360 -336 181 -337 655 -454 -156
4787 -156 577 -430 174 -239 403 -141 -408 653 -355 57 -77 147 105 -531 575 -207 -148 114 -65
4806 -65 220 -472 376 29 -296 239 -125 213 -324 158 221 -400 277 -74 94 -111 -39 319 -362 165 62
4827 62 -58 28 -108 290 -267 29 175 -157 66 -113 179 -114 -116 243 -175 -1 -8 43 -19 -158 218 -88 -78
4850 -78 81 -19 37 -130 129 12 -169 152 -33 -7 -50 47 106 -184 119 39 -56 23 -28 142 -174 49 126 -139
4874 -139 91 -57 112 -77 -68 192 -178 60 -18 14 3 -148 215 -154 -7 73 -78 102 -176 173 -40 -111
4896 -111 172 -127 121 -104 77 78 -174 199 -123 85 -29 -31 169 -217 192 -51 -13 98 -145 195 -174 92
4918 92 37 -118 160 -168 159 -97 -9 119 -181 196 -151 65 13 -109 153 -202 161 -69 -44 112 -137 173
4940A73l44K85o7j81L19l22K73k21J03J29l38L56k39J40p1n3K45l90L13j27nO7
4962D5j57L19l68J86N7j47J09j59K85k73N4J52j75J27j82K77j71j01K62j97J01
4983D4j44K15p8j57K44j32O9j62J91jk59K94j35O7j44J21J07l27K67r4P6j37L4
5006d1K41m01K71o6L8p7r7L85m28J66M7j3Lk49M95l76L8J37j08J70m26N43k39
5029A3j77L01k13K94n10M41J6m21M49l05L70m98K18L71p12N36k77K88k91j63P72
5050E02q78M66j03Q9j7n06J038q62J75K35k00L03q16J083n35l22O29m25M81q97
5070e60Q73k8q35R09n17M90p39M16N88j269R64l35K51m05q9J087j461P50O0j31
5090A9J9o14J469j371K37O51n77L82r01J453q87m94J238q75N20r11J153j80j292
$$ plain form
4940 173 -171 114 47 -134 185 -137 136 -85 18 147 -191 165 -74 66 -5 -58 187 -203 110 -17 -22 45
4962 45 -112 207 -161 25 82 -65 44 -115 170 -103 -49 103 -72 55 -127 150 -21 -122 140 -57 44
4983 44 -100 115 37 -120 124 -8 61 -101 90 89 -170 124 -11 56 -88 33 140 -187 80 -14 62 -75 -41
5006 -41 200 -201 70 4 42 -35 -132 253 -175 -9 38 25 28 -221 274 -102 -64 73 -35 135 -291 252 13
5029 13 -164 137 -76 218 -292 149 165 -256 193 -112 258 -240 -22 349 -363 173 -104 184 -107 -270 502
5050 502 -376 90 -13 76 59 -447 591 -271 -96 139 -61 242 -574 509 -26 -348 281 -144 337 -560
5070 -560 313 285 -550 359 -158 332 -407 9 597 -672 292 -43 208 -197 -286 801 -660 90 150 19
5090 19 38 -576 893 -478 -241 410 -167 215 -686 767 -120 -614 624 -251 269 -642 511 331 -961
5109i61J695q91L10n79N61O32j899J707m56k05p4o6J243k072J284K43q08M11n35
5128d60J512j802M78J123j334O15o33J370j168m67J825j514M96m17R13l46j329
5145a138K230j336K3J06K99M13j890K179o98p25O95k33Q84k015J673K20j553J170
5163C04n13J016j676P53J246k133J249l59P10j023k21K027k258Q47J56J33k36
5180B2j043K366j852O2Q67m37L21j397K142j049q61J484p57N17j332J560o2j696
5198a145J797o79K90q74P45Q42k192J669k44j75l22rJ475k263J172M55p88K41
5216en55J698j834K91J238j232N29p03J447j082o13J817j374M44m77Q73j77j369
5234a084K013j079j6L6K37N01j709J749m27o31N17k29Q27j619J165L17j174Q10
$$ plain form
5109 -961 734 -157 153 -426 135 767 -1132 575 119 -86 -160 -226 1017 -1055 229 472 -336 75 -460
5128 -460 1052 -750 -272 851 -483 132 -501 869 -299 -766 1059 -455 41 -376 537 191 -1138
5145 -1138 1092 -244 -221 -115 184 597 -1293 886 188 -537 158 -75 809 -1206 467 687 -866 304
5163 304 -209 807 -869 -116 1130 -1003 246 -113 597 -426 -647 1380 -878 -31 125 258 22
5180 22 -1021 1345 -507 -445 422 -15 306 -1091 1051 2 -859 625 -132 385 -947 613 551 -1145
5198 -1145 652 -27 263 -611 134 976 -1216 453 209 34 -288 -297 1178 -1085 87 542 -246 -5
5216 -5 -560 1138 -696 -405 833 -399 130 -573 874 -208 -821 996 -378 66 -411 462 285 -1084
5234 -1084 929 -150 -166 -130 107 608 -1101 648 221 -410 107 -122 705 -914 251 568 -606 204
5252B04l81P61j140L96R56j430P62j96M22n70k69J378j428M81J58J0m0p12J403
5271G65r86q8O06l75L59q96J153m56o12R56o15M40o90O56J65r98R86m14J58l12
5291a98J47N45j106Q50j57j89J40k02O98j010N04K60n27L28l54O35n99O3N43o44
5311b73L58k28L51k06l06O90n61J78mL7Q5m55O53l66q1K68j94K18m19M13n1l36
5333b29M22k63J80k45J37J94m48L99j79L4rp2K85m12K73J4k14K01j72K69k77L9
5355g3K52l29K04q5Q1l6j41L14k95R3Q6j03R6j94K93j89p7K44k15J49j54J48N
5378G4k48L37k13N4j6k1J71l36L13j12p6J32j60K49l24K08O4k54K69k21K10j54
5400e4nK33l59L04j83Q3L0j97L54l58J88K0j28K08l03L50k29nJ86k64K83k87K13
$$ plain form
5252 204 -177 584 -556 -160 796 -634 128 -68 354 -216 -485 893 -535 -54 104 114 74 -638 765
5271 765 -221 -309 297 -78 281 -615 538 82 -530 426 -189 251 -439 217 382 -616 370 -44 114 -198
5291 -198 -51 494 -612 238 81 -108 32 -170 528 -482 22 282 -245 83 -271 364 -235 -172 371 -273
5311 -273 85 -143 208 2 -304 386 -175 3 -1 36 121 -334 319 -47 -128 140 -54 164 -255 158 107 -229
5333 -229 193 -70 110 -135 2 196 -252 147 -32 2 -7 -79 206 -206 67 81 -133 68 -104 165 -112 -73
5355 -73 179 -150 54 -31 50 14 -127 187 -108 -15 71 -32 64 -130 163 -26 -103 141 -74 75 -79 69 74
5378 74 -174 163 -50 4 -12 -33 138 -198 115 3 -73 59 -101 148 -176 32 96 -158 111 -110 100 -54
5400 -54 -59 174 -185 119 -64 19 49 -148 206 -152 36 56 -72 136 -167 183 -46 -51 135 -129 154 -133 80
5423H0m9j91L50l57K86j78K0J54l27M10l39J78K0j49K65l32K97j85k6K35k92K99
5445A69k74J43K3k27L60l46K40j15oJ62l08L69k81J05N1j62K54l33K96j35q2K20
5467A23k33K54k78J77L6k35K85k41J99j69M3J91l37K97j63Q6m0q5K76l40K10n5
5489AJM0j72L36l18J06N5p8J00k14L15k11j3J30j23J43k55K91j21j16J99j66J82
5512A12k58K14Ok18K44j67J60k15J13J37l00K57j66J69j55l3L16l84K30r3J00
5533F9n2j82M02l59J44k7L1P8l39M68k86pJ16j04K35m74M63j18j99K10j75L51
5555B45n14L30J13m21L77k73L92m51R5M38o13M01k40L23k66k14P14o99L16r7J33
5576H9L2n55Q97o11N9J65j02K90p73R11l46l16M36k86M66q51O79J27p35O27l33
$$ plain form
5423 80 31 -160 190 -167 119 -59 -39 115 -212 198 -141 37 57 -92 173 -159 138 -47 -73 162 -130 169
5445 169 -105 38 61 -166 194 -152 88 -27 -33 129 -179 190 -91 14 65 -97 157 -176 120 -15 -97 123
5467 123 -110 144 -134 43 79 -156 129 -112 87 -82 -39 152 -185 112 -51 35 -5 -90 186 -154 56 1
5489 1 2 42 -130 206 -112 -6 49 -29 71 -143 172 -39 -52 78 -45 98 -157 134 13 -103 96 -70 112
5512 112 -146 68 74 -144 100 -67 93 -122 -9 128 -172 85 -81 88 -67 -100 216 -168 62 -31 69
5533 69 17 -165 237 -122 22 -5 26 104 -235 233 -53 -60 56 -48 187 -287 176 58 -141 69 -106 245
5555 245 -269 61 174 -247 130 -143 249 -202 -107 331 -282 119 -121 202 -64 -278 436 -263 53 -44 89
5576 89 121 -434 463 -148 -89 76 -26 264 -509 402 56 -260 176 -110 356 -495 184 311 -424 203 -130
5597a30M37o58K72O00j028O51k01K85l83j81J012j146M68R8k2k0n90J258j007
5616b85L3N46l27K55q38J226o23m89R44n84M19q27R11J5j108J157m89K55o00M47
5636C8O52j559J186k29n2j76j66J145j625Q28L10n31J81m37J295j351J81R04q39
5655b45L31n66J178q23n28J405r83K82m24Q00j87j136J629q05m2p1L33L91j534
5674i95J568l70n41L39j04Q08j630J158L02j081O68l33R11j357M65J011j438P14
5692I5k83P30q24k99J568j513M68N4K94k20q76J753j185q7N12j12K15j144J575
5711G21o09p05R45l89L85j074J099R5j245J141l79K89p72N19P19j576J072j29
5729A07%l32p2J172j575O76L53m01Q0m99J328j276J34Q18o71K93o09J078o87m87
$$ plain form
5597 -130 307 -351 -79 521 -507 144 -57 228 -155 -336 676 -470 -2 96 74 54 -536 722 -285
5616 -285 -252 294 -33 222 -616 610 -13 -502 442 -142 277 -550 361 376 -732 425 -64 191 -409 38
5636 38 690 -869 317 88 36 -140 -306 839 -786 42 352 -179 2 -435 860 -491 -310 594 -245
5655 -245 86 -480 698 -125 -653 752 -231 51 -373 427 240 -896 733 -72 -114 -185 148 539 -995
5674 -995 573 203 -338 1 -103 705 -925 233 535 -546 122 -211 700 -657 -192 819 -619 95
5692 95 -188 542 -282 -581 987 -526 -58 -4 290 70 -806 947 -238 -325 187 75 290 -854 721
5711 721 112 -593 352 -37 348 -726 373 468 -777 364 -15 274 -498 21 740 -836 236 107
5729 107 107 -225 -297 875 -700 -24 329 -72 8 -491 837 -439 -305 513 -158 135 -474 604 -83 -570
5749e70J197q52K89l92O53j6j099J376o68N9j12K16L76j196J168k43n30L71j95
5768a68O26j034O04K68o61M09k34O23p78J81P07r56M95j78L21k93l25R51q67K63
5788d6J24J9J5n60R81o70l0L24j88K33o26P68k67m19N78l36K96m90M30J19o58
5809d03O05k50J42k59J05L91p18N25q8q4M9j65M81n79K48J83l78K72k49L74k61
5830e9n8L74l99K07j66K35j11k23M47l18O3M2k3R9l32M01k19n3J99j42J51l67
5852b52L46o0j92K28j59J22j53J03J64l08K21j34O4M1r6K09l13K50l2j31K44k11
5874d9J81j91qK26k57J48m2M8n9j23K93k56R6P5j47J32j71J68q3l8J75l06K32
5897D4j24J99o8j98K97k57J74q1k8K33l20K38j77N1M9j62K74k79J57M2j89J86
$$ plain form
5749 -570 627 -225 64 -328 325 309 -790 586 -82 -23 -135 81 457 -739 429 186 -344 27 -168
5768 -168 458 -576 28 296 -365 44 -190 433 -345 -164 543 -413 82 -96 225 -68 -393 558 -309 -46
5788 -46 78 97 112 -448 533 -137 -167 157 -31 202 -424 344 77 -342 236 -100 196 -294 136 255 -403
5809 -403 202 -48 94 -165 -60 331 -387 138 50 -34 15 -150 331 -248 0 183 -195 77 -172 202 -59
5830 -59 -117 257 -142 65 -101 134 23 -200 247 -71 -8 34 11 110 -222 179 -40 -93 106 -36 115 -252
5852 -252 94 34 -158 70 -89 33 -120 -17 147 -161 60 -74 -10 31 -65 144 -169 81 49 -82 162 -49
5874 -49 132 -59 -67 159 -98 50 8 56 -3 -126 167 -89 7 82 -65 67 -104 64 -19 -57 118 -188 44
5897 44 -80 119 51 -147 150 -107 67 -14 -42 191 -129 109 -68 -17 32 -130 144 -135 22 64 -125 61
5919F1j59J78j33L0J83k78K52j56L9rj07K68k83J63l3p3J61k41K51k04Q4O6j76
5942a16K38k52J87n8q8K20k65K29j76Q3Q5k05K71k61J57j8j03J93k48K50j78M7
5964hJ10k10K28k20J73p2q9K20k61K08j26O8L6j98K85k27R3on3J50k55K65j49
5987c8%Q8j19J87k68K28m6j14J58j67K03j94Q4J04k06J76j29J39j17j0J86k53
6009a08J70r4Q3m8j03K39k32R6j2K7J2j69K79j99M8PlO4k25K87j39l8J65j32J33
6034A08k54K24l4j17J35j13J93k77J68Q8k06J52j50K23k10J8K13k62J60j36J92
6055A15j19j51L39k88J37r5J06L7l05M01k29M0j6J4J80m31M05j16q4Q0j07L31
6077B44m95L04R0k66K00k07L82m21J07L10m25K71k43L87l01j54N43m92K18j50
$$ plain form
5919 61 -98 80 -53 -23 160 -118 134 -22 17 8 -99 169 -114 49 16 -57 104 -137 114 -90 -6 60 -116
5942 -116 122 -130 57 -1 -89 131 -134 95 -81 2 87 -118 153 -108 49 31 -72 121 -127 123 -55 -8
5964 -8 102 -108 120 -100 73 1 -88 132 -129 79 -47 21 57 -141 144 -83 10 4 -49 101 -154 111 -38
5987 -38 -38 50 -69 118 -150 78 32 -82 76 -91 112 -82 2 106 -100 76 -53 86 -31 -41 145 -108
6009 -108 62 -32 51 3 -100 139 -93 3 -9 18 30 -139 140 -59 -11 -4 -7 57 -168 119 -20 -58 107 -25 108
6034 108 -146 78 44 -73 62 -51 142 -135 33 121 -85 67 -83 140 -70 -52 161 -101 59 -77 115
6055 115 -4 -155 184 -104 33 -62 44 81 -224 177 -52 -12 -28 -14 166 -265 140 24 -60 20 -87 244
6077 244 -251 53 143 -123 77 -130 252 -169 -62 248 -177 94 -149 238 -63 -217 326 -166 52 -98
6097i8K26k9m85P31m53O4L6L3J87o41P08k50j77J92j26L72p04N39R0m86L63k05
6119a13M29o16K48M47p04M09j77L41m01j14P71q20L00jJ48j19m42R50p24M6K42
6140A00p3J54o99R88m73l28N30k49K95p59P80j2p40P18k85K99o33M15M67j054
6160e59P31j40J15l53pQ58j131N15J73j86n4l11R88r73J03N58m02J37m60R37n90
6181e1l76Q59n53J81m47P07j44q05J063m78J3k00L90K41j114J084k55k57L5L8
6201f9O23j136P87R9n70L08k60Q29j052L10O50p93L42l20P36o72j95J034r12K60
6221aj05L39j73n92J106p23J9K16k4J39q78J072k87m93N79k45L42q45Q02J2o92
6242d32O01k26L30o60M27M73j006N62k5J52l51n8Q13j002M00J50r6n6l49R15q08
$$ plain form
6097 -98 128 99 -386 345 -108 -44 -8 25 212 -429 279 29 -148 44 -82 290 -414 125 215 -271 92 -113
6119 -113 316 -300 -52 395 -309 100 -77 264 -137 -251 520 -300 0 -1 147 28 -414 536 -188 -142 100
6140 100 27 181 -518 470 -3 -331 199 -50 245 -514 266 254 -486 232 -53 246 -387 28 495 -559
6160 -559 172 32 147 -206 -213 645 -486 29 202 16 -38 -349 639 -334 -231 327 -75 62 -398 539 -51
6181 -51 -427 432 -121 60 -387 320 176 -629 434 -44 -31 -231 159 400 -714 370 115 -142 -107 -69
6201 -69 554 -582 205 304 -266 42 -218 611 -441 -131 519 -274 68 -252 484 -188 -383 651 -261 -1
6221 -1 -106 233 60 -532 574 -149 -130 86 62 201 -677 395 108 -385 194 -51 291 -554 248 260 -432
6242 -432 169 -57 273 -387 40 513 -493 69 44 196 -155 -213 600 -402 -2 148 52 -4 -353 562 -246
6263b46N4M49l09J45m64P94m61l25O80m08J72l85N25n7o38P85l55M8j63J91K66
6284B98p50O48j02j84O7n8M56p45M61J77m26K15j68L98n31J52M07n46K87j50K80
6305A86k15k20N90n05J43mJ30o3l40N71l77J8J39j27J42l51M38p7k71L56k87K81
6327A57l82L09O5l62L32j34J74j51pK41m42K21J5o8L8o2K11l30J37J19k01K34
6349A14j84K31k74M3K32k41P6m8J00m8j35K34j68J7R4j21J15k00K60r2m6Q9j76
6372a28K73k44J50L2j95J63j05J32j58P2R8j86J65j3j7K2j65K25k20J17Oj43K13
6395I4j59J61j30J2M8j22J02nm0Lp9K75k37J5R3j14K32k70J60n0k9J21k05K21
6419I7k48J81M4j92K48j42N0q1j2J56k02K20j88P9M7j42J76k37J48M3q1J22j12
$$ plain form
6263 -246 -192 257 -52 93 -371 423 -38 -363 317 -91 81 -304 221 164 -474 311 -44 4 -159 32 298
6284 298 -452 196 94 -90 -23 -81 375 -370 91 268 -158 57 -111 287 -244 -92 315 -231 56 -94 186
6305 186 -29 -249 341 -164 -21 -25 105 42 -298 273 -104 -86 53 -74 68 -283 155 78 -193 163 -124 157
6327 157 -225 84 149 -213 119 -15 159 8 1 242 -200 21 36 -32 6 -56 155 -175 -38 81 -120 114
6349 114 -70 161 -113 -70 162 -79 -3 -51 49 1 -134 100 -68 -51 43 -78 37 -163 97 5 -41 48 -128
6372 -128 145 -99 51 83 -112 51 -54 78 -80 -8 90 -96 69 56 39 61 -104 121 -99 18 24 -119 94
6395 94 -65 96 -34 -22 26 -96 6 1 -39 -36 -115 160 -77 -62 31 -83 149 -121 39 -11 -40 81 -124 97
6419 97 -151 30 74 -118 130 -12 38 -43 -55 101 -101 119 -69 10 57 -85 91 -146 2 45 -36 86 -26
6442b6Q9j34M2J10j73J51j25J09n8o8J93k01J94j07j1Q8j65K17k04R6L3j09J63
6465A04j91J68j12J9R8j69J77j47N4M2j04J78j68O0ql1K2p3J61j70N6M8o1J01
6489E4j40J65j38o9K20j71J53j39J07j9j02K22k16J01k8M8M5j85J98j22L0j6r
6512a1J06j95J68m8n5P8r4J70k17J15K2j20J12q7J57j57J8J22j76J12p7R9o9o5
6536i2J99k10R8l6P7Mj24J95j54N0l4M4N3j83K15j06KOk0J25k29J69l7m4N4p5
6562e3J76k29J05O7j30J04j47K25j75j0J94k26J36j54J81n1j29K63j92P5r5J35
6584G0j2k40L35j71L3o3R0J38l51L06q9k7n8r9L60m25K37K6j03J31k45L62l50
6607a45L9K42k43Q8j60K92j65j27L98k72Q8r4J89l9l90N43k54k1j4R7J38m87M74
$$ plain form
6442 -26 63 -71 -29 81 -92 59 -66 43 -15 -83 110 -91 103 -4 -15 73 -92 125 -79 17 50 -59 104
6465 104 -87 81 -31 -12 86 -83 94 -53 1 43 -61 117 -51 9 1 -30 -8 -81 80 -90 -34 14 -47 54
6489 54 -86 79 -59 -128 92 -79 74 -65 42 23 -79 143 -73 28 0 48 93 -92 106 -16 14 -2 -11
6512 -11 95 -100 68 20 -35 43 -51 119 -98 17 39 -81 31 -56 101 -56 -38 84 -92 20 -57 42 -27 -92
6536 -92 107 -103 -5 -41 36 40 -84 111 -43 7 -27 17 70 -113 102 -4 -2 4 -16 109 -120 49 12 -32 22 -53
6562 -53 123 -106 -1 66 -64 40 -107 118 -57 -67 127 -99 37 -117 64 13 -116 147 -45 30 -65 70
6584 70 58 -182 153 -18 15 -48 42 180 -171 135 46 19 -39 -138 222 -203 34 60 -43 88 -157 205 -145
6607 -145 -106 136 -107 -19 -179 113 -52 -179 219 -53 35 -59 130 91 -299 244 -10 -31 -45 52 190 -297 177
6630A77j18j29P1l7K82n25L40J06k98J75j28L33m45J26L35m47K19j15K72k85j27
6651b18N38m96J56l4J65p8l63O69m38j1J22L2R5n09O61k47k40K67p8K20n62N23
6673A74M1m94L95j43K31m52K48L53o77L99o0J13k62k8N87o96K47J11m2o9k62O98
6695D12o00J6L47k01P7l62O33l41k79N33k79J09l37M79m5n58O36k40N6k39K45
6716F2K48p21N91q5j03q4J7M62p63M11J74l10Q9j44N40o43J24M39m59J67j86M55
6738B81l72j91O31m72R8q3K69j00m29P00l77o6R5P9J26n62O12j46k86K48n1K27
6760B31n59M21J51m72L37j04K04m05J77L44n28K26J6O1j83j2M37n46J64Q9k6k5
6782bk35N50m33nK45j50J08l26M48j94k00L80k26R0k54L13J4l53L91j41RKo7K60
$$ plain form
6630 177 59 -70 1 -36 246 -279 61 167 -131 44 -84 249 -196 -70 265 -182 37 -78 194 -91 -218
6651 -218 320 -176 -20 -54 111 33 -330 339 -99 -110 12 44 139 -370 291 44 -196 71 -7 213 -349 174
6673 174 215 -279 116 -27 204 -248 0 353 -324 75 15 128 -134 -162 425 -271 -24 87 45 -24 -286 412
6695 412 -188 -172 175 -26 51 -311 322 -19 -298 235 -44 65 -272 207 162 -396 240 0 56 -183 62
6716 62 310 -411 180 95 -8 -92 -75 387 -376 35 209 -101 -12 -156 384 -259 -135 304 -155 12 -174 281
6738 281 -91 -282 349 -123 -25 -108 161 61 -368 332 -45 -111 -16 63 189 -373 239 93 -193 55 4 231
6760 231 -328 93 244 -228 109 5 209 -196 -19 325 -203 23 39 100 -83 -95 342 -204 -40 49 23 -2
6782 -2 -237 313 -120 -125 120 -30 78 -248 200 6 -194 186 -40 50 -204 109 123 -230 161 20 29 31 -36 224
6806B24n10M36j20p0lr4L59m19K04J72k46J46j71L30l28L6K27k75J59j30J59j24
6828c8r2K73k06J06n9L7O3k66L34j66lJ21j50J51k29K05q8j21K15j48J28j57Q1
6851iR9k37K72j19m4M8j25J88k55J78K9K5nj82K54k20P6J07k03J73j14N1j0j10
6875a33K61j93Q8Ml4N6j25J62j69P2Q1J3k1j45J85q6j13J26j06K13j94J44k1j04
6899c9K6l0N5RL8Lj28K16j55K1m5o2R8l4k9J32n1K5q8L0J5r2J91k38J69l5O5r
6927E8j03J42j50J6P3m3K3j28K05p8m8N5o4J04j40J26o0j08K24k02J10n7O2qj19
6952a10J93j59K3M0o8J34j15J18q3p1J79j68J40j12J07J6r3R9j22Q5k0m2R1j28
6976f6J44j00J8N0j08J13k04K18m5m7J12j56R8l1JL1q9J21p5N8j8n9J51k06K17
$$ plain form
6806 224 -286 150 30 -40 -43 -137 222 -197 7 179 -67 79 -92 238 -90 -54 173 -102 57 -73 86 -38
6828 -38 -130 143 -63 43 -16 21 84 -182 152 -14 -17 104 -46 105 -124 81 -7 -128 87 -61 67 -90 -9
6851 -9 90 -147 125 6 -38 10 -115 73 -182 -4 25 50 45 -137 117 -103 -27 80 -123 50 -64 -13 -23 -133
6875 -133 128 -65 23 27 -7 49 -76 86 -83 -11 70 83 62 -83 102 16 -97 29 -77 136 -58 86 65 -39
6899 -39 -13 -43 12 21 59 62 -66 150 -5 16 -29 -91 7 -27 -56 76 25 50 -38 -8 7 -85 106 -132 37 2 67 58
6927 58 -45 97 -53 -37 36 -7 16 -112 93 15 -33 22 -42 62 -78 48 -12 -120 104 -98 12 -45 17 9 -110
6952 -110 83 -76 -53 -13 -81 53 -62 56 -27 -98 81 -87 53 -59 48 64 -29 70 -52 33 13 -29 62 -66
6976 -66 78 -22 -4 46 -62 51 -153 65 20 -27 85 -71 27 -4 -3 28 -61 60 -15 43 25 -34 117 -89 128
7001A28j60K7Op3J54n2j06P9Qj8p2J43l7l0J01j71J90j97J04jk5O6j21J81j59
7026c5O6Oj73K19j72J46p2rQ6j83J24l6N8L7j26J77k12J30l4l6R1j64J68p9n7
7051h0O6OMp9J87p7n6J29j09N3j24J03j1m5ML9M1m8K5j7j29J44n4L6k0m1J37j81
7079i7J27n4J7L3j15J40j41P9K4k7M7j16K05j80N2O3q9R5j46J76o9j16J95j48
7103d5J06j28J03O1k30K08j09M7o8L4J42k71K01n5mj4o9K54l00J44N1q9L8j45
7127a38K93k55M4J63j54R7j77K85j57j38K87j95J00j62K12j8k68L01j40M2q7P2
7149GJ53l80L34p7p0K0m6K58m02K18R4k13J40j26K86l29N1K68k99J26q7K41k10
7172d3j26M01l16J15j13J79o0k44M90k90J6k6O7J01m48N26j49j51Q5k6J83m31
$$ plain form
7001 128 -32 -5 1 -72 82 30 -76 3 11 -7 -79 64 27 -3 98 -73 117 -80 24 23 -2 64 -57 124 -35
7026 -35 31 37 -136 83 -89 57 -15 -24 62 -121 3 -33 25 62 -64 113 -99 31 -3 -39 52 -112 56 -23 -80
7051 -80 -14 -8 -4 -83 104 27 -29 100 -9 44 -80 23 12 -33 -29 10 51 3 28 11 -118 26 -28 8 -12 -53 84 -97
7079 -97 30 -24 -7 26 -89 51 -90 -11 13 -14 33 -83 122 -58 -6 57 -32 63 -83 93 24 -92 103 -45
7103 -45 61 -67 36 97 -133 75 -34 13 -55 -21 121 -150 51 -4 -8 -22 -91 163 -137 7 58 -31 7 -138
7127 -138 155 -100 -56 107 -47 50 -127 158 1 -137 150 -45 55 -107 105 87 -181 120 -20 22 -65 7
7149 7 160 -220 114 37 -33 -13 -59 199 -203 15 109 -104 36 -90 196 -133 -82 186 -113 13 -74 167 -43
7172 -43 -169 232 -84 31 -82 97 37 -207 283 -7 9 -17 50 151 -297 229 80 -71 14 -12 171 -260
7194b60L19P4l10K05q1K21l52J39K79m25J97m6J60k07o6M50m58J32O5J4j7k62
7216b29N11l50m5K17r6Q2l34M82k03k22L26j46J02l00L30M4m36M10j52Q9k45J74
7238IK16n06L56k8Pj63mM01n45K57J08j65O1j51M04l65j7L00k25Q1j70L58k58
7261c9j61M20k57M1r2K10m7l31M52k14o4nJ11J19m71M95l3k57J64n1J51l87K62
7284A6J11k97J94j25K56k97J29K41l94J61l2J18j76k3L13l35N8O0J16o2k45M56
7306B43l41l1K00q4R3k77K41lj34J98n4P0k09J01P7k78K79j24O1j04P5J53l27
7329a75K26k4o6L8q9K38k87J25Q1j12Q1j24J90j71NJ81j83J05q5J32p1j14K28
7352A29j82O8k6K3M1j73K33j38pN9n1R9j89J77m1r7J25r9Q9j22O9P6j71J64r6
$$ plain form
7194 -260 59 133 -177 28 -53 168 -184 -45 234 -191 6 -40 120 -87 -153 297 -161 -29 36 50 33 -229
7216 -229 282 -68 -113 104 8 90 -244 238 35 -187 139 -7 95 -205 125 169 -267 143 -9 80 -165 9
7238 9 225 -281 75 47 54 -109 -113 288 -257 0 108 -57 4 -147 257 -108 -125 175 -50 31 -139 219 -39
7261 -39 -200 220 -37 4 -88 122 75 -256 196 -18 -82 -87 24 143 -328 167 134 -123 41 -10 141 -246 16
7284 16 127 -170 24 -101 155 -142 -13 228 -166 -5 -37 81 -95 -118 195 -140 -82 -22 94 32 -213 243
7306 243 -98 -129 71 -13 80 -197 44 41 -93 105 51 121 -88 13 90 -188 91 -33 28 -76 -1 152 -175
7329 -175 51 27 -39 -1 -90 148 -139 -14 67 -45 36 -88 102 -69 -64 117 -66 39 -46 86 15 -99 129
7352 129 -53 15 -11 12 53 -120 113 -25 -32 27 -24 75 -114 63 22 -75 50 -49 40 -82 -13 63 -108 56 -40
7377d0N5l9j7J26j80J19mm6M1o7J42j52N6O9j07R3q4R3n8l2J14j38Q5l7L3pr7
7404g9J47j08L4J4l1N3j12J35o5l0P1q9R7r7Q5Pj05J26r0O6n0K0O9j44J23m9K
7431@J4n1J07j12O6Ko1P7p8J02q5RO2j07R8p2M6qp9J38j24O5k3qO4j23J25o8J
7460b3L4n0Q3j01R8l7l6R3j15J12j05J6On5J52j05P1l9j5P3j09J02o6J1M9q6J10
7487F8j17P4j8m4Q9j06J01o1mM2q6J22j03M1Pn0R7j17J07l6j9M6p7J01j01O2J1
7514B9o1Q5r2J03r2J7P9j09R8p7N8l3l6J05j15P5m4J7J5q2J21r5L6Nj7M1j02J23
7542E2o0rM3o1Q4j06R5k5p2J02p0Q0q2M1M6j17J10p3P4o1j2J04j42R8m5J8Ko0
7570d6J35j49P3mk5M3j09J51j00LL3m3Q4j30J36m0o4P7p1R8j28J03J9j07J07p7
$$ plain form
7377 -40 15 -24 -41 85 -95 24 20 -26 15 -52 90 -62 -6 63 -44 49 -35 58 0 -32 82 -56 29 -8 25 18 -79
7404 -79 68 -40 -6 8 -23 30 -82 53 -12 -42 29 -60 37 -60 25 32 -73 53 -37 29 -21 -1 68 -76 47 -2 0
7431 0 14 -37 70 -42 24 26 -35 42 -36 66 -19 -10 52 -55 43 -29 17 9 -70 68 -56 9 -14 -22 42 -81 44 -24 -23
7460 -23 11 -39 44 -57 41 4 -32 61 -54 58 -47 -31 -25 -80 72 -33 38 -1 -16 57 -52 50 -16 -5 44 -42 68
7487 68 -49 25 7 -37 52 -54 47 -14 -18 24 -62 60 -43 -2 5 -45 52 -65 42 6 -13 33 -44 57 -44 18 29
7514 29 -32 53 -39 64 -28 -11 68 -41 57 -20 38 5 -31 74 -41 34 -10 7 22 -60 61 -34 2 7 -10 31 -71 52
7542 52 -8 -17 26 -35 49 -57 38 13 -59 43 -27 53 -29 12 58 -59 51 -22 52 -9 -21 83 -59 39 -6 12 14 -46
7570 -46 89 -60 13 9 -16 27 -82 69 -31 -28 5 -38 46 -84 52 12 -52 25 -46 52 -76 27 46 -61 46 -31
7596c1R1j04K8J07j60J14o7O8m6n7J75j84Q9k4J2K6j36K12j52J6M6n8J02j81J92
7621G8p3q8J32r7J17j78J40L2j69J55r3J14j33M5J25k19J73o8N4o4m5K23k64J17
7645A4MlMj35K72k23L5R5q2P6j99K68j34r4J73j11R4j81J91Kk21K45j24P3j31
7670i2P3J59l16K48o7j0l0l8K58l39J75O3j05M8j27K95k96M6J84j80R2j46K66
7693A61j84j11K98k14P7j18J93m4k65L69j90J3m2P9J04l60L46p3r1L4j1J99l77
7716b07K57O3k14J22q9K37l00R6K24l04J51p2J78j78r1L61l35J06j7Q8m6k20M15
7739B25k78j7J09l0P8k97L84j48j67K08q4J21k93K71L0k82K52j10J21k17J28J65
7761A69l57K56o1O1j27j5K91l65J67N6o0jj26L32l03K3J81j45P8j86K92j62j46
$$ plain form
7596 -31 60 -44 -16 91 -69 45 -22 46 0 -57 118 -66 23 -1 11 37 -99 113 -39 -23 23 -35 67 -114 78
7621 78 5 -83 49 -48 69 -109 31 63 -106 49 -44 70 -63 -18 107 -112 61 -7 47 -17 -62 161 -103 14
7645 14 18 15 19 -116 156 -67 -32 63 -19 57 -142 126 -8 -102 71 -40 54 -127 64 66 -155 90 -34 39 -92
7670 -92 -19 140 -176 72 5 -5 -35 -73 185 -154 21 84 -21 27 -100 195 -101 -55 129 -51 41 -105 161
7693 161 -23 -134 164 -50 27 -91 102 58 -207 162 -28 -15 -57 22 126 -234 112 39 -52 -18 -29 170 -207
7716 -207 50 113 -101 21 -68 169 -131 -35 189 -115 36 -36 142 -36 -127 234 -101 5 -12 76 30 -190 225
7739 225 -53 -70 39 9 87 -210 174 26 -141 67 -17 104 -189 82 112 -170 82 -28 93 -124 4 169
7761 169 -188 68 7 68 -59 -74 217 -148 19 75 15 14 -112 220 -83 -60 121 -24 54 -132 160 -2 -148
7784a48K86j84P6j37J76ok69L34j59L0m7M9J35l38L04p8o6N1n4K07l06J81N8j71
7808g6J08q1J92k29M6J79k31J37q5J31j18p3K59k45J02k0L9Jj74K78j79jO5n0
7832b5R7k16K37p3j13J45r4R8j70J45M4j98J93j00Q0q8J7J43k27J62m1Nqo7J80
7857A26k04R5M0q3P5j13J59j41KJ03j05Q4q8R7m1p9J56j45R1n7L5K0j24J69j03
7882c1QL5l9Q1j35J33l6n7R3r5J06j06O3M7j36J38p9M5l4j7J02j56J04k2j9L4
7908B7r2J30j18N0L1p4Q1r0R5m2m4O5q9J19q5O4J6j26J38j01N1j0qM3q4J19p2
7935fj1M9o2Q1r0O6Lo7P8o1O3p5K1O7j24Q4n4N4m8k5J27j21R6n3j5N0r8J15p7
7964c3K1L1p1Q1p1P2k7l8R3r8O9m9K7J9p5J04p6L1qk0O2q4Q7m7qM8q4R6r1M7m0
$$ plain form
7784 -148 138 -46 30 -107 69 63 -206 128 -31 -1 -48 1 136 -202 102 24 -42 9 -45 162 -144 37 95 -76
7808 -76 32 -49 143 -86 -40 139 -92 45 -40 91 -27 -100 159 -86 16 -4 35 36 -138 140 -39 -40 25 -25
7832 -25 72 -144 93 20 -93 52 -42 56 -114 31 75 -123 70 -30 50 -38 -21 122 -105 57 16 21 13 -54 126
7857 126 -78 17 57 -26 49 -64 95 -46 -44 59 -46 38 -50 47 6 -73 83 -62 29 -28 7 27 -97 72 -31
7882 -31 -23 12 -27 54 -81 52 16 -41 52 -43 63 -43 20 67 -69 69 -10 35 1 -16 86 -70 34 12 -7 27
7908 27 -65 65 -53 -3 28 -46 35 -55 40 -2 -46 19 -70 49 -36 28 44 -82 56 -45 6 -4 -12 31 -53 66 -6
7935 -6 -17 32 -30 51 -39 27 30 -37 41 -20 43 -32 -11 56 -68 16 -38 16 -32 -57 70 -51 45 -8 -23 27 -71 44 -33
7964 -33 -12 19 -52 29 -42 30 3 -35 58 -40 29 -20 7 26 -49 55 -21 10 2 -18 44 -40 47 0 -8 40 -44 52 -39 8 -32
7995c2L0L0q4Q9l6k3L4o7Q6o0L2J5n8R1j00Q7n8K2M1o6N2j05J41J4j14J06j11
8022d4J24p9pL9q8J12j44Q4rm0Q1p3Q0l3l6P1q3R9r1L2L6p1P5p5P0n1pO3p7P6
8052C4p6O2j8m7R6r2N9k8J9J7q9J20o9K1jj2N9j11R9l5k2M8o6R9j19N5K5q0Q1
8081B9p5J02q8JP6j02Q6p5O8k3n5J20j08N6l9K8L4j06J37q9K3J3k4P1j35J39n7
8108Gj9M3o4J14j50R2J5q7R6r5J16j08PJ04j39J04q9Q6l8o8J54j50R4n4L7L5j51
8135a08J99j33L7J3l3R7j84J83o5m4Q4q0J28j93J41K1j35J25r3J18j33M3J24k02
8159i0J25o4R9r2n6K03k19J10k8K8Qj56K66j93K7N5m4Q6k02K41r9r0J45r4J17
8184H3k01J62M0k09K05j08J06
$$ plain form
7995 -32 -2 28 -56 33 -3 -26 8 -59 27 -33 -1 14 -44 47 -53 34 -24 -2 39 -27 25 -80 61 75 -39 67 -44
8022 -44 80 1 -6 33 -55 57 -87 -3 -12 -52 29 -44 36 3 -33 38 -45 54 -37 -5 31 -40 35 -40 30 -21 -28 35 -42 34
8052 34 -42 20 2 -45 51 -41 18 -10 9 26 -63 57 -12 9 8 -4 55 -56 43 8 -14 34 -32 67 -52 3 28 -52 29
8081 29 -46 56 -32 -31 45 -57 29 -46 22 -1 -56 64 -44 12 -27 1 35 -71 66 -23 0 13 -11 60 -75 64 7
8108 7 -12 31 -33 81 -69 23 38 -49 47 -48 68 -40 -33 71 -68 36 -53 33 -5 -73 81 -69 25 -29 8 43 -108
8135 -108 91 -42 -5 8 -25 72 -112 71 6 -38 46 -34 94 -99 42 63 -72 53 -40 78 -55 -12 112 -90
8159 -90 35 -29 70 -22 -78 125 -94 16 -12 16 24 -132 134 -59 -32 23 -21 65 -137 104 5 -85 60 -34 83
8184 83 -118 44 84 -125 80 -28 78
8191G8
$$ Imaginary data points
##PAGE= N=2
##DATA TABLE= (X++(I..I)), XYDATA
0@%%%%%%%%%%%%%%%%%%%NrQqQqQpMkKKpQj0J7k6L4m3N3o3P5q9J04j22J41j62J84
47I7k08K35k61K89l20L49l78M08m33M54m68M71m52M01l03J23J96p54J758l690
67b486P848j9139Q7048K31792l91995Q0141j59172K76987n6002j42565K94884
78B07341m73777K75365Q7044J6462j36352k85129N61461k41759k7961J7875j05727
89a05157K12179k37832L54736k72293j72392L40759q2154J02067l76957K54449
99A7405J09582k43510K57328k38349J13017r9891J47235J37500m61392K86941
109B5866M528N9077j07358j21290K97712l00603K20343m849j54436O3278p5561
120i3293L38305l39072j7329J90556j11959J31407k11778J98696j31081m9869
$$ plain form
0 0 0 0 0 0 0 0 0 0 0 0 0 0 0 0 0 0 0 0 0 5 -4 4 -4 4 -4 4 -3 1 -1 1 3 -4 4 -6 11 -15 19 -24 29 -34 41 -48 56 -66 75 -87 97
47 97 -111 124 -137 152 -168 181 -197 211 -222 232 -236 235 -217 184 -119 4 200 -554 1204 -2486
67 -2486 5362 -13777 73271 305063 -86932 -6791 -165963 111024 55022 -87543 207341
78 207341 -266436 8929 95973 112435 -23917 -309046 252415 10656 -17305 570 -105157
89 -105157 107022 -130810 223926 -48367 -220759 120000 37846 139913 -237044 17405
99 17405 126987 -116523 140805 -97544 15473 -84418 62817 200317 -261075 25866
109 25866 30394 89471 -17887 -139177 158535 -142068 78275 73426 -81010 -17732 -93293
120 -93293 245012 -94060 -111389 79167 -32792 98615 -113163 85533 -45548 -95417
130i5417K80770k48182N3374r6934J99888P025k65345K51887j41136Q5705k3081
141H554j5238P1132k41840K94113o6026r8423K1718k7819J99303k41126J16726
152B1074R247j12694J45048q7992J12970j94833O8794J68860j87169P7068q8531
163f8158J23521m8287o0287J54889j97404J02754P434K5205k6825j35500K23284
174A00626j11539N302J1637m2551Q5633j17743J50548r0204o3458J12001m5433
185e181O7843j44685Q9101L6008r0041J00124r1355N4750m6081L7943O1798j49837
197g9613R3258j6509L1859k6749m9806R7695r4917P0914q577m0232K5481l8714
209c5910J03904q9508o210M4361l0086M8534o6174N0268l0504j1368O9182o5122
$$ plain form
130 -95417 185353 -62829 -9455 -106389 93499 100524 -164821 87066 -54070 31635 8554
141 8554 -6684 64448 -177392 116721 50695 -47728 -26010 -53829 145474 -95652 21074
152 21074 30321 -82373 62675 -25317 87653 -107180 -38386 130474 -56695 20373 -68158
163 -68158 55363 7076 -53211 101678 -95726 7028 14462 39667 12842 -122658 100626
174 100626 -10913 -5611 6026 -36525 49108 -68635 81913 -8291 -71749 40252 -5181
185 -5181 62662 -82023 7078 43086 -46955 53169 -38186 16564 -29517 8426 70224 -79613
197 -79613 13645 -2864 28995 2246 -47560 50135 -44782 26132 17555 -22677 2804 -35910
209 -35910 67994 -21514 -27724 16637 -13449 35085 -31089 19179 -11325 -22693 46489 -18633
221a8633K2496l3377M6948J1872o4635N3467l7647L1394m985j2827J8783n0531
233c7675O2869j6102j4715Q22j3483M8796m2481J6846o594j5124L4835k2727J7902
246A3169l1073R819K8199k4449J0552k2690K0026K839q107J1177k7217K0374K045
259D664J173l741j8377K2807l881K402o389q643J2823j153O627j2537l462R567
273A880J296L529j2140k24O064L710J175r709j303O835M475l560m763k339N178
288A04M930k567m753m211Q593L091l283n632j197Q632k766K508o282k966R348
303C549j809L018j0344J534Q524l616K267q616M724J512J155K964j1876P070J31
318A87L576j472r857R732k977M068j858n949N128j901O903o346l210L752j3N583
$$ plain form
221 -18633 3863 -29514 17434 29306 -35329 18138 -19509 11885 6900 -5927 12856 -37675
233 -37675 25194 9092 -5623 -4801 -18284 30512 -11969 4877 -1717 -16841 17994 -4733 13169
246 13169 -17904 -8085 20114 -4335 6217 -16473 3553 6392 -1715 9462 -17755 2619 4664
259 4664 5837 2096 -16281 6526 2645 5047 -1342 -9985 2838 1685 8312 -4225 -7687 1880
273 1880 3176 6705 -5435 -5659 405 4115 5290 -4419 -5722 1113 5588 2028 -2735 -5074 104
288 104 5034 2467 -2286 -6497 2096 5187 1904 -3728 -4925 3707 941 3449 -2833 -5799 3549
303 3549 1740 4758 -5586 -4052 4472 856 3123 -5493 -769 743 1898 4862 -7014 56 187
318 187 3763 2291 -7566 2166 -811 3257 1399 -4550 578 -1323 5580 -766 -3976 -224 -237 5346
334E346q107J183J407m44N461o440m75P83K203K707n205j012K214K174k5k372
350f02j288J064J433K480m201j873L640l46L746p190J843L546n030P919q245K400
366g04K61o37Q155j4002Q670k458J528K811j1001J4911j4798R689K733j1941J2445
381E662j4770J9710j2475n192J6051j8023J8070j6726J2474k294j5948L0591k6950
394i820J4632r759L229J6353l5695L6892k1694L610Q097j5322K8738m3338L5911
407A1834n504j8819K3908k8325M0614m1940J7745K0099m3870M1306l1447L2077
419A7678k5811r565N1405n9937L8486k0549J5208P97l9146P2424o4531K2728P873
432G060j3110K7287o3007P8625m2793j2965L9799l7728M3794o6343O3534r185
$$ plain form
334 5346 -2761 -1578 -171 -615 4846 -1594 -2069 -1286 917 3624 -1581 -2593 -379 1795 1770 -602
350 -602 -1890 -826 607 3087 -1114 -2987 653 307 4053 -3137 -1294 2252 -2778 5141 -3104 -704
366 -704 -443 -1080 7075 -6927 1743 -715 813 3624 -7377 7534 -7264 2425 5158 -6783 5662
381 5662 -9108 10602 -1873 -7065 8986 -9037 9033 -7693 4781 2487 -13461 17130 -9820
394 -9820 4812 -4947 -1718 14635 -21060 15832 -5862 -2252 5845 -9477 19261 -24077 11834
407 11834 6330 -12489 11419 -16906 23708 -18232 -487 19612 -24258 17048 -14399 17678
419 17678 -8133 -17698 33707 -26230 12256 -8293 6915 7712 -31434 40990 -23541 -813 7060
432 7060 -6050 21237 -41770 36855 -5938 -18903 20896 -16832 26962 -39381 24153 14968
444A4968n4297O9979m8910M3590n3672K9241L8858r2131Q2869m0043K0634k1223
456a0137j1221Q0056j13630P1184p323j4426J4904n0562J06461j07996L3950M3205
468C4465n8215M5088o8509J04599p3057k5255R4893q4328N2364o2110P6155j9571
480A6519q5476J33620q7943L1203k9643K9264M0679j32389J38812n5234j4333
491a4921J5981j7622Q2655j48076J11812J762p0559N7000m9723J01001j30051
502f0741N2900P2641j20603P8353n1712Q4122q4021j7955J35737j45001O7653
513A1373k5998M5323k3473q6018J75556j36151K3933K6196o805L2287j30087J76327
525H2463q6680m3968Q1260m7939O5026j38706J39110j2170j17063J24033o3892
$$ plain form
444 14968 -39329 30650 -18260 25330 -28342 899 39757 -52374 30495 -9548 11086 -10137
456 -10137 -21358 58698 -54932 16252 8929 -5497 9407 -41155 65306 -42690 -8740 34465
468 34465 -23750 21338 -47171 57428 -15629 -40884 54009 -30319 22045 -40065 36090 16519
480 16519 -68957 64663 -23280 7923 -21720 7544 48223 -84166 54646 -588 -14921
491 -14921 1060 -16562 66093 -81983 29829 31591 -38968 18032 -31691 69310 -60741
502 -60741 -7841 64800 -55803 22550 -29162 54960 -29061 -47016 88721 -56280 11373
513 11373 -14625 30698 7225 -78793 96763 -39388 -15455 10741 3936 36223 -93864 82463
525 82463 -4217 -48185 33075 -14864 50162 -88544 50566 38396 -78667 45366 -18526
536a8526O4688j10412P0669P1899j71513J31399m2747L1028n7827k106J36129
547A02681j89841J00475P626j9623o41o2867J67745j65385L5119P5194p0055L8659
559A9087q9229J57757j06631m5022J34848r7776M9132q2849J15886k9271j21587
570i5655J72532r3929K4816m4981N4143M6679j71988J69610n2985k3505M660m780
582a5383J00124j85141J29310J3223q1619M9954m4775J19172j55562N6649Q7352
593G3304j26053O9070n0342J00302r7758k2317J45214j41377N6811k6311N6489
604C7032k8808q9401J71722j20070J3187J9244O517K5845j23952J59757o9163
615A910m3384O3021l0797N6464j26191J18267k374r9695R3454m4180N5583r6846
$$ plain form
536 -18526 46162 -64250 6419 78318 -93195 38204 -4543 26485 -31342 -33448 102681
547 102681 -87160 13315 20941 1318 677 -62190 105555 -59830 -24711 50483 -19572 19087
559 19087 -70142 87615 -19016 -64038 70810 -26966 22166 -60683 55203 25932 -95655
570 -95655 76877 -17052 7764 -37217 16926 63605 -108383 61227 8242 -15263 -10603 -15383
582 -15383 84741 -100400 28910 42133 -39486 10468 -34307 84865 -70697 -14048 73304
593 73304 -52749 16321 -34021 66281 -31477 -53794 91420 -49957 6854 -19457 37032
604 37032 8224 -81177 90545 -29525 -16338 2906 9423 35268 -88684 71073 1910
615 1910 -41474 21547 -9250 47214 -78977 39290 36916 -62779 30675 -13505 42078 -54768
627e4768N7285O2038j34630R5327l0601L2052n2881l173J09478j43066P0873L944
639A1878o032m768n0515J26715j17402K2715M7869m0756K6930o9947J13252p0456
651a0517l0788Q3782n9953L7271o2819P6098j3763p6856J00897n4931K1764l4730
663b4545L1577L2330r9455R2489l0328n636k766o094O0301r8996O4488O031l6424
676a7028K3290k7242O4422p6191K5149M0235n5859L3490l0399N1667m3850j2696
688b5012O4383o1741K9244j8687K6854q576m1053P0805m9563J1203Q50K616J6080
701A7403n2254O1208k7889j0199J9607j5739K8486m7970L9496j022k9811L0075
713A1391k0089K4474l1563J5301J8591l7653K9261j5169J3930j3419m608K9980
$$ plain form
627 -54768 2517 64555 -70075 25252 -5349 26703 -26178 -29351 80127 -62939 7934 11878
639 11878 5846 1078 -49437 77278 -40124 -17409 30460 -10296 16634 -53313 59939 -10517
651 -10517 -41305 42477 -17476 19795 -43024 33074 19311 -57545 43352 -11579 10185 -24545
663 -24545 7032 39362 -60093 32396 2068 -3568 -6334 -12428 47873 -51123 13365 19396 -17028
676 -17028 6262 -20980 43442 -32749 -7600 32635 -23224 10266 -20133 31534 -12316 -25012
688 -25012 39371 -22370 6874 -11813 15041 6465 -34588 36217 -13346 -2143 -1293 1323 17403
701 17403 -34851 26357 -1532 -11731 7876 -7863 20623 -27347 12149 11127 -18684 11391
713 11391 -8698 15776 -15787 -486 18105 -19548 9713 -5456 8474 -4945 -9553 20427
725B0427l6360J9869l060j32J782j4724K8654k5205O831O969q223Q592j6534K2100
739A0986j3207m096J3829j2362R854j1798J0938j317j0358J3789r426N739n482
752b911L233L982j0696J0808n945J793M2k263N776p418N058q94j554J738j705
767i56K309k684J955n28o20R44n64J57k86Q36j216J194j355J966j664o76L939
784B751n293L879j640J89J173l817O315o056K908M07k069L637o443Q248o036L97
800a450M645o777P339p546O021j024n261Q772q389O525m927J979L450q985J0910
815E282q573M545m84m116R070j1765R663m078j550N479q184R998r306N234P79
830A994o010Q997j0042Q988n278p13O752j0163J0143p461L303J388n862Q770r282
$$ plain form
725 20427 -15933 3936 876 744 2526 -12198 16456 -8749 -1918 5051 -3172 5420 -11114 10986
739 10986 -2221 -6317 7512 -4850 5004 -6794 4144 2827 -7531 6258 -3168 2571 -2911
752 -2911 322 4304 -6392 4416 -1529 264 306 -1957 3819 -3599 1459 565 -989 749 -956
767 -956 1353 -1331 624 96 -524 420 -144 13 -273 563 -653 541 -814 1152 -512 -1188 2751
784 2751 -2542 1337 -303 -114 1059 -2758 3557 -2499 409 816 -1253 2384 -4059 4189 -1847 -1450
800 -1450 3195 -3582 3757 -3789 2232 1208 -4053 4719 -3670 2855 -2072 -93 3357 -5628 5282
815 5282 -3291 1254 770 -3346 5724 -6041 3622 -456 -2006 3473 -4711 5287 -4019 1215 1994
830 1994 -4016 4981 -5061 3927 -1351 -2064 4688 -5475 4668 -2793 510 1898 -3964 4806 -4476
845d476P157l179j330N463q150Q892p099K940K190o361P954p136M822j648j873
860a834N058o509N736l666J255J084l709N646n460L105O0k248L371l662K964j230
876c9q92J904j640J064o78L43L84q28N38J3n42R16j442J157N84k674L563k703
894i72J397P0k511N340o253L744Nk208L417n571P981o779J276M238o601P222q914
911e119R190l589o145J2553j1646Q274o982M498L979j4731J7926j1747M658j787
925f68k282J3086k2984K0218o501m970Q126j1570K0554k4923J3474O645j7507
938i302J6067j5613K1442k0035R42K2203k8795K0014j3990J5180p034j7052L7101
951B1128l2785J3271k713K297P853l1363M3317k6336j200J2498j1311K0865m0138
$$ plain form
845 -4476 2681 -498 -1828 3635 -4515 4377 -2722 218 2408 -3953 4001 -3135 1687 39 -1834
860 -1834 3224 -3285 2451 -1215 40 1124 -2585 3061 -2399 706 766 -1482 1889 -1773 1191 -39
876 -39 -931 973 -667 397 -281 62 446 -382 156 169 -373 543 -899 258 842 -1832 1731 -972
894 -972 425 495 -2016 3324 -2929 815 820 -1388 2029 -3542 4439 -2340 -1064 3174 -3427 3795 -5119
911 -5119 4071 482 -5663 6890 -4756 3518 -3464 1034 5013 -9718 8208 -3539 1119 -668
925 -668 -2950 10136 -12848 7370 869 -4101 4025 -7545 13009 -11914 1560 8205 -9302
938 -9302 6765 -8848 12594 -7441 -6499 15704 -13091 6923 -7067 8113 1079 -15973 21128
951 21128 -11657 1614 -1099 1198 9051 -22312 21005 -5331 -6531 5967 -5344 15521 -24617
964b4617L9923r320k3270K9605k1069K5270l6680K4529J4699m4256L8920k0715
976f981J9741k4745L080L9805n9842L8393q905L657m725k0812N8344o1146K1671
989b465J4301j6646J3220l6615O3751m7521n925M0987l4383K4098m0917N3346
1001B5231j9011m0084O3292l9680J9464k9456L0322J3720o7478P0854k9267K379
1013B86r170L293M2989q2461O1170l210k4874J4121j8692N8211p7898L4211L1288
1026B9264n0383K8880k8030N8086n8389k329O6094o8042L1022k1960M1662k6101
1038b26m1093R0311o7379J4740j984J6836O590o9942R6605m8152j4315K4515q980
1051b474L2493q2227Q0776j1052n0590M7712k3425M0462p2869M7748L1281p9611
$$ plain form
964 -24617 15306 5986 -17284 12321 -8748 16522 -20158 4371 19070 -25186 13734 -6981
976 -6981 12760 -11985 -8905 30900 -28942 9451 546 4203 -522 -21334 37010 -24136 -2465
989 -2465 11836 -4810 8410 -28205 35546 -11975 -17900 23087 -11296 12802 -28115 25231
1001 25231 6220 -33864 29428 -10252 9212 -20244 10078 23798 -43680 27174 -2093 286
1013 286 -8884 -5591 37398 -45063 16107 12897 -11977 2144 -16548 41663 -36235 -2024 29264
1026 29264 -21119 7761 -20269 37817 -20572 -22901 43193 -24849 6173 -15787 25875 -226
1038 -226 -41319 48992 -18387 -3647 -5631 11205 17795 -52147 44458 -3694 -18009 6506 -2474
1051 -2474 30019 -52208 28568 17516 -33074 14638 -8787 31675 -41194 6554 37835 -41776
1063d1776N6752k1869L1670m8536P211O9154r3902M7171k411Q495j7343k8113
1075c3497Q9642q6172J9692K6591j6101P951m9780R1505o1027j7906N6969l5343
1087g476K1464n3460P3205k2113n6496P7093l8762J7971m0994M3422J7900q4888
1099e3134Q1050k6569J311j7660Q982N1369r5886O4420J680k4357O836j6942O6519
1112D7619q5221L2397L4926m6780K2676k8750O3315n8345p162O5253n8836K3406
1124D498k2262M3424k3551m1435Q0462n3347Q993n009J8862P139o3116P9570l3782
1137D46j4665J6602l878K7555o7670O1160l888l9331L2113j5516L3410n7403L3670
1150B605K6044n7172L7994j6302K6813l6048K190N0328o2688L0143m557J0752
$$ plain form
1063 -41776 14976 -6893 24777 -23759 -16548 52606 -41296 5875 3464 11959 -5384 -33497
1075 -33497 56145 -30027 -10335 16256 155 8106 -41674 49831 -11196 -29102 27867 -7476
1087 -7476 13988 -39472 33733 11620 -44876 32217 -6545 11426 -29568 13854 31754 -53134
1099 -53134 27916 1347 2658 -15002 -6020 45349 -50537 13883 15563 -8794 -1958 -18900 47619
1112 47619 -37602 -5205 29721 -17059 5617 -23133 40182 -18163 -25325 39928 -18908 4498
1124 4498 -17764 25660 2109 -39326 41136 -12211 -3218 -8227 10635 17774 -45342 34228 446
1137 446 -14219 2383 -1495 26060 -41610 19550 15662 -23669 8444 -7072 26338 -31065 2605
1150 2605 28649 -28523 9471 -6831 19982 -16066 -13876 36452 -26236 3907 -650 10102
1162A0102j2167k2228O0390n3984J2659J2255o337P417l5923N6826l4116j0804
1174a5910K9715j8713J5901l4482M0458r275l0507L8416k0376J3460k4262K0408
1186D833J2416m2566L8079j3249L181q841J224K6255m2867K7037J52q590L186
1199B50j0129L0078l4751J2407J3081j7699J0912j4882K5703k0530l854K3078
1211A3664k0882J0992j1342J5737o288j4771K5837j8240O688m800N075N270k0311
1224a3371K3078j0710j448L419l198R999j7935J4786j851p487P560o072R680j2528
1238f078O365N089j1094Q534m950N252m924o83P958r471N077j363J230q03l176
1253c037P166o503K273J050j547J871l439M144k325p45K094j524Q61r87J285p21
$$ plain form
1162 10102 -2065 -24293 36097 -17887 -5228 7027 690 8107 -27816 29010 -5106 -15910
1174 -15910 13805 -4908 10993 -23489 16969 7694 -22813 15603 -4773 8687 -15575 4833
1186 4833 17249 -25317 12762 -487 2694 -6147 -4923 21332 -21535 5502 5654 -2936 250
1199 250 -9879 20199 -14552 -2145 10936 -6763 4149 -10733 14970 -5560 -9414 13664
1211 13664 -7218 3774 -7568 8169 1881 -12890 12947 -5293 1395 -3405 1670 6940 -13371
1224 -13371 9707 -1003 -2451 968 -2230 7769 -10166 4620 2769 -4718 2842 -3230 6450 -6078
1238 -6078 287 5376 -5718 2816 -2134 3118 -1806 -2489 5469 -4002 1075 -288 942 139 -3037
1253 -3037 4129 -2374 -101 949 -598 1273 -2166 1978 -347 -1092 1002 -522 339 -648 637 -84
1269h4k24P77p29J86K03j87k80P40p26Q25j150J007M90k689L436k334N82L62r71
1288g66K729m470M141j559r60J922k794M595n786L806P18m261N291n052N058l908
1304a296M3M681p112O208m332K985o97l518P633q427N757k165q73L932p483R166
1320D502o867J973K562n119O789p927P054l209k157O130p740P838o666L371J989
1335B523o978R101q150N408j983k102O104q547Q385n673J788K357o025Q355q544
1350c981O055j667l232O973q320P396m767J177K797o286P850p039M318r37k351
1365b014N595p727P448m262j90L545n399O325o143L904O8l668N175m901M466l639
1381a417J028K699n338N234l577K012l69j996M412m776K825n62n02R44k104L265
$$ plain form
1269 -84 -308 469 -260 -74 129 -58 -338 402 -324 501 -649 358 848 -1841 1595 -739 -157 205 -766
1288 -766 1963 -2507 1634 75 -885 1037 -1757 2838 -2948 858 1576 -2685 2606 -2446 2612 -1296
1304 -1296 -1253 3428 -3684 2524 -1808 1177 480 -3038 4595 -3832 1925 -240 -1113 2819 -4664 4502
1320 4502 -2365 -392 2170 -2949 3840 -4087 2967 -242 -2399 3731 -4009 3829 -2837 534 2523
1335 2523 -4455 4646 -3504 1904 -79 -2181 3923 -4624 3761 -1912 -124 2233 -3792 4563 -3981
1350 -3981 2074 407 -2825 4148 -4172 3224 -1543 -366 2431 -3855 3995 -3044 1274 337 -2014
1365 -2014 3581 -4146 3302 -960 -1150 2395 -3004 3321 -2822 1082 1150 -2518 2657 -2244 2222 -1417
1381 -1417 -389 2310 -3028 2206 -1371 641 272 -1724 2688 -2088 737 175 -327 617 -1487 1778
1397A778k817R60P05j118J278j845J924q43p62J209n25n5J2K37j50K76p95J017
1415D86n82j74O06j005J679k012J473k38o94J549k990M141l441M94K373l477L820
1432B008m559M537j542l170N789n250M218m566L497J633p723R495o358L264k196
1447i23o85P324j2643J0429l174j574K399n010J1426j4247P671K714p540O960
1461C127q831J3689j2138L02J1900j3822R243q387J0518n161r299J9396j5869
1474e332O811m208M850L355j8483K4117j3334n01L872l247J1471k3652K2149m208
1488C660j1302J1924q584J5254k3677J4983Q140k2548J7949j0466J4360j7561
1500g868K440K2405l0896J7751n506P338p413j0763L2865l2102J0544M463k442
$$ plain form
1397 1778 -1039 -79 626 -492 786 -1059 865 22 -740 469 -56 -111 -99 138 -12 264 -531 486
1415 486 -96 -270 336 -669 1010 -1002 471 233 -461 1088 -1902 2239 -1202 -708 1665 -1812 2008
1432 2008 -2551 1986 444 -2726 3063 -2187 2031 -2535 962 2595 -5128 4367 -1991 1273 -923
1447 -923 -1608 5716 -6927 3502 328 -1246 1153 -3857 7569 -6678 993 3707 -3833 3127
1461 3127 -5704 7985 -4153 -3851 8049 -5773 3470 -4917 5601 440 -8859 10537 -5332
1474 -5332 1479 -2729 2121 5476 -13007 11110 -2224 -2725 1147 -2100 9371 -14281 7868 3660
1488 3660 -7642 4282 -4302 10952 -12725 2258 10398 -12150 5799 -4667 9693 -7868
1500 -7868 -5428 16977 -13919 3832 -1674 5664 -1749 -12512 20353 -11749 -1205 3258 816
1513H16L735k2193L7417k5004m032J8163j2106J1300k6026L2182r901k1289K9013
1526A2075j6132J1877k2503K0487Q449l6730L4206j2560M689j1905M615K5077
1538B1645m4806K9414m24p602r4q348L5065m3897J6710J5929k0589R670j6518
1551a3845L6750l3140k968L3537k9315J2281j5973K9499j6228k3217M5677l0027
1563f969P358q777J6608L384m0212M9336k0808o010L999J879J8843m7062M1088
1576A2657k967k2302J5472q167K6102m3729K4129J8568l7287K2006j0165K2983
1588A7300l0342K337L7433m4049J8416l051J2862j4070j6573M8508m1266P084
1600e411R333m3J432k9701M9397k8209j0667K3042r945J0366l3109M0448r392
$$ plain form
1513 816 4551 -17642 19775 -5229 -9261 8902 -3204 8096 -17930 14252 4351 -16938 12075
1526 12075 -4057 7820 -14683 5804 14253 -22477 11729 -831 3858 -8047 -3432 21645
1538 21645 -23161 6253 5829 -1773 -1867 -10215 24850 -19047 -2337 13592 -6997 2673 -13845
1551 -13845 22905 -10235 -13203 20334 -8981 3300 -12673 16826 598 -22619 23058 -6969
1563 -6969 389 -8388 8220 11604 -28608 20728 -80 -6090 -2091 -212 18631 -28431 12657
1576 12657 9690 -12612 2860 -5307 20795 -22934 1195 19763 -17524 4482 -5683 17300
1588 17300 -13042 -10705 26728 -17321 1095 -1956 10906 -3164 -19737 28771 -12495 -5411
1600 -5411 3922 3879 5311 -24390 25007 -3202 -13869 9173 -772 9594 -23515 16933 7541
1613G541k8229L2321j4087J2441k8607K4640J1821m2304L4628r971O006j6826
1625a0626O210K8399m6894K7258J051m400l990q792L7294m2324J2660J6143j6094
1638d105O173j6340L5522k8382o039K9627k2077Q476j5218K6440j1583k2180L7062
1651A7376k1198M214p839J3196M904l2712L5904j2399n531J717J662J5350l4662
1664b0018K7447m5j5301R374o208J9867k9773J4014J3611k3145J2934p821J6916
1677A1852j9151l10K3317k5152J0813m540J0191p444j1943K8081k2029M230K811
1690G26J024K594j7863K5579j3175m981R779m811P183j7514J8449l001j2937J4087
1704E139p092P114j2382Q427O715j7467J3511m416L017n793N12J1800j7104R660
$$ plain form
1613 7541 -20688 11633 -2454 9987 -18620 6020 17841 -24463 10165 194 6200 -10626
1625 -10626 -4416 23983 -22911 4347 5398 998 -2992 -11784 25510 -16814 -4154 11989 -4105
1638 -4105 2068 -14272 21250 -7132 -13171 16456 -5621 2855 -12363 14077 2494 -19686 17376
1651 17376 -3822 392 -7447 5749 10653 -22059 13845 1446 -4085 -2368 -706 14644 -20018
1664 -20018 7429 7384 -7917 1457 -4751 15116 -14657 -643 12968 -10177 2757 -5064 11852
1677 11852 -7299 -7609 15708 -9444 1369 -3171 7020 -424 -12367 15714 -6315 -2085 726
1690 726 1750 4344 -13519 12060 -1115 -6096 3683 -1128 6055 -11459 6990 3989 -8948 5139
1704 5139 -1953 5161 -7221 1206 7921 -9546 3965 -451 2566 -3227 -2715 9085 -8019 1641
1718A641j94j289m0n103J3356j3288L501M909n145L304o449J0587p343j796P471
1733D122o201L859n427O688j929n796Q791n588K284k201J808K136o720O785k781
1748a70l02M63o75L196n444M109k77k270K250j862K462k598P58J779k620J610
1764D09n23L57l56l76J287j364N79L10o88O68m37J31K38p28J105r56l9J354j873
1783i02J245l12n4L13j298K410k261O81Q00j196J477k500L210j866j006L021l105
1800a343K499k434J885M68l422M483l294J844j208M1K636n228N244k792K39J304
1816I22k859M940n765L739k6k740L726m263M915m229J205K684n013N261m684L701
1832A514j381k423N719o469M873k557L43K225m968O429n476K758J59k623M796
$$ plain form
1718 1641 1447 158 118 -4985 8371 -4917 -1416 3493 -1652 1652 -4797 5790 -1553 -3349 4122
1733 4122 -2079 1780 -3647 3041 1112 -4684 4107 -1481 803 -1398 410 2546 -4174 2611 -170
1748 -170 -472 -9 -684 2512 -2932 1177 900 -1370 880 -982 1480 -1118 -360 1419 -1201 409
1764 409 -114 243 -113 -489 798 -566 13 323 -365 303 -134 -3 235 -493 612 -344 -383 971 -902
1783 -902 343 31 -23 290 -1008 1402 -859 -178 622 -574 903 -1597 1613 -253 -1259 1762 -1343
1800 -1343 1156 -1278 607 1075 -2347 2136 -1158 686 -522 -481 2155 -3073 2171 -621 -382 922
1816 922 -1937 3003 -2762 977 951 -1789 1937 -2326 2589 -1640 -435 2249 -2764 2497 -2187 1514
1832 1514 133 -2290 3429 -3040 1833 -724 -381 1844 -3124 3305 -2171 587 746 -1877 2919
1847B919o236N849l248m32L608n465N920n059K784L90l467N471n884M787k520
1862e83l36L174n342O155n090K299J075l728N152n398M532k265j003L828n015
1877b545M719l838K335K90l513N535n172L277j298n89K879m957N156l088M71J156
1893H18k125L472m544L711j010j609K695k984L406l283J421J485l201K926k038
1908h60J777j387k45K309k995K096j097P61k88j163K665k446Q96J51k25L45j093
1925g99J605j051J06J27J69Kp87J214q39K99j86K20R6n19P11p96J039j135N81
1944E7L24r89J398j867K069j216m68J675j845J828k372K403o43j933L179k713
1960a113K390k723J778J518m745M884k722J423j423j71M154o776N014j281l19
$$ plain form
1847 2919 -3317 2532 -716 -1148 2460 -3005 2915 -2144 640 1030 -2437 3034 -2850 1937 -583
1862 -583 -919 2255 -3087 3068 -2022 277 1352 -2376 2776 -2622 1910 -355 -1358 2470 -2545
1877 -2545 2174 -1664 671 961 -2552 2983 -2189 1088 -210 -799 2080 -2877 2279 -809 -338 818
1893 818 -1307 2165 -2379 1332 322 -1287 1408 -1576 1830 -1453 -32 1453 -1748 1178 -860
1908 -860 917 -470 -715 1594 -1401 695 -402 359 71 -1092 1573 -873 23 174 -51 294 -799
1925 -799 806 -245 -139 -12 157 159 -628 586 -253 46 -140 80 176 -343 368 -428 611 -524 57
1944 57 381 -608 790 -1077 992 -224 -692 983 -862 966 -1406 997 354 -1579 1600 -1113
1960 -1113 1277 -1446 332 1850 -2895 1989 -733 690 -733 -904 3250 -3526 1488 207 -112
1975a12L37k654O934p964L419K130l624K921m739P836o244q16O484o081L718m895
1991c350O887k950n785J0509p413K928l114L701K103j0836J2523n478q74O13r4
2006f30O266j3508J1477j304n608M364l372R132j3949P548N515j1239P100m527
2020b735R023j0852R97J2381j4693P011l066O663n711o661J8278j5335L462J465
2034B27J785O66j2890K0161j1118l590P366k774N034j5665J7930l709j1837J2774
2048D360n494O482j4137J1165O096j9363J4882l880L617r350L301J4404k3123
2061a1040J2756Q26j214l378m383K0165k2398O054Q572p026J721r126K1016j6703
2075d158l258J5875j0552L873j0584J8418q085j3492K1695j1176K519p797J1517
$$ plain form
1975 -112 225 -2429 4505 -3459 -40 2090 -1534 1387 -3352 4484 -1760 -2576 3908 -2173 1545 -3350
1991 -3350 3537 587 -5198 5311 -2102 826 -2288 1413 3516 -7320 5203 -275 -1149 -536 -630
2006 -630 5636 -7872 3605 2301 -3307 1057 -2315 6817 -7132 416 5931 -5308 1792 -2735
2020 -2735 6288 -4564 -3567 8814 -5879 1132 -1934 4729 -982 -7643 10635 -4700 -1238 227
2034 227 2012 2678 -10212 9949 -1169 -4759 2607 -167 4867 -10798 7132 3423 -8414 4360
2048 4360 -1134 5348 -8789 2376 8472 -10891 3991 111 3728 -5622 -2321 12083 -11040
2061 -11040 1716 2542 1328 -2050 -6433 13732 -8666 -2612 5960 -1066 655 -8471 12545 -4158
2075 -4158 -7416 8459 -2093 1780 -8804 9614 1529 -11963 9732 -1444 1075 -6722 4795
2088D795K297k1503K2676o974k551k578M147J0502k5064J8984N80r535L403k151
2102b972J4980k3344J0428J0728j6128O681m129J4168j6958J28J9164j9135O091
2115b98k403R952q382r857K4404j7550J204K595M037m33j6237K4307j1289n946
2129e896P570p64N127j8742K0093k502j3672J1829l545P055j6662J2111P129j9157
2143a0026J2589k735N374j1552L527J4680k1379J0182J117Q45m748m391J8783
2156A2266j8822L723P157m149L49q261J7998j2738l801J2382p241K807q661J3726
2170F735m720j1012J5431p019J493n709P554K718j5140J4552l860j446k098K036
2184d85P929j6129J0925R27n264J591j851R770j3617N371N932p964L243l309Q891
$$ plain form
2088 4795 7092 -14411 8265 1291 -1260 -3838 309 10811 -14253 4731 5311 -4224 -821 -2972
2102 -2972 12008 -11336 -908 9820 -6308 373 -3756 10412 -6546 -6418 12746 -6389 -298
2115 -298 -2701 7251 -1131 -10988 13416 -4134 -2930 -335 3702 3269 -12968 11339 50 -5896
2129 -5896 1674 910 6037 -12705 7388 4886 -8786 3043 -502 6553 -10109 2002 9131 -10026
2143 -10026 2563 -172 5202 -6350 -2823 11857 -9522 660 1777 2622 -2126 -6517 12266
2156 12266 -6556 -2833 4324 175 524 -7737 10261 -2477 -6278 6104 -1137 1670 -6991 6735
2170 6735 2015 -8997 6434 -585 908 -4801 2753 5471 -9669 4883 1023 -423 -2521 -485
2184 -485 7444 -8685 2240 3167 -2097 -506 -2357 7413 -6204 -833 5099 -2865 378 -2931 5960
2199E960r110m05R691r162L399k527N756l660n267J1314p828R81K56K046M20p465
2215e601J0134m666j964K877r60L014p506P040m79m972M420j881K947n374L259
2230B88K723o247M283j382J802k847J11M697o028K910R5n9l75j779M485m074Q72
2247e25J383j032O19k109L581k372n99K278j831J118j480J701m37j471K075j136
2263b37K64k97M50K18j171J344n99k30M60l35L39m54K81K90p76O48L7o75P17l49
2283g5J01j44J4O26j238J087j78m93N29p17J284j508P40P00j705J565r53R78q22
2302b09m96K060k441J353l31K00J54j578L057k729P94P39j204J623k614K994j519
2319a47q91K204k142K065k369J957K3k397L298k722J997j486K27K069l821L594
$$ plain form
2199 5960 -3150 -3555 6136 -3026 373 -2154 3602 -58 -5325 5989 -1839 -858 -602 1444 1864 -5601
2215 -5601 4533 -133 -2097 780 -180 2834 -4672 2368 1889 -3083 1337 -544 2403 -2971 288
2230 288 3011 -3236 1047 -335 1467 -1380 -1269 3428 -2600 310 405 346 -29 -1808 2677 -1397 -525
2247 -525 858 -174 445 -1664 1917 -455 -1054 1224 -607 511 -969 732 295 -1176 899 -237
2263 -237 27 -270 180 398 -773 571 -28 -258 202 -133 206 -248 33 323 -453 195 232 -443 274 -75
2283 -75 26 -118 -104 522 -716 371 193 -300 229 -488 796 -712 28 728 -977 588 -365 613 -209
2302 -209 -705 1355 -1086 267 -64 136 290 -1288 1769 -960 -166 573 -631 992 -1622 1372 -147
2319 -147 -1038 1166 -976 1089 -1280 677 700 -1697 1601 -1121 876 -610 -383 1686 -2135 1459
2335A459j978N33M08j673L246l858K741o11j119K088l041L756l192J107J308k893
2351a719L362l184K616j096j123L048l786L302k268Q90R45k777L878l769K483
2366H02n44j422K887l578L353k196L61J555k955L535l096J989n69j201L010l857
2382a926L175j706J33J409k811L638l230J573L54j595K292k939L120k072p1J990
2398A334k703K643k512J973k35j988L047k667J720r24L63J005k644K978j903O42
2414A29m6o35J947l028K352m44r05J182j331J930k134R19Q24j526J233j036J473
2431I04j413%J517j683Q81m88N94k18p96J595j188K13m7L16q3p29J148o75M3Q4
2451b5L9K09o51O45j06j12k03L30L7l65K99j95N07p58M04K46m09K74n24J003j006
$$ plain form
2335 1459 -519 14 422 -1251 1995 -1863 878 267 -852 1236 -1805 1951 -1241 -134 1174 -1719
2351 -1719 1643 -1541 1075 -21 -1144 1904 -1882 1420 -848 42 987 -1790 2088 -1681 802
2366 802 258 -1164 1723 -1855 1498 -698 -337 1218 -1737 1798 -1298 691 122 -1079 1931 -1926
2382 -1926 1249 -457 -324 1085 -1726 1912 -1318 255 609 -986 1306 -1633 1487 -585 -656 1334
2398 1334 -1369 1274 -1238 735 500 -1488 1559 -1108 612 -312 51 1056 -1588 1390 -513 129
2414 129 83 -552 1395 -1633 719 275 -630 552 -779 1151 -983 -64 760 -766 467 -569 904
2431 904 -509 -509 1008 -675 206 -282 312 94 -702 893 -295 -82 -129 187 104 -625 523 -152 -109 -25
2451 -25 14 223 -428 217 111 -1 -204 126 163 -202 97 -98 409 -349 55 301 -108 166 -358 645 -361
2472c61J92N88o99O93j314J709p91q01J507j157J034j546J402K74k026K124j160
2489c32J003j594Q16J688l449K629p90L50o16q16L479m176J723Q04q79L31j898
2506a727M413l934J81K718k325J358k812M437k313k548M971l166J254k289L206
2521A424L5n061O092k681J82j183J464K645p210O218r20j962N82m62M640p801
2537c998M439K040m183J776j620N664p143J540N483o214K443j892N149m617k517
2552c650Q673o827J257l83L293j589n935J0256n749j097J798Q70J558q377R756
2567C854k413m910M503j030L119q415P127J930q400N870j362L137o953L283O493
2582E833j0845N575R6J448m145q67R727j0934L030K761m76j685m096J1401r192
$$ plain form
2472 -361 -169 419 -280 413 -901 808 17 -784 723 -434 600 -946 456 730 -1296 828 -332
2489 -332 671 -923 -107 1581 -1868 761 -29 321 -295 -1111 2368 -1808 -85 719 -160 171 -1727
2506 -1727 2686 -1248 -1067 1651 -674 684 -2128 2309 -4 -2552 2419 -747 507 -1782 1424
2521 1424 1459 -3602 2490 -191 -9 -1192 272 2917 -4293 1925 1005 -957 -375 -837 3803 -3998
2537 -3998 441 2481 -1702 74 -1546 4118 -3025 -1485 3998 -2216 227 -1665 3484 -1133 -3650
2552 -3650 5023 -1804 -547 -930 2363 774 -5161 5095 -654 -1751 47 917 2475 -5902 3854
2567 3854 1441 -3469 1034 4 3123 -5292 1835 3765 -4635 1235 -127 3010 -3943 -660 5833
2582 5833 -5012 563 659 2107 -2038 -2905 6822 -4112 -1082 1679 1203 -482 -4578 6823 -2369
2597b369o86N860k521M83n899J0674n247n412Q606l400R71n777Q187o00r389R913
2613C394k813J6l942M269M145j1875Q926p1k728j046P44P008j1781N835L520n229
2629a628J040j647Q103r667J183P833p300J760j908O862n858l508J0411p132O47
2644h09r15M852k054p176J1325n383j616J021K159J425r188J0050k035m509K890
2659C7K30L290r090P205J710p006M166q74L681p189L180N485q588M014r7K165
2675B319m135o67P768q298K307J556K95j376l344Q476o398o09L756j415N22m319
2691c562P059l171l547N298k102R65l969M982q1n660N689j759M83k598K345K503
2707B875o460M725l77o91j096L65L822o069L195J049j907M65j143M069m649J032
$$ plain form
2597 -2369 -3055 2805 284 767 -5132 5542 295 -5117 3489 89 1060 -4717 3470 2870 -6519 3394
2613 3394 581 597 -3345 924 5069 -6806 2120 2049 -679 -1725 -981 6027 -5754 81 3601 -1628
2629 -1628 -588 -2235 5868 -3799 -2616 5217 -2083 -323 -2231 4631 -1227 -4735 5676 -1456 -809
2644 -809 -1724 3128 1074 -6102 5223 -160 -1776 -755 1404 2829 -6359 3691 1656 -2853 37
2659 37 267 3557 -5533 1672 3382 -3624 542 -332 3349 -3840 -660 4825 -3763 251 154 2319
2675 2319 -1816 -2483 5285 -3013 -706 850 1145 -231 -3575 4901 -1497 -2106 1650 235 757 -3562
2691 -3562 3497 326 -3221 2077 -25 940 -3029 1953 1872 -3788 1901 142 625 -1973 372 2875
2707 2875 -3585 1140 763 72 -1024 -659 3163 -2906 289 1338 -569 -104 -1247 2822 -1827 -795
2723g95K723k752R53j259L108k650p97L516k858Q93q55J834q47k166L799k242
2739c95K0J92M34N11k473K857q97q90Q78k80Q42k128J848J03j552J260n39P88
2757E79j288P69P02j516R95k50L39o86K85P14j312Q63j82N3j71LN47q79N02J26
2777A93l09n7K41K19o74N19J7k30r8L43O0o13M92Rj21k64N03O5q15P99l02L1j75
2800a67J82M55j175J052k46k74J29j16Q21j453J069J26q40O77o90J227j354L55
2818b22J016j439R35o57R17p84l57J601j760J011m36L58J10j336K195j735M81
2835a02L67n10R07j725J988j080k70J072j269J479j778J407j32j312J869j621
2851g10J347j079K90J027k021K035j381P79j85p50J835k319J813p96k17J012j718
$$ plain form
2723 -795 1928 -824 129 -1130 1978 -672 -1469 2047 -811 82 -773 1061 214 -1952 1847 -395
2739 -395 -375 -183 251 762 -1711 1146 249 -641 237 -43 799 -1329 519 622 -930 330 -209 579
2757 579 -709 60 762 -754 241 -9 330 -356 -71 643 -669 194 12 65 -106 -103 444 -435 67 193
2777 193 -116 -173 68 287 -387 132 149 -81 -179 164 224 -389 103 112 -9 -273 230 295 -520 279 -23 8 -167
2800 -167 15 470 -705 347 101 -173 -44 -160 661 -792 277 403 -437 240 -450 777 -577 -222
2818 -222 794 -645 290 -367 550 -234 -591 1010 -750 261 -175 183 293 -1043 1152 -583 -102
2835 -102 265 -245 662 -1063 925 -155 -425 647 -622 857 -921 486 354 -958 911 -710
2851 -710 637 -442 -152 875 -1146 889 -492 287 102 -648 1187 -1132 681 -115 -332 680 -1038
2868a038K100j830Q85L31j271J795j959J647r22j02J264j992K080j597P24L01
2884D16j246J915k079J546n19n46J282j657J799j569P31N05j505J825j652J314
2900E60p22l66J587k089J648q59L01K26j128J957j865R05N8n16Q69j568J987j317
2918c32r4J069j166J075j307J288l15j064J552j086P33q51O54N25j674J638p65
2935a20J52j31j66J073j652J065P1n25K82m01J074j260M22O40q50M54m71Q31o05
2954a17m05J168q33J32p5L89j50o72R41k97k24O5J61J90p34N76K13o08K68N9J44
2975A91l50n6O23n04j24L53l9o5l77O42j88m69N21j98K58n79L42N36j074O97j62
2996b2K89m35l47J087r44M35K7m2J37r59J651j043k33P31n09P42j567J594k06
$$ plain form
2868 -1038 1062 -768 117 448 -823 972 -987 660 -262 -364 900 -1092 988 -609 115 416
2884 416 -830 1085 -994 552 33 -513 769 -888 911 -658 73 578 -927 898 -754 560
2900 560 -162 -528 1059 -1030 618 -241 60 286 -842 1115 -750 155 213 -303 566 -1002 985 -332
2918 -332 -426 643 -523 552 -755 533 218 -846 706 -380 353 -498 156 681 -993 645 -120
2935 -120 32 -99 -265 808 -844 221 292 -233 49 -352 722 -538 -116 524 -326 128 -343 488 -117
2954 -117 -522 646 -187 -55 -130 259 109 -563 378 81 -143 -78 83 273 -461 115 328 -280 -12 47 191
2975 191 -159 -215 408 -96 -220 133 94 29 -348 294 106 -363 158 -40 218 -361 -19 517 -557 140 -22
2996 -22 267 -168 -515 572 -372 63 90 48 185 -774 877 -166 -399 332 -177 565 -1002 592 386
3015C86j308J371o28P86j478R42R82k210J586m31M74r80j47K272k834J210M18
3032D11l43p1j120K865k500P9J523j012M80j756L016j607j475K755j498O92j795
3049a356K346n9l037L339j199K23j374J410J504m251L375l85o41n27J08K965m751
3066b310K393J242j877L51q21L558m173O54L030k906Q78j231L396k762j588M748
3082B582l283M13m97K132q08l471N435k596p61N00R11R49m737N092q78k543J674
3099A14n3J893m849L545J425m152K316m23K190m202J615L529n191K196j0J662
3115A605k832o07N327n252J090J113O14j295k395N991m270n64K393m36J09l420
3131b829N560k392k768L757j136N51l301M060J79m745M267q86L67k489K031K523
$$ plain form
3015 386 -922 449 -179 607 -871 71 1053 -1157 429 -2 472 -508 -655 1617 -1217 -7 411
3032 411 68 -3 -1123 1742 -758 -679 844 -168 312 -1444 1572 -35 -1510 1245 -253 439 -1356
3049 -1356 990 931 -2106 1233 34 257 -1117 293 1797 -2454 921 536 -105 -632 -524 2441 -2310
3066 -2310 83 1325 -552 -201 -1022 2536 -1637 -983 2047 -859 19 -1212 2184 -578 -2166 2582
3082 2582 -701 -288 -785 1347 539 -2932 2503 -93 -854 -354 557 1506 -3231 1861 983 -1560 114
3099 114 61 1954 -2895 650 2075 -2077 239 -184 2006 -2196 -581 2948 -2243 -47 -57 1605
3115 1605 -1227 -1834 3493 -1759 -669 444 1058 -237 -2632 3359 -911 -1475 918 482 591 -2829
3131 -2829 2731 339 -2429 1328 192 743 -2558 1502 1681 -3064 1203 317 684 -1805 226 2749
3147B749n878L844J88q08j083J81L940n719K303J902k005Jr72M409m709L23L506
3164B172k808N50j415L944k907j797M678k908L29j024K823j072l406N032k232
3179d1m27k59J443P31m349M544r87j655Q77J18J736m202L186O51k689J487m52
3196b88K004l454J427K340l518J583k66J348j957l91L402l437Q93M55N05o95j585
3213a634L648k648j16J251l41K78k115L213j477j224J869p15N43j929K242k06
3229F39j980K032q01N48j286J088Q39k506K066n69M9n43K30J311k309J470K7m28
3247a23N4l83J509j936P46P87j064N63n92J221j134n9J146j092M14l27Q12o11
3265f9m93J322j092L22j4J73m9p25J199p16o7L11m3M0n79R57o09j32L75j56J75
$$ plain form
3147 2749 -3129 715 903 95 -988 -807 3133 -2586 -283 1619 -386 -385 -1357 3052 -1657 -1334 2172
3164 2172 -636 -86 -1501 2443 -464 -2261 2417 -491 -162 -1186 1637 565 -2841 2191 -41
3179 -41 -468 -727 716 1447 -2902 1642 655 -1000 -123 -5 1731 -2471 715 1366 -1323 164 -288
3196 -288 1716 -1738 -311 2029 -1489 94 -172 1176 -781 -1172 2230 -1207 -314 141 646 -49 -1634
3213 -1634 2014 -634 -750 501 160 438 -1677 1536 59 -1165 704 -11 532 -1397 845 639
3229 639 -1341 691 -110 438 -848 240 1079 -1427 639 70 119 -424 -194 1117 -1192 278 305 -123
3247 -123 -69 -452 1057 -879 -133 654 -410 153 -439 782 -352 -411 735 -357 57 -270 542 -69
3265 -69 -562 760 -332 -10 -24 149 100 -625 574 -142 -209 102 59 99 -480 477 -132 -264 111 -45 130
3286A30m64O82l76l00N97k77K6l10O21l18l62N88k39L1l15N57j70m66N89j79m6
3307ak82N63j69m92O15j99K9l18M41O0p11P12j85m0k43L11K46q36P21j38q3q5
3329h4m2N87j016P05J48n12L01k54P25r42L36M09o16M20m41P17p40l8Q95r60O34
3350B32m17L86j32n90J144r32L77j10J7L61r69J243p86%L63m84P45j055R39l71
3370c9l42P28p05P32p92N13J56p56J016r07O73l61j63P43j069R94o27J88K50o48
3390d16R22r66P30k47l05P44r53R11o81K62L31q79J076q59M52j03k43O83j036
3409e77R73m81o0L50n67Q89j029O32J23o54P19o50P15o51J10O42r21O67m11M08
3429B27k72l33R84r91M24Pl0J52o73J016o33r6M04k49K54o53Q03k38n12O55l21
$$ plain form
3286 130 -334 348 -28 -328 269 -8 18 -292 329 11 -351 237 -2 29 -286 271 101 -365 224 45 -1
3307 -1 -283 280 111 -381 234 35 64 -254 187 247 -464 248 63 23 -220 91 337 -499 222 84 1 -84
3329 -84 -126 461 -555 150 298 -214 87 -167 558 -384 -48 361 -255 165 -276 441 -299 -337 558 -402 232
3350 232 -185 201 69 -521 623 -309 68 -42 -25 336 -633 610 -176 -176 187 -297 448 -607 332 -39
3370 -39 -381 347 -358 374 -418 95 251 -505 511 -396 277 -84 -247 496 -573 421 -206 -18 232 -416
3390 -416 506 -460 270 23 -282 462 -491 420 -261 1 332 -547 529 -330 122 19 -224 459 -577
3409 -577 396 -85 -145 205 -362 527 -502 130 253 -401 318 -332 383 -268 -158 484 -437 230 -181 227
3429 227 -45 -378 606 -385 39 46 16 168 -505 511 -122 -218 186 -63 191 -462 341 103 -409 246 -75
3450g5K50n05M00K97q58O52q5m1j93M6N53q17L31K50k47rj62O35n90r9O15m32
3472h4N0j36M03j31n24P05k24j76K6J51K08o92N81M7m25K37q4L39n87J32O01o57
3494b40K40j2J98j99l86Q70o12J3J32M1J87q26R90k97m24M86k95N53r35O08L44
3515D36q84O23l68O69q43Q2R74j235O92l06M96l26p34J636j284K25K12L0K37j284
3535i52J766q59m28P23l89P39j626J509K8j370J283o37Q16j340O54J135k094J346
3553C04l50M69p79k83K076k396R23L17j38n9j177K648k088p7J252p29M54j645
3571a278K574j269j163J988j022O30j692J993P0k459K510q99L13j198J010J332
3587A440l256K413k55l27m18j29K411l522J657R31j330L88q89K734k872J98K295
$$ plain form
3450 -75 175 -330 70 367 -491 161 76 35 -158 -112 441 -376 -45 205 -42 -51 -213 422 -168 -267 348 -84
3472 -84 -34 -170 233 102 -422 283 59 -117 -91 60 268 -424 157 204 -221 16 -68 271 -316 -184 417 -240
3494 -240 0 -12 186 -13 -399 471 -141 -128 4 45 232 -594 396 99 -325 161 -134 419 -516 92 436
3515 436 -448 175 -193 476 -367 -285 689 -546 146 -160 336 10 -724 912 -372 -147 65 95 332 -952
3535 -952 814 -45 -473 250 -139 600 -1026 483 511 -859 424 -213 603 -737 -83 1052 -1042 304
3553 304 -46 423 -356 -639 1437 -959 -36 281 143 84 -1093 1555 -533 -610 642 -87 367 -1278
3571 -1278 1296 27 -1136 852 -170 460 -1232 761 831 -1628 882 -17 296 -902 108 1440
3587 1440 -1816 597 342 15 -403 -532 1879 -1643 14 945 -385 3 -886 1848 -1024 -826 1469
3604A469k058O75j049K447j678j440L420k272M27o48J592k08k859L848j649n31
3620e14J87O22R81l598L474m63j651R64j73J784l659K398J108k771J485m90J842
3637A526k936Q76K564l416J469l10J386j788p26L692l482Q12M99M19m52j991M018
3654B160k643m82J569m58M79k605L604j240k002K516r63P92k378K396N55l320
3670b020K859p32L84j620J054J987l956K496L8l49o37k37K876l751J422J170j217
3687b33J85j010K993k876R4K152j761O19j246K539j633j285K957j933N23q64J567
3704G88k43k330L147j481j34r5N42Q68k890K780n40j061P01k70J398k656J761
3721B85O65j896J178n27J343j958N57J687k337J175l51Q33r58n53K294k236P18
$$ plain form
3604 1469 -589 86 -963 1484 -194 -1634 1786 -486 -59 -707 885 677 -2182 1666 17 -514
3620 -514 -327 295 1276 -2322 1152 689 -962 2 -171 1613 -2046 352 1460 -1311 174 -316 1526
3637 1526 -1410 -534 2030 -1386 83 -227 1159 -629 -1355 2337 -1145 -333 166 585 133 -1858 2160
3654 2160 -483 -965 604 146 625 -1980 1624 384 -1618 898 -65 727 -1651 745 1300 -2020
3670 -2020 839 107 491 -1129 -75 1912 -2044 452 490 141 -496 -733 2143 -1608 -186 984 -233
3687 -233 -48 -1058 1935 -941 -847 1305 -456 163 -1083 1456 -177 -1462 1495 -438 85 -779 788
3704 788 545 -1785 1362 -119 -253 -348 194 1062 -1828 952 412 -649 52 -218 1180 -1476 285
3721 285 950 -946 232 -295 1048 -910 -353 1334 -1003 172 -179 654 -304 -857 1437 -799 -81
3738h1J97P2o3j130K211j593jP44m66M41j414J980q94o59J219p45N18j072J193
3757D57p8j267J504q46M43o60N32N41j461J243l80j40j7n5Q84j406Q39J92n61
3776b36L11l58R21j099L10O35q55M95l33N82n58j29Q68q83L36o5K16j86l35Q47
3796D84p16J48J94o0ll46O72m38k10M57j66k3k29N13k78k47M08j29k1k23M29j53
3818F3l35M20o0j47r3L01q0l03K91O1j66j29L39p6l12K74O6j51j42L23n6k78K00
3841A0R4p1k59L57%l68L10k8Qk18K00J78m64L13j4Rj75O6L40n71L48K0j21M9j73
3866a60M48m85J40K21k79J88k67M45l48l8L66m18L19l19L09p0l15N34m56K70j40
3887e5K9J76m28N33l93J57M8k23L98n00M43j99j14L42m36M30l56J95K2k82M78
$$ plain form
3738 -81 116 188 125 -1005 1206 -387 -388 356 -110 331 -1083 897 3 -656 563 -182 336 -736 457
3757 457 379 -888 616 -230 213 -447 85 626 -835 408 28 -112 -129 -184 700 -706 133 325 -236
3776 -236 75 -283 638 -461 -151 484 -371 124 -209 373 -185 -314 554 -329 7 -58 158 -28 -363 484
3796 484 -232 -84 110 50 47 -299 373 -65 -275 182 16 -7 -236 277 -1 -248 160 31 10 -213 216 63
3818 63 -272 148 88 -59 -152 149 69 -234 57 118 -48 -177 162 86 -226 48 114 -37 -179 144 88 -190 10
3841 10 104 33 -226 131 131 -237 73 45 53 -165 35 213 -251 62 48 57 -118 -52 288 -283 65 85 -36 13 -160
3866 -160 288 -197 -57 164 -115 73 -194 251 -97 -135 231 -187 132 -187 122 52 -263 271 -185 85 -55
3887 -55 -26 150 -278 255 -138 19 67 -156 242 -258 185 -14 -128 214 -222 208 -148 47 69 -213 265
3908B65m85L38j48m5K46m47N37l97O6K13l07L47m08L85j54j87L82l40K60k92K25
3929E4Q2m18M94k68Q4p1mK79n12L69j0j33M3m8K92m44J97J86k63Q8o3K70l02n0
3953a48L70k69m6O9J52j68j45L47j28j73J16J52j11k26L00O1l48J64J76j44j26
3974a25R5K57l56rL30j91p4l0L27k53k17M80k40k4q2K32M3n47O10j65j66N0J2
3997d3L43p03M83J12l71K12k21N81p01J61N43o92M02l39N40l45m03R80q04L17
4017E2k03L11R1r17J240o79K4O2q0O44j335J177j91n16M60m30R83j377P29M91
4037E36j038P33o34J092j104oJ306j489P90n14P89m37q94J905j500M31o8K62L12
4056D72j647K164j099k95O31m05R87k013J824j31j307J243p58J195j835J003J029
$$ plain form
3908 265 -220 118 -30 -75 171 -276 261 -136 -70 143 -164 183 -225 160 6 -181 201 -139 121 -171 54
3929 54 136 -282 212 -56 28 -43 -47 232 -280 89 79 -54 -11 -59 233 -211 -14 172 -91 -3 -66 204 -98 -148
3953 -148 222 -47 -93 -24 128 -40 -185 162 34 -139 -23 129 18 -208 92 153 -195 -31 145 1 -125
3974 -125 -30 227 -129 -138 192 1 -73 -103 224 -29 -246 234 -6 -30 -112 120 163 -384 226 61 -105 -55 -43
3997 -43 300 -403 80 192 -179 33 -188 393 -308 -147 396 -296 106 -233 307 -38 -441 539 -265 52
4017 52 -151 160 251 -666 574 -105 -81 -19 -99 545 -790 387 196 -320 140 -290 693 -684 45 536
4037 536 -502 231 -403 689 -415 -421 885 -604 186 -328 461 24 -870 1035 -465 -34 -102 160 472
4056 472 -1175 989 -110 -405 226 -179 808 -1205 619 488 -819 424 -334 861 -974 29 1058
4073A058k175J559p23R75j205j46K202k676J263q8K92l37j166K849k472M36P71
4090D17m18M20j889K974j686p83J754j029Q74k037K377l84k076K429j172Q15j657
4107a071J351J049l134K624p68J94p76O3K309l566K012L19q08J60r42K948l238
4124a274P91J681j773Q47j449K856k128r04L002k281Q48j173K026o46k401L695
4140A717k052K34m47R48P73l427L631j117q53N21j09J742l623K733K94j984J270
4157B51p43K102l149J349J822k928J618q22J757k001l29L126l256J216j77Q66
4173G02o67j727L791k847K20Q63j83M98k583L644j668j233J946r35J038k561K671
4190I69r9k537K545j086R53j937J317J421l391K534o13K72q87l9K442l454J780
$$ plain form
4073 1058 -1117 442 -281 694 -511 -657 1545 -1131 132 44 336 -1 -1167 1682 -790 -354 417
4090 417 -1 419 -1470 1504 -182 -965 789 -240 634 -1403 974 590 -1486 943 -229 586 -1071
4107 -1071 280 1329 -1805 819 51 245 -531 -468 1841 -1725 287 606 -202 -42 -984 1964 -1274
4124 -1274 -483 1198 -575 272 -1177 1679 -449 -1353 1649 -632 216 -957 1069 423 -1978 1717
4140 1717 -335 -101 -548 400 1173 -2254 1377 260 -593 -72 -181 1561 -2062 671 965 -1019 251
4157 251 -492 1610 -1539 -190 1632 -1296 322 -500 1257 -744 -1073 2053 -1203 13 -164 702
4173 702 35 -1692 2099 -748 -528 335 152 650 -1933 1711 43 -1190 756 -179 859 -1702 969
4190 969 870 -1667 878 -208 745 -1192 125 1546 -1845 689 76 348 -539 -578 1864 -1590 190
4207A90L22n86N3r86K814k884O52J375j371P07j363K492j770o95K291j714P37
4224B64j107J690m93j834K750j563L23m51O54O64k515K602q43n28L92k23J326
4241A108k502J843J75j354J019o98J433j944P79J184j926J203o43R76j022k64
4257f33J820j971R08j98L54j96r67J994j614L20M16k98M11j222J699r20m02R41
4275D42o43N95j077J161k05r85J244p18M40o43M74M57j320J192m24L0j18p6P84
4294F10j251Q19J9m09L11l72Q01r35L32M84p36M72l49N18m60j12P10p27L36j30
4314f9J96j05l44P48o18J18J74j04R1l68N61l00j76L33j56O8k54L67r1l16L98
4335A53j44l2p3J53O1l47K93M4k06M2R5N5k50J53J66k68O0J03lj24j7K67k69j0
$$ plain form
4207 190 512 -74 -21 -1007 1807 -1077 -425 950 -421 286 -1077 1415 -355 -1050 1241 -473 264
4224 264 -843 847 354 -1480 1270 -293 30 -421 233 897 -1618 984 141 -387 5 -218 1108
4241 1108 -1394 449 624 -730 289 -409 1024 -920 -141 1043 -883 320 -323 653 -369 -633
4257 -633 1187 -784 124 -74 280 84 -883 1111 -503 -183 233 -65 346 -876 823 -97 -499 442
4275 442 -201 394 -683 478 273 -712 532 -186 254 -389 85 542 -778 414 -10 20 -98 -174 610
4294 610 -641 178 197 -212 99 -273 528 -407 -75 409 -327 145 -204 314 -146 -258 452 -275 61 -69
4314 -69 127 22 -322 426 -192 -74 100 -4 87 -281 280 -20 -196 137 -19 49 -205 162 71 -245 153
4335 153 9 -23 -96 57 118 -229 64 108 -98 -56 39 94 -156 -3 163 -105 -45 58 55 -69 -86 181 -88 -98
4359i8K17j30k0m5J94j01j82L19j57j9pP5M8l10L67j30j14J39r7J97l20K19O7
4382A12k80K49j44J76k05M5K24l72L07j62J01j7j82L77m03K26oj09J77k87L54
4403A81k80Q0J33k51L02l27K85j33j07L17l85L25k12O1R2k40L44l48K33l7j36
4424a03K32k97L43k79P1J71l12L03k45K06j06j08L13l21J91q7P7lk07L64k81N9
4446a9N4l6R2k68L23j36j08J41l1N9k38K77n1j70J42k0N8k32K12N9k16Q9O2L1
4470G4k24J80Q3j86K3O3J22k87J52J40j98K1K2J89l25J16J92j96K6q8L25l19l9
4493a34L31k69J07j84L66k09k46M62k99J25k39L13K7n17O13k95Q7j52Q5L68p66
4514d26O13j42p3K3j91O73q78M44J55l53L00n12Q78p47J8O31o66M75o10P85l46
$$ plain form
4359 -98 119 -11 -31 -76 118 17 -165 154 -3 -22 -29 46 94 -216 151 21 -93 46 -51 146 -174 45 112
4382 112 -168 81 -63 113 -92 -47 177 -195 112 -50 51 34 -148 229 -174 52 46 -63 114 -173 181
4403 181 -99 -19 114 -137 165 -162 123 -10 -117 200 -185 140 -72 -11 81 -159 185 -163 70 33 -103
4424 -103 129 -168 175 -104 -33 138 -174 129 -116 90 -16 -124 189 -132 59 -28 49 46 -161 203 -78 -19
4446 -19 35 -1 91 -177 146 10 -98 43 12 71 -167 110 59 -111 31 11 69 -163 49 108 -108 -19 43 74
4470 74 -150 30 113 -73 -50 13 135 -152 0 140 -58 -37 -15 174 -151 -35 157 -39 -13 -101 224 -95 -134
4493 -134 197 -72 35 -149 217 8 -238 224 -75 50 -189 124 151 -366 247 -48 39 -113 -28 340 -426
4514 -426 187 45 -28 -5 -196 477 -401 43 198 -155 145 -367 511 -236 -218 413 -253 222 -388 397 51
4535E1n60J060q21M81n44N00K31j178J328o79J56j62%Q11j521J217k33l13K36
4554F0m43J230j597P83M43q64O31p63J331j220j7J238j295P35p30J093n83q99
4572h67J876j434N26l97N34K83j729K170j078j25K69j57J002k173J935k68j008
4589f41R27o78J415k110J179Q57j899J339p97J287j504N4J975k402J211m11P57
4606E59o33j040K704k345N84L17J5K64j856K852j640m75J186o24Q33k141K413
4623I73n36j628J903r78J004j896J454Q49k666K190p60N62j142K84K025l177J856
4640C17%k36k06q13K791l047Q98J138j158N67j425K801k124n19K264j703Q06j434
4658a083K202q38j881K985j733N17q98J164N46k855L016j066k91p5J63J525l181
$$ plain form
4535 51 -509 551 -270 211 -333 167 398 -780 548 -131 25 -137 -137 674 -847 370 137 -176 60
4554 60 -383 847 -750 33 476 -388 243 -520 811 -409 -426 812 -483 252 -478 615 32 -867
4572 -867 1009 -425 101 -296 238 521 -1208 962 -116 -241 28 -129 873 -1300 635 367 -641
4589 -641 286 -392 1023 -1087 92 949 -950 389 -408 879 -625 -571 1404 -998 213 -198 559
4606 559 -74 -1114 1590 -755 -171 146 161 425 -1431 1421 -219 -694 492 -132 701 -1440 973
4623 973 437 -1191 712 -266 738 -1158 296 1145 -1521 669 -91 471 -671 -387 1638 -1539 317
4640 317 317 81 -125 -938 1853 -1194 -296 842 -316 251 -1174 1627 -497 -1016 1248 -455 351 -1083
4658 -1083 1119 281 -1600 1385 -348 169 -729 435 981 -1874 1142 76 -215 -290 -127 1398 -1783
4675a783K400Mj240O90n81J987k841J260J314k101J128p89J784j952j06K432k522
4692i16J021m59J139q00j375L111k335L39L23K12K89k177L061j497o95J162n22
4709a19R41k336K366k68j755J783q58J028j854J218R91k472J851o12N89j044J20
$$ plain form
4675 -1783 617 621 -619 71 -510 1477 -1364 -104 1210 -891 237 -552 1232 -720 -826 1606 -916
4692 -916 105 -354 785 -15 -1390 1721 -614 -275 48 260 549 -1628 1433 -64 -759 403 -119
4709 -119 822 -1514 852 584 -1171 612 -246 782 -1072 146 1137 -1335 516 -96 493 -551 -431
$$ [...]
8191A5
##END NTUPLES=NMR FID
##END=
