##TITLE=1H_Pr 5341-2
 200.13MHz,D2O.
 8 sc
 
 18.12.2025
##JCAMPDX= 6.0         $$ Bruker NMR JCAMP-DX V2.0
##DATA TYPE= NMR FID
##DATA CLASS= NTUPLES
##ORIGIN= UXNMR, Bruker Analytische Messtechnik GmbH
##OWNER= pz
$$ XWIN-NMR		Version 3.5
$$ Thu Dec 18 15:37:50 2025 Russian Standard Time (UT+4h)  she@DPX200
##.OBSERVE FREQUENCY= 200.1313
##.OBSERVE NUCLEUS= ^1H
##.DELAY= (6, 6)
##.ACQUISITION MODE= SIMULTANEOUS
##.ACQUISITION SCHEME= undefined
##.AVERAGES= 8
##.DIGITISER RES= 18
##SPECTROMETER/DATA SYSTEM= spect
##.PULSE SEQUENCE= zg30
##.SOLVENT NAME= D2O
##.SHIFT REFERENCE= (INTERNAL, D2O, 0, 14.3821)
##AUDIT TRAIL= $$ (NUMBER, WHEN, WHO, WHERE, WHAT)
$$ ##TITLE= Audit trail, XWIN-NMR		Version 3.5
$$ ##JCAMPDX= 5.01
$$ ##ORIGIN= Bruker BioSpin GmbH
$$ ##OWNER= she
$$ F:/spectra/data/she/nmr/H-C/1/audita.txt
$$ ##AUDIT TRAIL=  $$ (NUMBER, WHEN, WHO, WHERE, WHAT)
(   1,<2025-12-18 15:35:21.32 +0400>,<she>,<DPX200>,
      <created by zg, POWCHK disabled, PULCHK disabled
       configuration hash MD5:
       00 E9 B6 7A A2 85 ED C7 34 08 36 98 17 FE 4E 26
       data hash MD5: 16K
       1D A6 B4 F4 68 AE EA 55 7B 98 42 EC A4 1D 75 E3>)
$$ ##END=
$$ 
$$ hash MD5
$$ 2F 94 62 75 05 EC 2B 88 CB 61 A9 26 D5 14 55 52
##$RELAX= 
##$RELAX= 
##$RELAX= 
##$RELAX= 
##$RELAX= 
##$RELAX= 
$$ Bruker specific parameters
$$ --------------------------
##$DU= <F:/spectra>
##$EXPNO= 1
##$NAME= <H-C>
##$PROCNO= 1
##$TYPE= <nmr>
##$USER= <she>
##$AMP= (0..31)
100 100 100 100 100 100 100 100 100 100 100 100 100 100 100 100 100 100 
100 100 100 100 100 100 100 100 100 100 100 100 100 100 
##$AQSEQ= 0
##$AQ_mod= 1
##$AUNM= <au_zg>
##$AUTOPOS= <>
##$BF1= 200.13
##$BF2= 200.13
##$BF3= 200.13
##$BF4= 200.13
##$BF5= 200.13
##$BF6= 200.13
##$BF7= 200.13
##$BF8= 200.13
##$BYTORDA= 1
##$CFDGTYP= 0
##$CFRGTYP= 5
##$CHEMSTR= <none>
##$CNST= (0..31)
1 1 145 1 1 1 1 1 1 1 1 1 1 1 1 1 1 1 1 1 1 1 1 1 1 1 1 1 1 1 1 1 
##$CPDPRG= <>
##$CPDPRG1= <>
##$CPDPRG2= <>
##$CPDPRG3= <>
##$CPDPRG4= <mlev>
##$CPDPRG5= <mlev>
##$CPDPRG6= <mlev>
##$CPDPRG7= <mlev>
##$CPDPRG8= <mlev>
##$CPDPRGB= <>
##$CPDPRGT= <>
##$D= (0..31)
0 0.7 0 0 0 0 0 0 0 0 0 0.03 0 0 0 0 0 0 0 0 0 0 0 0 0 0 0 0 0 0 0 0 
##$DATE= 1766057720
##$DBL= (0..7)
120 120 120 120 120 120 120 120 
##$DBP= (0..7)
150 150 150 150 150 150 150 150 
##$DBP07= 0
##$DBPNAM0= <>
##$DBPNAM1= <>
##$DBPNAM2= <>
##$DBPNAM3= <>
##$DBPNAM4= <>
##$DBPNAM5= <>
##$DBPNAM6= <>
##$DBPNAM7= <>
##$DBPOAL= (0..7)
0.5 0.5 0.5 0.5 0.5 0.5 0.5 0.5 
##$DBPOFFS= (0..7)
0 0 0 0 0 0 0 0 
##$DE= 6
##$DECBNUC= <off>
##$DECIM= 32
##$DECNUC= <off>
##$DECSTAT= 4
##$DIGMOD= 1
##$DIGTYP= 9
##$DL= (0..7)
0 120 120 120 120 120 120 120 
##$DP= (0..7)
150 150 150 150 150 150 150 150 
##$DP07= 0
##$DPNAME0= <>
##$DPNAME1= <>
##$DPNAME2= <>
##$DPNAME3= <>
##$DPNAME4= <>
##$DPNAME5= <>
##$DPNAME6= <>
##$DPNAME7= <>
##$DPOAL= (0..7)
0.5 0.5 0.5 0.5 0.5 0.5 0.5 0.5 
##$DPOFFS= (0..7)
0 0 0 0 0 0 0 0 
##$DQDMODE= 0
##$DR= 18
##$DS= 0
##$DSLIST= <SSSSSSSSSSSSSSS>
##$DSPFIRM= 0
$$ [...]
##$SUBNAM0= <"">
##$SUBNAM1= <"">
##$SUBNAM2= <"">
##$SUBNAM3= <"">
##$SUBNAM4= <"">
##$SUBNAM5= <"">
##$SUBNAM6= <"">
##$SUBNAM7= <"">
##$SUBNAM8= <"">
##$SUBNAM9= <"">
##$SW= 18.0517328524113
##$SWIBOX= (0..15)
0 0 2 0 0 0 0 0 0 0 0 0 0 0 0 0 
##$SW_h= 3612.71676300578
##$TD= 16384
##$TD0= 1
##$TE= 0
##$TE2= 300
##$TE3= 300
##$TEG= 300
##$TL= (0..7)
0 120 120 120 120 120 120 120 
##$TP= (0..7)
150 150 150 150 150 150 150 150 
##$TP07= 0
##$TPNAME0= <>
##$TPNAME1= <>
##$TPNAME2= <>
##$TPNAME3= <>
##$TPNAME4= <>
##$TPNAME5= <>
##$TPNAME6= <>
##$TPNAME7= <>
##$TPOAL= (0..7)
0.5 0.5 0.5 0.5 0.5 0.5 0.5 0.5 
##$TPOFFS= (0..7)
0 0 0 0 0 0 0 0 
##$TUNHIN= 0
##$TUNHOUT= 0
##$TUNXOUT= 0
##$USERA1= <user>
##$USERA2= <user>
##$USERA3= <user>
##$USERA4= <user>
##$USERA5= <user>
##$V9= 5
##$VALIST= <valist>
##$VCLIST= <CCCCCCCCCCCCCCC>
##$VD= 0
##$VDLIST= <DDDDDDDDDDDDDDD>
##$VPLIST= <PPPPPPPPPPPPPPP>
##$VTLIST= <TTTTTTTTTTTTTTT>
##$WBST= 1024
##$WBSW= 4
##$XGAIN= (0..3)
0 0 0 0 
##$XL= 0
##$YL= 0
##$YMAX_a= 536311
##$YMIN_a= -612155
##$ZGOPTNS= <>
##$ZL1= 120
##$ZL2= 120
##$ZL3= 120
##$ZL4= 120
##$ABSF1= 10
##$ABSF2= 0
##$ABSG= 5
##$ABSL= 3
##$ALPHA= 0
##$AQORDER= 0
##$ASSFAC= 0
##$ASSFACI= 0
##$ASSFACX= 0
##$ASSWID= 0
##$AUNMP= <proc_1d>
##$AZFE= 0.1
##$AZFW= 0.1
##$BCFW= 1
##$BC_mod= 2
##$BYTORDP= 1
##$COROFFS= 0
##$CY= -3
##$DATMOD= 1
##$DC= 2
##$DFILT= <>
##$DTYPP= 0
##$F1P= 0
##$F2P= 0
##$FCOR= 0.5
##$FTSIZE= 0
##$FT_mod= 4
##$GAMMA= 1
##$GB= 0.15
##$INTBC= 1
##$INTSCL= 1
##$ISEN= 128
##$LB= 0.25
##$LEV0= 0
##$LPBIN= 0
##$MAXI= 10000
##$MC2= 0
##$MEAN= 0
##$ME_mod= 0
##$MI= 1.114404
##$NCOEF= 0
##$NC_proc= 0
##$NLEV= 6
##$NOISF1= 3.799351
##$NOISF2= 2.8
##$NSP= 1
##$NTH_PI= 0
##$NZP= 0
##$OFFSET= 14.38212
##$PC= 1
##$PHC0= -3659.222
##$PHC1= -72.20767
##$PH_mod= 1
##$PKNL= yes
##$PPARMOD= 0
##$PSCAL= 0
##$PSIGN= 0
##$REVERSE= no
##$SF= 200.129724274929
##$SI= 16384
##$SIGF1= 3
##$SIGF2= 2
##$SINO= 400
##$SIOLD= 16384
##$SREGLST= <1H.CDCl3>
##$SSB= 0
##$STSI= 0
##$STSR= 0
##$SW_p= 3205.1282051282
##$SYMM= 0
##$S_DEV= 0
##$TDeff= 0
##$TDoff= 0
##$TI= <>
##$TILT= no
##$TM1= 0
##$TM2= 0
##$TOPLEV= 0
##$USERP1= <user>
##$USERP2= <user>
##$USERP3= <user>
##$USERP4= <user>
##$USERP5= <user>
##$WDW= 1
##$XDIM= 8192
##$YMAX_p= 0
##$YMIN_p= 0
$$ End of Bruker specific parameters
$$ ---------------------------------
##NTUPLES= NMR FID
##VAR_NAME=  TIME,          FID/REAL,        FID/IMAG
##SYMBOL=    X,             R,               I
##VAR_TYPE=  INDEPENDENT,   DEPENDENT,       DEPENDENT
##VAR_FORM=  AFFN,          ASDF,            ASDF
##VAR_DIM=   8192,          8192,            8192
##UNITS=     SECONDS,       ARBITRARY UNITS, ARBITRARY UNITS
##FACTOR=    0.0002768,     1,               1
##FIRST=     0,             0,               0
##LAST=      2.2672688,     0,               0
##MIN=       0,             -612155,         0
##MAX=       2.2672688,     536311,          0
$$ Real data points
##PAGE= N=1
##DATA TABLE= (X++(R..R)), XYDATA
0 0 0 0 0 0 0 0 0 0 0 0 0 0 0 -8 8 -8 8 -8 16 -16 16 -24 24 -32 32 -40 48 -52 62 -68 81 -91 101 -117 129
35 129 -148 165 -184 207 -229 255 -281 312 -348 380 -422 466 -512 567 -621 686 -756 832 -920
54 -920 1017 -1127 1255 -1402 1578 -1782 2034 -2346 2751 -3294 4058 -5225 7208 -11238 22750
69 22750 -128019 -580282 -611751 -465233 -238431 30858 337655 536311 532243 303182 -33588
80 -33588 -351135 -527671 -516163 -314952 -2888 312508 507352 515047 330007 27145 -284255
91 -284255 -486489 -509493 -343515 -53089 254730 464646 502656 353968 76975 -225930
101 -225930 -442407 -494601 -362601 -98968 198739 419891 484601 369618 119699 -172296
111 -172296 -397477 -473883 -374569 -137922 146896 374897 462369 378403 155688 -122374 -352203
122 -352203 -450493 -380462 -170919 97272 329551 437562 383132 188059 -74341 -306857
132 -306857 -423890 -383850 -202747 51298 284033 409886 383598 215852 -29960 -262246
142 -262246 -395779 -381719 -226907 10416 241295 381111 378888 236823 8795 -220638
152 -220638 -366740 -375965 -246174 -26976 200147 351240 371573 254925 45348 -179432
162 -179432 -335922 -367211 -262857 -62498 159203 320096 361888 269759 78906 -139393
172 -139393 -304143 -355488 -275514 -94532 119883 288016 348603 280001 108690 -101027 -271795
183 -271795 -341061 -283841 -122431 82591 255210 332305 286498 135067 -64738 -238898 -323358
194 -323358 -288017 -146530 47525 222117 313404 288602 157630 -30670 -205591 -303164 -288118
205 -288118 -166976 14367 188668 292264 286939 176145 1178 -172285 -280749 -284719 -183706
216 -183706 -16265 155942 269056 281944 190697 29899 -140328 -256838 -278030 -196076 -42678
227 -42678 124860 245287 273298 199807 54485 -109754 -232341 -268728 -204438 -65891 96218
238 96218 220862 263018 207738 76752 -81808 -208823 -257475 -210946 -86744 67881 196155
249 196155 251094 213003 96653 -54097 -184220 -244658 -214507 -105764 41157 171282 237781
260 237781 215607 114093 -28406 -159209 -229987 -215653 -121827 15926 146591 222393 215080
271 215080 128945 -4428 -134530 -213805 -213824 -134924 -7128 122128 205188 212269 140688 18177
283 18177 -109813 -196522 -209391 -145254 -27994 98416 187194 206230 149184 37760 -86619
294 -86619 -177772 -202924 -152386 -46579 75293 168278 198401 154851 54673 -64401 -158882
305 -158882 -193701 -156486 -62128 54293 149686 188794 157635 68673 -44665 -140337 -183177
316 -183177 -158080 -74896 35222 131200 177940 158408 80395 -26119 -121783 -172091 -158312
327 -158312 -86203 17096 113097 166195 157471 90805 -8532 -104266 -160006 -156862 -95114 841
339 841 95322 154150 155375 99318 7115 -86856 -147921 -153741 -102920 -14579 77823 141095 152010
352 152010 106416 22146 -69558 -134438 -149338 -109133 -29108 60937 127745 146705 111440 35642
364 35642 -52769 -120590 -143524 -113364 -41865 44684 113390 139949 114447 47207 -36544 -106256
376 -106256 -135864 -115403 -52508 29390 98963 132063 115621 57082 -21779 -91750 -127454 -115692
388 -115692 -61562 14781 84848 122813 115330 65028 -8263 -77866 -117868 -114259 -68501 2012
400 2012 70871 113077 112985 71099 3533 -64242 -108073 -111412 -73702 -9255 57877 103195 109842
413 109842 75664 14386 -51554 -97918 -107489 -77941 -19421 45479 92960 105552 79346 24252
425 24252 -39717 -87835 -103562 -80562 -28147 33863 82653 100795 81646 32215 -28392 -77662
437 -77662 -98184 -82153 -36188 22891 72737 95456 82582 39607 -17500 -67499 -92325 -82693
449 -82693 -42917 12303 62399 88954 82557 45773 -7468 -57367 -85369 -81980 -48476 2729
461 2729 52233 82169 81380 50579 1663 -47141 -78426 -80237 -52679 -5857 42555 74684 78887
474 78887 54162 9645 -37610 -70908 -77206 -54984 -12981 33118 66846 75520 56190 16533
486 16533 -28903 -62831 -73530 -56751 -19419 24816 59417 71445 57363 22170 -20756 -55425
498 -55425 -69155 -57522 -24716 17058 51975 67141 57631 26728 -13330 -48153 -64909 -57709
510 -57709 -29051 10145 44793 62759 57549 31145 -6477 -41185 -60356 -57218 -32763 3429
522 3429 37772 57978 56542 34373 -157 -34581 -55675 -56097 -36194 -2858 30759 53117 55254
535 55254 37221 5635 -27518 -50470 -54451 -38424 -8708 24004 47501 53226 39320 11186
547 11186 -20801 -44783 -51895 -40137 -13470 17557 42072 50597 40290 15777 -14594 -39007
559 -39007 -48804 -40478 -17430 11494 36305 47175 40603 19478 -8965 -33430 -45598 -40513 -20725
572 -20725 6207 30651 43571 40085 22136 -4146 -27958 -41558 -39366 -23212 1893 24937
584 24937 38388 38550 23022 395 -22501 -37326 -38032 -24713 -2932 20223 35863 37832 25634
597 25634 4651 -18200 -34176 -37090 -26314 -6052 16185 32204 35313 26723 6838 -13669 -30295
610 -30295 -34663 -26744 -9456 11526 27656 33798 27377 10088 -9783 -26564 -33447 -27712 -12156
623 -12156 7809 24621 32213 27966 13444 -5826 -22599 -31132 -27894 -14474 3935 19808 29422
636 29422 26519 14515 -1931 -18826 -28563 -26979 -16206 649 16740 26640 26673 17312 963 -14546
650 -14546 -24781 -26252 -17686 -2550 13018 23827 25694 18359 4066 -11247 -22557 -24748 -18456
663 -18456 -5513 9553 21045 24346 18748 6426 -8175 -19622 -23558 -19045 -7478 6646 18154
676 18154 22776 19018 8397 -5284 -16745 -21666 -18861 -9153 3928 15399 20880 18689 9914 -2462
690 -2462 -13766 -19718 -17977 -10297 1754 12891 19361 18027 10760 -456 -11462 -18153 -18439 -11683
704 -11683 -729 10467 17383 18080 11986 1691 -9114 -16370 -17876 -12319 -2704 7921 15376 17158
718 17158 12749 3755 -6500 -14343 -16850 -13036 -4661 5482 13364 16236 13219 5288 -4571 -12277
732 -12277 -15618 -13235 -6115 3224 11448 14840 13439 6723 -2122 -10198 -14185 -13245 -7118 1139 9086
747 9086 13634 12828 7798 -161 -7955 -12676 -12645 -8192 -465 7088 12002 12378 8354 1342 -6598 -11204
763 -11204 -11636 -9048 -1986 5328 9923 11763 8809 2577 -4265 -9679 -10891 -7910 -3016 3082 8799
778 8799 11016 8686 4180 -3135 -8345 -10251 -8896 -4069 1680 7751 10415 9129 4645 -1511 -7032
793 -7032 -9928 -9175 -4857 777 6278 9272 9147 5531 -256 -5716 -8943 -8831 -5693 -640 4855 8376
809 8376 8884 5948 976 -4118 -7875 -8678 -6372 -1746 3412 7480 8559 6718 2228 -2766 -6620 -8235
825 -8235 -6683 -2670 2339 6177 8050 6710 3125 -1576 -5562 -7731 -6919 -3254 967 5058 7437
840 7437 6688 3806 -630 -4333 -6828 -6757 -4239 -164 3801 6408 6432 4511 410 -3457 -6224 -6443 -4537
857 -4537 -932 2918 5405 6449 4713 1175 -2205 -5118 -6128 -4778 -1578 1956 4668 5982 4854
872 4854 2113 -1447 -4268 -5621 -4992 -2483 1203 4001 5594 4923 2480 -665 -3539 -5209 -4850 -2774
888 -2774 495 3367 5048 4961 3257 62 -3156 -4955 -4901 -3191 -563 2434 4767 4894 3497 895
904 895 -2378 -4070 -4784 -3493 -1379 1784 3900 4756 4081 1434 -1406 -3661 -4717 -3959 -1814 1096
920 1096 3399 4489 4002 2084 -470 -2784 -4443 -4146 -2507 74 2784 3977 4112 2846 119 -2306
936 -2306 -3856 -4118 -2767 -453 1957 3820 3940 2851 1129 -1400 -3300 -3987 -3045 -1049 1267 3194
952 3194 3859 3148 1308 -844 -2755 -3843 -3158 -1603 656 2587 3531 3303 1777 -367 -2197 -3425
968 -3425 -3176 -1964 203 2097 3392 3117 2063 60 -1705 -3111 -3146 -2042 -312 1527 2937 3269
984 3269 2319 590 -1432 -2884 -2912 -2208 -866 1197 2689 3246 2658 924 -1051 -2474 -2904 -2617 -1290
1001 -1290 582 2261 3347 2611 1264 -398 -2126 -2949 -2914 -1720 201 1738 3034 2807 1823 -95
1017 -95 -1773 -2876 -3158 -1789 -344 1474 2892 2967 2255 538 -1212 -2524 -3032 -2482 -939 958 2356
1034 2356 2977 2452 1041 -719 -2126 -2913 -2445 -1030 384 1898 2671 2452 1295 -251 -1903 -2711 -2446
1051 -2446 -1429 24 1588 2616 2571 1697 159 -1389 -2225 -2494 -2012 -481 1236 2434 2345 1846 276
1068 276 -1035 -2098 -2422 -1887 -573 1019 2150 2486 1717 450 -855 -1868 -2464 -2060 -1031 596 1890
1085 1890 2458 2321 915 -412 -1900 -2496 -2244 -1100 356 2041 2495 2305 1277 -545 -1610 -2772
1101 -2772 -2631 -1392 -121 1455 2470 2649 1555 293 -1318 -2364 -2501 -1911 -423 1178 2399 2361
1117 2361 1790 477 -1032 -2358 -2560 -2188 -649 729 1946 2628 1902 727 -490 -1731 -2560 -2152 -1094
1134 -1094 268 1674 2351 2320 1389 -420 -1403 -2317 -1991 -1233 231 1336 2369 2186 1316 157 -1177
1151 -1177 -2215 -1992 -1578 -126 1026 1755 1961 1387 61 -1163 -1736 -1948 -1891 -341 1231 1749 1670 1447
1169 1447 542 -397 -1860 -2145 -1907 -1016 991 1536 1861 1786 712 -707 -1623 -1947 -1895 -704 334 1848
1187 1848 1879 1953 811 199 -1360 -1874 -2295 -1397 -140 1532 2241 1761 988 -136 -1338 -2337 -2276 -1341 -150
1206 -150 852 1693 1900 731 -92 -737 -2109 -1794 -1561 -265 616 1781 1637 1455 300 -756 -1835
1223 -1835 -1964 -1644 -721 802 1443 2065 1309 367 -772 -1359 -2073 -1337 -1155 -251 718 1514 1495 760 -738
1242 -738 -829 -1806 -1219 -736 -130 1313 1567 1742 735 -100 -1201 -1588 -1975 -514 -10 1476 1536 1258 1304
1261 1304 446 -1400 -1479 -1828 -798 200 588 1846 2045 991 42 -404 -1256 -1076 -1926 320 939 1190
1279 1190 1904 1462 222 -643 -1194 -1790 -1463 -622 194 1490 1629 1762 763 -199 -855 -1630 -1539 -886 522
1298 522 1615 1346 1491 879 -304 -1008 -1747 -1675 -944 22 993 1647 1515 1063 113 -729 -1324 -1598 -1066 -89
1318 -89 894 1344 1537 1214 199 -454 -1340 -1488 -1190 -380 309 1266 1677 1033 417 -572 -1037 -1278 -1183 -358
1338 -358 226 574 1559 1239 302 -265 -1283 -1166 -1472 -391 -240 1275 1452 1000 -15 -217 -882 -670 -1284
1357 -1284 -345 455 1019 905 931 1041 -423 -589 -853 -791 -869 -159 713 1215 1265 898 121 -806 -1341 -1200 -983
1378 -983 -161 649 1404 1393 839 153 -629 -1187 -1456 -1014 -383 626 977 1352 1017 594 -502 -899 -1585 -1351
1398 -1351 -715 272 1338 1663 1242 366 474 -1662 -1313 -1101 -563 99 565 474 1633 798 18 -967 -921
1417 -921 -1373 -368 -127 1185 1664 745 601 -95 -671 -1074 -972 -693 -215 560 721 1133 412 123 -570
1436 -570 -958 -867 -590 -229 532 739 805 500 183 -560 -714 -871 -534 -178 561 820 901 803 273 -606 -1125
1457 -1125 -1113 -1271 -203 866 1050 585 355 534 -485 -1013 -1153 -1503 -14 473 1401 1166 990 523 65
1476 65 -1286 -889 -540 -1019 33 439 1084 888 388 -85 -508 -817 -832 -489 3 478 751 831 449 -15
1496 -15 -351 -597 -849 -638 -119 334 561 709 531 388 -425 -698 -785 -650 -221 288 706 839 385 112 -389
1517 -389 -627 -596 -750 -592 298 604 1043 311 368 169 -569 -1026 -924 -323 224 683 531 512 128 122 -272 -517
1539 -517 -559 -157 237 487 648 491 378 86 -512 -720 -572 -260 -35 296 555 472 353 -111 -568 -489 -856
1560 -856 -367 -364 416 791 507 426 -55 -121 -514 -570 -461 -233 355 667 588 493 363 -147 -411 -594 -611 -291 25
1583 25 413 697 512 415 -217 -286 -663 -493 -416 211 489 436 466 458 97 -345 -429 -788 -234 -285 158 555 518 359
1607 359 -74 -220 -478 -513 -318 -30 246 241 536 228 7 -82 -405 -520 -112 -91 364 367 390 432 265 -146 -422
1630 -422 -409 -432 -243 99 340 383 424 91 6 -230 -259 -433 -265 94 233 239 378 211 -238 -329 -626 -470 -90
1653 -90 169 9 496 317 87 77 -108 -490 -484 -116 -21 106 476 231 233 -336 -220 -441 -508 -333 -284 139 367
1676 367 481 220 95 -32 -493 -749 -254 -306 43 108 192 212 197 -27 -326 -416 -261 -57 257 15 294 425
1698 425 332 22 -83 -360 -543 34 -48 135 252 156 159 -70 -367 -389 -220 -244 -20 194 213 685 110 -55 -265
1721 -265 -395 -247 -113 -66 95 44 76 172 -84 -216 -96 -74 -223 99 2 240 260 132 259 -78 -271 -162
1743 -162 -137 -238 152 273 340 341 -135 -119 -381 -390 -115 -70 144 159 153 110 153 -74 -307 -257 -327 -266 19 99 187 307
1769 307 84 -101 -69 -159 -263 -168 -10 171 332 314 -5 -270 -164 -279 -426 -153 -58 112 43 134 281 272 26
1792 26 14 29 -120 28 94 106 153 87 -2 -113 -175 -347 -225 -33 38 9 277 108 -107 -70 -263 -106 -200 63
1816 63 290 187 139 111 59 83 -108 -237 61 47 93 -4 74 107 330 -87 -60 -195 -61 199 209 105 240 216
1840 216 112 -55 -276 -21 179 -123 -78 70 199 20 195 -93 -74 -65 -155 -171 -157 145 221 59 -37 223 62
1863 62 -209 -105 -205 -50 24 99 175 240 68 -54 44 -110 2 12 49 -33 -41 15 89 63 -197 -121 40 -42 -246
1888 -246 -58 -83 96 107 81 33 -31 70 1 146 -408 252 83 228 78 -264 216 -201 -160 366 335 12 175
1911 175 117 13 -23 -55 -87 -129 -88 -64 4 21 277 199 -31 242 -53 -138 -86 51 80 45 76 14 -16 -15 -94 32 -48
1938 -48 -114 287 62 -25 100 3 -209 -78 -243 138 -20 74 25 140 194 -8 -10 -6 -50 -135 -21 9 105 281 176
1963 176 55 -16 -42 -2 -66 -1 11 -49 -70 123 96 -128 -102 -17 119 -38 149 119 -10 -47 -6 158 -179 -39 -167
1988 -167 -81 168 193 -69 -110 60 -185 -105 16 141 17 -175 147 94 -31 -83 145 53 -45 -300 129 161 158 133
2012 133 157 15 -106 -88 -67 -2 -41 -27 -73 221 182 96 -124 -135 -166 -153 -171 -81 22 -126 200 271 126 141 -231
2037 -231 -141 -65 36 237 242 -10 -215 -71 -12 -53 -142 135 -52 -89 41 116 -8 38 160 -75 13 -55 -99 101
2061 101 21 -116 -105 22 -94 -93 193 -33 0 -180 112 -27 31 -132 41 -47 -143 153 -14 -21 -78 -119 -137 119
2085 119 -137 116 -137 -7 144 -139 208 276 118 -76 67 4 -101 -109 64 154 -62 -188 9 172 -64 -89
2107 -89 59 -90 -220 -190 -128 96 -122 104 -7 -9 -167 91 -196 -51 114 3 -28 40 178 110 -145 -33 -27
2130 -27 -187 35 -128 15 -56 44 126 46 -123 47 -111 -118 -1 -96 18 211 -42 34 -10 -10 -140 -110 -105 51 15
2155 15 88 -40 75 28 182 -36 93 145 94 -44 -33 108 166 51 131 -39 45 50 32 -92 -2 -163 -12 -129
2179 -129 278 -27 -183 -165 68 -9 155 -75 -218 -134 -14 -126 28 -156 31 -50 17 26 140 59 -132 -112 135
2202 135 -98 -58 -37 135 -23 44 32 132 -41 -56 -37 132 105 15 163 144 -55 165 24 -158 15 -66 251
2225 251 235 19 -6 39 17 28 -257 -37 -58 21 -181 -89 93 137 -43 -281 -70 -78 -46 -72 -15 23 107 -45 84
2250 84 66 -121 -115 4 -2 -2 140 57 -30 -87 38 67 -32 -41 -28 82 9 24 125 49 -165 29 -47 140 -155 77 -57
2277 -57 50 -48 82 -46 -9 172 -27 -5 107 -193 176 18 -15 -38 97 140 30 -16 -280 209 64 54 -80
2300 -80 -65 -142 -240 160 -13 -103 -212 -25 -72 -59 -123 117 -224 -14 2 8 -117 154 -20 -19 -150 -40 272 4
2324 4 -10 106 190 -84 235 160 -185 -27 166 -269 -119 94 -29 2 -217 1 73 -63 15 126 -127 198 -41
2347 -41 179 70 -46 -224 -48 161 -58 9 -84 -54 -94 -32 -182 53 154 62 -50 157 -292 -76 96 -113
2369 -113 36 -2 118 -125 121 -59 84 -54 -41 -253 95 -131 14 52 -107 112 -83 -204 -3 41 19 179
2391 179 24 24 -8 90 -73 163 104 -82 34 -78 4 -99 -51 -223 -14 177 -90 257 -27 -215 -1 222
2413 222 -15 -90 -50 -134 -8 77 48 37 71 85 54 -154 -212 0 148 -270 -3 -122 80 -32 121 5 -73 -280
2437 -280 16 -53 56 -229 -24 -12 46 109 130 -35 -45 -64 315 88 -29 49 -58 314 91 2 -48 137 69 64
2461 64 -149 -64 -167 18 86 93 30 -5 -4 5 150 144 -59 148 -174 -29 211 -34 -232 141 -6 60 -55 -145 -71
2486 -71 -21 -1 -35 51 46 109 48 -9 -27 45 77 -172 54 -59 13 -27 261 -142 82 60 -25 -52 -106 -156 62 -59 -171
2513 -171 64 129 -118 -122 -76 79 -110 -19 -212 59 152 54 -258 28 -67 33 -58 67 41 50 12 -25 -284 107 -116
2538 -116 49 36 -157 -168 -95 -138 -64 -52 -79 22 -63 49 -55 272 15 73 84 -163 99 81 190 -101 -96 14
2562 14 103 -186 -159 44 -52 -6 28 -15 0 189 43 154 233 -95 -191 22 82 112 -133 27 -180 -147 -116 37 -159
2587 -159 -155 121 -6 64 -19 -1 -53 -119 -8 18 -85 -127 -141 52 61 -108 -172 16 161 114 26 116 30 24 12 -53 168
2614 168 -82 107 -152 -71 -204 338 101 -56 77 220 70 -87 -62 13 -31 -64 3 -14 -142 -43 -61 -19 268
2637 268 53 99 -23 -57 -85 120 84 -3 79 142 -78 -98 -19 80 -20 49 -161 33 -155 112 4 265 24 121
2661 121 -94 -3 -186 -160 52 126 48 -124 149 -222 -92 -113 -47 -198 33 17 102 104 75 81 106 -53 107 43 -9
2686 -9 -210 -1 -37 51 4 -161 190 -57 -178 157 138 53 40 58 26 0 -127 34 -66 36 21 120 -37 -167
2710 -167 84 -61 41 27 -189 -78 106 40 -76 -81 36 161 121 -203 -16 -88 62 -1 -120 -138 114 61 121
2733 121 46 26 -158 -283 -215 147 -31 -228 -27 -51 -38 -89 -64 24 -101 -42 -59 -71 2 53 -58 8 -208 94 98
2758 98 47 112 36 -78 -103 -34 5 -7 -187 70 0 71 139 -69 -76 94 -46 -64 -14 -10 67 -169 -4 48 -39 -296 -60
2785 -60 27 47 -155 81 21 -100 26 -168 66 -98 59 -122 190 -108 27 43 150 -74 -18 124 118 -47 -5
2808 -5 -46 -6 171 -45 -64 -16 -277 -50 -171 -215 68 -112 50 -53 -160 -4 0 -26 -153 -124 89 -108 231 -30
2832 -30 1 -22 151 129 5 -27 57 101 -31 3 -38 75 -127 -6 -9 75 20 -23 175 -151 58 -78 87 -59 -126
2857 -126 129 -212 223 131 -178 -128 -186 -251 -137 172 -306 178 170 -141 93 -226 91 8 -87 20 -94 88 114
2880 114 63 10 -38 75 18 -38 60 -89 4 134 186 -51 -35 67 -71 75 -11 18 36 -103 67 -64 -6 -69 -144
2905 -144 -97 -44 53 -192 161 136 66 139 86 -113 -113 -108 72 -81 145 139 -44 31 -201 -177 69 107 -31 -75 -210 -185
2931 -185 -42 14 234 70 -54 -31 90 38 162 129 -182 25 88 -118 64 -41 -69 -42 117 294 -2 47 42
2954 42 86 46 -14 -51 62 115 -10 163 -39 164 -52 -74 245 -22 172 199 -30 90 71 272 -218 173 84
2977 84 59 35 -135 18 21 5 -30 -113 -76 180 -163 -101 13 254 -43 9 100 126 -72 -107 5 -244 -154 113 -328
3002 -328 -23 56 66 18 -145 125 -1 196 -191 -151 -128 -166 68 106 220 -8 143 -126 -166 75 143 32 145
3025 145 19 1 -1 -13 54 68 -312 -10 57 -49 -76 53 44 -183 -12 102 -10 -19 -63 50 173 -215 -239 -20 -60
3050 -60 -27 -131 -92 -21 3 31 57 -67 22 -292 -41 -91 77 24 -106 -39 -136 2 123 -334 -62 -83 24 19 117
3075 117 75 58 7 100 -94 82 38 36 125 -4 -51 -297 111 -2 -25 -3 80 -201 127 138 91 -49 -67 53 -91
3100 -91 -29 47 -157 9 209 90 89 -10 66 66 -64 39 -1 -15 -29 20 -268 -115 105 27 -117 145 206 156 -20
3125 -20 79 35 58 -152 148 -85 -140 89 -27 194 62 152 110 139 -39 -39 -4 181 34 190 -123 -117 -42 68 -172
3150 -172 -37 20 -31 10 -83 -196 -144 27 -223 84 41 -82 50 165 22 -4 3 37 153 -104 -119 112 16 7 132
3175 132 -115 -64 -73 118 89 -91 -59 -110 -105 -82 254 33 36 -11 119 110 -60 -54 -114 -82 44 157 181 -14 -20 2 -72 -149
3203 -149 -54 246 -38 117 111 -100 68 -50 -36 168 -39 -278 262 123 -148 49 155 278 73 -2 -147 110
3225 110 114 95 55 -43 -114 -212 -115 -170 174 -29 78 -77 -78 42 -128 120 -14 -74 -76 -26 45 117 233 -226 -10 35
3251 35 44 143 -106 84 -48 -142 101 118 -106 61 -30 -66 125 -29 -79 107 -94 38 -62 -132 -12 102 -201
3274 -201 -186 -126 -155 -96 64 107 128 178 -107 119 114 -187 29 39 -85 252 117 204 -14 -81 98 -6 -24 -23 -19 -132
3300 -132 168 33 -309 -278 133 41 2 -110 -167 -54 -19 -24 -1 55 -78 -121 -199 -48 13 -60 -82 152 178 -63 -112
3325 -112 18 276 -7 32 -63 8 -223 41 8 15 36 158 232 -70 30 -156 -70 -27 72 -68 149 16 -30 -64
3349 -64 -128 -105 66 -45 76 -21 -9 52 -260 -38 34 75 141 -48 150 20 -11 9 -103 37 92 -121 -20 173
3373 173 -235 108 -110 -68 -29 -136 -31 -39 -51 160 77 -23 100 52 168 41 131 -36 -200 62 4 -47 31 -72
3397 -72 -202 -59 196 -111 50 -102 5 -42 -121 124 189 33 -73 -101 -52 45 27 32 -75 46 109 76 -131 -26
3421 -26 -123 -17 -184 -27 232 166 -5 72 -38 -102 11 43 -209 -26 2 -119 -21 40 -123 -6 181 86 117 -110
3445 -110 -95 12 -61 -158 -60 -46 -138 123 47 25 131 52 -58 -98 -21 -30 63 56 132 -1 -1 39 -82 55 -25 62 -28 -40
3473 -40 8 -88 228 108 -36 -148 26 13 -64 4 -161 50 46 59 -21 -54 258 -74 -208 16 -72 39 -4 -108
3497 -108 94 -43 -173 -117 15 36 46 -170 -251 46 202 77 264 -80 -138 -58 -186 50 -83 101 148 145 -89
3520 -89 9 150 221 81 -94 -159 -98 67 -131 -25 -77 200 13 -142 -39 -120 -47 -103 -98 209 -93 -102 -233 12
3544 12 251 139 31 -29 29 -89 -52 50 192 -158 111 234 39 -25 6 15 -83 -43 -14 54 60 -128 -24 123 86
3569 86 -16 -73 -66 23 10 -22 -101 -74 123 81 -193 250 -31 54 56 -79 -142 53 91 -115 -92 -23 -44 101 3 44 -97
3596 -97 40 -226 -39 -32 -97 1 15 -33 61 -135 72 -76 45 -184 -89 -25 301 -70 52 -46 -129 4 -117 -130
3620 -130 -123 22 -6 74 107 141 -54 296 41 106 -202 139 33 129 52 -150 -47 -111 -33 -11 89 71 -140 -56 -114
3645 -114 -38 -78 -97 -145 -64 -99 -60 -103 -18 50 -122 46 -62 21 -75 -44 -64 41 -10 -56 40 -50 88 -105 20 146
3671 146 -50 126 -27 -27 -180 -196 38 -103 111 213 -79 -43 44 256 23 -107 -19 37 280 -4 78 45 213
3694 213 -240 -110 -11 -136 -169 -27 -43 17 -47 9 -189 60 -162 45 -105 -92 -41 80 25 5 -120 -160 -102 -90
3718 -90 -72 -53 37 -10 114 66 -102 -30 147 136 88 -45 46 -49 29 56 9 8 57 96 29 108 29 23 2 -38 152 129 -64
3747 -64 5 3 -61 41 -95 20 17 79 -71 -66 60 -31 78 -2 -204 -173 8 92 40 -187 -105 -106 87 225 23 28 -15
3774 -15 -156 -105 65 161 -25 33 21 173 -26 22 103 -52 -121 -67 143 -9 26 -37 -63 90 37 -177 72 139 108
3799 108 -259 -90 180 -20 217 -69 39 -1 14 173 82 -97 379 -105 -127 -47 45 59 187 163 195 -171 53
3822 53 -38 209 139 -121 -137 -74 -151 70 38 6 -111 174 -455 -181 122 353 -91 -140 48 -101 -117 -143 -684 -5
3846 -5 -392 -602 -315 -456 -515 135 513 -273 143 50 1 -237 -147 -62 -210 -3 -22 -557 181 916 -254 -357
3868 -357 88 104 -135 -118 -306 -159 191 350 50 -6 -105 5 -493 158 338 119 -755 88 -212 -50 -102 -11
3890 -11 -89 59 -181 99 -283 -38 90 8 14 21 -75 -10 35 62 -63 34 109 39 -53 -10 -10 84 -112 188 -87 -78 95
3917 95 -195 -257 -88 93 31 18 -23 -3 -59 -198 -261 85 -66 -37 42 -55 12 -250 41 108 -41 55 -2 49 20 -399
3943 -399 -20 24 133 23 83 -253 35 131 139 -28 -37 168 -51 -23 113 120 -51 -107 159 -47 37 109 -41 -128 38
3968 38 -191 -62 1 106 172 -130 14 -143 35 118 24 127 -123 65 -188 -163 102 -187 16 -8 214 -101
3990 -101 -199 146 -185 -20 -54 64 -92 -27 -22 193 -3 -52 -70 122 25 -251 120 99 23 198 5 -54 85 151
4014 151 -47 -5 -41 -53 -3 46 -23 86 -136 -110 -161 -36 55 -8 -239 -129 -45 72 124 29 -199 35 -80 -73 -44
4039 -44 98 -172 4 -77 -217 118 -159 -121 -115 111 97 144 55 -84 148 139 -344 88 -29 142 98 39 107 -65
4063 -65 -41 -42 -48 -230 47 127 -176 95 130 119 -93 10 -172 178 -4 -49 -70 61 221 35 19 -183 75 -159
4087 -159 -182 129 -67 222 -20 -42 -85 30 99 64 139 -105 -16 192 -54 3 -12 -79 -56 -239 -180 -71 53 -36
4111 -36 143 185 -283 78 -251 -120 -74 -17 105 -114 -141 193 -64 -49 177 -4 17 -45 -106 128 -84 -83 120 210
4135 210 233 18 -7 -193 71 -91 109 107 -42 129 90 178 36 -93 140 -213 73 -96 -97 -137 26 -47 -45 121
4159 121 -85 115 99 -112 44 214 41 -186 221 -355 -222 -120 60 -125 12 16 -25 133 -60 84 51 0
4181 0 104 -82 -141 -37 32 -138 28 -6 -170 91 -103 -150 63 -76 -32 57 -193 -57 -18 -77 -160 -51 -2 -52
4205 -52 36 -15 33 71 4 116 -7 110 77 39 -112 64 191 58 -22 -114 18 -17 205 122 -32 -92 158 -28
4229 -28 75 97 189 216 -115 87 13 -77 -11 30 117 -202 -73 39 -90 -164 -147 23 82 18 24 76 -19 -133 141 83
4255 83 -85 104 -225 157 34 -127 -18 -66 -18 -15 151 -140 77 -78 -130 -50 259 -156 106 -96 -67 -178 56
4278 56 114 110 86 72 18 45 123 -73 51 86 108 -73 42 -9 -223 36 34 88 -135 -50 5 -48 110 102 1 101 -76
4305 -76 -205 13 -58 18 89 -180 -271 59 -133 60 -35 64 -19 -126 171 -1 178 31 -68 -104 158 -130 154
4328 154 50 -148 12 51 -51 -30 101 -179 -85 17 118 197 101 32 -159 -103 225 -45 -84 -64 -179 -78 -200
4351 -200 33 -3 -161 -73 313 57 -1 -131 -65 -70 87 142 -52 -99 -211 92 -203 -52 112 -36 6 66 -6 90
4375 90 40 -91 -57 -30 124 134 4 -91 -142 -159 39 -31 -220 -139 -39 75 -214 12 -85 68 133 -207 -110 -90 -112
4400 -112 -103 115 81 -98 -68 37 -205 130 6 62 -11 -141 -117 -151 77 48 -54 39 371 -11 309 -102 105
4423 105 95 23 178 25 -92 0 141 40 -62 28 -1 -107 107 -138 11 96 -12 158 -169 65 147 -99
4445 -99 30 103 -59 -40 26 29 -54 80 -63 -36 69 -83 48 -45 38 -1 -101 -156 -185 -116 -103 92 -44 99 84
4470 84 65 114 128 -12 -15 -52 86 173 -9 -56 -183 -249 -89 105 13 -47 8 96 -91 67 -49 -18 51 77 -6 -69
4496 -69 81 23 -15 62 -43 -91 -27 115 11 -24 54 -225 -24 88 -10 -16 110 -40 151 -144 -140 -76 131 -146 -38
4521 -38 -49 -19 -40 -47 51 -104 -25 1 -143 -102 86 221 -19 194 30 -50 -68 -141 -72 57 -70 -58 41 179 -14
4546 -14 -8 216 33 -62 103 7 61 50 -23 20 -131 -77 -42 280 -100 31 37 13 68 173 -224 11 19 33 -139 -171
4572 -171 -61 -167 13 -21 127 -58 10 -8 -5 -5 -27 -28 -53 208 20 -15 248 -143 -85 -50 -44 -68 89 36 13 -172
4598 -172 -197 -65 -3 78 -30 206 15 188 -20 -96 -161 -95 -101 43 18 -132 181 -70 107 -67 -171 48 -113
4621 -113 -4 -8 -173 -94 -159 -1 -244 27 -34 -173 -86 -11 -12 -120 -129 -102 33 -79 56 14 -83 -247 -57 178 6
4646 6 5 82 -23 281 -9 -47 -237 47 -177 32 -91 -49 265 -29 52 45 -8 76 47 -77 -2 -99 -109 -18 149 -123
4672 -123 -168 89 -48 119 76 -40 -178 -78 -43 -49 18 31 -46 57 176 -116 117 43 -63 -120 242 -129 59
4695 59 -109 43 -289 177 -56 120 30 -9 15 60 18 98 -60 -177 17 -21 -21 -12 102 -218 63 -162 197 -157
4719 -157 108 63 52 68 -29 118 66 218 -219 135 -102 -15 19 114 -44 -7 -56 -95 57 121 19 98 245 13
4743 13 37 54 161 18 227 -365 -29 60 -42 3 -124 -21 39 -133 -184 161 -60 67 -37 18 138 114 91
4766 91 59 -44 -126 184 179 -17 68 149 -4 -17 -111 -96 145 -108 -8 -9 74 22 -13 -74 95 56 -58 11 208 -30
4792 -30 -97 -212 -14 -160 -155 192 80 -30 -220 -134 -50 148 -269 -283 -38 34 81 89 -75 104 30 37 23 -12 12 -36
4818 -36 243 -108 -24 49 -12 -26 18 66 -165 -105 -50 6 -29 -182 -54 -213 115 -221 -3 -45 -49 20 -106 81 176
4843 176 -8 -129 24 73 101 50 -53 -154 -44 -61 8 -102 -28 260 -192 -76 13 -145 233 185 -69 12 33
4866 33 -65 112 -75 -13 -65 -73 6 82 -152 -46 -99 -87 -19 -23 -64 94 140 -50 84 38 -122 -100 -68 88 50 121 -76
4893 -76 -114 85 -14 -28 -41 299 97 -119 -190 44 219 138 113 26 75 -228 -99 -67 90 -106 -43 -89 150 -63
4917 -63 -116 -51 157 16 52 -26 -105 -11 66 -62 97 -81 93 -38 -75 200 -192 208 215 17 -51 -21 -10 134 38
4942 38 80 186 39 -68 53 30 -47 -172 72 -205 -55 -48 17 27 -111 -53 -94 -14 71 259 32 77 51 163 70
4967 70 56 -75 -110 73 -90 -8 -121 -47 127 35 -37 -103 -263 -77 84 -97 -12 4 -106 60 -21 236 -75 -105
4991 -105 -185 -126 115 -147 -208 -176 -209 -93 320 68 -38 -19 24 143 -280 -66 -99 -38 86 25 -171 -212 -67 3
5015 3 107 -20 19 -139 84 29 21 -200 -138 -102 37 91 43 -127 35 72 -43 208 39 85 -30 108 46 -53 217
5040 217 -76 7 -4 94 139 -47 -122 123 110 -67 -28 -70 -290 -97 -122 104 233 181 39 94 22 1 178 -156
5064 -156 -158 23 173 5 109 -17 -124 42 127 70 71 -69 -85 223 248 -189 44 -240 -96 -21 186 200 -144
5087 -144 -26 -110 -31 70 27 -124 -37 109 -9 53 344 155 -142 98 23 -180 13 -31 35 -5 -32 46 29 46
5111 46 26 82 88 -150 11 79 -70 -33 -20 50 72 182 2 55 27 -2 -83 -62 51 -168 52 94 98 -16 84 62
5137 62 -222 -202 -241 47 225 250 -134 -163 -89 -103 -106 224 -29 -107 238 190 -62 -62 -153 -47 -110 -167 -61 54 65 29
5163 29 104 -67 42 -6 -295 -58 93 -82 39 5 3 192 75 -98 70 -142 -23 6 129 19 80 21 -186
5186 -186 171 -87 54 42 150 -37 217 107 -119 -86 -183 -214 -129 11 66 -37 -33 -150 14 22 -102 63 -11 -125
5210 -125 33 -90 7 24 162 28 90 26 -29 5 -63 -56 -12 19 -3 99 -52 -36 -14 -99 -136 149 -141 -97 84 37
5236 37 78 104 -52 71 69 75 -72 -125 -20 -4 36 -183 -295 -219 -20 110 -22 -12 -139 -113 -21 -38 13 35 177 109
5262 109 97 18 74 21 -129 -18 -183 4 -107 -145 165 -97 -71 -23 -24 52 -42 -172 -29 -45 108 -62 50 71
5286 71 -140 -75 -119 -50 116 29 1 116 -86 290 -16 -93 -20 -42 -59 -34 8 102 9 52 -87 -65 81 -196 162
5311 162 188 257 -63 32 247 -143 -52 -49 77 26 51 58 37 23 107 64 -152 82 -20 110 -34 137 -93 -88 88
5336 88 -194 -33 -81 34 -103 45 -298 105 3 23 43 -145 -67 59 237 83 63 -49 -69 100 -47 130
5358 130 85 108 17 -230 -41 -193 363 -4 -45 73 -14 -38 62 -83 142 62 138 -148 -121 54 180 60 93
5381 93 -51 67 -56 -64 109 -231 -30 122 36 50 156 -6 -221 -90 107 -119 -169 -178 -125 -88 -64 -19 -69 145
5405 145 136 -70 2 81 75 -45 88 -288 -12 29 -221 -33 14 185 50 275 -143 115 -104 -106 178 6 -79 92
5429 92 52 113 71 -182 117 91 -110 91 87 34 73 -78 -165 142 13 -36 25 -16 43 6 -190 -104 90 2 163 -184
5455 -184 -37 -24 162 -67 -14 90 219 20 -178 151 95 79 161 19 -86 39 -159 68 32 -58 43 29 -66
5478 -66 34 -210 -70 -15 -44 16 -121 55 27 -7 -92 101 -78 -30 162 73 70 -89 -163 2 91 131 82 37 -48 -86
5504 -86 254 -21 -136 161 -33 90 -118 -161 48 -128 46 -190 41 99 -123 50 175 49 -79 -76 -33 -25 51
5527 51 -4 -154 -179 48 -82 -97 -45 -202 -137 37 148 56 58 281 -145 65 45 13 153 -28 -31 105 94 -208 191
5552 191 -26 -111 -9 -178 -7 111 27 -163 -164 -22 -34 120 -68 -237 -108 90 200 287 13 -8 3 158 -61
5575 -61 63 219 97 -181 86 135 112 63 358 132 72 27 76 -12 -66 -161 -144 99 -353 112 -60 -204 52 71
5599 71 -145 44 -241 34 -98 97 23 -53 95 -111 -79 -32 -14 -147 -207 -76 -99 -54 31 -13 73 -76 128 110
5623 110 -11 151 92 -33 90 8 -22 -70 -2 107 -4 74 77 -99 64 14 106 -37 -299 -50 -65 154 83 14
5647 14 -160 -22 -102 -9 -49 109 87 96 -86 72 76 -46 100 124 -55 135 26 -123 -22 -116 66 103 -21 -159
5671 -159 -17 2 68 32 -6 -15 42 -146 18 21 -81 -90 -54 78 -5 33 -217 9 -92 92 -262 -73 -129 -41 -19 55
5697 55 12 226 -137 88 -32 37 198 312 -150 -120 -63 -4 -108 -121 -97 -4 -149 -13 5 -89 90 -205 -176 -135
5721 -135 75 85 -81 -120 80 109 -318 -85 74 -13 -52 -124 -85 177 41 -196 99 -173 -148 -42 1 -23 -33 -198
5745 -198 10 -23 211 -364 -519 629 -144 15 -366 145 202 3 180 77 93 -145 -20 325 -341 -32 -79
5766 -79 187 -328 -345 -674 145 213 407 -388 -113 92 -228 55 -4 197 -14 128 110 -4 16 264 -70 89
5788 89 45 54 -82 52 241 -34 18 -55 13 81 76 144 -54 193 -67 -29 85 -142 40 192 -26 15 153 63 146
5813 146 25 -95 -34 117 75 167 5 -73 -290 -77 -65 354 27 -91 169 -165 -110 -91 37 231 263 10 319
5836 319 -22 290 65 16 160 -221 158 -55 104 65 -57 119 -279 -51 -248 200 -40 14 35 181 -248
5857 -248 179 -65 64 2 -68 256 25 134 -56 35 96 128 212 -31 280 -39 -64 -7 31 109 -6 145 -215
5880 -215 137 179 211 189 106 118 -57 195 -146 -115 136 19 -26 10 -92 39 99 94 87 17 -55 41 -241 -25 5 -110
5906 -110 -12 40 102 -142 -72 -106 95 -67 -4 185 -32 159 -107 2 165 102 -332 -143 -101 -137 -51 -84 11 -86
5930 -86 -103 251 -12 9 -38 -24 138 -194 -10 1 37 229 -1 -88 35 26 131 -89 122 132 -89 -75 -66 -106 -50
5955 -50 -134 146 -156 171 59 -86 -131 35 215 -177 -26 -121 41 -48 74 -143 -105 -82 327 30 -167 -288
5977 -288 -59 -38 35 82 23 -147 -199 197 -33 135 104 -2 117 17 -23 -89 -34 70 -96 -58 64 138 -128 53
6001 53 -2 -94 23 199 187 -42 18 -4 -51 -54 -164 -26 -54 -204 -122 -70 135 -55 16 -75 -325 198 116 -279 -43
6026 -43 53 298 57 37 -77 92 34 -82 21 127 57 177 -54 -128 -83 74 109 -25 -61 142 35 -22 -288
6049 -288 -134 -95 51 140 18 -200 124 259 -125 -22 -97 -42 -142 -97 -107 -43 38 35 -188 118 30 179 -48 4
6073 4 4 80 -30 -30 -237 83 174 -3 107 9 -116 -79 -39 -104 18 125 93 -49 -79 68 263 66 -162 -89 -80 -140
6099 -140 98 117 -274 34 66 -320 84 -104 -83 -35 -35 164 96 133 0 49 -98 42 -92 -64 275 -13 -59 216
6123 216 92 -243 16 -135 -36 -1 -34 -29 -183 -86 -55 97 63 -69 91 57 81 -11 151 -348 -145 60 -36 94
6147 94 -41 -222 77 198 93 16 79 178 -111 190 -231 47 -12 -37 -110 181 160 -54 -128 54 17 -35 -286 88
6171 88 -120 -51 -43 99 -139 110 -116 32 10 63 108 -204 -45 -66 -102 88 -24 -142 -29 82 10 45 8 43
6195 43 -156 31 201 33 -35 119 31 26 88 -210 -28 -17 124 1 -37 111 -64 24 45 163 -31 201 -47
6218 -47 7 7 124 32 -36 -49 30 15 242 137 144 25 -74 -136 -20 126 60 27 -29 82 -12 -279 79 64 88 -199
6244 -199 39 -154 -40 -146 219 -20 -67 73 -77 121 -103 -114 -132 99 -9 -213 14 21 -119 125 191 -102
6266 -102 -33 9 -57 -119 65 81 32 -178 -12 158 77 -115 63 37 79 138 40 62 -106 -49 -40 45 -19 95 93 31 40
6293 40 115 -76 -129 -150 81 54 -206 -129 108 -3 -8 24 75 -74 -150 -72 50 -20 -62 -113 -25 16 -68 65 -45 -1
6319 -1 31 -55 -73 -14 5 -22 77 116 -46 2 3 -97 55 -50 -149 200 -175 -70 158 42 -26 -74 7 -180 44 257
6345 257 141 -141 -42 -64 -49 65 -99 -83 79 36 -14 -55 -36 -63 -107 -34 -154 13 -37 89 -87 56 71 153 -56
6370 -56 -127 -44 313 77 18 -133 32 -9 -92 -162 -73 67 -22 100 19 -52 17 -223 -101 -6 92 -96 -305 -202 98
6395 98 13 84 154 124 25 -39 -102 129 64 133 69 -98 53 26 -32 113 -26 135 166 -57 174 -185 -80 -93 -87 79
6421 79 121 -210 97 -18 275 -140 136 -43 -95 -8 -33 -139 -227 88 50 -15 22 187 13 -81 47 11 -96 -154
6445 -154 7 181 135 -52 -68 -50 177 -116 -133 150 24 -36 -59 249 -45 8 79 -4 -11 121 -6 -20 -121 39
6469 39 -4 -83 21 16 84 143 6 -34 -55 45 -83 211 77 -166 159 117 175 -107 5 115 -42 -83 -116 -3
6493 -3 -52 -144 199 37 149 -11 -126 64 169 45 -85 17 -96 -63 140 49 34 140 127 -8 -6 154 30
6516 30 -122 120 146 7 -165 42 208 5 32 -8 -162 -66 8 -125 -146 -228 32 -47 -118 -73 9 -100 -85 51
6540 51 -3 99 102 167 31 -67 54 68 43 -55 -49 95 -70 -12 49 -41 68 185 129 137 41 75 105 134 10 60 125 76
6568 76 -6 152 -211 128 -34 -69 101 -121 45 -74 6 -104 88 80 5 92 36 71 -55 37 72 113 -57 203
6592 203 -153 79 -20 46 -153 -6 35 -189 -1 -81 -306 106 147 -180 -56 -89 64 122 -156 -71 -87 133 58
6615 58 -86 31 -137 148 -187 -5 3 123 -2 170 -31 -33 -196 -32 48 -72 72 69 94 16 53 77 -61 34
6639 34 -40 105 109 -135 -237 9 204 -128 72 19 51 -47 -60 53 -56 -1 -17 220 223 98 48 146 49 -125 7
6664 7 -115 152 8 -38 260 130 80 98 127 -32 -18 0 61 -103 -324 -96 -73 -4 -213 -592 148 -94 432 66
6688 66 64 20 -111 219 9 -346 -384 -116 506 170 238 285 291 -21 -65 -41 -7 48 -24 -129 -293 144 -9 256 -182
6713 -182 123 481 -149 8 942 305 650 207 314 98 159 -256 25 37 0 114 -34 26 222 149 -145 190
6735 190 136 107 260 105 -655 333 241 408 255 14 365 719 195 86 -107 -150 159 35 48 25 -34 52 -30
6758 -30 -155 -42 -154 -215 233 -329 -48 -285 527 124 -589 -86 -55 464 8 -355 128 90 46 -132 -162 -76
6780 -76 -77 -318 42 323 -6 -123 -99 -695 -128 -113 109 188 17 -43 -217 -23 -642 150 -7 -105 67 -73 -95
6803 -95 -206 -129 -313 -415 174 72 204 171 -158 -5 -67 -94 -77 300 164 -216 8 -214 83 -86 112 -55
6825 -55 131 141 105 65 5 142 -59 -96 91 257 -295 490 171 172 -145 233 118 114 183 45 0 48 -71 -208
6849 -208 24 -116 109 -61 123 5 -98 -111 101 -1 -26 -89 -123 -86 61 60 -56 -39 -93 111 -24 15 51 -134
6873 -134 68 3 72 -88 180 -88 -110 -93 130 12 157 -636 -272 -292 -164 205 114 -14 65 30 33 261 -53
6896 -53 19 110 -15 155 -25 -52 -36 -80 66 145 -53 -95 71 68 47 -130 -136 -59 -131 331 237 -367 552 146 -341
6921 -341 -672 154 3 192 475 -221 -374 83 328 45 317 -297 113 387 -269 -23 -237 -53 -38 -291
6941 -291 -200 -112 -310 -208 -1 107 -175 6 57 153 119 -156 3 -97 -34 -110 38 94 111 8 3 -14 87 53
6965 53 -65 -184 -197 -32 37 -95 30 78 27 -136 67 296 -354 88 -238 -276 406 414 -96 -112 -85 1 -138 -5
6989 -5 47 -15 -116 56 20 -33 -89 -79 -283 8 -85 120 184 -205 -271 -114 -18 -66 149 -98 166 -136 -211 -170 194
7014 194 -183 -314 45 -121 35 9 -109 -103 -207 -7 98 307 -124 -97 -106 54 -65 -135 34 232 294 -98 -258
7037 -258 167 21 -84 -105 -59 115 -54 98 -115 188 163 105 -48 -33 71 -134 62 -168 67 -111 38 -36
7059 -36 33 -78 -255 59 -215 41 -131 -18 -4 100 -29 42 143 89 -227 -113 6 241 34 -162 198 -2
7081 -2 18 -9 89 -70 96 -143 38 13 143 283 -145 -205 177 32 -7 519 -826 6 -73 53 -56 71 72
7104 72 -20 230 -184 314 -151 37 112 -204 112 -38 -96 10 -491 -196 262 -197 549 -48 325 -222 84
7125 84 86 189 -100 -22 50 52 -27 138 -199 55 186 164 -99 148 20 175 -75 -125 90 59 -64 -110 -130 -96 117
7150 117 -115 -177 34 108 -25 -37 -42 -105 72 201 23 30 -68 13 -5 144 -119 -165 -3 -94 -21 -12 -14 79 -170 18
7176 18 13 27 42 -32 10 -6 195 93 49 -132 -32 73 -15 -97 22 -19 -232 -171 76 215 -27 -151 -144 34 -225
7201 -225 28 -100 -205 -101 22 36 -95 -128 -88 -203 -95 125 124 -132 162 143 -117 -188 -93 113 -47 -90 -63
7224 -63 32 23 206 -72 -127 -60 -1 -127 85 158 -189 -82 36 228 11 -20 -56 98 -116 98 33 33 0 -25 53
7249 53 -92 72 -218 -39 27 81 11 -108 -18 28 19 3 -69 66 -4 -31 246 -233 -41 86 -63 117 36 106 190
7274 190 -174 44 -73 -51 -2 122 -58 60 -70 169 114 -155 -24 84 -146 -46 88 80 196 -24 -62 32
7296 32 5 35 148 -129 24 -79 5 254 4 -60 -25 30 -22 41 37 -149 53 103 -63 79 -155 -95 20 38 -100
7321 -100 -52 37 34 -96 17 67 137 -57 -97 -56 -46 -143 -64 158 86 42 -40 153 52 134 26 33 28 -15 47 101 -138
7348 -138 -86 153 64 -36 -45 -51 -6 -194 -240 66 -132 -19 -136 161 57 -129 -112 -71 -77 -70 -210 -121 -53 27 119 153
7374 153 -110 65 47 257 170 169 277 148 157 30 -55 -38 199 185 67 -45 -128 206 65 127 103 139 -162 109
7398 109 -83 -5 55 99 233 19 137 79 -10 -113 126 21 -62 56 -128 -153 271 349 99 -174 -7 22 -265
7421 -265 170 -139 -241 98 536 85 17 291 82 158 53 129 -542 -159 112 -341 552 -163 386 33 -250
7442 -250 246 18 102 -159 -98 -219 12 -62 162 -103 -236 -94 80 101 15 191 -134 191 115 -74 -64 150
7464 150 37 -161 -20 -88 23 85 77 -64 3 81 105 -73 -205 124 -217 -38 57 -109 -67 26 5 149 238 267
7488 267 11 -249 266 274 103 139 -27 92 -5 268 145 -104 -204 -21 29 -205 -90 77 -68 67 -19 -32
7510 -32 15 16 104 16 -60 292 -32 38 102 26 -148 129 150 -100 28 -91 31 19 2 -55 26 -51 -33 123 -12 -37
7536 -37 -16 -14 -189 130 79 -14 -125 -11 -61 -158 -73 59 -137 68 86 -56 -59 -30 -188 -61 -4 -54 32 265 -145
7561 -145 -96 252 121 -49 -163 35 -76 -76 -181 4 3 -255 -154 152 -76 -17 -58 47 -72 82 66 48 61
7584 61 41 -36 183 96 10 -73 61 -41 -35 128 25 41 -47 -96 -260 -249 -47 99 76 123 -19 79 -62 -62 55 -136
7610 -136 -47 -23 268 -98 -94 4 42 -7 46 33 -124 178 19 72 46 -196 61 18 86 17 24 22 -71 72 49 61 -105
7637 -105 158 31 -156 -11 -3 126 -117 -159 63 -3 22 -15 213 -18 -189 -18 64 3 -40 -43 -129 48 6 -131
7661 -131 -35 100 -145 -93 -48 -63 174 56 244 150 200 424 297 -91 0 235 -180 219 -96 48 245 225 156
7684 156 -103 102 61 -30 -422 -31 141 150 140 -88 159 -141 416 219 507 46 210 280 109 -496 64 56 -140
7707 -140 -271 -350 384 344 131 -430 498 513 -175 -318 -417 209 347 -40 347 -177 -277 385 -301 -169 80
7728 80 90 -254 63 25 63 -301 -179 53 -205 150 -115 -60 -220 161 -237 -81 -111 166 75 269 -205 -1
7750 -1 -106 -186 -66 19 58 -147 -149 83 23 68 38 -56 26 -167 -101 24 127 -98 121 -80 -102 198 24 255 -178
7775 -178 49 -173 -39 91 -157 145 194 59 105 -93 56 -18 -181 -144 -76 5 27 -68 -23 0 -214 97 -134
7798 -134 -94 -237 -42 -17 -41 -32 -85 84 118 -15 28 101 35 -89 -264 -6 109 -62 7 -8 152 -174 124 25
7822 25 -151 59 71 -8 76 55 -147 94 90 -176 -99 -88 76 -104 61 116 160 308 60 38 227 -69 -31 -113 33
7847 33 -262 -127 131 -216 -16 170 -29 86 -231 -166 -235 -15 70 128 -45 7 -53 -56 48 -162 -108 -35 -141 34
7871 34 73 -119 -51 -15 74 55 -24 -424 -95 199 37 42 -107 -70 109 103 -115 -53 73 41 16 -73 -104 -113 102 35 -108
7898 -108 167 -343 -85 224 12 219 -89 -8 -80 -132 84 1 -166 -31 16 110 -64 43 123 131 24 108 165 -42
7922 -42 -21 60 126 -228 159 238 -48 76 71 -139 -98 48 128 -150 -180 -3 -160 -51 -52 93 289 -91 114 145
7946 145 -138 -93 -1 -108 44 -168 122 31 -167 10 105 -38 77 -68 84 -54 -145 51 -76 -137 -210 -87
7968 -87 -58 -43 -6 150 -98 202 94 -27 -37 53 78 42 148 -3 -68 143 -165 114 79 -84 -121 -91 -89 73 55
7993 55 -88 158 -86 -4 -167 46 -17 53 10 -97 -31 13 -42 -11 -76 -190 181 -100 -5 -7 119 -19 -275 75
8017 75 -175 96 23 36 -87 -37 16 24 -31 -267 -124 204 -98 -283 -8 11 -4 -239 -140 37 58 68 -36 -69 26
8042 26 54 -121 -16 17 192 -38 53 -22 74 -110 -44 -58 45 165 -66 82 -130 118 91 -85 6 5 192 -85
8066 -85 90 99 205 -17 25 -65 -114 -97 -38 -61 97 103 -135 164 -48 -79 -24 -231 -64 267 118 106 214 -181 44
8091 44 279 -47 103 69 -45 -28 -25 -22 -59 101 92 18 -39 25 169 -164 -69 -81 -126 -49 55 -107 -22 7 -12 -36 -197
8118 -197 6 53 -171 -47 112 207 -19 65 124 88 167 -153 157 7 -348 -81 237 16 -1 -144 -47 -161 3
8141 3 72 73 158 35 173 -167 -79 -20 86 -46 133 27 -14 -80 -141 62 -9 -16 -69 172 -93 162 -85 -159 34
8166 34 -65 -56 -118 -211 102 143 11 -44 -77 -69 -81 -47 -164 -95 124 -7 -42 -125 -199 52 -54 48 -217 102 -17
8191a7
$$ Imaginary data points
##PAGE= N=2
##DATA TABLE= (X++(I..I)), XYDATA
0 0 0 0 0 0 0 0 1 0 1 -8 8 -16 16 -16 24 -32 40 -48 56 -72 80 -97 113 -136 160 -184 217 -249 289 -333 377
31 377 -433 489 -557 630 -704 793 -888 992 -1110 1232 -1373 1519 -1685 1863 -2055 2272
47 2272 -2504 2761 -3043 3349 -3692 4068 -4491 4963 -5493 6100 -6795 7603 -8558 9702
61 9702 -11110 12882 -15204 18382 -23025 30496 -44510 80224 -379506 -612155 -22017 205916
73 205916 443372 477810 424945 126065 -201757 -496923 -559479 -445144 -147414 170085 445095
84 445095 536013 446270 174920 -144617 -420491 -526435 -448791 -196771 116314 391560 512748
95 512748 450155 216189 -89098 -363520 -496913 -449727 -233533 63335 336791 480850
105 480850 448060 248256 -39257 -310956 -464101 -445493 -261295 16933 286325 446950
115 446950 441536 272847 5206 -262067 -429978 -437405 -283530 -25797 237120 410479 429719
126 429719 293073 47533 -214167 -393966 -427247 -302503 -67795 189939 375316 420819
136 420819 310591 87094 -166611 -356629 -413584 -317300 -104975 144396 337965 405226
146 405226 322207 121235 -122811 -319156 -396067 -326288 -136564 101620 300178 386255 329264
157 329264 151471 -80126 -280477 -375624 -331738 -165668 59929 261039 364268 332431
167 332431 178523 -39641 -241514 -352128 -331970 -189936 20942 222128 339710 331138
177 331138 200157 -3255 -203618 -326859 -328434 -208832 -13768 184920 313776 325572
187 325572 217041 29420 -167258 -300291 -321390 -223828 -44357 149719 287000 316802
197 316802 229773 58350 -132683 -273429 -311965 -235101 -72100 115925 259590 305891 239231
208 239231 85140 -99153 -245642 -300121 -243151 -97408 83068 231133 292941 246233 108834
219 108834 -67151 -217241 -285675 -248111 -119554 51983 202648 278023 249539 129321 -37729
230 -37729 -187993 -269140 -249404 -137377 22750 174678 260438 249278 146114 -9585 -160715
241 -160715 -250511 -248130 -153850 -4072 146037 241176 246090 160721 17163 -131542 -230523
252 -230523 -243397 -166685 -29176 117520 219359 240057 171752 40878 -103893 -208927 -235905
263 -235905 -175509 -51322 90607 197682 231242 178995 61254 -78016 -187207 -226045 -181295
274 -181295 -70231 65537 176062 220830 183211 78759 -53704 -165307 -214709 -184537 -86577
285 -86577 42504 154627 208540 184999 93314 -31772 -144175 -202466 -185234 -100169 21386
296 21386 134207 195639 184988 105803 -11377 -123550 -188971 -184140 -111158 1963 113469
307 113469 181940 182918 116181 7232 -103482 -174950 -180963 -120306 -15782 93385 167436 179089
319 179089 124149 24385 -83790 -159594 -176010 -127726 -32534 73392 151599 172908 130340
330 130340 40170 -63809 -143285 -168996 -132526 -47104 54589 135055 165223 133876 54005
341 54005 -45362 -126864 -160752 -135031 -59731 36627 118498 155748 135530 65514 -27934 -110280
353 -110280 -150853 -135495 -70205 19978 101756 145649 135224 75103 -12383 -94061 -140214 -134354
365 -134354 -78907 5098 86292 135024 133199 82725 1875 -78710 -129205 -131705 -85642 -8461
377 -8461 71111 123846 130039 88210 14250 -63751 -118129 -127879 -90995 -20378 56838 112099 125828
390 125828 93054 26233 -49853 -106624 -123548 -94762 -31247 43075 100673 120734 96172 36516
402 36516 -36093 -94692 -117784 -97412 -41203 29384 88449 114251 97868 45662 -23033 -82451
414 -82451 -110685 -98269 -49669 16592 76020 106734 98164 53449 -10384 -69531 -102790 -97658
426 -97658 -56521 4831 63869 98642 96724 59139 498 -57844 -94290 -95510 -61621 -5553
438 -5553 52057 89580 94020 63524 10011 -46247 -85355 -92387 -65148 -14395 41030 80938 90343
451 90343 66442 18271 -36137 -76551 -88177 -67318 -21857 31094 71930 86247 68089 25199
463 25199 -26550 -68059 -83942 -68667 -28299 21805 63805 81581 68893 31152 -17474 -59661
475 -59661 -78912 -69116 -33997 13277 55432 76342 69196 36515 -9528 -51046 -73672 -69078 -38641
488 -38641 5280 46816 70735 68437 40965 -1483 -42595 -67716 -67916 -42582 -2157 38449 64677
501 64677 66743 44468 5846 -34596 -61429 -65852 -45691 -8985 30354 58340 64370 46794 12007
514 12007 -26495 -54980 -62875 -47531 -14779 23031 51595 61337 48078 17464 -19180 -48245
526 -48245 -59290 -48250 -19605 15834 44912 57284 48500 21849 -12513 -41912 -55323 -48145
538 -48145 -23784 9365 38487 53167 48207 25321 -6640 -35656 -51380 -47854 -26817 3677
550 3677 32475 49255 47380 28149 -1155 -29617 -46818 -46900 -29441 -1465 26894 44735 46143
563 46143 30614 3634 -24131 -42630 -45603 -31556 -5960 21443 40620 44804 32097 8176
575 8176 -18509 -38272 -43533 -32889 -10182 16284 35944 42300 32673 11580 -13113 -33152 -40402
588 -40402 -32967 -13696 10771 31300 39600 33157 15309 -8428 -28848 -38486 -33872 -16629 6235
601 6235 26235 37078 33725 17904 -4577 -24273 -34947 -32268 -18549 2319 22181 33376 31816
614 31816 20237 -180 -19385 -31396 -31495 -20713 -1840 17558 30403 31757 21238 3457 -15659
627 -15659 -28478 -30922 -21759 -4708 13661 26692 30256 21747 6048 -11981 -24640 -28778 -22147
640 -22147 -7569 10353 23732 28267 22140 8776 -8455 -22038 -27003 -21873 -9542 6521 20520
653 20520 26549 22692 10420 -4799 -18787 -25748 -22856 -11736 3570 17310 24478 22779 12489
666 12489 -2059 -15736 -23479 -22765 -13329 636 14046 22415 22449 14150 1068 -12709 -21286 -22128
680 -22128 -14797 -2002 11084 19993 21575 15177 3428 -9519 -18674 -20619 -15187 -4068 8250
693 8250 17468 20430 16058 5610 -5957 -15956 -19446 -15664 -6242 5195 15010 18576 15850 7306
707 7306 -4015 -13590 -18030 -15827 -7625 2974 12334 17213 15633 8279 -1784 -11069 -16370 -15507 -8641
722 -8641 953 10181 15506 15195 9308 123 -8968 -14651 -14895 -9543 -932 7921 13726 14575 9870 1792
738 1792 -7098 -13321 -14371 -10255 -2505 6185 12348 14139 10665 3451 -5042 -11232 -13622 -10414 -4179
753 -4179 4128 10686 12971 11047 4393 -3088 -9611 -12446 -10613 -5140 2293 9011 12305 10709 5750
768 5750 -1462 -7996 -12025 -10728 -5909 791 7354 10471 10464 6658 -36 -6697 -10344 -10784 -7373 -953
784 -953 5543 9928 10647 7385 1488 -4712 -9217 -10130 -7464 -2316 3677 8312 9919 7715 2840 -2994
800 -2994 -7626 -9532 -7663 -3190 2221 7260 8980 7779 3476 -1806 -6293 -8715 -7658 -4090 909
815 909 5533 8218 7818 4376 -399 -5140 -7964 -7481 -4627 -275 4870 7531 7580 4790 507 -4051
831 -4051 -7093 -7329 -4976 -795 3411 6751 7212 5313 1512 -3119 -6089 -6992 -5641 -1734 2518 5778
847 5778 6882 5543 2466 -2115 -5352 -6854 -5732 -2558 1410 4841 6574 5876 3065 -922 -4528
862 -4528 -6281 -5912 -3372 341 3857 5929 5866 3484 -5 -3306 -5607 -5775 -3946 -562 2753 5317
878 5317 5641 4343 1173 -2316 -4906 -5540 -4247 -1337 1905 4734 5233 4344 1963 -1554 -4233 -5234
894 -5234 -4301 -2069 1029 3784 4942 4386 2255 -514 -3383 -4705 -4265 -2631 392 3133 4619 4445
910 4445 2765 -8 -2620 -4256 -4189 -2930 -102 2537 4012 4233 2949 512 -2147 -3688 -4236 -3274
926 -3274 -1185 1735 3822 4110 3229 1096 -1414 -3321 -3995 -3223 -1391 980 3105 4202 3553 1748
942 1748 -676 -2743 -3671 -3564 -1849 557 2607 3638 3644 2130 -2 -2309 -3632 -3621 -2268 -141 1995
959 1995 3507 3537 2414 700 -1677 -3315 -3707 -2808 -1044 1309 2935 3570 2752 1325 -896 -2871 -3647
976 -3647 -3010 -1324 599 2633 3472 2906 1697 -449 -2098 -3308 -3075 -1546 474 1933 3093 3010 1953
993 1953 -114 -1828 -2948 -3061 -2029 4 1665 3077 3071 2022 378 -1117 -2525 -2894 -2188 -790 1049
1010 1049 2623 2775 2274 847 -855 -2159 -3042 -2273 -1155 754 2329 2805 2575 1442 -482 -2206
1026 -2206 -2857 -2618 -1384 179 1849 2796 2472 1544 -245 -1774 -2709 -2533 -1776 -156 1501 2553 2676
1043 2676 1846 144 -1384 -2542 -2748 -1972 -644 1181 2362 2758 2119 793 -902 -2286 -2433 -2094 -869
1060 -869 886 1959 2664 2466 1124 -707 -2078 -2605 -2454 -1374 405 1943 2658 2516 1458 -201 -1672
1077 -1672 -2372 -2445 -1688 -196 1562 2562 2537 1741 398 -1197 -2267 -2440 -1810 -567 804 2013 2591
1094 2591 1983 592 -842 -1909 -2595 -1988 -823 584 1775 2414 1974 932 -625 -1536 -2424 -1988 -1215
1111 -1215 423 2067 2409 2199 1307 -301 -1619 -2189 -2273 -1162 24 1382 2367 2070 1250 88 -1572
1128 -1572 -2236 -2305 -1137 3 1281 2221 2270 1709 261 -1077 -2086 -2291 -1605 -601 994 1947 2339 1833
1146 1833 461 -921 -1991 -2372 -1808 -762 773 2288 2669 1831 606 -531 -1689 -2260 -2024 -609
1162 -609 827 1624 2202 1962 835 57 -1479 -1625 -2274 -1440 289 1069 2230 2402 1342 120 -1096
1179 -1096 -2185 -2409 -1598 159 529 1673 2069 1169 516 -546 -2035 -2211 -1674 -221 1122 2277 1637
1196 1637 1064 1256 -645 -1893 -1935 -1509 -889 512 1487 2007 1741 754 -483 -1176 -2150 -1407 -722 429
1214 429 1609 1848 1944 992 -684 -1199 -1788 -1439 -725 628 1770 2020 1491 1010 -299 -1223 -1729 -1478 -886
1233 -886 177 1283 2190 2356 1244 187 -963 -1947 -2373 -949 -767 1268 1648 2259 829 209 -620
1250 -620 -1296 -1701 -1115 -669 -110 1808 1944 1769 1237 -83 -2338 -1346 -1556 -627 142 1802 1753 1177 263
1269 263 -746 -702 -1942 -1463 -817 -190 1001 1705 1928 1237 -181 -822 -1566 -1530 -559 -589 815 1391 1878
1288 1878 1025 639 -578 -1354 -1038 -1540 -154 883 1541 1422 1511 -124 -688 -1220 -1561 -1375 -393 453 1207
1307 1207 1682 1421 373 -538 -1122 -1662 -1299 -548 732 1306 1540 1124 561 -654 -1172 -1528 -1166 -652 151
1326 151 1047 1504 1267 495 -307 -1032 -1497 -1698 -863 164 880 1576 1414 784 -776 -1185 -1638 -1666 -740 -209
1346 -209 620 1907 1794 894 288 -667 -1335 -1376 -501 87 309 1414 1600 604 273 -1682 -1296 -1827 -962
1365 -962 -185 474 1059 1347 1187 504 -470 -1120 -1351 -1158 -624 195 938 1232 1049 559 -222 -913 -1074 -1108
1385 -1108 -643 227 684 1201 1067 777 -126 -841 -1404 -1419 -349 -59 926 884 1498 688 -550 -835 -1601 -402
1405 -402 -160 725 556 1446 1852 805 -477 55 -1168 -1169 -892 -802 160 1041 968 716 -147 -715 -1290 -1226 -986
1426 -986 -436 414 1044 857 861 392 -448 -1136 -1224 -1053 -632 168 828 1152 905 601 -158 -729 -1083 -905 -639
1447 -639 140 664 1247 976 540 -56 -647 -963 -1000 -452 434 569 1180 1227 495 1034 -425 -218 -1187 -699
1467 -699 -165 852 477 620 337 118 -303 -891 -1568 -235 -135 124 1028 803 699 371 -166 -691 -564
1486 -564 -415 -109 214 734 880 638 7 -252 -719 -798 -914 -112 263 767 982 546 382 -306 -605 -798
1506 -798 -628 -245 111 595 751 692 326 -145 -514 -840 -605 -352 333 458 870 612 485 -85 -382 -683
1526 -683 -543 -514 -352 476 829 1034 509 208 -477 -694 -678 -759 -297 407 654 424 484 128 -235 -414 -754
1547 -754 -610 -120 336 478 571 531 239 -138 -511 -655 -583 -36 -15 161 628 703 274 -235 -311 -538 -294 -361
1569 -361 123 233 371 399 323 -3 -340 -573 -561 -66 -128 121 452 359 158 86 -301 -378 -687 -371 19 168
1591 168 309 425 425 159 -262 -414 -490 -394 -121 80 526 641 146 6 -62 -494 -457 -576 -118 332 353 612
1613 612 385 183 -362 -279 -631 -324 -283 -106 427 545 378 245 -151 -210 -477 -615 -240 -151 154 326 310 162
1635 162 32 -236 -349 -414 -336 -95 31 357 379 348 -249 -88 -345 -408 -294 -221 90 208 413 306 111 -228
1657 -228 -258 -214 -390 -251 49 219 238 251 84 -1 -413 -395 -208 -234 224 307 320 352 115 -144 -227 -466 -374 69
1681 69 116 204 305 282 150 -95 -264 -373 -475 -260 168 371 283 254 347 186 -86 -270 -337 -182 -123 163 348
1704 348 468 425 -26 -41 -148 -302 -156 -57 3 233 436 518 -29 -207 -121 -252 -203 -134 -146 256 380 391 268
1727 268 16 -136 -411 -205 -132 84 159 159 279 194 18 -211 -522 -407 -78 121 249 187 111 57 -31 15 -104
1750 -104 -258 -44 -24 215 153 183 66 67 -126 -127 -93 -89 -3 353 362 254 236 -112 -15 -185 -261 15 -120 108 176 143
1776 143 188 91 -21 -246 -132 -148 11 8 247 422 390 144 -205 51 -201 -234 -121 122 281 228 261 291 103
1799 103 -133 -15 -79 -115 -201 155 125 84 25 -113 -157 -241 -392 -73 -155 104 234 28 254 -23 -70 -277 -128
1822 -128 71 90 33 243 269 210 29 -9 -231 -120 -248 -144 110 87 70 -60 190 -136 -57 35 -102 24 56
1845 56 -11 28 27 -108 214 78 -413 -61 -216 21 92 98 158 116 172 -60 85 -51 184 61 -109 63 22 162
1869 162 68 -11 -258 -122 -123 -85 174 -22 122 -41 237 -266 42 -3 -99 -204 134 -35 19 174 -64 -52 126
1892 126 -225 -130 -124 -77 83 114 119 216 253 -145 -131 -138 -142 1 1 222 158 11 -11 184 -221 -47 -270 -92 -93 107 11
1919 11 29 -3 -135 -50 -246 146 -60 -84 -95 173 -28 103 54 -266 -76 -119 -247 -53 51 171 84 -113 -67
1942 -67 -95 -18 -46 -38 55 31 3 78 59 174 -282 116 16 -128 85 173 131 -20 89 -167 -5 -93 -85 -45 -109 119
1968 119 65 136 86 -154 -203 -5 -295 -81 -2 106 240 241 22 83 31 -198 122 -127 -32 7 -107 262 70 32
1992 32 -5 -10 -78 59 55 -169 126 39 -21 -55 85 152 -33 52 -123 89 43 13 267 123 45 -292 -101 -118 -227
2017 -227 -331 -13 -154 -13 69 78 -126 26 -161 14 -43 -12 117 191 -52 -179 18 41 -198 -74 74 205
2039 205 -104 -15 60 106 13 -156 -100 -179 -113 177 136 108 -35 -109 -57 84 -166 -2 -73 13 35 -3 -130 81 -138
2064 -138 -43 -39 -128 -114 231 245 -108 122 27 240 -83 -99 -168 -8 -19 -67 -149 120 138 89 -129 -146 8 4 -176 -146
2090 -146 177 -124 70 -10 -90 -64 -148 110 -76 -144 -3 -94 207 45 0 -73 -126 -157 -110 17 58 35 154 -64
2114 -64 36 3 118 137 29 -116 -183 -37 210 79 -131 153 17 111 137 -46 202 -65 354 -58 2 -111
2136 -111 -27 100 -17 77 12 16 -24 -71 -41 -33 -107 -4 135 62 -47 122 7 25 -38 166 84 -194 64 -123 221
2161 221 -64 133 80 169 204 -36 102 -86 -102 -50 8 194 -185 -126 -136 -19 9 -164 -56 -175 62 71 57 126
2185 126 -274 -194 -139 -59 -41 43 251 -72 59 125 138 -19 -100 8 -138 79 133 -169 133 217 117 25 -109 -117
2209 -117 -140 -88 6 -134 -324 67 -89 182 -257 -123 126 -39 -101 54 203 -120 -148 -158 -128 33 144 48 168
2232 168 32 223 -54 -57 -117 -105 14 -83 -74 -123 52 109 112 -40 30 10 -242 -77 26 121 -34 -34 369 172 61
2257 61 -13 56 -174 -42 -146 46 -97 23 129 -145 -214 -72 -169 -103 44 -173 91 54 188 128 -16 -62 -10
2280 -10 45 117 -341 120 33 -53 1 195 39 -143 56 -102 -44 -33 -60 146 -93 63 124 -37 -94 68 -154 -31
2304 -31 104 -75 -167 -250 154 -82 -17 -75 88 12 -12 123 268 -44 -249 170 -8 72 -72 -78 128 90 -31 89
2328 89 -79 -20 -136 223 -46 138 158 243 -159 -38 -19 -268 47 -175 42 116 142 26 74 3 -146 -68 -93 -139
2352 -139 -64 -55 97 230 97 -45 11 -25 232 -82 139 -72 171 24 67 -18 -256 70 121 -99 -38 54 211
2375 211 -105 41 176 132 54 8 53 131 -66 98 129 -228 -136 103 -120 -134 -217 -22 -42 9 -74 172 88 124 -179
2400 -179 -2 -199 -46 -58 -113 7 -191 -117 -38 175 87 160 123 24 -92 -176 -323 83 -64 124 140 -121 -132 72
2424 72 87 8 -236 26 -90 212 4 174 -119 206 -35 139 83 115 2 -213 -5 -162 -113 -47 32 -233 -97
2447 -97 27 168 -24 -145 292 195 -91 42 -66 69 230 -144 39 -4 8 100 -4 39 -252 -100 -306 -25
2469 -25 349 45 -4 -79 94 31 -108 -65 -108 176 9 -79 331 -39 -48 -17 -19 119 -1 149 62 6 70 -41 -53
2494 -53 -216 89 -19 49 139 50 -18 -149 278 66 -11 103 81 -50 24 -27 -110 -93 127 -52 54 -153 204 85
2518 85 24 72 -68 -120 -92 -262 -148 -131 -81 175 59 -88 -129 41 185 45 153 0 -1 -21 -57 134 56 56 118
2543 118 27 54 -3 -145 -115 -92 143 -77 52 -49 -128 -7 70 -131 299 155 133 3 63 110 111 66 -72 68
2567 68 -78 -14 123 67 -85 -92 26 -90 143 158 -11 -10 78 -114 36 -106 61 -195 260 -53 -58 117 21 92
2591 92 67 -221 41 59 47 135 -74 59 -90 76 -31 -51 -222 -40 62 -106 321 158 162 103 173 131 -55 -50
2615 -50 5 -142 10 -106 -101 89 -117 -16 -90 -188 -66 83 6 -84 67 35 -81 119 110 44 -154 1 40 -56 123
2640 123 -30 42 175 24 -97 175 -162 -145 -139 -75 35 -57 29 200 -67 -139 82 -77 231 110 -76 -145 42
2663 42 -135 26 107 -6 61 -96 176 -174 -176 146 -75 47 -107 23 68 77 -63 -6 -96 95 -183 122 -59
2686 -59 28 -40 -74 36 -145 57 3 111 -11 -18 35 107 -79 4 55 214 69 115 -18 -24 -44 -197 -78 -31 51 20
2712 20 63 61 156 17 -19 -103 -50 49 74 -55 99 -61 226 -223 -12 56 -73 -24 128 16 145 135 -38 -45 -18
2737 -18 -85 108 137 -42 5 -171 85 -56 -212 -303 188 -115 -21 -141 -16 -111 15 117 136 82 -33 38 13 -57
2761 -57 -105 45 -69 -85 -13 -21 7 198 30 -22 -46 -94 -3 132 31 -205 25 22 -56 79 11 -26 37 -59 24 177
2787 177 -7 22 140 119 -59 -158 -55 -80 -52 -20 154 72 -15 -105 -2 -83 -23 233 53 -70 42 98 -64 -67 0
2812 0 -51 33 -11 35 -16 79 -137 193 120 136 -17 44 -11 -129 71 40 -28 -68 19 -56 55 -114 66 -66 214 73
2838 73 305 106 119 84 20 48 287 -74 -170 91 -49 -141 113 -274 112 -34 -62 299 -138 -65 -97 -34 249 51
2862 51 -168 30 -136 71 -112 -38 -21 -93 -173 -101 49 17 100 -30 -33 -117 27 74 121 13 82 100 -103 -45 -82 113
2888 113 15 -127 35 -51 280 -64 -60 37 -12 -104 -93 -10 -24 -164 -25 -167 -138 92 43 58 -129 126 48 78 76 50
2914 50 -62 -79 -5 -36 30 -4 -129 40 96 -101 104 106 -84 23 4 86 176 101 82 37 213 122 64 -29 8 -119
2940 -119 186 -113 21 -62 11 -33 124 -19 -144 195 -183 112 37 -53 54 90 -92 -43 -45 -150 213 50 149
2963 149 -11 -17 55 -107 -117 62 -229 149 -217 -116 -348 -57 129 -167 92 -119 -36 96 39 -95 -28 260
2985 260 -166 -100 76 15 123 -30 41 -135 -2 -57 32 -16 -82 88 -9 -44 79 -240 166 -69 37 13 -88
3008 -88 30 -56 -11 36 183 -112 68 83 -9 -90 181 -107 -183 42 -89 -111 -117 54 -219 -229 -10 -6 60 24 107 113
3034 113 66 -143 232 -293 162 76 28 -18 159 69 183 -100 -314 191 -71 -111 9 -158 -64 73 183 107 -22
3057 -22 182 -52 -7 20 -122 -29 158 -39 5 -206 -27 -201 -183 -98 60 7 -281 -29 66 -183 86 85 116 83
3081 83 -91 280 274 -75 99 -209 -18 166 243 -65 139 129 -44 24 151 137 -109 21 134 39 204 -30 147
3104 147 97 -100 87 20 -30 22 40 130 190 27 115 95 -30 175 -62 -14 130 59 43 -153 31 124 -38 -233
3128 -233 -129 83 -109 180 123 -19 -96 -4 -111 77 56 -36 -210 145 43 139 -129 -27 146 -151 -76 80
3150 80 -115 -11 4 -194 -27 -210 124 -132 105 29 -127 93 -2 -29 -114 -106 -43 75 82 -31 162 -92 -58 61
3174 61 -19 -12 -135 -91 -50 -95 74 97 -33 -109 217 125 160 25 23 212 37 51 -93 -103 -255 96 -48 131 27
3199 27 -205 115 12 69 -208 -135 152 -124 34 -58 -117 -99 31 45 70 -3 6 45 -176 63 -120 42 -184 -310
3223 -310 -140 123 -67 4 -97 -220 -79 139 -45 106 212 14 41 -211 127 143 45 -100 80 -40 -287
3244 -287 72 -10 142 -92 -20 36 202 37 89 276 -5 98 -352 -66 -20 -70 29 76 170 104 31 -175 53 129
3268 129 141 92 79 -43 31 2 9 61 -232 50 -190 -185 -23 -108 141 -43 40 -51 -213 -11 142 116 157 171 47
3293 47 -132 150 121 -224 -26 -42 2 161 -28 219 82 62 124 47 207 121 -194 -91 27 -14 82 32 -173 125
3317 125 76 36 -227 -115 -163 143 46 7 -214 -159 13 -94 103 -130 -42 -19 -63 121 -58 -187 7 257 -104
3340 -104 11 -15 25 -223 -318 160 -52 -140 134 120 246 -103 34 209 -138 -34 18 -2 32 -171 204 150 81
3363 81 -56 -95 -89 201 94 87 59 79 -31 27 129 0 55 33 92 92 119 48 153 13 -177 93 -24 94 -114
3388 -114 -103 144 -7 27 -85 239 -67 116 -93 22 -136 14 170 111 19 -28 -116 29 135 146 37 30 97
3411 97 191 -93 -27 49 3 -81 -147 31 144 -71 -92 24 -154 -26 -47 40 -309 -85 210 220 -195 149 38 -126
3435 -126 24 173 -24 -47 -89 7 84 -41 33 24 117 24 143 -88 97 173 11 26 41 152 104 -155 17 12 -62
3460 -62 -109 33 10 38 24 101 63 -53 125 -131 111 160 120 41 -5 50 -58 -101 -32 -219 -116 -103 -18 94 149 69
3486 69 -137 38 18 78 -58 68 -123 16 -164 5 121 -6 -48 -58 -194 -43 103 25 -104 -106 148 -109 -21
3509 -21 136 -25 -6 -69 80 13 105 -184 22 -76 -10 -97 51 26 138 41 -53 -222 0 -89 79 -288 -10 -102
3533 -102 -133 25 38 -41 53 7 -101 100 -60 -212 -72 30 257 -171 -8 -5 -303 -295 -104 8 -3 -166 -77 -140
3557 -140 263 -127 -36 -2 -232 -2 197 33 -25 -95 -39 -40 54 95 86 13 -54 36 -23 211 84 77 -156 146 248 123
3583 123 -122 9 72 14 -331 -37 199 34 -60 6 -8 -214 138 14 -170 -50 -263 18 126 -69 -162 -58
3605 -58 231 -144 -82 -212 124 68 249 -14 -9 -134 207 -139 -76 55 -69 62 65 174 -128 190 116 -159 -204
3628 -204 60 -20 -28 238 -75 80 60 -81 177 115 52 -41 -208 59 81 -41 97 129 65 38 35 -90 -120 -282 88
3653 88 57 -113 -72 22 -289 -51 -36 -102 -16 32 -62 -2 -145 -14 167 158 -105 37 -81 33 -20 82 129 69 142
3678 142 -134 -57 -3 -44 -19 -161 80 -49 -26 63 -76 38 -83 31 -98 -150 117 161 48 -98 -71 116 -23
3701 -23 -34 45 -68 -150 103 182 -176 121 -175 13 26 -14 -305 -44 192 -9 -10 231 262 -129 113 55 122 -99
3725 -99 40 105 -11 13 -95 49 45 128 -145 -54 -197 75 -111 22 -33 -193 46 -262 -88 5 14 -15 0 85 -245
3750 -245 44 28 -128 -28 170 27 58 15 21 -172 60 -3 -59 36 -44 95 123 37 -31 86 -154 -16 120 -10
3774 -10 72 82 -258 183 -211 82 195 -33 -80 -32 62 22 -104 125 57 -144 -74 -63 -12 -158 -4 164 5 15
3798 15 -61 2 155 -438 285 -455 -259 -34 -28 -133 147 106 -48 769 444 399 -14 184 -3 188 -170 108
3820 108 -2 -114 110 -40 -179 -38 149 -166 -123 -171 -16 -165 38 -15 132 -52 75 207 -481 31 266
3841 266 488 -187 48 119 226 421 379 145 19 411 -224 -90 -338 430 -257 595 647 87 257 99 -226
3862 -226 61 268 561 559 200 -77 123 745 150 -189 -26 -183 -206 52 -242 385 222 -83 443 -75 -65
3883 -65 349 -23 -38 155 -164 143 47 247 -24 80 8 -176 47 132 -40 -104 -61 42 -32 -106 3 89 -8 -58
3907 -58 -119 51 -138 311 -145 -66 56 137 61 -26 -10 57 6 44 -18 -205 -126 230 87 60 -93 -74 68 -192 54
3932 54 54 168 -170 26 104 46 100 -26 -9 -216 1 -74 76 108 61 -251 68 -53 40 5 147 -117 -211 58
3956 58 -23 63 -155 -46 -146 54 -44 -2 -63 50 70 10 63 65 -134 -13 -18 -17 121 -54 58 73 -70 -13 -97 24
3982 24 96 -214 146 -188 140 175 103 -74 93 110 -11 -267 39 -202 -108 131 35 105 -223 42 -119 49 1
4005 1 93 -158 87 108 203 -53 215 96 38 -27 -95 86 -40 149 -49 -131 8 25 -161 145 -130 56 39 -109
4029 -109 -15 67 -85 -36 49 70 -266 98 -110 -41 140 -6 -120 170 -57 -100 168 163 47 -66 91 -85 267
4052 267 -125 -35 15 -71 127 -39 1 47 127 -31 -84 7 235 -187 130 -25 -2 74 285 -9 73 104 -192 -39
4076 -39 63 -69 -50 110 61 69 -11 37 -18 80 -83 -107 -144 23 -8 66 67 -50 108 -108 102 -26 71 14 15 -219
4102 -219 186 -111 -71 194 -66 0 -54 -105 -60 25 -124 -85 138 -58 -78 62 -76 48 -29 -61 19 49 -18 1 -63
4127 -63 -75 30 44 130 20 11 30 80 -140 207 3 32 26 -112 -11 -234 -142 -82 100 -32 262 -92 199 -149
4151 -149 -22 -24 34 179 -23 103 -72 13 139 -4 -23 84 38 265 138 233 17 -128 -152 -283 -176 -7 -6
4174 -6 116 -115 -82 4 -77 -25 -18 96 260 149 132 -188 -39 127 131 -40 181 -10 -66 -90 -61 -136 -49 -48 -130 -113 -19
4201 -19 179 -235 -41 -56 1 37 -180 -3 24 -372 2 216 291 153 55 54 -139 206 -45 218 -111 -189 9
4224 9 -53 93 -195 45 126 151 142 -131 -28 17 -86 65 -68 -40 97 -82 -35 -56 -159 -184 -91 -134 -8 78 8
4249 8 81 -241 -96 115 -283 -2 -158 77 -104 -219 -83 63 -146 122 10 -75 156 245 140 98 1 -108
4271 -108 -112 73 -63 148 95 -114 118 -99 75 93 -124 107 -114 15 -216 102 -141 -131 184 135 -164 -177
4293 -177 236 -161 157 201 117 -10 -102 -52 18 -99 80 -90 124 -61 45 -175 63 -117 143 66 -64 20
4315 20 109 137 -65 56 -121 46 61 110 -31 -40 -11 -112 87 -209 -69 -97 -32 76 -104 201 -75 55 -142
4338 -142 78 -252 -54 77 120 10 -43 138 104 -34 -23 -20 230 15 -16 -263 9 55 -57 67 45 36 -118 -92
4362 -92 -35 147 -32 24 158 14 53 -237 -50 -86 -124 -138 104 19 -205 41 -17 83 54 55 214 -122 -49 -153
4386 -153 86 88 73 -32 -30 41 -169 81 94 97 45 179 -14 -142 -187 -34 -34 183 40 32 -131 247 188 23 89 127
4412 127 69 -64 167 10 24 111 -90 51 9 -1 -39 38 -80 -41 -27 21 -34 184 15 -107 -57 163 132 19
4436 19 46 20 157 28 193 131 -104 99 -10 10 96 52 103 -222 51 24 -7 146 -32 80 30 -87 -18 -92
4460 -92 -52 5 33 -37 -11 196 28 10 55 44 -9 94 128 -85 -117 69 -194 236 -63 106 -68 -152 -79 75 172
4485 172 -181 14 68 -49 -33 -41 162 -68 -154 -94 -79 85 84 85 -148 4 -41 20 14 -14 39 117 -27 17 -163 -47
4511 -47 113 136 -3 5 -18 -81 -125 152 164 114 255 -80 -191 -10 -9 -194 146 -29 -116 41 -60 -99 9 73 -56
4536 -56 -38 -28 -63 44 43 -170 189 35 -21 -26 -215 69 96 -116 -33 130 82 -111 -60 182 152 92 -22 -118 -5
4561 -5 -263 -62 32 181 -14 55 107 -55 142 130 -59 -10 205 48 57 91 -33 185 -13 78 139 -34 -95 148
4585 148 132 -105 116 147 65 7 -169 182 -100 151 -26 -23 -34 -102 90 -125 137 148 11 15 121 65 -72 162
4609 162 99 55 18 17 32 -65 -9 16 -49 -37 234 23 -39 -19 -144 160 51 -63 -179 14 -82 3 -64 -86 120 -107
4635 -107 48 123 29 -136 110 129 -108 112 -80 -82 -31 202 -219 -29 -4 34 107 134 80 -151 87 -183 -153 -209
4659 -209 82 63 -49 -60 43 -112 -79 -101 105 -32 -92 130 -83 -34 180 -146 -57 59 42 68 318 -84 -18
4682 -18 -12 -117 65 -218 -61 -76 -76 102 -124 109 -52 115 83 80 -118 -86 143 86 224 0 -28 -16 -67 -64 -100 46
4708 46 166 -196 -151 -15 89 -125 -114 61 7 22 200 8 98 -47 12 -57 60 -57 -26 -40 9 31 133 -111
4732 -111 -22 -59 -18 117 30 218 25 197 119 22 2 110 204 80 95 38 50 -14 -1 49 131 129 71 39 -9 165 148
4759 148 -22 -36 288 -23 -218 22 8 -79 -177 12 191 -53 -47 -10 -78 -57 129 110 -59 -75 -237 -97 74 82
4783 82 88 -87 30 -108 -86 -99 -97 -3 -61 -291 -137 39 -134 36 -112 -77 -47 75 -19 0 11 -104 237 -153 -142
4808 -142 6 57 -4 97 133 12 74 -257 -12 -24 -94 -51 132 -6 -27 -165 155 -221 -141 2 96 148 -137 166
4832 166 192 198 94 42 -62 322 -131 30 -157 89 -50 -76 103 79 120 171 -7 211 76 -174 90 73 -107
4855 -107 -331 -117 61 11 194 103 155 -38 138 142 20 -166 56 94 -109 -104 19 -17 118 -87 6 199 30
4878 30 17 -10 85 -34 8 122 -48 -113 63 73 31 -45 3 132 -79 -57 147 41 88 40 29 -2 -216 153 96
4903 96 14 12 -85 101 106 36 -163 5 -40 -257 49 182 61 1 -2 138 29 47 -48 98 -3 -3 111 -41 91
4928 91 -151 33 -146 -65 21 -5 -45 -67 -59 -162 34 68 35 107 76 -10 -141 273 135 -95 -125 -40 131 27 -48
4953 -48 -158 119 -169 118 -215 39 31 -96 143 106 -298 108 190 -148 -27 67 -14 54 18 -117 -27 14 -114 -74
4977 -74 -27 108 43 86 -35 18 -4 131 40 43 50 -45 -55 -52 -54 18 -164 -20 -28 42 -23 -57 -135 -117 125 -12 -18 -18 -8 77
5007 77 -154 -162 160 76 -256 -7 -99 85 199 -131 -8 164 -36 142 -6 -86 112 -152 59 -58 -3 -72 177
5030 177 -127 73 -105 26 240 -66 29 195 42 -172 189 -21 -168 31 15 24 -50 -1 -340 -3 29 11 202
5053 202 21 -2 119 24 -12 -170 106 -29 -32 44 -41 141 -207 162 173 183 -59 -150 64 -21 -64 -53 -63 58 -39
5078 -39 -68 37 55 -117 -31 16 295 -27 -19 100 -30 38 46 32 -109 140 46 -33 -103 -119 149 -159 129 -78 -103
5103 -103 177 21 37 101 26 19 181 12 128 -20 84 -84 19 2 -66 -239 -150 -121 -191 27 8 -26 -76 -33 -64
5128 -64 60 43 77 67 125 122 -126 -59 -152 -5 -2 -243 -98 56 34 -29 -90 -20 68 -6 117 -167 34 -149 70 94
5154 94 49 -6 -132 150 -18 36 75 -124 -80 99 -131 -41 28 -57 76 -79 -82 -83 131 49 44 -61 27 -69 -77 -254 95
5181 95 166 72 -124 28 -158 -48 88 162 -148 -75 19 -60 87 -6 -8 -116 -78 -113 40 -90 216 -93 -36 -22 16
5206 16 -21 58 2 -120 -49 -331 111 156 181 -137 67 -25 136 -60 -116 76 29 -92 87 32 -83 -39 -18 226
5230 226 -101 62 -49 73 193 -14 -48 23 -105 -48 72 5 78 -119 152 -165 201 -127 -57 90 -16 84
5252 84 40 -162 129 -82 -69 -95 3 13 -83 56 -4 -203 -11 135 86 70 -101 90 -218 -78 112 89 -243 -158
5276 -158 -50 70 158 47 42 -11 25 -49 72 46 23 82 32 42 116 -263 75 157 -81 -20 30 59 -220 -228 61 -19
5302 -19 -54 -178 -4 -99 -65 97 -102 130 79 6 48 -236 -209 -84 -94 -13 -22 109 27 36 36 -143 -196 -112 198 52
5328 52 -242 51 -13 35 133 105 -118 218 14 31 67 45 53 -138 -137 -49 39 -15 -44 49 139 -123 -98 111 142 -40 47
5355 47 -135 -86 55 -59 -118 -112 -150 -55 81 31 32 5 -23 -79 -193 60 186 32 62 -58 32 156 -3 -126 104
5380 104 -74 -23 128 -63 -124 -76 130 42 -126 -80 174 151 56 -142 -10 -35 -18 89 37 120 33 -100 4 -103
5404 -103 33 62 134 -28 -38 -3 37 -175 7 24 55 -5 -170 100 124 -32 51 -126 -116 232 85 35 26 108 4
5429 4 -114 -35 -103 -88 67 90 75 40 -200 173 -49 27 12 -38 99 143 65 -7 -12 -25 0 -77 22 -126 75 -15 88
5456 88 81 24 10 105 -133 -21 9 37 -172 -42 -4 34 96 15 42 -73 -343 195 -27 -49 -100 202 184 -105 -114 1
5482 1 -86 69 -75 9 167 8 -182 3 -122 41 -90 186 65 -44 54 105 -48 18 -62 73 -87 20 72
5505 72 -147 -88 -109 -108 70 -132 -31 30 -110 43 260 80 -19 -73 68 -87 224 92 14 5 25 -72 -27 -135 -81
5530 -81 -128 -43 43 -58 -84 -22 20 -29 41 18 10 -10 -211 -7 -144 -133 -76 -140 38 12 49 -294 -4 -17 48 149 -104
5557 -104 -13 48 45 48 31 -38 117 51 149 135 103 -63 -106 -261 -50 56 -74 139 -80 -105 -34 -71 120 57 -154 -118
5583 -118 -65 -30 -28 158 208 152 -22 -2 7 182 -7 -247 176 -121 144 119 -125 -233 280 18 -45 36 5 -79 -8
5608 -8 27 26 56 51 9 32 -113 131 -25 -5 61 -1 113 -117 -41 -89 24 90 171 28 24 -242 63 13 32 114 75 -117
5636 -117 138 -205 182 -36 34 0 35 58 98 -60 100 342 53 217 -36 -93 -161 58 142 -32 77 -53 178
5659 178 196 -33 178 -106 104 119 -121 2 98 51 -32 178 48 83 127 99 -11 224 58 258 -156 -192 -69
5682 -69 2 77 -113 -145 48 -119 -47 -118 -21 304 104 56 -129 180 19 -253 -132 -101 -114 -9 60 -39 124 148
5706 148 6 -113 83 59 28 -50 63 99 71 -17 53 74 -87 -61 121 -96 -135 -145 -150 264 108 -12 -119 194
5730 194 -58 3 59 164 -188 59 -67 124 19 -9 -124 -76 -168 4 194 -13 -76 -231 36 321 -199 54
5752 54 -653 -425 547 518 244 48 195 30 -273 0 -387 -99 284 -130 -184 207 -239 89 -89 513 114
5773 114 -416 -253 -25 -74 232 -131 -36 28 157 -178 -82 98 5 119 -127 120 9 200 191 -61 34 127 58
5796 58 -61 -162 31 66 -77 -29 -123 62 10 121 -33 120 -13 -61 -64 -49 58 -158 -90 50 -181 12 -93
5819 -93 48 -213 40 254 -176 -109 299 37 -91 -51 -123 -78 13 213 -192 -49 87 -77 313 151 -39 112
5841 112 182 206 607 -587 -442 146 -299 42 -53 -35 -100 -83 -10 -17 -49 -142 -32 -18 121 136 21 194 393 -77
5865 -77 -166 -92 -144 -7 95 -156 -33 41 -65 162 70 8 -12 -99 84 -118 78 13 48 -1 85 -47 -46 -75 -41 79
5891 79 23 -52 -91 195 -61 -33 -70 -2 -139 -266 275 9 -17 27 -15 -106 -110 163 179 -25 -12 -33 -26 185 -14 -81
5917 -81 -31 294 -38 83 62 -12 -160 -139 80 146 190 72 13 157 19 -77 119 -199 -92 54 -21 -88 215 57
5941 57 -64 85 154 153 121 49 10 -312 23 -68 104 48 58 -171 -27 113 52 148 -30 -146 -23 32 -70 124
5965 124 39 -124 -12 90 -204 -55 -75 -208 107 80 91 -21 123 160 14 -109 -8 174 9 -164 33 176
5987 176 -20 -26 45 53 68 -62 -72 -60 158 99 -36 214 -92 -128 -92 68 57 -267 -27 -160 155 0 -4 -155 -141
6012 -141 104 32 170 -99 -57 -243 37 -71 -97 -113 -9 -74 -6 47 188 -156 -20 -32 -108 -181 127 44 56 19
6036 19 109 5 -29 39 32 -63 -24 36 -12 145 -128 -104 254 -14 -19 -184 39 121 -132 -10 -197 -1 -230 413 62
6061 62 -4 11 3 -95 63 -163 -36 101 -117 224 16 136 63 51 169 -14 -28 -48 -30 24 -174 47 -30 38 -50
6086 -50 -34 -6 138 63 -29 -93 -96 109 84 -53 -63 -125 -121 -78 -42 -161 -20 -121 -147 -40 -120 50 -20 -49 -39 -15 8
6113 8 -7 91 -56 175 93 243 146 -32 42 -173 143 -185 110 1 -169 182 -23 -53 -68 53 -93 7 -5
6136 -5 93 67 -64 70 99 -23 28 135 -9 -240 -206 59 77 -39 -111 143 119 178 1 -15 -144 -131 -113 -48 43
6161 43 25 219 -76 -42 -73 -89 -93 125 70 270 -67 -245 -119 -13 -28 -14 -93 -195 -47 -188 63 -236 6 64
6185 64 -190 29 53 -1 66 21 -161 60 -31 -12 -2 183 -138 -187 9 174 -59 -131 58 -107 -11 108 25 -11
6209 -11 149 52 32 22 -42 -115 52 -239 45 48 208 -22 96 -27 4 -118 50 84 103 -27 -176 29 -15 -66
6233 -66 -90 -54 244 -28 52 -48 215 276 -129 171 -149 -47 86 -3 -101 -224 170 -172 155 -148 14 -68 -153
6256 -153 30 -113 -17 -199 -55 43 -25 -69 79 -70 66 47 -76 -89 87 -7 -183 19 -157 -105 55 153 -27
6279 -27 -42 -288 -122 55 -81 195 154 31 8 226 -34 -32 13 -47 3 -38 -2 0 167 140 28 32 -145 134 -36
6304 -36 -115 -94 123 17 3 69 -106 -227 -121 -69 -52 -34 -2 148 74 70 -130 -6 -30 70 -5 -2 -85 -23 -119 75
6330 75 127 -198 -95 307 -14 -63 14 28 -124 -99 -79 39 18 -29 182 42 122 -241 174 -44 -182 153 -176
6353 -176 -193 -70 102 46 -1 70 -133 114 145 -37 64 14 -8 126 -28 -167 -180 21 -102 -118 180 151 44
6376 44 -2 -213 45 56 225 206 -49 39 107 115 122 7 98 -15 -196 -1 186 -71 14 -14 -68 163 36 157 -133
6401 -133 38 -86 49 77 -19 121 75 -27 -24 41 -20 -65 -12 -82 -3 93 -35 110 8 221 -60 -175 7 75
6425 75 -203 -191 153 -153 -136 141 -41 204 100 92 182 -120 -72 276 21 -26 106 9 -24 25 -73 251 1 81
6449 81 85 15 230 -48 114 50 -96 21 -128 -130 -182 90 149 -69 19 -216 79 30 67 6 -114 8 139 214 71
6474 71 -108 -100 -246 99 -20 -49 -22 58 -32 -6 -135 117 -106 84 -124 -224 74 14 174 75 136 -184 -134 -91
6498 -91 23 -27 236 -136 -97 152 -185 39 -11 -18 -3 101 32 -126 -124 27 77 13 -80 38 -36 -22 -273 2 -103
6523 -103 -125 -151 162 101 -47 -107 -215 -19 37 -6 109 298 -46 11 -98 219 -20 -97 -218 -81 9 23 -80
6546 -80 -60 70 -108 -6 81 9 58 -137 -24 -32 159 18 -17 79 -7 31 -92 -193 -62 -124 -38 251 65 109 -128
6571 -128 2 129 -118 133 9 -121 -39 -93 44 -7 78 5 30 152 -63 14 -173 -7 87 -19 -79 -59 -150 -68
6595 -68 -170 -68 65 -76 -37 -160 -20 -42 -132 -165 -3 168 151 -74 -21 5 132 -124 27 -126 33 87 74
6618 74 57 -304 -146 156 20 15 70 94 -58 53 193 -35 106 -85 -57 96 -12 101 -25 -82 189 -185 174
6641 174 -72 -66 169 -134 145 9 20 -176 -188 -62 -10 -19 220 0 70 68 93 122 -101 -15 -158 -29 -135 49
6665 49 -31 139 -54 168 -228 4 46 -34 -36 -183 77 85 6 -587 98 256 19 -407 -98 -23 279 5 243
6688 243 318 -146 103 -19 68 -113 167 -277 208 -11 603 -398 -605 -211 -116 -101 142 2 106 29 -110
6709 -110 18 14 217 73 -469 466 -386 328 -160 581 846 -323 -194 -67 475 180 52 85 150 -237 -461
6730 -461 113 -217 76 489 128 -287 -7 -305 23 -69 139 126 -175 -10 52 118 35 266 -163 18 122 199
6752 199 -89 -5 -26 -76 176 -105 -69 126 -113 10 -76 -64 -156 261 -46 25 49 -271 -2 72 -209 -61 95
6775 95 30 -116 39 -73 150 -114 38 61 132 -199 -110 -180 -95 -53 355 124 -23 75 53 184 543 -46 -236
6798 -236 25 75 -72 -12 84 34 175 670 623 -113 -17 158 -61 -43 100 -373 -100 143 -176 178 -89 -54 -263
6821 -263 58 180 263 47 43 -96 1 -82 111 59 -7 -33 -18 259 622 469 -272 -415 414 -32 68 -85 -313
6844 -313 117 -168 84 245 -118 -25 179 -158 -76 79 58 -92 -50 -51 40 46 -75 26 108 33 -53 -145 0 155
6868 155 -75 -27 109 -85 35 -27 -207 -38 50 77 -298 -4 20 -165 -18 -226 -81 -124 -279 393 -184 358
6890 358 -129 69 177 97 -9 -24 -216 95 -161 -252 166 -110 -162 129 146 -49 -125 109 233 169 -258 77
6912 77 -51 -97 184 564 42 -561 181 202 145 324 340 119 -607 701 528 149 46 -76 -136 -177 1011 -30
6934 -30 245 -17 300 43 -375 -280 -266 79 -239 79 -155 280 118 -222 14 68 146 -117 135 49 -92 -186
6956 -186 -81 38 -296 74 -56 48 99 -31 111 -3 67 -29 80 -125 46 -135 -102 -20 -60 -1 35 505 -117
6979 -117 360 533 -478 71 -152 -194 33 33 -155 26 -247 -183 -93 16 62 185 177 204 56 65 1071 392 324
7002 324 75 16 256 52 -53 88 -70 -178 -58 85 26 -120 80 95 -153 -5 62 -106 3 62 -28 36
7024 36 -55 106 -28 86 -4 -177 125 25 -42 1 -195 45 5 -158 -31 24 57 -12 -68 -146 55 214 35 29
7048 29 52 148 139 -64 -56 9 4 98 -85 -57 -28 -98 -152 -211 13 -82 -98 76 -16 124 60 175 -86 -59 -89 203 2
7075 2 36 32 17 -64 296 114 -77 74 59 32 337 -7 -59 228 126 -181 -87 41 -45 13 59 90 -198 466 394
7100 394 -286 -14 105 -89 49 100 -106 -61 -26 -203 4 -64 218 -128 -106 -1 142 29 -280 -90 -256 113
7122 113 -257 -188 40 116 -136 -41 44 32 -169 84 157 102 -41 202 -175 123 -60 -79 -121 -59 27 -210 126 -4
7146 -4 15 -98 -23 19 -2 -88 120 195 -86 -101 229 2 -69 -92 59 130 -7 20 1 -111 -7 3 -45 88 274
7171 274 213 100 65 153 -39 -57 -24 -57 -7 -67 49 55 -122 60 -4 -3 175 144 -92 -51 -90 -73 -47 82 -137 -47
7197 -47 -100 -159 76 62 122 -11 -116 -219 177 74 -28 132 156 232 -102 -18 -228 -179 189 84 2 -16 25 -150
7221 -150 33 -43 -7 -64 111 65 101 150 -58 -30 102 -129 175 79 -107 56 -8 42 141 135 155 12 -145 -76 -93
7246 -93 -89 83 -158 73 -69 -12 13 -107 -108 -150 -161 -45 85 176 56 -92 -9 -124 -5 -44 -141 172 -91 -204
7270 -204 104 -187 -186 19 216 171 -8 -260 -27 -55 -107 89 -149 -13 116 110 124 133 150 -178 37 88 86 16 -195
7295 -195 -88 -19 35 43 -124 -11 64 162 -160 150 28 -128 -197 -152 -75 -223 -20 77 -110 -41 -228 44 -144 191
7319 191 -72 166 104 87 -24 -195 -56 0 -179 -219 -75 -111 -1 -215 59 4 14 39 -12 60 -199 -106 -54 -105
7343 -105 -172 -91 -128 -5 -35 -9 102 26 -49 -156 78 -46 -44 57 18 9 86 69 -105 117 163 -83 -104 -39 136 -163
7369 -163 143 53 -170 27 116 -42 49 235 -86 195 -245 216 121 -246 181 -32 177 -99 -141 -58 63 -31
7391 -31 72 -4 264 -110 -17 36 -8 -5 -26 -5 97 71 59 82 81 -40 -239 14 82 -33 100 24 306 240 86 -155
7417 -155 377 -193 -369 -307 -463 -38 -217 825 603 -290 427 -65 -109 -368 276 -71 -291 34 -52 116 253
7438 253 30 -11 354 -375 -280 243 -119 -51 -57 -185 -107 170 -120 -30 100 -2 193 25 4 -53 232 182 -81
7461 -81 129 158 -100 40 -3 -117 191 -46 4 266 -28 -60 194 -25 -180 22 86 -62 -116 211 155 -264 10
7484 10 -27 119 42 -810 -160 -165 -181 -372 -66 66 -29 -79 69 156 72 -49 115 -188 -67 175 143 37 -87 -112
7508 -112 62 48 30 -17 88 123 20 -42 0 183 69 52 38 70 -253 28 -205 -327 19 -131 -54 -173 -49
7531 -49 62 128 -8 -46 97 90 -31 -5 88 -25 -82 -2 178 18 -33 -38 61 -69 73 165 -42 49 -47 121 -69
7556 -69 6 83 -48 -27 114 60 -2 -87 67 -111 21 2 -95 3 86 -41 -173 -52 -34 22 44 -267 26 161 -94
7581 -94 73 119 206 -146 -28 41 70 -80 92 135 -83 -36 -143 145 25 52 110 29 -60 -89 -95 -84 -27 -185 -192 64
7607 64 -36 -24 109 1 94 107 -118 -129 65 164 127 -22 192 36 132 -86 64 25 157 171 -109 78 -59
7630 -59 2 93 7 -206 -44 -149 101 -43 -249 -170 -66 20 7 138 -86 -45 162 68 -74 -164 24 14 84 193
7654 193 149 80 -11 121 -22 -149 61 196 -209 -55 49 22 130 -43 90 243 187 -164 8 71 425 296
7676 296 204 202 267 63 -325 336 36 -147 136 61 124 -425 329 406 -327 -219 334 167 74 -266 -22 109 -390
7699 -390 325 302 296 -111 -402 684 202 42 -56 -70 -11 119 -2 -295 192 170 -288 277 65 -140 -95 -501
7721 -501 285 162 37 -93 -114 -1 -297 -92 125 -231 56 -281 181 -54 -175 16 -140 166 121 -147 74
7742 74 -280 -50 485 316 8 25 -83 75 28 202 107 -6 -57 38 153 -213 15 44 7 43 1 -31 146 -89
7766 -89 -181 -48 -133 -103 53 263 -55 -19 33 3 -26 -96 42 10 128 -1 -8 -8 -150 -78 140 8 -32 -88 -87 27
7792 27 -76 -208 -19 120 170 -16 -33 118 -44 -17 115 -217 47 -67 -117 -46 1 25 -97 76 116 82 -9 174
7816 174 24 48 -131 36 165 -282 -134 77 116 2 17 37 -78 -61 -72 93 102 -124 120 -4 -6 -186 -34
7839 -34 -63 -46 144 58 -69 11 9 6 -70 -72 -81 44 -68 26 10 -163 -47 164 -97 59 -308 -40 -41 -285 -140 -93
7865 -93 139 -42 83 -240 -106 -217 -197 -3 206 -43 41 51 117 -4 157 2 -394 -55 98 -69 -21 116
7887 116 81 -7 60 130 -117 -65 -13 14 190 -26 -22 -158 130 -77 129 68 63 -65 5 -62 85 28 33 60 -91 86
7913 86 -6 183 199 32 -194 117 37 -77 -53 -124 157 -144 -66 -100 7 -63 115 -32 0 22 -115 21 20 -115
7937 -115 -55 -78 -187 155 32 -56 4 -71 77 46 -66 -31 -4 248 118 -6 43 -173 -34 -115 -40 105 -120 -343
7961 -343 92 -155 253 28 107 -16 19 34 28 167 -78 205 -55 54 14 155 62 92 35 207 -8 97 -60
7984 -60 170 12 -68 -91 84 -185 29 -122 -1 -60 -90 70 97 -58 -70 31 108 40 -64 -20 144 -59 356
8007 356 2 -250 12 180 -23 -126 46 2 47 78 69 78 67 -105 101 108 -5 -252 0 1 -15 -44 37 -135 -49
8032 -49 -139 72 -124 14 -86 -125 134 183 -29 67 -123 -130 222 -125 44 154 -75 57 -36 15 139 37 247
8055 247 -282 -141 20 -99 74 -96 -52 40 151 108 17 238 25 -94 56 -31 -16 -143 121 35 28 -248 -100
8078 -100 -37 84 -107 -3 58 -152 71 116 131 -15 -97 72 -31 -53 -198 -60 135 75 -38 -119 -73 123 -157
8101 -157 -17 -131 -110 -39 1 -196 0 216 -26 -66 111 -7 -112 -59 71 91 -10 -37 71 28 18 17 -168 -4
8125 -4 5 -73 -97 -97 116 -151 57 -226 -122 -25 -23 -226 -56 90 -27 -11 -41 31 -145 -18 124 -222 15 35 -100
8150 -100 -4 -146 172 -28 159 -27 2 32 -189 -120 82 43 -199 190 -3 16 -168 2 147 -154 13 166
8172 166 35 104 106 -39 -113 -48 135 222 79 110 103 -222 -82 102 -33 -31 -92 10 56
8191E6
##END NTUPLES=NMR FID
##END=
