##TITLE=1H_Pr 5033-m
 200.13MHz,CDCl3.
 8 sc
 
 18.12.2025
##JCAMPDX= 6.0         $$ Bruker NMR JCAMP-DX V2.0
##DATA TYPE= NMR FID
##DATA CLASS= NTUPLES
##ORIGIN= UXNMR, Bruker Analytische Messtechnik GmbH
##OWNER= pz
$$ XWIN-NMR		Version 3.5
$$ Thu Dec 18 16:15:10 2025 Russian Standard Time (UT+4h)  she@DPX200
##.OBSERVE FREQUENCY= 200.1313
##.OBSERVE NUCLEUS= ^1H
##.DELAY= (6, 6)
##.ACQUISITION MODE= SIMULTANEOUS
##.ACQUISITION SCHEME= undefined
##.AVERAGES= 8
##.DIGITISER RES= 18
##SPECTROMETER/DATA SYSTEM= spect
##.PULSE SEQUENCE= zg30
##.SOLVENT NAME= CDCl3
##.SHIFT REFERENCE= (INTERNAL, CDCl3, 0, 14.3821)
##AUDIT TRAIL= $$ (NUMBER, WHEN, WHO, WHERE, WHAT)
$$ ##TITLE= Audit trail, XWIN-NMR		Version 3.5
$$ ##JCAMPDX= 5.01
$$ ##ORIGIN= Bruker BioSpin GmbH
$$ ##OWNER= she
$$ F:/spectra/data/she/nmr/H-C/1/audita.txt
$$ ##AUDIT TRAIL=  $$ (NUMBER, WHEN, WHO, WHERE, WHAT)
(   1,<2025-12-18 16:13:47.04 +0400>,<she>,<DPX200>,
      <created by zg, POWCHK disabled, PULCHK disabled
       configuration hash MD5:
       00 E9 B6 7A A2 85 ED C7 34 08 36 98 17 FE 4E 26
       data hash MD5: 16K
       BE CE E1 98 95 1D 7B A8 1B BA 05 8C 65 FC 37 B2>)
$$ ##END=
$$ 
$$ hash MD5
$$ A8 12 7B 24 A8 84 3B AE 1E FF 26 A0 CE C3 04 E0
##$RELAX= 
##$RELAX= 
##$RELAX= 
##$RELAX= 
##$RELAX= 
##$RELAX= 
$$ Bruker specific parameters
$$ --------------------------
##$DU= <F:/spectra>
##$EXPNO= 1
##$NAME= <H-C>
##$PROCNO= 1
##$TYPE= <nmr>
##$USER= <she>
##$AMP= (0..31)
100 100 100 100 100 100 100 100 100 100 100 100 100 100 100 100 100 100 
100 100 100 100 100 100 100 100 100 100 100 100 100 100 
##$AQSEQ= 0
##$AQ_mod= 1
##$AUNM= <au_zg>
##$AUTOPOS= <>
##$BF1= 200.13
##$BF2= 200.13
##$BF3= 200.13
##$BF4= 200.13
##$BF5= 200.13
##$BF6= 200.13
##$BF7= 200.13
##$BF8= 200.13
##$BYTORDA= 1
##$CFDGTYP= 0
##$CFRGTYP= 5
##$CHEMSTR= <none>
##$CNST= (0..31)
1 1 145 1 1 1 1 1 1 1 1 1 1 1 1 1 1 1 1 1 1 1 1 1 1 1 1 1 1 1 1 1 
##$CPDPRG= <>
##$CPDPRG1= <>
##$CPDPRG2= <>
##$CPDPRG3= <>
##$CPDPRG4= <mlev>
##$CPDPRG5= <mlev>
##$CPDPRG6= <mlev>
##$CPDPRG7= <mlev>
##$CPDPRG8= <mlev>
##$CPDPRGB= <>
##$CPDPRGT= <>
##$D= (0..31)
0 0.7 0 0 0 0 0 0 0 0 0 0.03 0 0 0 0 0 0 0 0 0 0 0 0 0 0 0 0 0 0 0 0 
##$DATE= 1766060026
##$DBL= (0..7)
120 120 120 120 120 120 120 120 
##$DBP= (0..7)
150 150 150 150 150 150 150 150 
##$DBP07= 0
##$DBPNAM0= <>
##$DBPNAM1= <>
##$DBPNAM2= <>
##$DBPNAM3= <>
##$DBPNAM4= <>
##$DBPNAM5= <>
##$DBPNAM6= <>
##$DBPNAM7= <>
##$DBPOAL= (0..7)
0.5 0.5 0.5 0.5 0.5 0.5 0.5 0.5 
##$DBPOFFS= (0..7)
0 0 0 0 0 0 0 0 
##$DE= 6
##$DECBNUC= <off>
##$DECIM= 32
##$DECNUC= <off>
##$DECSTAT= 4
##$DIGMOD= 1
##$DIGTYP= 9
##$DL= (0..7)
0 120 120 120 120 120 120 120 
##$DP= (0..7)
150 150 150 150 150 150 150 150 
##$DP07= 0
##$DPNAME0= <>
##$DPNAME1= <>
##$DPNAME2= <>
##$DPNAME3= <>
##$DPNAME4= <>
##$DPNAME5= <>
##$DPNAME6= <>
##$DPNAME7= <>
##$DPOAL= (0..7)
0.5 0.5 0.5 0.5 0.5 0.5 0.5 0.5 
##$DPOFFS= (0..7)
0 0 0 0 0 0 0 0 
##$DQDMODE= 0
##$DR= 18
##$DS= 0
##$DSLIST= <SSSSSSSSSSSSSSS>
$$ [...]
##$SUBNAM0= <"">
##$SUBNAM1= <"">
##$SUBNAM2= <"">
##$SUBNAM3= <"">
##$SUBNAM4= <"">
##$SUBNAM5= <"">
##$SUBNAM6= <"">
##$SUBNAM7= <"">
##$SUBNAM8= <"">
##$SUBNAM9= <"">
##$SW= 18.0517328524113
##$SWIBOX= (0..15)
0 0 2 0 0 0 0 0 0 0 0 0 0 0 0 0 
##$SW_h= 3612.71676300578
##$TD= 16384
##$TD0= 1
##$TE= 0
##$TE2= 300
##$TE3= 300
##$TEG= 300
##$TL= (0..7)
0 120 120 120 120 120 120 120 
##$TP= (0..7)
150 150 150 150 150 150 150 150 
##$TP07= 0
##$TPNAME0= <>
##$TPNAME1= <>
##$TPNAME2= <>
##$TPNAME3= <>
##$TPNAME4= <>
##$TPNAME5= <>
##$TPNAME6= <>
##$TPNAME7= <>
##$TPOAL= (0..7)
0.5 0.5 0.5 0.5 0.5 0.5 0.5 0.5 
##$TPOFFS= (0..7)
0 0 0 0 0 0 0 0 
##$TUNHIN= 0
##$TUNHOUT= 0
##$TUNXOUT= 0
##$USERA1= <user>
##$USERA2= <user>
##$USERA3= <user>
##$USERA4= <user>
##$USERA5= <user>
##$V9= 5
##$VALIST= <valist>
##$VCLIST= <CCCCCCCCCCCCCCC>
##$VD= 0
##$VDLIST= <DDDDDDDDDDDDDDD>
##$VPLIST= <PPPPPPPPPPPPPPP>
##$VTLIST= <TTTTTTTTTTTTTTT>
##$WBST= 1024
##$WBSW= 4
##$XGAIN= (0..3)
0 0 0 0 
##$XL= 0
##$YL= 0
##$YMAX_a= 456267
##$YMIN_a= -582113
##$ZGOPTNS= <>
##$ZL1= 120
##$ZL2= 120
##$ZL3= 120
##$ZL4= 120
##$ABSF1= 10
##$ABSF2= 0
##$ABSG= 5
##$ABSL= 3
##$ALPHA= 0
##$AQORDER= 0
##$ASSFAC= 0
##$ASSFACI= 0
##$ASSFACX= 0
##$ASSWID= 0
##$AUNMP= <proc_1d>
##$AZFE= 0.1
##$AZFW= 0.1
##$BCFW= 1
##$BC_mod= 2
##$BYTORDP= 1
##$COROFFS= 0
##$CY= -3
##$DATMOD= 1
##$DC= 2
##$DFILT= <>
##$DTYPP= 0
##$F1P= 0
##$F2P= 0
##$FCOR= 0.5
##$FTSIZE= 0
##$FT_mod= 4
##$GAMMA= 1
##$GB= 0.15
##$INTBC= 1
##$INTSCL= 1
##$ISEN= 128
##$LB= 0.25
##$LEV0= 0
##$LPBIN= 0
##$MAXI= 10000
##$MC2= 0
##$MEAN= 0
##$ME_mod= 0
##$MI= 1.114404
##$NCOEF= 0
##$NC_proc= 0
##$NLEV= 6
##$NOISF1= 3.799351
##$NOISF2= 2.8
##$NSP= 1
##$NTH_PI= 0
##$NZP= 0
##$OFFSET= 14.38212
##$PC= 1
##$PHC0= -3706.564
##$PHC1= 13.39231
##$PH_mod= 1
##$PKNL= yes
##$PPARMOD= 0
##$PSCAL= 0
##$PSIGN= 0
##$REVERSE= no
##$SF= 200.129724274929
##$SI= 16384
##$SIGF1= 3
##$SIGF2= 2
##$SINO= 400
##$SIOLD= 16384
##$SREGLST= <1H.CDCl3>
##$SSB= 0
##$STSI= 0
##$STSR= 0
##$SW_p= 3205.1282051282
##$SYMM= 0
##$S_DEV= 0
##$TDeff= 0
##$TDoff= 0
##$TI= <>
##$TILT= no
##$TM1= 0
##$TM2= 0
##$TOPLEV= 0
##$USERP1= <user>
##$USERP2= <user>
##$USERP3= <user>
##$USERP4= <user>
##$USERP5= <user>
##$WDW= 1
##$XDIM= 8192
##$YMAX_p= 0
##$YMIN_p= 0
$$ End of Bruker specific parameters
$$ ---------------------------------
##NTUPLES= NMR FID
##VAR_NAME=  TIME,          FID/REAL,        FID/IMAG
##SYMBOL=    X,             R,               I
##VAR_TYPE=  INDEPENDENT,   DEPENDENT,       DEPENDENT
##VAR_FORM=  AFFN,          ASDF,            ASDF
##VAR_DIM=   8192,          8192,            8192
##UNITS=     SECONDS,       ARBITRARY UNITS, ARBITRARY UNITS
##FACTOR=    0.0002768,     1,               1
##FIRST=     0,             0,               0
##LAST=      2.2672688,     0,               0
##MIN=       0,             -582113,         0
##MAX=       2.2672688,     456267,          0
$$ Real data points
##PAGE= N=1
##DATA TABLE= (X++(R..R)), XYDATA
$$ [...]
2418D512p683J985O376n226n359P401K732q629K571O898p193l642Q081j573n872
2433d621N627L386p075l37O767k864n668O761L738r212J054P685o067m128Q164
2448C210L56p248K428M878n492k960P939j62p612M796M463q228J03Q301l299n090
2464c617N640J885o889N03O514l421m779O943P36q549L556N975o568j345P404
2479C988j794o602L908M007n409r86P413k703o613N938K869p918K316O388n179
2494c77l305N480N14o399K583N668m774l590P366j328o868N470L998o506J80N603
2510C715k827m457M484K645o093M31O265m203m689O868J60o274L512M206n349
2525a606j776N581l67n083L188M392n619j851O858k811m779N623J245n761J436
$$ y = [4512, -3171, -1186, 5190, -36, -5395, 2006, 4738, -3891, -1320, 5578, -1615, -5257, 2824, 1251, -4621, 1006, 4392, -2683, -3020, 3747, 883, -4785, 1976, 5714, -3498, -2444, 5241, -826, -4954, 3210, 3566, -3682, -1254, 3624, -1868, -4828, 3111, 2949, -4663, 133, 4596, -3632, -3529, 4772, 1473, -3617, 2023, 3908, -2981, -2478, 4036, 615, -4164, 2779, 3515, -5034, -1478, 4497, -2071, -3416, 3988, 2194, -4408, -500, 3507, -1902, -2888, 4525, 1822, -4791, 1147, 4016, -3902, -1586, 4802, -377, -3682, 1798, 2312, -4087, -1504, 4164, -610, -4200, 3166, 1838, -5030, 440, 4438, -2068, -1888, 3715, 888, -3569, 915, 3560, -2533, -2102, 4163, -40, -4729, 2139, 2299, -3975, -463, 3743, -1606, -3382, 2199, 1832, -3251, -63, 4329, -1290, -3141, 3717, 906, -3873, 1750, 2995, -2766, -1330]
2540a330M574l524l389N205R28n795J853N424n191k309O697j485m720L843K290
2555C071m520n09M318j017m390L820K295n777M85N452l673k510M651j59m157J847
2571g73L188k902j719M531l04n168L589L159n481l5M826k255l618L733J087l871
2587b013L57L755j858l187L740J182m508J606M005l919n47L635r17l148J692K275
2603B150k712j110L539j248l647L543J439m561J108M111l097j974L345R85l003
2618a132K19L040j699k134K972mk995K051J559l328K81K553j285j723J971J027
2634A373k688j4L269j538k424L049N66l113J422J550j594q23J755J27j903L89
2650e97K344k172j093K799j105k053K296K38j780P96Q90o18o55J039O83j845O40
$$ y = [-1330, 3244, -280, -3669, 1536, 2464, -3331, -1478, 3946, -1245, -3554, 3143, 1658, -3062, 781, 3071, -1449, -1958, 2360, 1343, -3047, 773, 3068, -2709, -2224, 3228, -445, -2955, 1696, 1537, -2620, -773, 2415, -487, -2206, 2325, 2021, -3147, 442, 3601, -1880, -1915, 2911, 656, -2962, 771, 1858, -2013, -1656, 2099, 241, -2946, 794, 1976, -2532, -926, 3079, -840, -1387, 2248, 1331, -1817, -125, 2150, -562, -1672, 1867, 619, -3028, 515, 1954, -2607, -1499, 2612, -485, -2459, 886, 1871, -1132, -913, 2127, 428, -1706, 1266, 1262, -1733, 318, 1877, -1451, -1170, 1383, 98, -1625, 346, 1373, -1315, -1329, 1940, 402, -2022, 1027, 1593, -1520, -98, 1452, -142, -965, 790, 917, -986, -597, 1747, -425, -1518, 1281, 176, -1877, 419, 657, -1123, -327, 563, -55, -710, 329, 1012, -833, -193]
2667a93J872j854p13K235p74j813J281N23r68o61J243M38j387J47J567j171k72
2684e00J263q04J57Q36m94p11P23Q8o18j28M49J52j834Q95J459j523l12J233k82
2703D9k40P1L30L89p09j06J129q95J49L92o86LR3n03M40l0l48P32k57l86M71k96
2725b08P8M12r9l8L31r25N55M2q9N09j231O24R12j312k64J665q91o64L38O97o8
2746C74j306M32J316j365k0J186o96l14J298p45k69N24l84k13O4P88n60r77P58
2765a09J131k348P76J444j833M0J338lj259O39R05n29j250J632O17k275J307J354
2783A577k520M47J222p95j042J220L17j313J88J621j210j086K229n3k234J787
2799C55J251k183oJ982p65j890J245J589j841j452K678m37k378K172M01k076R72
$$ y = [-193, 1679, -175, -888, 1347, 573, -1240, 41, 564, -404, -1065, 178, 616, -771, -624, 943, -228, -500, 763, -41, 116, 952, 458, -253, 470, 558, -60, -188, 261, 413, -1421, -526, 933, -590, -902, 331, 49, -191, -120, 210, 599, -110, -216, 913, 18, 167, 559, -127, -124, -31, -534, -94, -124, -472, 260, 3, -383, 88, -208, -130, 282, 183, 145, 476, -449, 106, 148, 59, 568, -663, -39, 873, -439, -703, 962, 71, -593, -255, 442, 374, -932, -500, 816, -549, -569, 617, -79, -393, 905, 160, -109, 415, 31, -182, -118, 670, 110, -867, -109, 1022, -1326, -550, 894, -939, -899, 439, 436, -823, -184, 721, 192, -1058, 574, 1191, -1084, 223, 1577, -943, -496, 726, -69, -1111, 109, 426, -887, -699, 922, -288, -1374, 855, 802, -1432, 355, 1606, -577, -583, 1399, 634, -1256, -11, 1578, -263, -1715, 963, 526, -1852, 320, 721, -1355, -383]
2816c83J216j071l43J643K7k257J160K061k434j262L585j159k971K391J518k601
2832h80k00K039n74j765J591J207k860N06K914j862j820L148k07k856J518J803
2848A702k037q47K416k07k426J277J741k740m72L416j912k325L225M79k801N92
2864i19K829j414k573K951J259l631R00K564k688r91L215j136k165J984J134k813
2880a494L36K666j286k495L144J309m084R26L581k795j862L716l81k926Q88K747
2896A990k257j775L421j84l261J938J970l309L04L221j956j914K616Q04k910L82
2912i20L072j843k568L563J35l899K231K229l085l08L122j212k982K336K445l146
2928h30p38L832q17l914L192J259l759J226K819k550j514K887k9l269J713K994
$$ y = [-383, 833, -238, -581, 1062, 1089, -1168, -8, 2053, -381, -1643, 1942, 783, -2188, 203, 1721, -880, -1080, 959, 385, -1380, 211, 1418, -1442, -936, 1978, 116, -1704, 1444, 1237, -1619, -101, 1702, -335, -1182, 1234, 1027, -1399, -122, 1619, -1121, -1593, 1823, -89, -2414, 811, 1290, -1511, -919, 1910, 496, -2077, 874, 2133, -1498, -598, 1966, -722, -1713, 1502, 366, -1799, 185, 1319, -1494, -1158, 1508, 222, -2273, 871, 2180, -1904, -978, 2603, -192, -2054, 1662, 1281, -1645, -757, 1990, -267, -2042, 1379, 1195, -2066, -128, 1842, -1467, -1163, 2058, 102, -1812, 804, 1608, -1302, -920, 2152, 309, -2259, 1304, 1439, -2460, -229, 2000, -1085, -1393, 1729, 517, -2465, -129, 2316, -830, -1568, 2264, 1447, -2467, 725, 1984, -1775, -549, 2270, -280, -1794, 1093, 1064, -2205, -492, 2502]
2944B502l364j496M204r70l475L000K162l632k65L065j094k606K585J441l582
2959a525P49L543l397j985L807J75l749K283K228l278q97L128p8k978K128K544
2975B698l752n46L903k158k462L821L87l709R57K928k449j713L208O51m059J366
2991i29L466l419j130L961q03l110K719J085l254j72L870j418l125L253J124m424
3007b306J034L913k981j581L523m77l295J272K857k453j286L320n48l253K615
3022C54J886l565O22L261j924k512K783N62l224N64L399k073k440L084K92l621
3038b552K079K987l269p23K933j121k393K635J663l136k21L297j878k745L015
3053E71J169l481J053K611k572j099K548K13k406J130K629l272j065L639q47k816
$$ y = [2502, -862, -2358, 1846, 876, -2599, 401, 2563, -1069, -1334, 1731, 637, -1969, 616, 2057, -1525, -776, 2767, -630, -2615, 1192, 1367, -2382, -99, 2129, -1149, -2046, 1082, 1004, -1974, 154, 2698, -1054, -1600, 2303, 145, -2317, 1504, 1891, -1818, -861, 2067, -382, -2095, 1113, 1764, -2295, -929, 2537, -882, -2012, 1949, 1146, -1964, 755, 1840, -1414, -1586, 2284, 866, -2259, 994, 2118, -2306, -1272, 2641, -340, -1921, 1602, 1125, -2170, -898, 1959, -494, -1780, 1540, 992, -2261, 354, 2240, -1325, -703, 2558, 634, -1878, 905, 1467, -1757, -1193, 2206, 133, -2307, 777, 1069, -2552, -473, 2514, -755, -1478, 1455, 334, -2059, 576, 2239, -897, -1118, 2179, 301, -2444, 571, 1740, -1741, -688, 1923, -649, -1748, 800, 1013, -1393, -263, 2366, -906, -1971, 1668, 821, -1995]
3069a995K529J188k823K48K319j489j862K612J090l283M16L003k232j617L168
3084A272p7k760J508J617k256p54K833m37k233J171J917k805m04L552j945k033
3100a834K417L27k454O82K110j298j215J978M69k888J153K313k338p72L210j253
3116F07k421J911J172k061m63K552p46k103J807J057k642P15K248k019p95K329
3132A148m91k026J238J879j911j120K271Q1k674J681J465k764M54K121j753j044
3148a445K006L76j604Q9J708j033j264K063K46k318J138J688k252K8J423n76j269
3165i96P57J243j653j21J598o51j705K077N71k394J178J441j625m20J229J61j397
3182g07Q2J634j019j333K083l70j621J298P41j290j16J306n24j073J258N30j436
$$ y = [-1995, 534, 1722, -1101, -853, 1466, -23, -1885, 727, 1817, -1466, -1050, 1953, -279, -1896, 1272, 1195, -1565, -57, 1560, -696, -1450, 1383, 946, -1287, -116, 1801, -1004, -1408, 2144, 199, -1834, 583, 910, -1544, -862, 1248, -50, -1265, 713, 1182, -1706, -553, 1760, -578, -1350, 1860, 607, -1814, 97, 1269, -792, -1255, 1297, 551, -1552, 255, 1312, -1330, -615, 1633, -386, -1181, 1148, 657, -1369, -131, 1748, -163, -1283, 988, 1069, -1605, 76, 1541, -1223, -769, 1352, -401, -1445, 561, 937, -667, -578, 1130, 97, -1167, 896, 1142, -1176, -38, 1650, -602, -574, 849, 273, -996, -239, 1004, -649, -770, 828, 177, -1528, 549, 1120, -1274, -96, 1345, -280, -700, 529, 690, -707, -625, 1009, -10, -1343, 740, 370, -1251, 47, 788, -502, -618, 688, 164, -909, 349, 879, -557]
3199e57r4J743q62j114J605k2j434O63P99r18o36J342l4j208Q30Q36j406k80J641
3218H94p19j031J368nq95L08P05o35k41O34L16q39P3R39j239k27J279o17p02N45
3238h9Q62r89m43O76K35o98P41N99j161N07M39p75k11L54l01j22J96M47n58r6
3258c87K19K00p69P42M26p70L00O56q17L23K20j17k56j86L14J23q01L66J59k14
3278b69J56M34l12k8K1j5k31K95J28j00m97M83K51m38L98k0j62pl9j66M1l0J65
3301E8l2n00K08K48l75M02L3J28j15k46J08L07n19K48K09J68k59qk60M04m40K24
3323in6m2n8M1k47K22N14o27K16J63l70J91L13j13K1k76K72n3k82K90J30r84R00
3346A56K11o92j24M85p2l24L70J58j49k24L31j00n76R08j31m73M71K70r19L15
$$ y = [-557, -651, 1092, 230, -884, 721, 699, -735, -72, 727, -191, -827, 515, 481, -727, 103, 939, -467, -747, 894, 175, -856, 512, 507, -388, -80, 625, -10, -251, 383, 699, -140, -67, 872, -367, -594, 685, 68, -634, -89, 773, -216, -659, 17, 252, -446, 295, 894, -267, 240, 679, -96, -307, 47, -254, -376, -180, 267, -291, -387, -168, 32, -737, 5, 431, -339, -39, 617, -200, 123, 343, 226, -30, -216, 98, 221, -580, -214, -55, -269, -113, 321, 9, -19, 2, -13, -244, 51, 179, 79, -418, 65, 316, -122, 276, 256, 94, 87, 48, -118, -77, -107, 58, 26, -474, -266, -18, -393, 9, 42, 170, 55, -191, -83, 224, -295, -47, 162, 330, 71, 63, -197, 207, -233, -9, -65, -107, -165, -124, -371, -149, 365, -262, -46, 117, -253, -62, 251, 138, 159, -117, 155, 102, -180, 110, 240, -744, 156, 367, -325, -449, 36, -36, -360, 10, 168, 19, -205, 126, 26, -550, 358, 227, -246, 225, 495, -424, -109]
3366a09J60po19M32P37p54m27Q33j93n19R24pp60Q0N33m20o8L03K64p11J39N76
3388C87r68j36J428p85p79J043K51m63j61P80o23n04L92P19q85O2Q04n98n91J299
3408F72l12j095R13M59r45k69O98K97j164Q17K02q41K19R07p43l98R89N6r10M27
3428b1R01j253l43J139Jj291N55J027j625O50Q20p76k36R45j11n84l2J054q63
3447d3o32J341o3j359O84P58j257k92J544n32r78P32N60q28l80J214l31j028J269
3466C79M96j456O70O39q34p11J157L25j083J27Q99n94p57J546r89p82J096M14
3484E42j109N3J282n77q39Q32M24j103J09J176n96j181J402J3q88M87O02j069
3502d40j72J078k48r23P08J066j450l06J353m81j279J530J48j542N59J255p58
$$ y = [-109, 51, 44, -575, -143, 594, -160, -587, 246, 53, -466, 458, 451, -309, -229, 304, -116, -184, 119, 383, -328, -189, 387, -581, -717, 711, -74, -853, 190, 441, -22, -183, 597, -26, -530, -138, 581, -304, -242, 562, -36, -627, 672, 360, -735, 178, 637, -308, -577, 121, 418, -746, 71, 273, -568, -349, 558, -185, -583, 406, 462, -448, -21, 880, -373, -716, 423, 424, -867, -312, 715, -910, -260, 560, -216, -452, 493, 382, -202, -234, 820, -43, -675, 666, 603, -756, -72, 686, -571, -863, 681, 149, -829, -97, 463, -365, -745, 469, 138, -890, 379, 875, -581, 89, 728, -106, -817, 340, 665, -418, -291, 608, 14, -743, 803, -186, -968, 128, 542, -567, -514, 768, 191, -648, 184, 608, -495, -386, 790, 194, -987, 415, 428, -460, 27, 629, -440, -612, 466, 218, -705, 3, 1069, -381, -687, 666, 185, -1094, 436, 584, -958, -399, 856, 98]
3519I8o24J167J26j405O33N41j116k29J731n61j224R73N48r18l35J070k84p43
3537e52Q77M38j362K52J370j287m66J408m02j096P49J251j448j79Q36o6j232P69
3555a40J053j147k00J362q02q67J093R5q76J40J168p64r54J283J38j412Q87P14
3573G71j201j58J115m09q85J054M50j130k54J239n95j023J407K29j324O16O93
3590E95j007l54J310j81j227P25P42r67m80J731o83r24J320J47j369M04Q67m16
3608B33p45Q01L00j359K22J207r48l47J087j81j151N36J190j283J28J005k73j059
3626f37N47R68j169j5J535j337n98R58J02r60O04O73q20o34J483k22j232N50R39
3645G35j106J86Q43n49q28J078J33r36M82O42p46n82R74L70j321M14R59j085r3
$$ y = [98, -526, 641, 767, -638, -5, 536, -580, -809, 922, 361, -863, 110, 658, -260, -595, 475, 191, -552, 325, 763, -599, -347, 1023, -264, -730, 678, 276, -820, -71, 1180, -268, -447, 389, 323, -909, -140, 913, -234, -434, 928, 126, -741, 352, 447, -429, -289, 879, 115, -839, 444, 582, -830, 57, 771, -430, -588, 527, 118, -767, 287, 737, -393, -647, 592, -3, -1026, 381, 610, -714, -98, 595, -412, -766, 544, 363, -864, -139, 603, -364, -844, 887, 204, -720, 600, 747, -622, -218, 649, 233, -512, 289, 589, -770, -548, 659, -289, -636, 451, 270, -881, -345, 845, -438, -310, 695, 422, -637, -90, 878, -291, -306, 1229, -108, -706, 252, 354, -606, -2, 671, -149, -783, 700, 478, -754, -204, 735, -371, -185, 658, 109, -719, 359, 492, -444, 38, 680, -66, -648, 326, 696, -625, -211, 748, -337, -430]
3664d30Q63l64m20M04M30o68j83R48l08r36J007N19j677K11J127p02n30R24m5
3683A70o64M02M91m82o18J402k10j189P40O01j033j28J087o12m85O72L54j150
3701f52J52J010k61p74R28k94o43L50Q63o15o57R26O3o19K02N31p24L6M72k99
3721ek56M13K03j018M36M05m98m5N54L25r63L28N17n88l98J233m72q96P61J38
3741A74n82L97L82j91l90N55j1p96K20P48p65m09J005k29n30N03M80q10k60Q17
3761C08r2k55j43R21j046L7N85n05k66Q04l15n28K58O85m39n18N25P1l83L86J67
3782B57l28j61M33j33j83J49J61l30k55Q41p06j95M78k5m97M17M74p13J89M89
3802C62k97k32J96K89k23l0J33N14j020J68M01n43L27J66m45k57N40K08n23J08
$$ y = [-430, 433, 69, -351, 53, 483, -185, -368, 580, 272, -664, 343, 862, -815, -604, 523, -179, -709, 215, 170, -494, -92, 399, -83, -701, 701, 491, -698, 42, 643, -390, -518, 569, -43, -528, 144, 498, -652, -500, 510, 249, -525, 403, 109, -534, -184, 679, 64, -593, 333, 396, -223, -21, 510, -214, -178, 294, -5, -261, 152, 355, -663, -227, 178, -320, -365, 189, 514, -449, -121, 396, -192, -590, 643, 171, -725, 36, 174, -408, -11, 371, 180, -210, 345, 334, -462, -242, 506, -259, -668, 337, 108, -422, 81, 561, -249, -509, 308, 216, -39, -182, 739, -307, -270, 315, -190, -456, 348, 33, -495, -237, 448, 9, -509, 16, 87, -296, 90, 257, -71, -232, 201, 68, -115, 34, 195, -135, -390, 451, -255, -450, 28, 3, -494, -77, 397, -316, -127, 362, 65, -167, 29, 318, 95, 65, 198, 712, -308, -140, 261, -282, 45, 211, -234, -491, 49, 257, -266, -158]
3822a58M09k20k69N52j67m85M61R8l97K11J5m7n1j69K50k88qM04m4m45N58l08
3844i8k27R5K56k05K37K45k2l33L8K03k86J05L50k21l90M84k01J09k37M2j3j55
3866b24M7J95j55J41L04o85L27J94o9j91N02m80L0L1n8j07J61j16L77l46q8M16
3888B06k02O9l02P4L94l93L4N69p11L28J51j38J58q0k91j05O4o0R6J98l73M10
3910I6j4j27k2L34n82L15p5K19m1Mk8k54m5M3J67k28N30l71J18K89k08k9l21K49
3934A9n6k3lJ36j29N1R1j24J65N4l16N4m4K14lk01j4J29j86K53Lk30P0Q1N3o7
3960b3K68o5J7k89O32n70k32L80J59n26L69J36l70j94N10j33M2k76L92j39l42
3981b54L68jl97M36Q7n32K00K3l0j29L74J94n10j25O21l58k46L81m6n91P43j3
$$ y = [-158, 251, 31, -238, 314, 147, -338, 123, 221, -176, 35, 50, 3, -48, -217, 33, -255, -263, 141, 97, -348, 210, -98, -325, -230, 26, -179, 58, 303, 281, -52, -14, 189, -97, 8, 358, 137, -253, 231, 30, 139, -98, -56, -69, -224, -177, 18, -137, 4, 308, -377, -50, 144, 75, -116, 386, -94, -64, -33, -91, -198, -37, -153, 224, -122, -210, 206, 4, 73, -229, -155, 239, -154, -120, 449, -262, 66, 217, 79, 237, 157, -134, -239, -175, -235, -139, 59, -314, 96, 82, -45, -67, 267, -315, 0, -75, 144, 103, 107, 79, -175, -220, -177, -10, -238, 292, -79, 39, 328, 120, 91, -230, 19, -37, -60, -63, 73, -56, -5, 86, -38, 127, 181, -135, -81, -125, 89, 86, -115, -129, 0, -186, 67, 70, -160, -90, -9, 44, -23, 245, 180, 197, -92, 540, -30, -262, 118, 277, -249, 120, 256, -114, -308, 202, 69, 111, -165, 227, 88, -254, 114, 113, -284, 152, 239, -293, -93, -70, -100, -229, 145, 339, -171, -296, 325, -33, -279, 102, 56, -535, 208, 195]
4003A95k55L4K35k2n91N99J66n00J5L85m61N7J50N20p91K11J96k04j35pM54n40
4025b89J29L57m65R2O14n65r1J06O1j96J10N66n08j93L60J83q01O03Q9l17k26
4046c81N56l7n67K44R25j136O6P84r6q81O38K85n86q4Q03o16n1J89Lm12O1Q62
4068E69m99m39P13J02r27M38N83r68n9Q69m36l98Q20j39o05N3R21m25n67O12L5
4089B53o55L46N03r89K57N30l6m04K41L80o60k96R40n03k83O86L51j256M77N04
4109C86o94j25O17q0k47r3J050r50l47R44j31p40O42L4p37L57L07J3p59O25L42
4130D14j005L85N38k51n67Q23P0j041P82J69n90j30P67Kq71O59L48r28K70N01
4150C45j69j000J243l63p01P94M98p14j02M26K90j296N59P32p88q8Q89m05q20
$$ y = [195, -60, -26, 209, 187, -404, 195, 361, -139, -124, 261, -200, -143, 7, 527, -264, -53, 143, -61, -196, -203, 251, -289, -160, 197, -268, -176, 438, -127, -218, -112, -51, -247, -137, 429, -79, -272, 88, 271, -530, 73, 162, -155, -381, 175, 138, -429, -185, 740, -396, -330, 454, 358, -523, 115, 400, -186, -270, 533, -83, -134, 55, 58, -354, -293, 569, 70, -369, 344, 446, -481, -43, 540, -428, -487, 382, -54, -452, 368, 229, -376, -323, 598, 173, -394, 218, 253, -402, -56, 447, -542, -285, 245, 209, -195, 46, 426, -234, -530, 410, -93, -376, 310, 661, -595, -118, 386, -308, -433, 184, 104, -143, -236, 814, -136, -483, 461, 330, -410, 232, 266, -471, -114, 193, 206, -553, 72, 414, -591, -206, 332, 81, -486, 337, 407, -634, 148, 317, -273, -403, 364, 366, -505, 154, 502, -426, -156, 345, 176, -824, 419, 56, -645, 149, 647, -67, -169, 257, 547, -749, -190, 542, -246, -334, 555, 150, -670]
4169f70R63J72o20k59Q23o86k32O06M20j062M62L09m62j67Q19l92n76N16K23l51
4189a64m52J119k07r44Q15M91j145K12Q06m69n10Q20o7p05p5J094q99l1O23K07
4209E19j179P52L77q40K40Q35n50n71O73j18n96J60Q59q57r1Q29k02p52L06P00
4229D94q20p6P23k28n47M55M92p49k54R28j99q90R26K26j096L09O00n11l37Q45
4249B91J91j095M99O80p50j54P09k22p12Q69k7m73K4O35l30n16L49M67r15M13
4269f7N81o88l8O17K39j018K48N49m16m56Q04n8q98O37K90p33j58Q59m42k10M59
4290A01l1l54k9N98j19n32N11J63p78M45L28l90j26N49n68k53O62p4m79N0P87
4311D61j41r66J103l86p06O45N67p82j11N56j14k69l6O72o14j93O46J8r16M63
$$ y = [-670, 293, 465, -155, -414, 409, -277, -509, 97, 517, -545, -83, 226, -236, -403, 416, 24, -552, -36, 187, -164, -616, 503, 296, -648, 167, 658, -487, -275, 531, 62, -448, 372, 305, -400, -475, 619, -280, -311, 312, 519, -660, 92, 469, -371, -131, 704, 154, -417, 256, 138, -458, -298, 561, -296, -387, 442, 240, -512, -206, 494, -326, -402, 321, 93, -454, 1, 493, -256, -510, 418, 219, -671, 255, 481, -615, -306, 294, -217, -554, 291, 482, -613, -114, 566, -184, -338, 371, 149, -563, 306, 279, -194, -170, 465, 135, -381, -32, 435, -480, -67, 514, -174, -212, 405, 644, -374, -126, 423, 7, -449, 355, 297, -601, 36, 326, -407, -565, 294, -148, -358, 101, 70, -284, -313, 285, 166, -366, 145, 308, -470, -25, 303, -87, -213, 336, -232, -485, 177, 103, -376, -326, 461, 320, -646, 457, 71, -635, 10, 577, -205, -316, 240, 126, -143, -179, 493, -121, -314, 332, 350, -566, -103]
4331a03M26n99J22L24j84m05N11p9l45J89P83l24r37Q15m0p54Q03K80p04k3M37
4352A93j80l40K15M49o43k07P99k38k71N43q5n80L09K46j44l40L82M13o94J34
4372c9K66k51n74R21j22l88N4L68k73k19N83l79n06P42J13n54P1O31n40j19L95
4393A80j60l04J48K89k20n8L18j23m84K99K81m53j25L59k3j39K40p0K6n7L16j03
4415A37m70N64Ko85K98L61l18k98O50l11l18M99n1q4k93N94k8k40L47k55m42M54
4437A13J45m51kJ99m2J0K05k58J15p3J05j9k39N6J68r5o5J36j47P1L65k30L2j32
4461c3K48j38p0k08N1J47J20j33l9J78q0J11k29l5K7J86l27J73O2p5k65N39k23
4484a3m9K59m9Km58J7K56nJ23k9q2Q4m5j31j59J17L06M7l84L61j18j55J8J07m0
$$ y = [-103, 323, -276, -154, 170, -14, -419, 92, 13, -332, -143, 640, 316, -621, 194, 154, -600, 203, 483, -221, -244, 193, 13, -327, -112, 337, -306, -513, 286, 48, -223, 320, 235, -345, -36, 210, 66, -274, 108, 521, -173, -39, 227, -24, -598, 323, 201, -187, -133, 235, -38, -257, 326, -53, -559, 183, 296, -258, -187, 444, -96, -215, 180, 20, -284, -136, 153, -67, -125, 193, 70, -414, -115, 166, -287, -412, -53, -76, -215, 25, -45, -19, -76, 240, 137, -333, 231, 233, -452, -154, 207, -111, -409, 241, -70, -388, 111, 60, -24, -317, 277, 249, 9, 356, 101, -341, 113, 258, -193, -195, 4, -38, -28, 177, -81, 34, -39, 66, 47, -192, -136, 32, -63, -128, 8, -139, -68, 297, 67, 99, -33, 215, 77, 7, -201, -150, -3, 117, -16, -55, 123, 43, 154, -75, -110, -83, 103, -224, -51, 11, -64, -329, 210, -13, -62, 197, 148, 150, -308, -291, -35, -40, 83, 54, -28, 56, 11, -120, -279, -162, 144, 191, -193, 168, 50, -105, -87, 20, -20]
4509b0N2j94J07K28l93L95k11K7J74K9j40qk0J19j36J75j50M0nQ2j33k5R0j08
4533b5l39K07K31n13L50K82J38l25q4K41k95j92O18l94kJ88L08o72k0L76Ok70
4555a86RK49k03j08O44n78mM30j76l07L23l0j61M6M46k16l93K62Oj62K44L55n56
4578f6l69P98m90k22M37P2l46J44K77k28j46J42J46l75J94L05n64R9L75L8l38
4599a17p0K65k97r2N21l47j3J33K11k55o8L93m47j21N56J02l91j18L34J86o08
4620b43P80l77q41N27J88l33p1P38l05m96Q16j80k57l74P53j81l84L75m1m83L42
4641d7K64j10m06P96m65j46O5M07m65r2N36m12n95P27K77n22J68L08j90m77P72
4662C93r4p49J66P63n65l70Q09j46m39J96P06j036K6P98m84n82P34M46r77L30
$$ y = [-20, 32, -162, -55, 173, -220, 175, -36, -9, 165, 194, 54, 46, 26, 145, 9, 184, 34, 74, 69, 151, 18, -7, 83, -25, -364, -157, 74, -439, -89, 193, 331, 6, -78, 163, -132, -324, 294, -100, -102, 86, 394, -278, -298, 78, 84, -186, -177, 72, -131, -239, 405, -173, -177, 253, 77, -230, 93, 63, -98, -52, 394, 178, -215, 47, 53, -109, 135, 490, -66, -435, 363, -127, -349, 88, 160, -186, -42, 235, 7, -139, 3, 149, -226, -32, 273, -291, -192, 183, 221, -117, -187, 78, -219, -311, 210, -137, -150, -17, 194, -61, -129, 264, -183, -304, 252, 354, -37, -155, 179, 365, -243, 537, 160, -681, -154, 34, -299, -370, 368, 63, -433, 383, 203, -54, -428, 325, 144, -240, 135, 94, -389, -47, 217, 107, -299, 497, 32, -114, -49, 358, -107, -199, 337, -75, -670, 57, 334, -188, -20, 288, 98, -379, 393, 299, -450, -284, 479, -86, -456, 353, 207, -232, -36, 670, -366, -340, 458, -26, -608, 126, 572, -405, -75]
4682g5P12p90l66J052J13j021L68L79n04l54P01P4q24N94M19q98L13N59n25l79
4702d52N90j9o13K00P05j06o97O66k76o01M94N55m13k77N15l26l86P15k47l86
4722c59K66O23l73m88M15N03j070J36J004r30J21J69L4n32L78O59p09N0N56k87
4742A66o38O14L46r64R6J164o44p46P65%m61o1R59o87n78O92L3o70P03L99q31
4763c43rP27k18n50N46K33o49J57O53p12j21P11L16j236J37O59n48l50Q24J41
4783C68p71K12Q08r23M6P33j7r29O80K44q86L08N79l25p56Q24P5q60J09J279j051
4804b53j92Q52j68q80L89M73l44J13P08j77j102M01M60p17K42P36n99m80O35j4
4824H3m52M37L15m02o10O38J37q58O18O15p77O8M62k81k92P29O6o90R0P10n06
$$ y = [-75, 637, -153, -519, 533, 646, -375, -7, 372, -132, -486, 215, 289, -535, 59, 478, -420, -107, 452, -73, -452, 138, 119, -494, -294, 411, 305, -392, 274, -2, -603, -109, 446, 33, -244, 271, -55, -441, 274, 27, -359, -93, 530, 157, -331, 84, 587, -483, -347, 657, -273, -152, 17, 51, -481, -103, 556, -153, -103, 453, 166, -472, 142, 488, -476, -380, 784, 140, -606, 159, 159, -302, -363, 596, -91, -669, 23, 56, -614, 89, 488, -343, -352, 375, 157, -393, 153, 386, -263, -106, 547, -165, -286, 425, 741, -495, -358, 301, -247, -597, 227, 368, -403, -191, 617, -306, -260, 473, 456, -473, 207, 451, -435, -127, 452, 127, -629, 195, 270, -590, -481, 798, -253, -445, 407, 239, -641, -252, 221, -123, -10, 698, 521, -581, -180, 280, -437, -195, 541, -58, -538, 97, 83, -369, 68, 383, -19, -629, 9, 146, -712, -94, 521, -256, -188, 274, -7, -299, 430, 496, -194, -104, 606, 100]
4845A00n51P14K65j097L91P51o25k42P85l01n30M22K90p32j2J031n91m30N29L83
4865E50j044R5Q71m09n34N82M49q88L13N51l95r12J155O1q04O01N6m63m3N41k39
4886I4n10L30P03q73k1O97k82n67O54K09q81J84N69n20j68M81N7m05L11O39n85
4907A16l76Q77l17n39M19J8m96L10M08l41m30M67K15q51K72O76p53j57Q37j15
4927B40m84M05L13o54J43J10k02k09L75N20p88K3N98k39m18M08n2o20O23J10k80
4948g8j85N48k56l74L65K60n52R7K62p7k64O23k31k46o1M00k69l21P29q6p39L96
4970e9K74k70m1L43j20m41M30J66n59j59O48k00k06L71j16n18L24J62N7k93M36
4991B29P5k05j01J90l01m8M99k56k85L73j40l75J40J41J94m11L62P3k33j5N45
$$ y = [100, -451, 263, 528, -569, -178, 573, -52, -294, 491, 190, -340, 82, 372, -360, -372, 659, 68, -362, 167, 550, -494, -399, 472, 63, -471, 111, 560, -328, -15, 536, 141, -771, 384, 445, -359, 242, 298, -165, -208, 333, 94, -416, -86, 617, -256, -277, 420, 138, -429, 225, 434, -447, -263, 306, -214, -382, 99, 156, -249, 62, 701, 116, -260, 617, 300, -239, 180, 198, -298, 12, 420, 79, -351, 116, 331, -520, -248, 428, -325, -482, 355, 240, -244, 161, 474, -180, -37, 73, -129, -338, 37, 557, -231, -208, 390, 151, -267, 141, 89, -531, 92, 202, -78, -263, 285, 29, -345, 20, 280, -272, -175, 87, 10, -254, 369, 138, -108, -169, 231, -38, -359, 370, 284, -455, -59, 215, -55, -96, 247, 127, -314, 116, 282, -277, -436, 212, 12, -194, 177, 61, -457, -133, 29, 86, -207, 229, 304, 99, -2, 188, -113, -161, 338, 82, -203, 170, 30, -345, -205, -64, 130, -281, 81, 154, -79, -94, 451]
5012D51n74j81P25m28k04j10N49k21p6j17L59m03J2M50m12N0J37p5k46N51k87
5033e0j27kM1J67Q9m1l4j46N0K10l29J44L18k07k23K66J81o55L87j3J08k21m2
5056a29K17m7jQ9j50K79m65K51K44n9N0p2k31j17J49l18kN67m40K57k7l85N51
5079B11k21j31K29r1L4j6j40J17m0J1J97M4M7j29k94o6K17p5R9J57j36j12K30
5102A42k26p2q7K58Pq8K07J90k13k05J2k5k4K13O9r1l5r3k7j8K88R3j91J64r6
5127A52k19J2L57j09j19j16m6J28j33R5K6k54J94K51n59L52N1j26P9J37jm77L08
5150a7K04j52j38K34L08r03K70K98j50n9L70m03j6L25J57n07K25Q3p8l34M76J05
5172B98m06L27j10n93M20K73j59k64N13l07j46RJ95K01p48N67L8r6K28Kj97mm1
$$ y = [451, -123, -304, 421, -7, -211, -321, 228, 7, -69, -186, 173, -230, -218, 232, -180, -130, 7, -68, -314, 237, -50, -177, -179, -138, 29, 118, 77, 43, -103, -53, 157, -172, -28, 290, 83, -140, 126, 307, -348, 39, 26, 134, -87, -129, 88, 41, 40, 129, -21, 258, -207, 44, 288, 229, 279, 207, -24, -141, 8, -310, -312, 255, -185, 72, 45, -340, 211, -10, -141, 88, -3, 31, 15, -125, -8, -48, -37, 160, 204, 251, 122, -172, -238, -21, -96, 3, 160, 24, -88, 142, -84, -156, -243, 15, 22, -66, 141, 331, 118, -87, -75, -100, -124, 89, 158, 67, 32, -61, -88, -106, 182, 275, 84, 248, 152, -67, -55, 302, 193, 74, -42, -88, 40, -93, 2, 28, -226, -32, 219, -340, 12, 63, -63, 16, 153, 152, -325, -17, 187, 35, -103, 131, 439, -464, -194, 104, -46, -105, 265, -138, -154, 171, 328, -179, 46, 129, 51, -283, 193, 298, -108, 219, 109, -484, -64, 209, 50, -214, 299, -8, -154, -145, 50, 251, -497, 70, 108, 12, 240, 242, 45, 41, 0]
5195@M11n62K91J84m71j83P08j61o35O54j13l37J15K85k23m69O93J74m74J58K2
5216F7j83l00N24k3m54L21O79r52J25N74l57l46L53Q4j50l38P41l67n71O84J59
5237B70m40j35P17n32j87O43m0o33L18N42o91m8O01k04o17L90J43n48L20N03k08
5258A64p39Q60R4n96K60K86o60J4N25j03k92L6K77j85k09O88k86m71L92L73q21
5279c93K04L08j97j58P85m6o92J81M21m64n64Q74j11m30L95J70m37JL85k3o56
5300d47P83K75n62k58M57l5n81M26N89p15k98O04l06l39N57L99j180J59P26m91
5320b37l28J026p1r05O35L40o86k2O45l52l46M05J82l41l1M90n51j62O73Nr72
5341f03M32N77m64k97O55R4j119P49N37r40P5Q07j63p24P42K6o26n7M87n14l30
$$ y = [0, 411, -151, 140, 324, -147, -330, 378, 217, -418, 236, 123, -214, -99, 186, -37, -506, 187, 361, -113, 45, 67, -116, -416, 108, 85, -369, -48, 631, -321, -196, 378, 21, -325, 28, 112, -38, -376, 365, -2, -573, 111, 270, -170, -305, 412, -120, -307, 336, 296, -337, -19, 523, -168, -216, 385, 181, -436, -46, 97, -451, -131, 372, 164, -575, 285, 379, -217, 43, 329, -331, -317, 208, 105, -187, -151, 126, -59, -268, 420, 134, -337, 55, 428, -393, -189, 119, -78, -236, 549, 503, -189, -8, 413, -51, -615, 259, 148, -282, 113, 283, -154, -153, 232, 209, -447, 336, 611, 49, -209, 248, 213, -368, 58, 647, -68, -366, 238, -68, -407, 150, 549, -631, -472, 254, -237, -565, 461, 390, -515, 120, 460, -226, -248, 397, 45, -301, 104, 286, -55, -86, 404, -147, -309, 364, 369, -603, -171, 406, -58, -355, 300, 394, -725, 24, 561, -379, -304, 503, 340, -384, 358, 384, -242, -299, 188, -326, -656]
5362f56O51K80q24L59N92o41m6P38l54m87N97K70o21O4M44k57o92O31M46q76K2
5383c60P35o32l3L48J72m79K29L04j81l30O28j80q50O94L00o67q1Q80l99n92P26
5404B32j51j84j08O93o10k6L95J51p61J50O55n27k29N46P0n20J08N47o17l61O86
5425A39l00q8L31M54r15n4O54m53O5L21J7l21m3P32n75n11J162n8p54N00k38m68
5447d03j4Q55n98j47L70L94q62pR59l75n35N60R2p70O42P2j07l71O62o8o00K78
5469B7K98l76j30N38k19o91N17p1r6K30N08o17l89Q06m0n64M44K14m84j39N55
5490C21l91p4J98J92n76j59R15l30m24K58L30n62N23K41m13r2K50J17n41R7O76
5511E56n65k72L97K40n96K09K87o20J20J79K25m68L24L90o27R1K31j32j43K05
$$ y = [-656, -5, 275, -549, -190, 402, -239, -285, 453, 99, -388, 209, 479, -142, -78, 366, 109, -583, 48, 494, -382, -360, 375, -257, -290, 58, 230, -249, -20, 284, 103, -227, 401, 221, -629, 65, 365, -302, -383, 497, 98, -494, 232, 81, -103, -211, 482, -128, -154, 241, 392, -369, -219, 436, -91, -320, 226, 296, -224, -116, 431, -186, -547, 139, -161, -249, 82, 536, -379, -433, 221, -232, -167, 154, 171, -150, -193, 539, -36, -547, 615, 557, -197, 303, 65, -403, -417, 438, -160, -307, 63, 457, -405, -412, 547, 172, -363, 197, 289, -481, 161, 233, 126, -245, 417, 349, -251, 27, 325, -51, -181, 357, 138, -553, -36, -107, -203, 27, 535, -82, -471, 335, 295, -269, 175, 389, -95, -234, 321, -70, -144, 54, 246, -330, -489, 426, 96, -328, -70, 260, -302, 221, 462, 49, -43, 207, 324, -217, -120, 556, -9, -281, 116, 356, -240, -31, 256, -364, -244, -65, 160, -308, 16, 406, -221, -130, 101, -31, -174, 31]
5531C1j31l51N77j08l86K78K40j53q1n7K12j49j64N06p6k74L29J21l07k02J83
5552C8m5P9k16L93n93J56K56J15m19N44l55l99K78K37J1l8L55k93l45K37L07n31
5574b28K60L24k16k55K12O4l86n0N85k97k19j5l06M12j1L97j47PJ18m19lN42p9
5597B90l94r5K15J55m33K52R2k7qL38n84J36J08O8r5OJ15m84K66N5K30j89M0J48
5621B05l18K04k78K07M0k3j29L66k15j31nK39k64J56N7k07K27j52k6p7LK56o0
5644G5qJ85l00L28q5l09K09J49l95J02M6R8n8j7J28M0j84J10o9k13n7K8R7M6J78
5669A24j00j7J0k85O4K53r6J66m06O1K17K7L7q4M6P1k07K51p6k47L01k16L93m26
5693a39P9J4j79J03K61k91J51k97J48J02L20l50k81L54J91m23J34Q0kO1k60L63
$$ y = [31, -100, -451, 126, 18, -368, -90, 150, -3, -84, -141, 71, -78, -242, 264, 188, -86, 243, 364, 57, -145, 38, -7, 72, -144, 249, -344, -188, 68, 183, -236, 308, -47, -446, -168, 69, 80, 42, 397, 104, -241, -4, 303, -228, 32, 356, 140, -115, 97, 161, -225, -275, 310, 13, -206, -221, -527, -115, -126, 271, 124, 131, 249, -170, -173, 369, 290, -104, -199, 16, 171, -262, -10, 82, 55, 47, 385, -199, -63, 45, 113, 18, 24, 139, -345, -79, -24, 206, 17, 57, 205, -113, 91, -187, 20, 60, 37, -92, 274, 59, -72, -77, 162, -102, 54, 111, -96, 131, -21, -47, -124, -121, 135, 75, 67, 252, -48, 280, 195, -114, 95, 244, -151, -49, -3, 95, 37, 20, 148, 188, 4, 114, 45, -168, -225, -197, -100, -54, 124, 24, 7, 17, -268, -204, 49, -47, 119, -287, -226, -9, 18, 55, -29, 17, 88, -119, 132, 56, -191, 110, -106, 287, -139, -60, -46, -225, -122, 139, -152, -1, -298, -150, -48, 272, -78, -359, -5, 186, -237, -103, -23, -25, 36, -224, 139]
5715A39J1l49L52j94L4j57J66j60j45L81j21J6m9K2q4Q4J78k00p5M34j18k38J64
5738I1L5j65k31L40j65l7O4QK00j48J11k7k79J54K58j65k1J11p8k00m6J48j91
5761b33K15K08k51J58P3j1m99Q7M29n21K35L38j8m42K51K40k13j54M04q5l69L75
5783B17J16n04Q4N7j30r6N21j19j00J5K76l47l03L69j26k20K07L05j63j37J72
5804I4j01m05O64L03n78qo7j32K26Q5L26n99J14M15l74j24N29k14l67K29J84l09
5826a09k87P21n38m8M14O9m79K80K28k27j97M23N9r64J010on05J51J77J7j53L37
5848C73j43m55k6L14k45q6N41m4n27K89K34m73R7K45K42n29L05M04n47l37N61
5869A93K6l62M15j7l84l4K21j89j31N31Oo30L25M41n20L7L41l33j15R3M01m97
$$ y = [139, 150, -199, 153, -41, -7, -164, 2, -158, -303, 78, -43, -27, -76, -54, -138, -54, 124, -76, -151, 283, 165, -73, 91, 126, -39, -270, 70, -95, -132, -68, -60, 140, -8, 103, 76, -203, -49, 209, 44, 23, 134, 56, -144, -190, -42, -233, -18, 190, -61, 97, 170, 159, -340, -253, 176, -345, -110, 228, 210, -232, 19, 259, 46, -108, 296, 211, -158, 217, 333, -171, -87, -30, -160, -256, 265, 146, 46, 61, 337, -10, -313, 56, -70, -290, -83, 222, 59, -78, 94, -7, -412, 252, 555, -23, -31, -98, -230, -4, 81, 407, -192, -78, 337, -37, -161, 368, 154, -213, 16, 200, -109, -396, 325, -213, -261, 153, 222, -257, 23, 251, 24, -173, 250, 309, -655, 355, 349, -156, -5, 172, 189, 36, 373, 230, -225, -251, 63, -182, -268, 273, 229, -298, -9, 225, -248, -151, 94, 336, -193, 112, 516, -31, -368, 193, 219, -143, 272, 255, -129, -163, 58, -131, -262, 269, 275, -355, -30, 411, -109, -72, 269, -64, -179, -86, 315, -182]
5891a82J16J66m4n42M89N95j041M40O72p71j30M57M1n27K07J62j69k76Q27l21
5911A69o65P37P1m00k56N90k02k91M83O5m81pL90k4m31M10M14j156P09R2n07j08
5933c98P42j02m24K55O0k21r9M96k41n29M42M85n52K71J73n13K2J62R3l61J28
5954a11M24k82k07K19J50p11M26N22m38m3K87J20o43K95L3j54J56J50j53k57O16
5975C99o0o30J49O51o61J13M33k55l43R0O47j010J34O75l44k73N70Qm46M1O75
5996E63p90o5O67J28p56Q1O29o08j98O66j09m81M08L37o17K9L46j1p27L54N39
6017C85o72J41N08l75j43K67O3m75J22L15k19j80M08K47o73K15K10m76J09M85
6037B62k26n81N54K76k21k78M47q0k65L04J61m09O7K93o01Q6M29l52QJ45K41l87
$$ y = [-182, -66, 100, 56, -486, 3, 598, -443, -3, 669, -102, -232, 225, 266, -261, -54, 108, -61, -337, 490, 169, -496, 241, 312, -88, -344, 246, 44, -247, 236, 301, -180, -187, 203, 179, -252, 158, 572, -584, 125, 217, -290, -398, 344, 242, -182, 73, 133, -88, -187, 309, 68, -461, -19, 466, -86, 185, 358, -155, -133, 29, 122, -239, -111, 313, 31, -176, 43, 193, -518, -92, 430, -8, -51, 236, 356, -287, 8, 41, -113, 43, 193, 40, -217, 399, 339, -291, -142, 509, -152, -39, 394, 139, -204, -114, 533, -477, -343, 332, -12, -285, 285, 293, -153, -112, 563, -227, -292, 375, 503, -253, -172, 457, -151, -349, 317, 208, -273, 135, 472, -145, -116, 230, 219, -508, -154, 385, -287, -146, 362, -13, -156, 111, 174, -301, -179, 136, -83, -263, 145, 392, -281, -66, 144, -332, -223, 262, 36, -545, 9, 285, 64, -214, 233, 153, -112, 192, 353, -56, 11, 304, -297, -211, 218, -134, -126, 19, 260, -127]
6059a27m02O88k5k67L14K95p64J49K88j77k93L35%k24K92J26m14q2K68m2l16M78
6081A00L54p84R1L91r1m18L12M46n24M4P2j55K6J62q0l75M76J02l51J07K66j34
6103C7k2l96N58l35n7N25k28l90O28l59j75J52K72l67Q3J22J25m05L13K56o77
6124c40Q8L99j52l29L15N06n03PL00N2l29kK05q9k75K62nj05K06j74k14L37m1
6147A19k49J68l0K60l99N9K21k9n08N14j59k18L52j14R9k39J05N5k74O23k41j34
6169a9J62J8m49L2O34m65j9Q6J48k59N1L34k16j82K18p5m3q4N42m13P3l5P3l70
6193b58L47l23J83n3J68K92n51P1J84L5k96L70J23m44J54j06K11k49J75j42j91
6214c00O75j5l31K08o6l46K15J01q7K65k88p9K82k84L8j51J37k75M45k62O4q5
$$ y = [-127, -529, 159, 134, -133, 181, 476, -288, -139, 149, -28, -321, 14, 14, -210, 82, 208, -206, -288, -20, -62, -378, 100, 454, -330, -239, 152, 61, -357, -45, 401, -123, -79, -7, -162, -136, 26, -54, -429, 47, 149, -202, -95, 171, 37, 15, -381, 177, -158, -215, 310, 82, -308, 320, -39, -214, -62, 210, -157, -74, 48, 173, -232, 81, 337, -340, -252, 147, -5, -334, -19, 487, -16, -9, 291, 343, 14, 12, 217, 128, -147, 115, 110, 5, 211, 37, -177, 160, 119, -130, 38, 8, 268, -131, -72, 149, 120, -388, 126, -33, -251, 101, -13, 86, -153, -48, 7, -267, 356, 115, -19, 143, 161, -288, -256, 378, -87, -106, -20, 128, -131, -80, 254, 38, -144, 74, -1, -44, -128, 414, 1, 74, 39, 112, -258, 89, -234, -51, -104, 64, 356, -195, -124, 60, 95, -201, 169, 292, -152, 2, -104, 107, -142, 33, -109, -300, 375, 360, 29, 237, 171, -175, 40, 141, 54, 319, 31, -48, 234, -50, -12, -163, -26, -301, 144, -118, -54, -139]
6236a39n6P5J59lJ66j28pj54J96j36j53K79J65k84m1l5r6J15R6K4J42l80k30J76
6260b49J21K72kj08p2K53l27J79q9n8L9P2j19j09J71j32K00N1l24N79k71J07k15
6283c1L8j59J85l4j48O7K5j44p5J1K79j48J60l13J50M27j09l7P2k04K01L9m41
6306a89L78j31k66K27Q4nK21k65j71K47L4j08J8j76Q8j89n0K40o4K7k03R4K09
6329E0N1j29j6J67n9j46J28Q1k18j10K06n0nJ80j3j41j1ln2J94m6j64kJ94j16
6354c0k15L72k43L26k94K17jk45Q6K17j31o9N9r4Q2l26k8O83l97r6L94m00o1K24
6378C0Kl98M22P2j32ML3p9j59L54j35J28j21lj85N3N2K91k11p5K92k68j39N5M89
6403C72o34K40K03J45q20O41J6l56L83p1l40J18K12p6k76L49k90Q8n0J83l31L33
$$ y = [-139, -195, -120, 39, 36, 202, 74, 67, -87, 109, -27, -180, 99, 264, -20, -61, -96, -192, -77, 19, 43, 185, -195, -425, -249, -128, 144, 142, 34, -38, 215, -112, 67, -22, -80, -41, 31, -88, -197, -26, -158, 42, 93, -231, 348, 77, 184, -31, 7, -152, 33, -1, -149, -82, -57, -201, -276, -265, 14, -134, 26, -287, -137, 290, 181, 144, 216, 12, 213, 252, -189, 189, 58, -208, 19, 103, 98, 319, 54, -117, 130, 164, 56, 74, -102, -14, -203, -253, -13, -77, -50, -253, -159, 50, 101, -28, -44, 123, 64, -82, 46, 127, -91, -201, 5, -45, -50, 130, 117, -24, -35, -38, -90, 104, 58, -106, -108, 86, -30, -245, 127, -116, 210, -84, 133, 132, -113, -27, 190, 59, -10, 49, -45, 37, -289, -317, 366, -31, -127, 267, -133, -194, 30, 32, -366, 56, 128, -4, 0, 33, -46, -205, 149, 14, 142, 21, 18, -167, -114, -62, 229, 18, -57, 235, -33, -172, -117, 372, -262, -22, 181, 326, -494, 147, 163, -193, 190, 119, -221, -103, 109, 33, -243, 106, -184, -96, -146, 37, -294, 39]
6425C9R6k50R4j00L88k25J4K76k78k11J83J38m01K76J89j84l11M14J78o02K41
6446c6O35p49j09Q40m19m26K62K59o35L17L36j38p08N29Q9j99%L11j73k19O43
6467D10k96l12K32N8j12j11J95J2r9K33kl69R8M01j52l15M80j97j42j19K23j78
6489f2r1N3L25n85M03L77l87j84L07L7o43O54k96N7l98O92l45l08P54k73p3j27
6511a13N81p94J19L12J22k82J55J23k24k37M92k49l74K70L32m33n8N36l4o30L05
6532h1J37k59J73j7M6m33O19K1n51L22K42k73j29L51k44k05L26K75m56J17L88
6553C69m39j49L91J4k57j51N37k76j17K62J01m61q0N18k89k16L17n4l35N35J33
6574C53l04l41P39m56k45L69j23r1j27N67n78k9L64N3o65P91R6m81J56K21j47
$$ y = [39, 135, -115, -21, -121, 267, 42, 56, 332, 54, -157, 26, 164, -237, 39, 228, 44, -267, 147, 325, -277, -36, 599, -150, -259, 581, 162, -264, -2, 257, -378, -61, 275, 137, -571, -42, 47, -152, -152, 159, -14, -233, 410, 114, -198, 34, 92, -20, -131, 64, 76, -23, 210, 208, -161, -63, 338, 186, -129, 351, 154, 12, -107, 116, -62, -153, -100, 225, -360, 43, 420, 33, -151, 156, 193, -450, 204, -92, -35, -433, 259, -86, -394, 360, 87, 14, -113, 468, -326, -207, 105, 227, -55, 100, 223, -1, -238, 254, 5, -369, -99, 233, -200, -258, 278, 244, -386, -81, 56, -203, -30, -47, -1, -434, 185, 206, -345, -23, 219, -54, -183, 168, -76, -281, 45, 320, -136, -19, 369, -70, -219, 172, 186, -71, -222, 315, 39, -78, 184, 285, -176, -256, 262, -27, -243, 74, 20, -315, 220, 353, 49, -292, 447, -9, -254, 115, -8, -99, -226, 341, -237, -266, 98, 151, -514, 277, 373, -108, 48, 269, 122]
6595A22m63K51K43k63L1M29k48j27J4K1l32L42M31l13m30L41o9k36J17M22m38
6616a55m5L89k68j28Q3K55k41m02N88n4k16N04k03k72J93K79n23L7J33J25k14
6637a35J47Q0j13k89M34r6n85M89K06n9m03L95Rj96N3J93m55M19M28m34j95LK82
6660A78k42L00p5k03j29J88j76J03J23J0l4j76L31k06k21N15m11r1M7M08k56j02
6682a19M8J92l86L81J56k87l23N31K15o28M05l52JrqK33k98K32J08m93N01p6j14
6705i0J62rr3p4J58j32J3o0J49J63j90K49j21l83J48K93k29k54N17J8l48j20M28
6728A95j33k58K56K40k96J4J23N4j82K12j75k66K46l0n4J3R7j76L4r1K22l69K11
6751a13L41l81J84KJ4no0J33q0R0O9j66p3QK46m48J81J97Qm98K91nOj34L77k99
$$ y = [122, -341, -90, 153, -110, -79, 350, 102, -25, -11, 10, -322, 20, 451, 138, -292, 49, -20, -256, -139, 283, -155, -200, 189, -79, -207, -124, 131, -110, -512, 76, 22, -194, 310, 107, -165, 28, 307, -216, -179, -46, 79, -135, 12, 92, -21, -310, 124, 28, -557, -68, 138, 79, -324, 71, 80, -116, -63, 130, -325, 94, 522, 88, -107, -104, 178, -64, 236, 161, -42, -171, 17, -159, -56, 67, 77, 43, -133, 198, -8, -229, 286, -125, -216, -169, 239, -17, -119, -71, 121, -265, 116, 272, -15, -338, 193, 408, -220, 185, -167, -166, -175, -183, 50, -248, -16, 92, -401, 100, 24, -90, 72, 63, -30, -104, 54, -78, -65, -125, 24, 187, -3, 246, 125, -258, -110, 183, -46, -300, 217, 235, -113, -233, 195, 62, -196, 60, 300, 4, 18, 141, 195, 13, 225, 50, -216, 30, 0, -54, -41, 56, -120, -86, -177, 45, -324, -113, 228, -153, 31, 33, 47, 42, -18, 115, 35, 125, 194, 28, -45, -37, 209, -239, -58, 139, 147, -351, -60, -65, -59, -193, 184, -115]
6777a15J43J45k55r0K86k44J48O0l37J35J58m81M55k74L48L6kl68L02n06K32L10
6799H6n02M39j22J74o0J04m49Q17o67K61nl58M9O32l90P2j56R0R8Qk37J44k80
6822b52M29j74j62j75O72j02J0l7l93r32Q57P30r91Q77m79K9l4L1j6J20j13J56
6844E1p7J01k07N41m66P7k64L83q5K07j054J043k28m20o3L22r4o8L81j0R7q22
6866f55O44J80l10N54K56j192N84p1j23RJ46l9j15J22Q1n3q7j39L35j04L01k32
6888I2l63L67k04J53j18N7n5O5j33P0O1K45k13M6p3n2K6Mq0j75K63j5j29K70j66
6913e7p1K53k75N3K61k76k4K84R0k86N1l9k6R4l84Q0L35m49N42q5j26Q1r2J96
6937A30j76K20m59L84k32r2K35j88J27J4j30N16m14J00J00k70n5J44K2j00Q5K94
$$ y = [-115, 28, 173, -82, -172, 114, -130, 18, 78, -259, -124, 34, -447, 8, -266, 82, 118, 116, -252, 50, -456, -224, 86, -416, 23, -99, 75, 15, 119, -330, 487, -180, 81, 76, -282, -233, 399, 9, 81, -75, 15, 113, 121, -116, 28, -252, 177, 3, -159, -334, 338, 236, 246, 209, -184, -1116, -259, 471, -520, 357, -122, -93, -127, -96, -112, 8, -105, 51, -26, 75, -132, 409, -57, 20, -244, 139, 54, 261, -793, 250, 22, -398, -461, -139, -233, -301, 80, 70, 167, -655, -11, 169, -141, 413, 669, -523, 61, -10, -133, -124, 22, -17, -132, -10, 71, 18, -69, -208, 127, 23, 324, 92, -271, 96, -108, 45, -73, -16, -71, -6, -139, -69, -8, 237, 24, 70, -3, -55, -29, -25, -105, -280, -17, -32, -161, 109, -57, -128, 125, -150, -97, 164, -112, -136, 148, 238, -48, 3, -36, -62, 32, -352, -272, 63, -386, 156, 71, -55, 26, -66, 130, -46, 174, -285, 99, -133, -225, 10, -178, -51, -37, -167, 349, -65, 35, 135, -135, -190, -46, -24, -124, -39, 255]
6959B55J16k83l38K71K7R6R2l17L5p1J61j80J15n3qK12j11j17o6K63Q7k16m02
6982d32O05j51N0L7k58J96K1J43ok60m0L09k99q3L51j76j31J34l7ml6N4Lj11J46
7007B5O5j24J08K10k86l7K31j24l23L39J71l10pR5j43J17J08n5m3n5L94l32l4
7030a0J17K16o40M02K31n51J50J43J09l71j12L47j97L9M45k01L7j07O5j72K3M70
7052D33m83R3J69k20l56M77j5l31L15K5K3q7j14K48k17j89j3K30j38J68n4k02
7074b38J81L88k07k87L24k54l9L03K0j78k00L71j96m43M67l6N0o0K49m18k85P52
7096B64j94j31LK7j65J76J08k3j39N3J83k89m2N43k93k35M77j99l84N8K76j74
7118a00q4L17L0j24L4J20j48p4J08J30k30J22J53m67K4l3L04l24L95k41k08K41
$$ y = [255, 371, 88, -250, 21, 48, 144, 236, -81, -46, -117, 44, -136, -21, -74, -82, 130, 19, -98, -164, 99, 186, -30, -432, 173, 22, 72, 109, -149, 47, 68, 211, 205, -55, -95, 214, -85, -168, 183, 7, -124, 10, -27, -31, -67, -13, -10, -121, 25, 90, -34, 74, 284, -2, -39, 192, 68, -255, 84, 255, -55, -62, 33, -110, 7, 115, 60, 17, -38, 356, 24, -10, 107, 323, -317, 85, 316, -235, -85, 58, 167, -204, -316, 31, -166, -127, 318, 117, 154, 47, 112, -60, -37, 433, -50, 43, 212, -8, -364, 113, 98, -233, 82, 107, 130, 43, -71, 177, -40, -229, -242, -12, -150, 18, -36, -238, -57, 331, 124, -163, 161, -93, -132, 171, 191, 13, -187, 184, -12, -455, 12, -24, 26, -34, 215, -203, -488, 264, 70, -61, -58, -31, -196, -20, 88, 65, -74, -21, 162, -127, -169, 374, 81, -154, 323, 124, -260, -202, 74, -100, -184, 133, 163, 39, 73, 193, 45, -29, 79, 209, -21, 101, 254, -213, -189, -222, 82, -242, 153, -88, -296, -55]
7140e5J61k30k9M11k52j23K38l7O7l17K88O7m96K00M01j76o8M5j23J9M9j07k01
7163b68n2N43m28J88Q1j5o1J12k00K43j82J60Lm60O68k24n28K05K39K9l70L62
7185D5k4J9o3J93L7o03M93K80m59L26k11P2k51O3O3j66J83j2j23Q7K53Jk25J44
7209A22j54J1j12J81l36K66MK1k37K50r2J9k19N39o3l64J25J02J40l38O1j46L1
7232a89K76K30m10j43L05o9j40J51L14n34L69k5j29k15K34j52M82k07O7m36qL96
7254A67j65K87k46N3k06P8r3K42l21M83k08l53J99M4J42j25j08J15k69L76k0n0
7276B2J43k70J42k57L52j17L9o1J51k99m3M23m01L56m7j26m3k05K35K5k20L66
7298A65j40P4k75K19j88L25k9k82QL24j15j21m7L07r6l1J6n1k51j57M15N9k60
$$ y = [-55, 106, -124, -153, 258, 6, -117, 121, 84, 151, -166, 122, 189, -307, -107, 294, 118, 50, 95, -28, -9, 40, -67, -268, -320, 223, -205, -17, 64, 49, -12, 100, -100, 143, -39, 121, 124, -336, 332, 108, -420, -215, 24, 53, -317, 45, 21, 40, -23, 170, 207, -396, 97, 377, -82, 244, 33, 105, -146, -83, -20, -186, -3, -15, -138, -51, 202, 203, -22, 122, -32, -21, -133, 48, -288, -22, -18, 3, -234, 16, -76, -57, -276, 263, 200, -164, -39, 63, 203, -135, -74, -220, -189, 87, 317, -93, -236, 69, 0, -140, 11, 325, -209, 160, 135, 6, -209, 25, -127, 355, 148, 215, -221, -229, 167, 2, 289, 43, 96, -110, -32, -125, 117, -204, 279, 71, -282, -83, -39, 103, -22, -130, -15, -284, 92, 72, 22, 165, -105, 37, -220, 132, 15, 54, -7, 144, -155, -198, 225, -176, 180, 133, 7, -36, -241, -6, 19, -201, 165, 25, 99, -176, 43, -145, 180, 151, -131, -123, 201, 86, -35, -82, 225, 129, 98, 114, 63, -188, -345, 70, 129, -131]
7321a31J77Q7l30K47J44k56l2M0j11n1K00J73l27K5O1l9J92k03j3J8R4J04k37
7344a68m8L11k9j70j00L50j38j9J96j50l4O4j55m4J01N2J32j37J69j33q4J01j00
7367c3l4%P3J15k08j7J32j04q4M7K55m14K98rj14O1j52M50k21R2j75P7k39L93
7391A89k39R6O2k88L31m36L36k17K53R4l41K03K46o01L63j99K06NQ2k69N8r3p
7414a66Q0J75j25J22j30k35L25n2n5j6L2K6O0m5L9J93m52J20L50m17M0K60j55
7437b6j70L24j57n3J52j65N3j79K66J52k62K44l05J89O2l9J11N3k46K69l02j6
7459d5O4J33j99J82J66J6j10k0N4n2l05K42j42M8J48j18M7j07J49k76N8j8J27
7482D2k50L82k11J26j59L27m34m9J08J57K92n34j31L78j14jK86j33j41J22J67
$$ y = [-131, 46, 133, -197, 50, 194, -62, -94, -54, -165, -216, -16, 157, -170, -145, -84, -123, 69, -134, -147, -129, -35, 69, -168, -216, 95, 66, -104, -204, 146, 8, -11, 185, 35, 1, 65, -90, -134, -33, 19, 151, 14, 183, 50, -34, 67, -33, -67, -67, 6, 121, -87, -104, 28, -76, -160, -113, 142, -272, 26, 17, -97, -36, -188, 262, 41, 133, -42, 35, -204, 189, -50, 46, 108, -180, 151, -285, 51, -166, 87, 181, -160, 43, 289, -312, 51, -148, 58, 63, 145, -124, -66, -159, -166, -86, 89, -36, 86, -44, -279, 46, -6, -61, -77, -45, -19, 41, -4, 35, 228, -224, -104, 246, -171, -131, 129, -26, -196, 128, -29, -82, 70, -95, -42, -221, 45, 197, -65, 179, -126, 63, 125, 86, 197, 250, 4, 273, -29, -45, 19, 152, -47, 135, 301, 317, 207, 187, 241, 189, -116, 126, -16, 32, 180, 62, 109, 2, 151, -125, -67, -85, 42, -208, 174, -37, 89, -70, 257, -177, -226, -118, 39, 331, -203, -334, 44, -70, -71, 215, 82, -59, 63, 230]
7503B30m11K38j48J9J92R3l6j10k37J53k7N2K09k72J63R8m06mn8M10k17J41j91
7526a19L4l8P4L50l31L1O8L5p1J53o2nk31j63L33n5l6m2K51l63L82k22k18K63
7550A8J88l49O5L39l23j90M11J18o04M14L7l4j32L11k54P9k35M9k4q3J54o8O2
7573e1o2J68j37J09K31m77J98q5M16m21lJ63l6j99L79k27K11R2k57Nl04N21m65
7596b31l09N42O5l23L35O4j97m22N58j57J07J02J86l05P4j45J81n36J75N67n16
7617a85J25L39k21l89N07m4l44K85l64L42n9K71k56l91O10k0j22qJ09k63N9O3
7639D4k98Q7M16k92k48L90j35J19l50K08K18l42q2K26L61m77j7J46j26O5K83k14
7661a8m8o4P0q3J04J18o0k49L03M6l42M36o6N6j19L36o04L2L19j11k3k49L95j64
$$ y = [230, -181, 57, -91, -72, 120, 213, 177, 67, -170, -17, -44, 8, 217, -55, 108, 206, -200, -204, -262, 148, -69, 72, -119, -85, -123, -49, 301, -30, 1, 69, 104, 33, 186, 124, 119, -112, -275, 58, 3, -33, -75, 176, -187, 195, -27, -245, 18, 206, -143, -78, 261, -62, -252, 159, 277, -327, 87, 124, 90, -42, 269, 15, 94, -141, -92, -116, -199, -45, -113, -51, -113, 55, -82, 27, 258, -219, -21, -106, 310, -111, -114, 49, 13, -186, 193, -34, 177, 269, 12, 17, -287, 234, -231, -540, 2, 67, -256, 79, 143, -54, -476, 82, -75, 32, 134, 320, 15, 89, -56, 125, -411, -236, 331, -185, -60, 279, 58, -331, 176, 132, -212, 73, -291, 51, -8, 263, 7, -384, 226, 206, 84, 76, 185, -78, -19, 44, -254, -167, 249, -43, -291, 99, -36, 83, -267, -59, 159, -183, -265, -39, 322, -155, -172, -26, -152, -87, 196, -18, -66, -130, -60, -143, -39, 79, 19, -230, 73, 119, -223, 213, 147, 203, 84, 420, -184, -152, 167, 56, 33, -216, 179, 15]
7685A5R1P2n2j29k63L65%m06K93K68m05K82j43j5N4j28L60l11K2J58j10q4J45
7708G9J40j56j11Q6k08J56J05o6j82J09n0L2J77J36r0Kr8r7J5N7j40L8K16m7j02
7733Aj92K77L6n04K22L8K32k53J35J6j67J88M7j7l71L57o4o0k40N51j24j66J66
7756A08J07l05M2J5P8n7O9l8k46K19NR2oK94n47K42j31m8N9J89J00m86J53J87
7780I5r0j61L01O5l04j08L60N2l13M24l02r9O6L2K63k65j14K76k75O7J79rk08
7803f8N30j70r4l31M38m35O7K04jk20L13j26l38R9J22R0j35L28j40k28m4L45j39
7826F7l09N11l03k7j00M17k08n2J74l78K23J91j34k4J38j54j13R9j89L66m71K72
7848dQ0l44M02k20j19J19K07j22l6m7K53Q0l47K27K7o17N47o2k1k64K12K07j64
$$ y = [15, 106, 178, 126, -3, -266, 99, 99, -307, -14, 254, -151, 131, -12, -27, 27, -101, 259, -52, -30, 128, 18, -66, 79, 219, 63, -48, 38, -170, -14, 91, 25, -157, -48, -98, -66, 111, 247, 157, 159, 61, -36, -21, 36, -104, -66, 150, 103, 1, -191, 86, 122, -382, -160, -122, 110, -143, -8, 8, -159, 29, 76, 59, -312, 45, -19, -79, -319, 232, 108, -58, 108, 215, -90, -48, -33, 45, -12, 57, 19, -227, -8, -3, 89, 83, 377, -170, 72, -59, -107, -48, 141, 241, -245, -92, 95, 5, -156, 145, 210, -94, -202, 158, 210, -103, 321, 19, -80, -14, 18, 281, 16, -98, 178, -97, -30, 149, 140, -68, 462, 292, 198, -133, 305, -130, -63, 141, 140, -80, 233, 107, -231, -132, -10, 80, -55, 273, 133, -95, -139, 206, 67, -242, 269, -34, -61, -161, 256, 48, -4, 170, -208, 15, 206, 72, 48, 186, 32, -81, 18, -171, 195, -276, -4, 76, -268, 134, -86, -205, -86, 121, -1, -37, -84, 169, 249, -98, 129, 156, -461, 86, 24, 3, -261, -49, 158, -6]
7871fJ33k77K11q7N6j45p5L26j40n1Q7J16l01q5l6L97k14J04J12j06l32M41n4
7894G4m41L81m0k10J68J74k25j04K85ol24N18j88k18R2O7L4l3j19J55j01j05n
7917a71J76j22Q5J19k98L69l37M03l35K31k10J55p6r0L09k07M2q2K17k58K62j21
7939F1%p0j41K12j84K85j03j78J10P6J26k46j7j03J94N9k96R6m3K92P5k66o0j20
7963b41O1K08k6M0p3J29j76QJ37l15J51l4L85k19J1qL8j2n5Jj83N54l87O2l20
7988b64k6K08K08o5j8j29j55N27m75L28j34R4k30J06jJ34o1k23J95k88N03k71
8010c7j96K44Lj36L5K2J21k85J85r6N8K43O1j09l80K54j65J59J21k53L7L25j35
8033G6N5j42N3j79K50k56J53l0J06j67O9Kk51J83N9n6k61L42K94n40K64j52J04
$$ y = [-6, 127, -150, 61, -26, 30, -115, -190, 136, -4, -55, 32, 148, -153, -238, -274, 123, -91, 13, 125, 19, -313, 128, 74, -367, 14, -26, -236, -68, 106, -119, -223, 62, 56, -268, 250, 62, -156, -64, 3, 37, 4, -115, 40, -61, -166, -171, 5, -117, -32, 87, -211, 158, -179, 224, -111, 120, -90, 65, -11, -101, 208, 1, 43, -39, 178, -80, 182, 61, 61, -9, -150, 62, -122, 163, 60, -118, -8, 68, 194, -52, -69, -172, 22, 81, -215, -119, -162, 130, 205, -61, -121, -241, -180, 28, 2, 42, -31, 98, -78, -70, 67, -248, -97, -131, 254, 35, 46, 38, 76, 64, 9, 10, -173, 381, -6, 56, -264, -290, -82, 126, 61, 43, -86, -241, 286, -189, 139, 5, 99, -131, -25, -26, 108, 47, -176, 19, -269, 234, -37, -233, 11, 14, -122, -87, -65, 56, -229, -44, -140, -82, 161, 222, 113, -267, -13, -178, -19, 102, -151, -114, 211, 76, 131, -11, 42, -137, 113, -143, 10, -20, 86, -81, -12, -10, -261, -78, -19, -75, -336, 6, 300, -240, 24, -128, -24]
8056b4j4j16J86RN9J5OJ6k35J97j90j03J63k14L99j08n6J04j54j8L34j86j59K75
8080A86k12k7Q0Q4J20j32m69N15k8n4N8j65P7Q6m16L61J01k79k23J97K81p5j40
8103g4M3k7m0Q1L8nl5K27l11q4K52P8m11K28L7l42J87K05j61K74j52o1J53k84
8127a84J81Ln1kJ09q8m0J46l44K67K47l51K29j77J19q3k23K06K76j38j24J91o0
8150A09R5k22R0l1J69j74p9J19k98r4L22n1j73J36q6N87j95l76J80j75l22N81
8172A12k90J79j12l7K92j95J80J40m01J71k0m1k99L91j79j4O9o9O9
$$ y = [-24, -38, -154, 32, 41, 100, 115, 121, 137, -98, 99, -91, -194, -31, -245, 154, 46, -10, 94, -60, -78, 256, 70, -89, 186, -26, -53, 27, 111, 231, 99, -370, 145, 117, 63, 121, -44, 33, 119, -297, 64, 165, -114, -337, -140, 141, 66, -74, -31, -58, -98, -17, 21, 16, -19, 208, -103, -187, 65, 143, -268, -40, -3, -345, -158, 47, -114, 160, 8, -53, 100, -184, -3, 0, -51, -53, 56, -32, -72, 74, -270, -3, 244, -107, 122, -55, 64, -19, -242, -36, 240, 102, -22, 169, 109, 204, -18, 72, 41, 210, 36, -43, 76, -222, -316, 6, -45, -218, -82, -168, 419, 224, -152, 28, -147, -469, 112, -178, 1, -111, -148, 144, -51, 129, 269, -132, 39, 19, -22, -321, 70, -109, -123, -54, -123, -54]
8191e4
$$ Imaginary data points
##PAGE= N=2
##DATA TABLE= (X++(I..I)), XYDATA
0@%%%%%%%kKqJ6j6K4l2M0n6P0q6J04j20J44j76K08k46K88l36L92m54N25o03O91
31C69p90R00j020J152j300J463j640J835k049K283k540K820l124L458l825M222
47B214m658N135n656O230o864P565q343R213j0190J1299j2565J4028j5745J7789
61I452k0269K3355k7325L2642m0172N1739p1952J17308m01066R0450O92105m20334
73C5933k66072K04686J71890j70614J1384L7097k6450O3186J45763j50111j57327
84a00635M4122M9105K2033J15636j08845j94124J15846J73993j93221j42607K35565
95A6868J46355j92598j7040J35258j40296p7499K85435M8709l08298m6775K15207
106F5326j8765j35442Q0640J00174o3307O050K5172j48109l6893J76535L2944
$$ y = [0, 0, 0, 0, 0, 0, 0, 0, -2, 0, -8, 8, -8, 16, -16, 24, -32, 38, -48, 56, -64, 80, -96, 112, -134, 154, -182, 210, -244, 281, -322, 369, -421, 479, -541, 611, -689, 774, -866, 969, -1080, 1203, -1337, 1483, -1641, 1817, -2008, 2214, -2444, 2691, -2965, 3265, -3599, 3966, -4377, 4836, -5354, 5945, -6620, 7408, -8337, 9452, -10817, 12538, -14787, 17855, -22317, 29422, -42530, 74778, -326288, -235838, 456267, 35933, -230139, -25453, 146437, -24177, -12793, 24304, -2146, 61040, 206803, 56692, -100635, -56513, -7408, 14625, 130261, 21416, -172708, -56862, 117131, -76090, -218697, 16868, 163223, -29375, -46415, 88843, -51453, -128952, 156483, 205192, -103106, -149881, 65326, 46561, -88881, -8241, 91933, 28626, 34676, 59848, -88261, -125154, 51381, 84325]
117H4325q7378K167k2919m0377P9157K1754j14998N5715J95721j25487k64905
128b17225J63857K32147k08998j18922K77430O1724k78476o1776J91959L9117
138H0837j04072k127L5496j5605J3365k7637o0687Q9527Q9994q8014m0469M7558
150A8166o4867l9147J43305N5763j59085k2609J72812n7545k03670J05283J81128
161A29534j08923r2197R9163j243j02059L8558R6270l0195m0865M2637k2954n7171
173d9445M7697J8531l7314N7521K0853r7393m776O3690l9975k4707R3628J1126
185E9436j21377J6896J17826q2098r1700J57288P0592j75222m7987J34097J4810
196E2561j00381N247R0767P984n6084l5712j7051M9806P1804n6042o5248O1364
$$ y = [84325, -3053, -886, -23805, -64182, 14975, 36729, -78269, -22554, 173167, 47680, -217225, -53368, 178779, -30219, -149141, 128289, 190013, -88463, -150239, 41720, 80837, -23235, -25362, 10134, -5471, 7894, -19743, -80430, 9097, 99091, 11077, -29392, 18166, -46701, -85848, 57457, 113220, -45865, -68474, 104338, 46793, -156877, -51594, 129534, 20611, -71586, 27577, 26334, -75725, -37167, 59103, 28908, -11957, 30680, 7726, -49445, -1748, 16783, -20531, 36990, 57843, -39550, -44326, 19364, -20611, -45318, 48310, 59436, -61941, -45045, 72781, -9317, -101017, 56271, 126863, -48359, -96346, 37751, 52561, -47820, -42573, 48194, 56178, 94, -35618, -52669, -2863, 68941, 12899, -52349, 9015]
208I015K0595n9786J0749L3796k7036Q553O6357m1225j23341N1389J42346n6550
220C4862r7967P7004M9944p5404k4995L9556p1j1948K9993N917n5009j2185L5502
233d801N320K0923J4231n9387n971O5845k5465n9306M3834N3073l3599l0021K6039
246A0715k0535m5974O8242N8219r1784l9556Q4795J0734o7063j029N3874K0767
258D1405k6200k2580r358j252K6905N403k5864J9492R923m3702P439L3863k5856
271a0382r647M6088O486n5889j3291N3343j393m0997M0531L0175n8481j5738L9607
284A0412k625k0938R817K1511j882k6300j1169P836J7945K0757k3469k6216L2103
297G782L303l6949J5521K7330j2466l283J3878j1847l0996J5768M7623j9069l9210
$$ y = [9015, 29610, -30176, -19427, 14369, -12667, -4114, 62243, 21018, -102323, -50934, 91412, 34862, -63105, 13899, 63843, -11561, -36556, 3000, 2929, -9019, 20974, 26891, -28118, -40303, -4801, 519, 21442, 35673, -23714, -29685, 36160, 10695, -48611, -4777, 48296, 14697, -15324, 10715, -9820, -55794, 12448, 70667, -21117, -60673, 24122, 34856, -32207, -33236, 20638, 41405, 15205, -7375, -16733, -17985, 8920, 14323, -11541, 7951, 17874, -25828, -18389, 15474, -10382, -20029, 26059, 32545, -23344, -36635, 16708, 15315, -25682, 14849, 45024, -13457, -29195, 10412, 7787, -13151, -3334, 18177, 16295, -10005, -21174, -13338, 4607, 25364, 1895, -24321, 7782, 11085, -25864, -10343, 16987, 4521, 1238, 15116, 3269, -27727, -11959, 35664, 16595, -22615]
310b2615L0331J3025l7639m661J9303Q261L979r023q390k111K39Q701J984N831
324G215J0354k0867q387K3728j1993j4923K6836R544k0942j1788L966K687r188
337a3758J1343K2368k0203j5068K2355m771j5726J3397J2061K814j0033j7309
349a2530M945J0721J64o2l557O189Q23k2942L307J9783q713J413J1273j0867p830
364g883K896N353M941p220N003R621j6182p272Q349J624J1047J920j2200K502
378B499o612j0879J3451O613p735r48L318N547j0254j2294J8023J1137o910K981
392G937j0524j0347J7658O559p757n82k900M659J938j3745r074K360K0611J5456
406B2249l0695k0186K8377J1832r143R80m725j249R489P34j1980j3284J8279K8915
$$ y = [-22615, 7716, 20741, -16898, -21559, -2256, 6005, 9984, 961, -7429, -9540, -9301, -600, 1384, 7215, 17569, -3298, -11685, 12043, 50, -14873, 11963, 21507, 565, -11223, -7257, -4570, -13758, -2415, 19953, -250, -15318, 7037, 2266, -13460, -63, 11998, 14812, 4779, -12530, -7585, 3136, 3300, 3238, -319, 5870, 6693, -16249, -12942, 6841, -1872, -459, 10814, -53, -7883, -4987, 366, 5307, -1913, 3090, 12711, -3471, -10743, -2394, -770, 10277, 12197, -3, 2499, -4113, -14992, -1541, 5072, -2663, -3611, -293, 5254, -5000, -17294, 729, 11866, 4956, 7937, -2587, -12934, 4724, 11283, 3526, 2944, 44, 4703, 6641, -7104, -16178, -13818, 6793, 22249, -8446, -28632, -255, 11577, 2434, 3414, -1311, -2560, 6929, 7663, -4317, -17601, 678, 29593]
420B9593j6895k1833L986n411P735J8425k1764j7656K4585J7561j7950k0862J5347
433e139J9432j0321J582J669k7786Q691L3511j4273j6290J5096J633r556K006
446B55K790j4997l126L3407m51m5717J1900L5724k0861q875K4638p344j9983M936
460g704R895m384p27J1742q537l699L2967j6577n5499L2817N5237l7477m2327
473c4273K3971K1151j3332l641J1212j6043l846L9162q459m6185J8928K7351j2106
486C890J3318M172m3982j238N9503Q19p4046n079P1291m339n2550J0999J2381
499d861m760L7490K201n7577l26N2971k242m0313P640K2995j9503Q985L2610n1590
513a6280l8211P4585L1050o9393k0595M3783J0902j4656K172n466j2451L2572
$$ y = [29593, 12698, -9135, -5149, -10560, -2825, 15600, -6164, -23820, 765, 18326, 376, -20486, -5139, 14293, 3972, 5554, 7223, -20563, -11872, 21639, 7366, -8924, 6172, 7805, -1751, 255, 3045, -11952, -15078, 18329, 17878, -27839, -15939, 19785, -1076, -9951, 14687, 7343, -12640, -7704, 2191, -2193, -2920, 8822, 285, -3414, 29553, 12976, -42523, -9706, 45531, 8054, -34273, -10302, 10849, -2483, -6124, 5088, -10955, -14801, 24361, 15902, -30283, -11355, 15996, 3890, 17208, 21380, -22602, -23840, 35663, 36482, -37564, -42643, 28648, 24309, -28241, -17242, -4861, -9621, 27869, 30070, -27507, -27833, 25138, 22896, -17417, -9777, 13218, -6285, 2700, 35310, -16280, -54491, 20094, 51144, -18249, -38844, 4939, 15841, 1185, 3357, -2109, -14560, 18012]
525A8012J3686o4218n179P2469k0589n5159M7798L0646n7586j0471N8462k536
537B5335n1084K0452L3379l7814o773L4744k6905j1945M8198j2100m2176K8230
549A541J6687m6457N868O5527k3085p2611M6365O2301o2166l3612N3224r80k3654
562a1052K4861j1280m1472L3330N3386l9017m4673M6350J4936m9965K3154L0997
574B9555n9025k06P8383k2584p8764K2817O1258j4098k6825J2517j5752p360N6165
587C6081j4151q0918M6669Q4351o0025o1378N3669K0840n0416J3192M7572m0004
599d518l3427N8551N011n6821K4871L1190l8018Q451L1550m4777k3198O4715J5099
612C8679o5992P790O1492m0647m5981O4030J3048o3666K6088M6029m8755k6642
$$ y = [18012, 31698, -32520, -37699, 34770, 14181, -40978, 6820, 37466, -20120, -30591, 27871, 25335, -25749, -5297, 28082, -9732, -16505, 18239, -8666, -20611, 27587, 15487, -26689, 1541, 18228, -28229, -22361, 43166, 20081, -52530, -6165, 56136, -6030, -39642, 13582, 12602, -11052, 13809, 2529, -38943, -5613, 47773, 8756, -35917, 10433, 25369, -24596, -1442, 29555, -29470, -29676, 48707, 26123, -52641, -29824, 31434, 17336, -9489, 3028, -12724, -20084, 36081, 21930, -58988, -12319, 72032, 12007, -49371, 4298, 25138, -25278, -12086, 35486, -4518, -37945, 20606, 25617, -31204, -6333, 24857, -13161, -4710, 26840, -17937, -41135, 23580, 38679, -27313, -19523, 41969, 1322, -44659, 19371, 32419, -31247, -5159, 40870, -7885, -34527]
624c4527M6792K205l5923K8079K4184n7620j0160O3742j8951m2582N3350J4939
636C3528n9936J5871M6878m3201l1658N9621K0270o2013j32M2237l2964p908N4258
649C4851l1569n1425O1053L0083p6086j2429P3939J771m9156K2470J8994m9561
661b7065J3156N5067m1634l3490N6814J784n4094J7578L0946k9749j977M5644
673C2980k4845n7785M4636M5024n7471q727O1056k2120m1886L9259J0692m7139
685b6326J4029M9957k9185m3252L9854J6069m6383K0082L7478m5383j0474N0891
697B7357k2121m5388M0335L4710m2404j2658M3524j7844l7967M5063J7649n5203
709b4947J6119M6134m4960k8764N0946Q859m3003J3361L2227l5490k1448M5876
$$ y = [-34527, 12265, 14470, -21453, 6626, 30810, -26810, -36970, 26772, 7821, -34761, 18589, 33528, -26408, -10537, 36341, -6860, -38518, 21103, 41373, -20640, -20772, 21465, -11499, -19407, 34851, 3282, -48143, 12910, 42993, -33093, -45522, 28417, 30188, -18968, 3502, 22496, -27065, -13909, 41158, -476, -33966, 22848, 24632, -29462, -11884, 19062, -10687, -12664, 32980, 8135, -49650, -5014, 40010, -17461, -26188, 34868, 12748, -29138, 10121, 20813, -26326, -12297, 37660, 8475, -34777, 5077, 21146, -25237, -5155, 32323, -13060, -23534, 27357, 5236, -40152, 183, 34893, -7511, -20169, 23355, 5511, -32456, 12607, 30256, -24947, -8828, 37306, -7654, -36418, 14528, 23387, -19616, -6255, 25972, -9518, -30966, 14910]
721A4910l530m0191L5900K3172m9384K666M2024k3069k5577L8032J3438m4790
733a6399m53L9379k4061k5835M3957L89m4446K5074K6064m2849o323M7575n115
746A6957l8557J8405K6900l2333o933M0185j8923l0029L9997N035m7359J4618
758a2037L5259k5338j8525L1487J409l6495J7265L3445l4320j2732M3889j3761
770I546l4828L0936J4713l4561N418L1168j8917k8035K8167J6871l6238K805L4441
783B1486k2423j7194L1691q191k7133K4465J8871k8666q935K9118m206k9799K1492
796E76K2299l3765j222L3698k0600k0652L0120M269l0021O369K4131j5392j7540
809a7730K4608M242k9908J6035K2521l0127l546L1824j2723j9779K2645Q628k5596
$$ y = [14910, 11380, -28811, 7089, 30261, -19123, -16457, 25567, 2498, -23079, 14953, 28391, -16399, -16852, 22527, -1534, -27369, 16588, 16977, -27469, -2395, 23669, -19180, -25503, 22072, 16957, -21600, -3195, 23705, -8628, -15561, 24624, 5701, -24328, 15669, 20704, -26655, -12037, 23222, -2116, -20641, 10846, 12255, -24240, -6975, 26470, -7850, -20582, 23307, 9546, -25282, 5654, 20367, -14194, -8776, 22392, 3475, -24560, 3607, 20478, -15760, -12955, 21486, -937, -18131, 13560, 5369, -21764, 2701, 21572, -7094, -16029, 13089, 8883, -20916, 576, 22875, -10890, -12112, 21586, 986, -19666, 10454, 14723, -15298, -8929, 15202, -190, -17730, 6878, 11120, -18788, -2753, 19768, -10359, -13905, 17919, 5196, -14583, 8062, 16690, -8906]
822h906j798K5437r969k1945K3485O329l3594J1898K6272k3331q787K5792k715
835H168j9848R535J5704j5491q180K2134m734k1115K0934Q434k8462M554K0943
848A2576j3999j0230J4600J234j5800N868K0204j4993j4698K4244J229k3122J3947
861A060J1790j9710O49J7651o892j5165J0663J3834j6342q707J6851n829j1435
874a1582J6736k193j5692J4744J0344j5914m062J2936K85j3178O841J2801j6763
887d697n570K3012o188j7426J2836N284j2382P85O962m037o785P214Q906j0765
901b851k049J1191p092k114J1234r979p834J3784L302r820j623Q128J628q710
915b805L521L683j4578K855J6793r918j0445J0633N474l025l396m17L556j781
$$ y = [-8906, -10704, 14733, 4764, -17181, 6304, 12633, -20961, -9063, 17209, -6122, -14909, 10883, 8168, -11680, -2145, 13559, -1932, -10112, 12022, 7288, -13827, 7107, 15541, -12921, -8367, 12576, -1423, -11653, 2947, 4181, -11619, -5751, 14453, -540, -15238, 9006, 10235, -12887, 1060, 12850, -6860, -6211, 11440, 4548, -10617, 46, 13880, -2462, -11169, 5682, -147, -11582, 5154, 2961, -12731, 2013, 12357, -3557, -7619, 5317, 5602, -7576, -735, 12066, -4697, -10267, 12745, 6557, -10869, 1967, 7251, -5131, -4346, 2616, -1421, -8206, -992, 7914, -2851, -4900, 6291, -801, -2915, 8319, -1660, -9494, 4290, 7592, -2228, -3851, 4277, 5905, -2805, 716, 4399, -10179, -7324, 9469, -449, -10894, -261, 5213, 2188, -1208, -1625, 1931, 150]
929A50K812K169j0380J272R626k754l07k172p964P659P861j0471q123N068J1291
944E737j047j1836N519R599q012r77N210m295k404N5L026M789p701k923J0329
959E069l32n697k581o93O362J86o448K619K2N32N411m177j922M805l990l04N272
976D134l412k390p38J915P159l344p796N55J933P456l067j7112Q112J9516j0072
991B849j2590Q369J0209m369q656O958L560j4235M816J5151j0069j1104M794O724
1005B407N242p703j4050Q152J6531k334j8020k082K2807L79k1830R394J2565j6947
1019e489o71J6463o878j5023P341J4520n584j2738O934M237n391P377m695j4276
1033a3873J5172J1516j8045m263J4614P04j0208K253Q533r662m343J7303o050
$$ y = [150, 2962, 5131, -5249, -3977, 5649, 2895, 2588, 416, -7548, 111, 7972, -2499, -10622, -5554, 5737, 4690, -7146, -1627, 7972, -40, -1017, 4193, -102, -2506, -2451, 575, 5364, -2337, -5260, 5069, 4737, -960, -3541, -4234, 2128, 2314, -4134, -1515, -1493, -961, 4450, 273, -1649, 3156, -834, -1138, 4134, 722, -1668, -2406, -491, 6668, 3324, -4472, -3917, -1984, 5472, 2405, -14707, -6595, 12921, 2849, -9741, -1372, 8837, 4468, -4188, 2770, 6330, -7905, -3089, 12062, 1993, -9111, -4317, 2407, 7649, -54, -14104, -5952, 10579, 8245, -9775, -11857, 10950, 11329, -10501, -1107, 11458, -5489, -6160, 10303, 3425, -11598, -4257, 10263, 4679, -8059, -1125, 3112, -2279, 5098, 403, -13873, 1299, 12815, -5230, -9493, 5121, 5825, -4383, -2130, 6403, -3259, -7602, 9701, 3651]
1046C651j3279J7517J342k1034R655J6104j7570j2433J9741R349k3351k584K6037
1059A3145p917j9340J7593O780j5792M206O711o980K502L596q999r21J6826k103
1073I307k8403J0256L2023k4135k4894L1232R764k6787N271K1526j2501j5524
1085a2865J7778R487k2817j22J9380j2183n101J6592j1887j1022K1522K95k3886
1098a4829O023K2303j0446j6970J8161O972k4157J1375K2890k7450j0297L2724
1110A6299n047k9969J3374K1201j9009j2166K5165J023k7720J3484J9573k4414
1122h206k795K3579j2041j1360J8324n16j6777J0383J5234k1189r756K9708m747
1135I841l2893K3009K4199l4524p361L3992r370k7784J8796K0450k3738r919K7070
$$ y = [3651, -9628, 7889, 9231, -11803, -2148, 13956, -3614, -16047, 3694, 13043, -10308, -12892, 13145, 5228, -14112, 3481, 10261, -5531, -1325, 5386, -1594, 908, 4504, -4495, -5416, 11410, 9307, -19096, -8840, 23183, -952, -25846, 5386, 15150, -11637, -6366, 15160, 2659, -12865, 4913, 14400, -8417, -8539, 10841, -1342, -6443, 10149, -1738, -12760, 8762, 9057, -14829, -8806, 13497, 3051, -13919, 4242, 11214, -12943, -1568, 21322, -6128, -16425, 16299, 11252, -18717, -5343, 15858, -3151, -15317, 9848, 10871, -16849, -3365, 16208, -8206, -11001, 12578, 537, -10823, 7501, 6985, -9792, 591, 15825, -5364, -15120, 14588, 9841, -23052, -43, 24156, -10368, -17729, 16263, 6893, -20891, -2095, 18355, -5383, -15302, 11768]
1148A1768n104k3832K0176J2138k2780P188J4914k1889l835K4375p592k1807J7371
1161A091J7205k8470q666L4614r559k9449K8129J5803l5494J503L1011j3249k1503
1174a7034K2721J4051k8668k855K7560j4761j8161K7269J605k6653J2957J3126
1186A1157k2184N60K4467r482k0161J9675J1396l1281L910L6434k0523k4643L2618
1199A1943N566l6359Q268K9332j6554j8673K3904O338k9904N986K5296j8671q742
1212a2270K6796r260k1504J8974O955k1064Q430K2470j8014k0265K5412P535l2217
1225a8022J2266L1903k8975j9220L3190m60l0607J5213K4379k0236j5109K2670
1237F992P10k4316J6126J8439k4392n4K2833j8181j4225K4427K525k2017R639
$$ y = [11768, 6664, -17168, 3008, 15146, -7634, -446, 14468, -7421, -11256, 13119, 5527, -16280, 1091, 18296, -10174, -18840, 15774, 6215, -23234, 4895, 20698, -14796, -13293, 17718, 4469, -17034, 5687, 19738, -8930, -11785, 15775, 1014, -17147, 10122, 11727, -14926, -1969, 11157, -11027, -10467, 14000, 4518, -15643, 4032, 15428, -15853, -11943, 24491, 3968, -20675, 11943, 17509, -18850, -10582, 18750, 2196, -16477, 7427, 13765, -16139, -10153, 15143, -3528, -12270, 14526, 5266, -16238, 2736, 9691, -11373, -2943, 19527, 1513, -18752, 6660, 14195, -18022, -5756, 26147, -2828, -22048, 11142, 10682, -19925, -4712, 19667, -569, -15678, 6992, 7702, -16614, -488, 17951, -6441, -6495, 16338, -1843, -16068, 8359, 10884, -11133, -1494]
1250a494J8657k3217j5129L0119K856k9417J6696K1895l1047p302L0929o821k1787
1263a5062J8809J5415k4989q979K5173m179k0014J9567Q019k6108O564J7267j9161
1276g678m915K4257l952k1144J2209J5713k3313o077L2379p133k8172K1645J3641
1289A7460l0210R67K7699j0523j8725J6442Q593k3912L13K4746j0841j4737K1750
1302I022j538k2755J4405J2808j8474J559J9585j1066j8473J7012J2187k4731
1314a0459K34K8517j4308k3193K3374O973k3948O458J9463j2769j1865J6262L508
1327H247j9071P664J8032j8020o402K1345q859j7177J8888O980j9442K365J6283
1340A0833j0977j4591J7995Q488k2909N255K0637j8451j1179K4479q08j9860J0446
$$ y = [-1494, 17163, -6054, -21183, 8936, 11792, -17625, -929, 20966, -10081, -17383, 13546, 6725, -15062, 3747, 19162, -5827, -14806, 10367, 6188, -13826, 5741, 13760, -12348, -5784, 11483, -7678, -12593, 11664, 7712, -13432, -1223, 14490, -8823, -14900, 17479, 10346, -17826, 3819, 17460, -12750, -11783, 15916, 5393, -13332, 3110, 11703, -12209, -11896, 12850, 2009, -12728, 9022, 7484, -15271, -866, 11942, -6532, -4973, 14612, 3546, -14927, 2085, 14272, -10459, -10225, 18292, 3984, -19209, 4165, 11138, -12810, -6352, 13111, 342, -11523, 4739, 8247, -10824, -3160, 14872, -3148, -9550, 11795, 2936, -14241, 4647, 11627, -7815, -5450, 10833, -144, -14735, 3260, 11748, -11161, -5906, 14731, -3720, -14899, 9580, 8772, -11088, -642]
1353f42J3747j4899q776J7145O17j6973J0489J1214j9247k52J8087j2492j0291
1366a2273J7684J583j6507N543J4292j1783j0039J9394K535k1660R076J5582j7710
1379d283m731J8537n595j3295J0430P157j3846k851J6680n182j4259J3833N815
1392H410j7529O164J4139j3540n297J4846j260j3589N879J1393j1413o749J6771
1405H225l051j7071J2653Q591j6694J246J3810p418q455J0040N003j1964J76J4119
1419I210p460j0013J3437P65j3518Q631P018j3079l46J1775l365j1689O853R608
1433G827j1571m382J4413l988j0656J1541L135j1152L681P250o371l397P590J1
1447C931r976M668J0511j2281o191J5362k316j1951P326N674p284q31O347j416
$$ y = [-642, 13105, -1794, -10570, 6575, 7192, -9781, 708, 11922, -7325, -7577, 10510, -1982, -12273, 5411, 6994, -9513, -3970, 10322, -1461, -11500, 7894, 10429, -11231, -2155, 13427, -4283, -9014, 9523, 3928, -9367, 1063, 8220, -5626, -8477, 8203, 3021, -11238, 2595, 8410, -9119, -2955, 11184, -2356, -7653, 7193, 5933, -7656, -1777, 9616, -1797, -8546, 8225, 5174, -11897, 756, 9347, -7347, -6101, 7709, 291, -8164, 1876, 6879, -5085, -4909, 9210, 1750, -8263, 5174, 5939, -7579, 1052, 8070, -5009, -5355, 6420, 3055, -8634, -1781, 7827, -3744, -8126, 6287, 2299, -8357, 3184, 6319, -4833, -1152, 6098, -273, -3670, 3920, 3931, -6045, -1377, 9134, -3147, -9338, 6024, 3708, -8243, -917, 4757, -2527, -3358, 2989, 1573]
1461A573n928N756M718r529J238R861q753m842J1543k153r151M345N965m631n076
1476e064N577K381p345K796N754p608P89Q682o221l898P656j23o065J123O330
1491D764k093p680M765M848p522j00N231l668m79L717l368n12L371L5k747k22
1507a660M643k86o046M897L301q254J418O086l269l002J403J731K72l025N63J047
1523a81j812K237N36l210L435J536m492K213J553j586L16r14J727N6l238J576
1539b48K074l427O30P08p33K066k040j122K568n97L24L95k145K548J916l932R40
1556g5K565j766j992l09L541M33o026J682M833m123j398L133j111K57J19q10J994
1573I47M52o93j148r41M835j205o405N478L525p723n65O371j387m530P59L805
$$ y = [1573, -4355, 1401, 6119, -3410, -2172, 7689, -1064, -5906, 5637, 3484, -5667, -1322, 4643, 12, -5064, 513, 2894, -4451, -1655, 4099, -3509, -2720, 5962, -259, -4157, 3499, 3376, -2689, -1566, 4764, 2671, -5009, -244, 4604, -2918, -3018, 2213, -1455, -1934, 1783, -1585, -2097, 1274, 1309, -1438, -1660, 2983, 2697, -3349, 1548, 4849, -3405, -1987, 4099, 830, -2172, -769, 962, 1234, -1791, -1228, -181, -1993, 244, 780, -2430, 1005, 2541, -1951, 262, 1815, 229, 545, -369, 1358, 1414, -1824, -248, 1826, -1601, -971, -263, -996, 1070, -970, -2092, 476, -121, 203, 598, -1547, 1001, 2917, -1015, -75, 2490, 724, -1268, -1577, 1964, 2397, -3629, -1947, 2886, -1237, -2635, 498, -613, -356, -237, -1047, 947, 1399, 706, -442, -1383, 3452, 2247, -4158, 1320, 4845, -2878, -3443, 2928, 1541, -2989, -2230, 1575]
1589A575j646l295N169k92n321N442J931o891L375M134m586j655M859j56n229
1604b586Q13N906m762m324Q281j000q641P169L346q425J617O593l688m605N714
1619A408M074q363n35R870n187p428J0101N21r643M376N286o509k037O128k65
1634A797o809M240O355r258m00J0972o072q062J1498K215j1774K682R691n760
1648A315q184Q417M594j1770J434J1215q584n557J1580k385r026Q006M524r289
1662c710R0J0448l995j0174R729N899j4405K171J3342r883p652J2746k05j2191
1676g790N354R811q916o741J3014P87j4408P884J0243j3381j426J3798n918r157
1690f846R545L509j0854J783J0609q401q957J4559J982j6850P429J2762j4745
$$ y = [1575, -71, -3366, 1803, 1511, -3810, 1632, 3563, -3328, 47, 4181, -405, -2060, 2799, 2643, -2586, -1773, 4133, -629, -4953, 3328, 2328, -6313, 856, 4202, -4223, -2606, 3987, 299, -4306, 1408, 5482, -2881, -3416, 6454, 1267, -6161, 3940, 4461, -5182, -806, 4480, -2029, -4066, 2062, 1797, -5012, -772, 5583, -3675, -4075, 6897, 825, -7237, 4261, 6476, -5298, -2616, 7075, 1315, -6869, 1548, 6142, -5628, -4194, 7021, -1563, -7120, 4460, 2075, -6951, 1055, 5579, -3710, -3620, 6828, 2833, -7341, 2388, 8287, -6118, -3947, 9395, -488, -8140, 4606, 4401, -7790, -2436, 7375, -1541, -8282, 4732, 5519, -8889, -1005, 9238, -4143, -5569, 8229, 2311, -6846, 2699, 6208, -4646, -2863, 7746, -655, -9612, 4947, 6929, -9921, -2492, 10270, -4475]
1703d475m746J5830j794j2812P623R237j1681m202J4750l893j2789J2146N476
1716H670j5834L272J2568j0665o768J3249J609j3730M330J2232j2242o266J7653
1729H078j861j6399J1570Q425j5673j47J5221o192j2152J1083O135j5166J69J6393
1743I484q986j0941J5824O75j6067P763J1331j2162l545J4155k615j4264Q821
1756e27J0553j5097j448J8210r316j4252J5014M693j6303L806J4348r035j0841
1769a0195J2864M077j5576N623J4607j2955o582J6042m712j3175J2468P910j4973
1782d577o27J3536o914j3201J3613Q131j7565K362J5479j2585r402J7266R27j4386
1796g943P570J0949j2664o888J5828j009j4910J0498J0225j7663k053J5974q442
$$ y = [-4475, -9221, 6609, 4815, -7997, -374, 8863, -2818, -7020, 7730, 3837, -8952, 3194, 8670, -7164, -3892, 8676, -1989, -8757, 4492, 6101, -7629, -3299, 8933, -3309, -9575, 8078, 6217, -10182, 1388, 9813, -5860, -6007, 9214, 3022, -9130, 1953, 8088, -7078, -6909, 9484, 498, -10443, 5381, 6056, -10011, -2248, 9083, -3079, -6624, 7531, 4916, -9348, -527, 10026, -5071, -6519, 11691, 2375, -11877, 3137, 7830, -8473, -4667, 9681, 646, -10195, 2669, 6746, -8830, -3207, 11400, -1555, -8137, 7905, 3193, -9982, 2486, 10396, -4577, -5204, 8332, 1418, -11783, 1830, 9961, -7604, -5242, 10237, -2348, -11750, 5516, 6443, -7943, -373, 10576, -2088, -8976, 6852, 5843, -9067, 1431, 11656, -6007, -8060, 7914, -528]
1809e28r014J4199L242j5845K332J3788r672q794J7664K396j8962O847J2682j4388
1823d053l824J6551l230j2884P695O928j3339j571J6244n716j2563J3575M237
1836H050j8051M791J4881j0208o551J3243j31j4423N499J1819j0734m690J5823
1849I318m775j6022J2079Q421j5715J538J4904q039j1892J0687O305j3245K134
1862d302J4587r301j0085J4154k01j3712R746R472j2844l289J2237m005j2580
1875a0123R622J0055j3921k640J5554p911j2108J4190M799j3133L529J0453q987
1888f21p127J1722K385j2332N394J0861j3810m716J4863m136j1208J0751N053
1901G079j2707j63J1487m564q996J0904N126j4299K217J2733j0573n204J3923
$$ y = [-528, -9542, 4657, 7899, -7946, -5614, 8174, -1498, -10292, 7372, 9768, -9194, -2347, 10335, -4053, -7877, 8674, 5444, -7440, 255, 7183, -6156, -7727, 8517, 2801, -9762, 3813, 8050, -10001, -5210, 9671, -537, -7088, 6155, 6024, -8399, -2900, 8919, -1815, -6505, 9318, 4543, -11479, 600, 9021, -6694, -5156, 9748, 1709, -10183, 504, 6809, -6436, -4302, 10285, 984, -9101, 5053, 4852, -8860, 886, 10358, -2486, -5775, 6462, 2457, -10123, -501, 9554, -4367, -7007, 8547, 636, -11472, 2718, 7517, -5616, -2087, 8366, -621, -7748, 3974, 6359, -5973, -579, 10282, -3528, -8244, 6619, 2483, -8725, 2026, 7079, -5628, -5791, 5696, 1132, -7864, 3040, 8166, -6133, -3916, 8817, -1756, -6960, 6963]
1914F963j288j2468N990P730r802m162J2011m97j1999P128P248j2140m6J2259
1928F927o391o764J0198Q99j1116L496J0356o913p857J2166J506j4202N351R743
1942G399r788k938J0475l280q340O405M904q241r64J0865m658r435J0326L843
1956F573j1973L009J0088p999n061Q283L15p921L052P029p049m166J0277k606
1970A851r686R039N124j0530O31R528m620o683O677M195q243n39Q889n235o102
1985e704Q819k8r044N440N334p945j137P824j722o933M571O281q046j969R294
2000E035l408o361P305J358p324K474M828m463l336N995P76p507K588O863p075
2015b252k812Q961j782o917N207L557n515r80N287o21n069L597L312o697Q26N968
$$ y = [6963, 5675, -6793, -803, 6927, -2875, -7037, 4974, 4477, -7522, -394, 6854, -5286, -5332, 6927, 536, -6228, 3970, 4869, -6247, -2751, 7605, 692, -7165, 5001, 6507, -7695, -2344, 7399, -2389, -5327, 5148, 1868, -6472, -67, 4837, -3404, -4368, 6497, 1839, -7596, 2730, 6573, -5400, -2391, 7697, -302, -5363, 2920, 3235, -4686, -1634, 5395, -1654, -5820, 4457, 1851, -7835, 1204, 6328, -4202, -3571, 5957, 1337, -5346, 1331, 5526, -2717, -3256, 5633, 398, -5704, 3115, 3087, -5957, -517, 4817, -3128, -4265, 3559, 1837, -5096, -525, 5756, -2290, -4259, 5035, 1627, -4734, 2571, 3929, -3395, -921, 3907, -556, -3892, 2103, 2879, -4628, -2040, 4823, -2252, -5064, 3897, 2115, -4802, 405, 3962, -1553, -2533, 2754, 2133, -2936, 661, 3973, -2724, -1898, 4070]
2031D070n302k724O547j459n422L761L523m109k623N435Q65o161L206N098o116
2046a411q04N644k615l201L890P36l842L93L143j485l908L896J803n386K018M190
2062C061l924m27L372j614k152K348J258k620p27L855j132m608L970K491n648
2077b497P83L755k074j562J505P94j054q23K021m05j403K198K5l087K986P01l413
2094a550J413J884j752q57O39J301j727q99K557j141k061K711M76k402J236J027
2110H55j023j10K57R54j31j617J525L89j868J046k11m60O92j316m69K205j032
2127c14n15R39k01L04m39n46K238q05j356J757l87o95O7o39J518o97k242K353
2145C40O01k636R71J449m96p30l67J735O5k143J871N48k140J141M78j233J145
$$ y = [4070, -1232, -3956, 2591, 1132, -4290, -529, 2994, -1115, -3738, 1697, 2562, -3599, -393, 4705, -1411, -2215, 3429, 814, -2387, 1503, 2239, -1603, -1210, 1933, 448, -3460, 436, 2239, -3147, -1129, 3061, -863, -1290, 2082, 468, -1684, 664, 1922, -698, -1425, 2430, 1298, -3310, 660, 3151, -2497, -1714, 2041, -33, -1595, -90, 704, -350, -1173, 848, 443, -960, 1238, 1263, -1824, 1162, 1863, -1550, -137, 1747, -5, -862, -223, 1078, -649, -1548, 1009, -132, -2193, 518, 994, -1408, -172, 855, -168, -278, -21, 933, 802, -815, 710, 1099, -769, 277, 66, -394, 298, -1018, -1487, 718, -314, -829, 110, -91, 213, -226, -772, 1466, 661, -695, 1062, 675, -20, 47, -592, 926, 229, -2013, 340, 941, -1695, -724, 725, 229, -501, -868, 867, 932, -1211, 660, 1208, -932, 209, 687, -546, 599]
2162E99k8j246O94L28m28r90M76J835j677j561L465o31k850K742Q04l048J316
2179b00J971j103k180J549K475l529j050M524j973l004L305M58k768J375Q37j512
2195h25J70J273J8k232J739K465m509J57N629l610l466M721J156m604P47L198
2211B027j511l742L334K280n021N53N128l850j924M777r28l073K888J320k848
2226e90k31L243r44m451L625K253o163J449N599m971l090O247K8n384J977M890
2242C487l051m185O048R21o218K587M614n639p72N241k941k648L516J122m513
2257b431N58M727l124l836O457Q42p644L975N107o250j874P106j266n730K679
2272g04M712n070k733O925q15o842N413K649o782J441N656m202k780N008N66n670
$$ y = [599, 571, -675, 19, 347, -81, -1071, -595, 1240, -437, -1998, 1467, 836, -2014, 728, 1532, -1516, -200, 1771, 668, -1512, 37, 2512, -1017, -2067, 2457, 484, -2520, 785, 1243, -1525, -150, 687, -825, -655, 618, 636, -1596, 143, 2608, -1901, -1744, 3885, 275, -3191, 1530, 2686, -1918, -1171, 2027, 516, -3226, 108, 2388, -2633, -2080, 3048, -802, -2726, 2051, 1123, -1950, 938, 2258, -590, -821, 2422, 1478, -2973, 652, 2905, -3258, -1809, 3790, -1181, -4271, 1976, 2004, -3380, -1403, 3487, 436, -3749, 2299, 3220, -2998, -411, 4203, -1436, -2208, 3033, 92, -2556, 960, 2082, -2431, -1873, 2854, -270, -4106, 2351, 3193, -4451, -476, 4631, -1619, -3493, 3613, 2347, -3383, -704, 4008, -1062, -3795, 3130, 2315, -4527, 886, 3535, -3247, -1806, 3850, -352, -3132, 1876, 2442, -3228]
2288c228J893N762n220l033P381j291p621O024L724p262L39O603k787n869M696
2303A11M345o897r54Q108l780n970O978J081o716L093M735m903j956N579q39o518
2319d503M546N185p986j077Q480m051o514P467K712p922J376O712m219n044O570
2334A732K588p815K033O932o798l662Q288j300o199M867L101o469j167O561j569
2349A123n866O408L179r063J684Q474o681m359R116L14q263K438O250n611m281
2364e138Q041R00q734M085N325q166j3Q271l486n157N607J818p174J780P511m727
2380G43n236P619J117j0059M503O662p064k313Q168k259p647M558N288o078j523
2395c521Q241k608p947O796L309q106K582P001n455m577O205Q86o823K551P254
$$ y = [-3228, -1335, 4427, -793, -3826, 3555, 2264, -5357, 667, 4391, -2871, -2532, 4071, 1284, -4585, 111, 4456, -2441, -3395, 4713, 933, -5037, 1941, 3022, -3694, -601, 4134, -769, -2725, 2854, 2015, -4503, 43, 5228, -2758, -3835, 4645, 594, -5920, 1547, 4259, -3663, -2287, 4425, 206, -4838, 1732, 4320, -3495, -1462, 5470, -1328, -4990, 3298, 1998, -4201, 666, 3767, -2702, -3869, 2692, 1123, -4743, 1665, 4844, -4219, -2535, 5939, -742, -5101, 4015, 4329, -3934, -1496, 4754, -857, -5138, 2903, 3803, -4931, -846, 4479, -3687, -3700, 4571, 1085, -4072, 1535, 3353, -3821, -2041, 5470, 743, -4493, 3126, 4243, -5816, -1313, 5349, -1715, -4028, 4140, 1881, -5766, -1208, 4080, -1998, -3521, 4720, 2112, -5835, 961, 4270, -3836, -1254, 5747, 292, -4285, 1920, 2806, -4017, -1466, 5788]
2410E788o395m000P853k016p558O806M846q149k18P253l869n743O288M781q062
2425b395l26P843n073n602Q266M69p038L576M510o638j607O618j061o245M982
2440B79N376q775j282R057l743n820P446K633q242Q28N999l800m284O936J342
2455C950q042K212O292o455k380Q429j897o806M872L501o156m46O894k039n736
2470c807N362K963q437J213P856n236l926P408r60p095L137N112m469l043O958
2485C036o01p480M253N385o850J09O956l703m891N214J641n747Q69O286m040m998
2501d561O223J225p554L560N341n765k257O630j568n091L886L956n230j545O347
2516C597k281n566N684K306o996J904N326n030k703N412Q22n649J849N246m614
$$ y = [5788, -607, -4607, 3246, 1230, -6328, 478, 5324, -2825, -3043, 4210, 341, -5402, 886, 5667, -2395, -2721, 5122, 49, -5553, 2713, 3182, -3856, -280, 4230, -2408, -4015, 2603, 1542, -4703, 279, 5655, -3120, -4402, 4655, 912, -4908, 2538, 5171, -3071, -2243, 3756, -44, -4328, 2608, 3950, -4092, -1880, 4412, -2043, -4423, 4006, 2109, -4697, 175, 3676, -2480, -2926, 3968, 1929, -3807, 1555, 4518, -3919, -2706, 5150, -86, -4012, 3396, 2436, -4659, -1522, 3590, -879, -3922, 3036, 2435, -5045, -792, 4593, -2257, -2148, 4808, 1105, -3786, 1428, 3069, -2678, -1809, 4477, 437, -4561, 1662, 2887, -4667, -1107, 4234, -1531, -3788, 2842, 1274, -3817, 69, 4025, -1205, -2750, 3597, 1316, -4250, 1434, 3740, -3256, -1352, 3974, -1056, -3759, 1653, 2475, -3174, -1325, 3921, -693]
2531f93l326O741o22n717M601K721n967N93M792k384l846L961K391n366n9N734
2547C554l729l859O081J67n734K834M036m565r45M472m53m459K800L291n105j142
2563b756O267k601m151M463J042m770R22M023l018k350L863J102m842J779M599
2578C572m325j885N559j397m292K962K436l815l35L567r53l808K848K264m543
2593b145M15M387l230k292M152k64k717J252K363k044j561L461k56m044K657K917
2609C051n051M1M340k440k402K566J833k989o01L115p89k490K531R18l038J128
2625b77K571k927n15K898j087k260J503J439j886j443L407o12l196K659J780l632
2641a578O29K571k123q34J822P22j692l89K356j292j550K619j2k841J922P36j781
$$ y = [-693, -4019, 2722, 2100, -3617, 984, 3705, -2262, -1669, 3123, 739, -3107, 854, 3245, -2121, -2180, 3554, -175, -4034, 2047, 2214, -3520, -686, 3350, -1215, -2160, 2312, 1859, -2600, 200, 3491, -1614, -2756, 3511, 910, -3241, 1222, 2264, -2506, -1584, 2439, -579, -2929, 934, 2036, -2806, -1027, 3572, -753, -2638, 2921, 1524, -2768, 194, 2630, -1185, -1520, 2047, 1094, -2714, 134, 2398, -2145, -1730, 2657, -573, -2865, 1287, 1023, -1694, -442, 1921, -123, -1684, 1777, 1521, -2523, 134, 3051, -2000, -1959, 2381, -59, -2461, 105, 1938, -1051, -1652, 1463, 674, -1816, 715, 1633, -1405, -277, 2294, -633, -1148, 1750, 663, -1597, -94, 1345, -541, -1984, 1423, 811, -2385, 274, 2054, -1578, -949, 1622, -501, -1335, 487, 1209, -483, -872, 1484, 192, -1358, 1261, 1249, -1592, 330, 1066, -715]
2658g15L52J005o48r33R60Q78j890J5K353j113j631K316m2j925J278R57j219q01
2676h03R96N00q86q08J556n43q18Q34j25m58R79m17o50J050J84k66m69R37n6j061
2696c24p6J619j167j093J486j96p09J79k85J50M62o84P11k98K01N99m64Q4O63
2715H58o55N9J75n58N41l31n89N49j32m31O79l54k1L52n71L37K85o4J55l83m5
2736a44J134r90q71J780l40j086J25R39j85p15k8J190j096m80J153n81p86R49
2754c2l1o82P32J11l88K00N92p4q30O24J157j915l8J766j385j072J919k72j046
2773f64oQ25l25r06J064P28j731O32J824j796j7J550r97q04R11L35j145k58J296
2792E16m23j402J258R50k313R24J786j959o05K498k54j911O99J775j098j876K203
$$ y = [-715, -363, 642, -6, -939, 21, 899, -991, -976, 1377, 264, -1367, 949, 907, -1018, 260, 1217, -2, -803, 193, 693, -193, -1001, 555, 12, -806, 28, -97, -555, 424, 7, -643, 407, 591, 325, -144, 793, 737, -324, -400, 1219, 52, -1041, 445, 249, -460, -281, -566, -416, 46, -638, 73, -225, -24, 575, 111, 195, 858, 203, 262, 437, -121, 420, 89, -500, 49, -83, -514, 165, -189, -210, 142, -429, -92, 193, 129, 284, -99, -144, 990, 0, -871, 909, 569, -517, -392, 547, 362, -353, -381, 809, -287, -767, 386, -195, -981, -32, -63, -745, -13, 98, -290, -90, 502, 428, -402, 222, 1379, -536, -574, 1192, -193, -1265, 654, 382, -664, -670, 155, -170, -1076, -12, 716, -1015, -383, 1441, -355, -372, 1178, 181, -623, 288, 623, -522, -780, 516, 93, -1309, -51, 899, -1414, -490, 1296, -663, -1268, 1230, 976, -935, -236, 1539, 441, -1435, 768]
2809G68O44k690J033J760k235j25J805j255r03J734J00j774O86K130j803j669
2825a794L189N8l232J693K126k731p65K605n85j717R68J685k253r69L166j067
2841C77k522K753N69k729P30K197j442j073J973K2j997Q71K369k428j408L397
2857A659r63k861K714J334l262J60K794j082k302J807J880l099k67L712k138j589
2873a503K700Jk759J310J692k112o92K809m89l027K118K252l771k93L954k253
2889f3k464L598O69l329O72K789j649k067K942P50l687J217K813l208q37L914
2905B060j360k995K579J297k906k47L506j242k874K950J620m384J062L447k908
2920c95j480L362m56l186J673K532k566j748L690J3l739J828K683l349J30L317
$$ y = [768, 1412, -1278, -245, 1515, -720, -845, 960, -295, -1198, 536, 636, -1138, -452, 1678, -125, -1794, 1395, 1453, -1779, -86, 2040, -691, -1456, 1149, 564, -1153, -185, 1500, -753, -1722, 1444, 377, -2145, 608, 1177, -1552, -822, 1375, -67, -1140, 833, 855, -1142, -271, 2098, -330, -1738, 1659, 696, -2165, 549, 1883, -1379, -1219, 1575, 493, -1809, -2, 1878, -1221, -1488, 2224, 86, -1503, 1197, 1198, -1561, -251, 1441, -671, -1363, 1446, 957, -2070, 48, 2300, -1471, -1764, 2190, -63, -2527, 1071, 1740, -1589, -917, 1872, 223, -1844, 1098, 1848, -1839, -622, 2191, -1017, -1854, 2060, 700, -2295, 284, 1581, -1325, -1572, 1934, 692, -2182, 768, 2388, -1996, -934, 2513, -395, -1875, 1487, 1031, -2155, -482, 2050, -516, -2264, 1426, 1439, -2300, -472, 2211, -1138, -1008, 2309]
2936B309k189j848K452Q13l117R52L324k872k320L846L22m653K692L032l278j522
2952b057L357m84k763J954K201k923l79L374k011k731L523J217m041J178K927
2967B342l015j706L422N46l481J249K889l266j442M516j024l291K960J611l874
2982a564J6L653j580k440K693J524l792Q0L698k430k281M019l3l826J834K204
2998A775k774o86L374p57k885J919K277l933J23M102j893k724K977O02l330O84
3014a149L142j864j816K463M93l660J610L015l316m38L808j816k718K528J698
3029A980k636l56L217j320l040K546J570l550P26L227k530j778K663M5k527J699
3045f4K182k595j332L541r41l318K766K047l306j69K928j876j962K541J088k749
$$ y = [2309, 120, -1728, 724, 1537, -1580, -628, 2696, -176, -2496, 1350, 1672, -2981, -289, 2743, -535, -2057, 1300, 816, -1947, 7, 2208, -715, -1094, 2280, 269, -2462, 1061, 2278, -1763, -585, 2342, -673, -2379, 1043, 1589, -1892, -643, 2246, -1020, -2462, 2054, 1030, -2261, 699, 2310, -1564, -1548, 2105, 525, -1915, 778, 2302, -1490, -1410, 2288, -142, -2423, 1596, 1563, -2263, -429, 1775, -999, -1685, 1689, 932, -1953, -34, 2243, -1690, -1567, 2535, 642, -2082, 895, 1497, -1833, -1149, 1993, 129, -1687, 776, 1269, -2391, -781, 2234, -1082, -1520, 2288, 472, -2246, 282, 1980, -656, -1012, 2205, 885, -2155, 391, 1961, -1589, -863, 2364, -166, -1944, 719, 764, -1763, -64, 2118, -477, -1809, 1732, 791, -2527, 239, 2286, -1020, -1189, 1739, -137, -2099, 442, 1530, -1219]
3061a219L00K653k008j842L118L03k984J717K043l193l66K940n74k164J659J428
3077A811k780o67L301j519k040K694P96k849M94K644k266j131K632K81k743R02
3093d40K303k733p72L384n07l176K225J205k558P6K316q28k051J766J018k465
3109a237K73K956j953j990L160J67k940J561J629k205k64J914l90k075J302J654
3125A562k227l86K535j350j889K335N12k327O13K103j558j440K031O31k388J023
3141b20K080k395l87K194q01j865J582R57j844m08J894n67j639J800Q91k429L29
3158h28K190j446r55J642%j559Q39J066j230q70K127k97k096J641J083k526J80
3175a039K290j240q75J324K03r41m2J287q35j092J655O5j753R56Q03j361K13J229
$$ y = [-1219, -919, 1734, -274, -2116, 1002, 1305, -1679, 38, 2081, -1112, -1478, 1462, 888, -1276, 383, 1811, -969, -1636, 1665, 146, -1894, 800, 1596, -1253, -759, 1885, -381, -1512, 1120, 1401, -1342, -440, 1863, -870, -1642, 1742, 1235, -1941, 284, 1489, -1069, -993, 1323, 495, -1556, 210, 1228, -1237, -964, 1992, 39, -1951, 1209, 1376, -1564, -3, 1626, -579, -843, 1071, 681, -1394, -92, 1562, -665, -1051, 1484, 134, -1755, 580, 1092, -1235, -622, 1481, -77, -1517, 514, 1145, -1243, -220, 1860, -535, -922, 1272, 471, -1394, 188, 1145, -699, -1107, 787, 220, -1419, 381, 1272, -1157, -828, 1362, -84, -1039, 603, 603, -956, -117, 949, -281, -1151, 976, 679, -1417, 224, 1307, -1219, -1039, 1251, 11, -864, 460, 663, -278, -320, 967, 132, -960, 695, 760, -993, -37, 766, -595, -382, 847]
3193H47n98j041Q79P43j420k56J800n15j502J313O73j827L12J653j144m29Q02
3210B90M28q99oJ123j062n64J494p88r36Q29O16j252L52Q67l26n70M31N75j239
3229f37M06J044p77p37J544m02j220O46O33q78j09P40Q8r04L39P63r67N9J185
3248H16q58k45O58m3p30L76N00l16o90Q25r0n64J60P46r91m8O82m58k73P34j44
3269D7P4k15J17M44o25K13K03l12P8K74n06L23R3n63J96r6L78j22q9K40j52j68
3291a68K06M10n86M68j10j97pQ2k60K16j41j17L10m06K60j28o4J17j5j79K70L02
3313B63m94L79r4N2j72K15j47r0P7pk04J35R0l71L54L57o98N27rm10j64N85k28
3336e4J05l3J21j38j20M21J97p31L41M29q38K18L90q3n36m6M69k93L2K67j16l62
$$ y = [847, 249, -792, 87, 830, -590, -846, 954, 439, -1063, 250, 923, -904, -592, 1061, -83, -512, 290, 718, -181, -187, 936, -126, -690, 804, 16, -920, -91, 525, -727, -375, 492, 166, -404, 27, 602, -637, -231, 813, 36, -701, 843, 441, -779, -133, 500, -378, -487, 253, 341, -563, -224, 539, -428, -369, 816, -42, -287, 371, 328, -402, -26, 474, 158, -532, 293, 203, -361, -201, 545, -446, -494, 188, -270, -543, 191, 47, 121, -94, 23, 467, -158, 55, 258, -54, 24, 298, -208, 115, 208, -355, -159, -255, 123, 1, -88, 152, 0, -168, 38, 448, -138, 330, 220, 23, 16, 98, -162, 54, -87, -204, 106, -300, -40, -168, -232, -115, -130, -309, -39, 263, -231, 148, 54, 106, -66, 149, 2, -88, -11, -18, -222, -87, 3, -368, -14, 343, -355, 172, 163, -247, -411, 174, -54, 51, 18, 139, 1, -119, 302, 499, -232, 109, 538, -300, -82, 308, 225, -311, -357, 112, -181, -149, 118, 2, -360]
3358c60M41J38m23K56M89n72p0N62j95n27L55J98l38k26M76K80j203N78K80n35
3378c96J98M69m15k62L38K89n06K02Q68o77o25R80k47p90N52N25q73PL94k8m80
3399d77L82O08q58J95P47n95p08J129l8q76N68L86n24m87Q15J84j217O12O17o67
3419b04l56J292o81p08R15Qj118M76J044m63n92R06M14j268J14J265j018n64Q80
3438C42j67r75R15L20r49o0R35j79r86Q88P65j487L87J263j051p07J441m7j080
3457d32M35P14o87p21J282k41j467J156P83j262l07J287q30m74R38L29q61k0J258
3476H80r39q74J626k06j101Q63N79j141j87J074l72p15M21Q19j229j88J273k87
3494B96j206J457M40j351P3J271j082o63J029L40j106M15J037j109o17J358o2
$$ y = [-360, 81, 219, -204, 52, 541, -31, -101, 461, 266, -261, 94, 292, -46, -272, 204, 484, -719, -141, 139, -396, -198, 271, -144, -406, -68, 221, -285, -83, 785, 108, -517, 463, 216, -574, -22, 503, -370, -363, 31, 3, -477, -95, 513, -345, -150, 597, 2, -706, 423, 385, -491, 77, 463, -61, -548, 267, 451, -766, -154, 463, -204, -560, 732, 51, -657, 258, 266, -852, -376, 668, 205, -387, 519, 933, -335, -221, 1044, 26, -538, 342, 175, -800, 115, 435, -514, -574, 361, 182, -804, 84, 849, -638, -251, 1012, -39, -746, 695, 648, -432, 3, 717, 30, -691, 591, 350, -1117, 39, 822, -440, -747, 540, -290, -764, 174, 503, -358, -378, 880, -59, -933, 693, 487, -614, 249, 828, -313, -500, 574, 202, -513, -92, 727, -502, -690, 583, 296, -910, 547, 987, -364, -291, 980, -102, -765, 264, 604, -502, -87, 950, -159, -776, 582, 520]
3511E20j337Q86M42j086k04J240k52q59J037J86j058m6J481r90q39J484Qj294
3529f81M91Q55q96m80J138J93j698R32R88j498l14J971n73r80P73K03j042M03
3547b15R54p15n09O25N26j521O81J130j433k90J467n54q61R83L65r37j22R64k25
3566C13j179J191M71j455K38J324j165o90J517j98j017N58M09j098J95R81j1j471
3584a087J577N42j612J02J448j049n29J149j0j108Q3J312j144o59J458K01j509
3601h35Q60L81r45k59J363k20j005P79N70j292J0J292p14o30R05K42j279K67J311
3620H01j363j83J417k92r05J47J006q44l01J318n19j096J156L72j238J93J063
3637G32m43j133J129N97j307j96J466m71j034J189n90q45Q81O05q87k04J109k12
$$ y = [520, -817, 69, 511, -575, -779, 461, 209, -650, 387, 573, -485, -531, 950, -40, -879, 605, 613, -681, -190, 665, -231, -711, 427, 620, -1078, -146, 842, -656, -970, 1001, 428, -552, 221, 424, -618, -215, 739, 24, -485, 140, 666, -855, -174, 956, -477, -767, 700, 146, -715, 268, 633, -304, -426, 538, 313, -866, 325, 796, -659, -421, 903, -262, -952, 565, 367, -650, -92, 317, -781, -586, 395, 384, -1087, 490, 1032, -580, -478, 970, -79, -608, 541, 531, -577, -494, 818, -326, -985, 473, 674, -835, 25, 406, -539, -798, 565, 345, -660, 119, 689, -603, -593, 699, -15, -645, 260, 502, -777, -510, 801, -562, -745, 672, 380, -525, -378, 628, -216, -517, 801, 282, -814, 342, 714, -524, -331, 732, 289, -844, 285, 882, -425, -621, 845, 374, -660, 529, -61, -906, -25, 580, -307, -511, 598, 386]
3655C86j152O09J049j285j95J448n25j172J296j27r60P17M48n21n45Q39K36j152
3673f06L02J206r22m08P59j63o83Q37J40n91j94O29p7q14J064lj022O19L82p14
3693b59j76R10k08q27R33K62j046J77N31K8q48P40K27p56k71J005n51j72M50L03
3713D52j005M12P99r23l25R95o1j031N70N56n02k90Q80l63m71M18K98r84L98N78
3733D01m83n70Q89J91r86N83O65q01k65N86j81m01M74N62o51k54P35m83m51O76
3753B36N7o06M12K46m27l29O69j10n57L13O91n80l79N03m2m36M04K65n54J65L43
3774B84j76n89J29P54p07J79L31k81J2K19J47o28L15L28l75o8K60L33o15O1O22
3795E35q35J57N02l92j33L70K33q04J42K68J18m93M15M4l30J87M82m54j42J51
$$ y = [386, -766, -157, 892, -393, -588, 860, 335, -837, 459, 332, -628, 89, 537, 16, -529, 310, 546, -606, -304, 902, -20, -428, 331, 168, -515, 322, 462, -129, -323, 306, 229, -585, 479, 476, -546, 73, 455, -259, -435, 475, 267, -560, 373, 635, -411, -234, 297, 325, -523, 217, 444, -312, -583, 422, -129, -301, 149, 452, -553, -141, 658, -265, -590, 405, 344, -687, -117, 439, -63, -353, 527, 164, -307, 111, 409, -575, -177, 401, -82, -652, 237, 428, -558, 25, 690, -111, -376, 210, 29, -372, 102, 664, 13, -241, 494, 11, -440, 236, 293, -313, 99, 345, -82, -411, 258, 148, -409, -96, 595, 15, -364, 139, 97, -339, 65, 330, -224, -59, 284, 108, -481, -352, 402, -305, -126, 205, -76, -64, 155, 302, -326, -11, 317, -58, -126, 134, 467, -148, -87, 535, -300, -143, 359, -33, -166, 204, 437, -367, -225, 43, 161, -332, 83, 127, -203, -16, 466, 12, -130, 21]
3815B1L63j73Qk3n39K96J97P3o82O25J05m36N0K03K9k78K45R0l71J46M67m99j69
3838b52O06l87m7J49k12j51K56M0K5l19L36R2l37r5N63l23k2L19j58k81K01J15
3860A18k81K32K23k44oM2J04l60J15K13k67J22p5k6K10n4J32k33N6K99p5k10j63
3883a28L34l27K52q1j67j50L40P0k35rj68O8L28k43j43K53q5M24l88KR8J17k48
3906h6K69m37K56q9J0L5N0p4J09j57O0L08l25m0l4N5J08L0m30M50j34k6o4L69
3930B13k89j32K49r2J06j59K18l49K68J08n6k54K05j34N4N2J23L24m57J61N3n90
3952c78M08P3l65J17J23j98L7M77k4o21J50M11j35l83M55K78n31P5L52m65R4J5
3974c5j3k23L11j45j11J87P8p6p5P9J98k31k6N58n70k22K96J94k52k34N42O1m92
$$ y = [21, 384, 211, 219, 196, -343, -47, 150, 223, -459, 166, 271, -165, -115, 88, 117, -161, 84, 174, -197, -51, 416, -83, -252, 354, -33, -80, 69, -143, -294, -38, 2, 27, -292, 44, 136, -201, -296, 267, -56, -78, 241, 83, -198, 3, 118, -163, 69, 292, 48, 42, 84, 188, -172, -57, 156, -111, 11, -64, -90, 120, 66, 198, -35, 21, 320, 245, 35, -128, 206, -121, 131, 50, -117, -267, 73, 143, -92, -101, -269, -201, 127, -116, -259, -6, -91, 333, -55, -53, 45, 162, -86, 183, -254, 2, -87, -77, -42, 8, -66, 43, -114, -54, 254, -71, -111, -145, -90, 18, 48, -382, 68, -66, -92, -156, 213, -76, -208, 41, -51, 55, -104, 114, -235, 33, 141, 85, -169, 36, -98, -44, 8, 131, 455, -2, 159, 212, -378, 30, 103, -262, -145, -22, -220, -183, 294, 270, -351, -201, 210, 75, -308, 147, 425, -106, -31, 321, -144, -50, -35, -48, -271, 40, -105, -216, -29, 49, -27, -102, -23, 175, -56, -82, 476, -94, -316, -20, 174, -78, -312, 230, 291, -201]
3997b01L72p3m47J34L94k02o5M50k49l88L55J64k81k21L62p2l13L39L17p91N07
4018I1K92n07r8O8L22l43j10O90k82o21P80Q7o58K69N19q92O4R61n82m16L95J35
4040A64n52K00M22n36o7N95j85m08K44K76j41l20M61j48n30O83N51p87j15O65
4060D72m79k67M96K01n15M9K17k51l11O36o0q96O25L65m30LN92k75k97K30K14
4081C19l95k57R49m63l68L67K26n86KM76k70l98O86j46n51L52L12m60j54R20l72
4102A89q39Q26K80q87R5P28k27j91J52K53p86J85O91m50l72O71j4n23N24K53o24
4123f6p9O63k08p32L49O26o54M2N77l39j017J051L3m51M06J71l87l72M32N6m45
4144c44L09O84j138K33P85m39p09J015m26q1r0O04m38n71Q72m2n07L09P64j024
$$ y = [-201, 171, 98, -349, -215, 179, -23, -88, 362, 113, -275, 80, 244, -37, -258, 104, 32, -281, 58, 375, -416, 91, 383, -124, -222, -154, 168, -175, -285, 405, 123, -498, 282, 369, -289, -20, 499, -393, -329, 632, 50, -366, 29, 164, -388, -188, 234, -302, -369, 226, 41, -367, -123, 153, 12, -308, 153, 5, -525, 158, 709, -78, -193, 472, -7, -274, 222, 423, -92, -43, 174, -77, -388, 248, 188, -708, -83, 282, -148, -145, 447, 172, -125, 105, 319, -76, -333, 616, 153, -215, 152, 378, -208, -206, 270, 0, -398, 288, 142, -409, -57, 255, -205, -359, 561, 189, -650, 176, 456, -431, -336, 392, 165, -26, 126, 379, -407, -222, 469, 19, -353, 318, 304, -219, 305, 558, -66, -145, 518, 310, -422, -73, 553, -101, -59, 518, 179, -838, 213, 246, -205, 201, 372, -15, -387, 45, 101, -344, -35, 649, -489, -256, 529, 90, -619, 396, -30, -111, -201, 403, -35, -606, 266, 224, -283, 26, 790, -234]
4164b34m42R26J38p73L91L62o15j27P48m51l39O26L45j025j73J309p37j81P36
4183D84l50n86M36L64n51m37J040k94m93M49L70r33Q3R07l28k73P9O20j064K35
4203b42O74l37o01P95P5j036P37P12r16k53O62j1p22N89O17j199P2J043n83o45
4223e69P39L18j195P29L66j77o07O31j06m96L32M04l13l92N28k16m49L78O12p40
4243b23l38R76m58n05J026k37o39K10O46o71l79R81j25m50J58L37l17n22M99M10
4263C79p41L76J63l90j78Q26m10q14R04L92p68k47P48j89j92K33l5n02M29N23
4283E07n94m29P98k76l50N10K37n75q9N35O9r54N99L70q40K23L25n9o12P89K58
4304D42r05M84K91k49m15P78j30p30O55L17p36mN94m17k63L48J48m93mP48o74
$$ y = [-234, -676, 250, 388, -385, 6, 368, -247, -374, 374, -77, -416, 210, 555, -470, -643, 666, -71, -252, 484, 134, -452, -16, 348, -203, -640, 400, 106, -387, 62, 432, -501, -418, 489, 161, -112, -33, 587, -477, -242, 432, 95, -506, 289, 364, -672, 65, 777, -139, -392, 270, 259, -463, 126, 743, -456, -384, 659, 76, -569, 170, 488, -707, 22, 388, 211, -396, 235, 129, -367, -35, 369, 56, -336, 192, -24, -473, -95, 517, -223, -561, 415, -43, -548, 478, 241, -398, -188, 458, -213, -592, 389, 264, -186, -28, 309, -8, -530, -31, 379, -362, 14, 177, -213, -391, 435, 25, -789, 115, 507, -261, -508, 240, 51, -141, 92, 57, -445, -16, 507, -87, -516, 282, 6, -344, 166, 403, -172, -261, 274, 343, -611, -12, 358, -482, -259, 66, 7, -605, 184, 442, -463, 21, 312, 63, -352, 426, 296, -434, 221, 538, -198, -202, 392, -25, -288, 60, 208, -285, -289, 459, -215]
4325b15k90R72l13n51O69L56q17q4O99k57l99K39K57m68j24N09qn28M74L00p23
4346c02M35J10lm24K85q5m91K28O15k99k71L32k9p80M80P73q91J9O19l60q2L02
4368A81J15o41L30L53m01j24L39j3l82J67M38n41J37K87l20m46M15L52o24o6Q38
4389C94m12l20O78m23k56J89M21l18L64m1j39l59J38J06p4KK36o0n33M80J02l93
4411b18J92N4P7l43M34Q3n04m1P52n81k13L14J48k40l0J53o2n8J95%k66L31rl75
4435b07L02K86m94LJ99n4R1j00J57j66k33k2J95j18J16K21k19l85P04j98k17K82
4457A43m72K48L43J21j72l02K01pM5j64l4p6J3J31j00Q6j85L61o3r6J53j07N7
4480A24j3k5j84L8K63j91j08J9j0R0l4J27j23K18j40k1K9J12k45k5J15j85L02
$$ y = [-215, -505, 467, 154, -397, 272, 628, -189, -273, 426, 169, -230, 9, 266, -202, -326, 183, 175, -353, 121, 421, -302, 133, 243, 240, -184, 101, 16, -475, -247, 368, 69, -202, 130, 101, -679, -199, 574, -317, -298, 321, -39, -121, 181, 296, -345, -15, 338, -63, -187, 152, 139, -243, -76, 362, -179, -42, 245, -75, -521, -106, 246, -378, -444, 394, -18, -338, 340, -83, -339, -150, 271, -47, 317, 276, 137, -222, -84, 22, -52, -50, 186, 126, -407, 73, 175, -218, -26, 28, 105, -238, 196, 279, -225, -266, 486, -95, -308, 6, 154, -86, -116, 37, -25, -83, 112, 112, -154, 177, 168, -207, 95, 381, -113, -110, 89, 35, 126, 26, 183, 17, -216, -238, -43, -161, -45, 176, -43, -428, 276, 78, -139, 143, -329, -81, 262, 383, 211, -91, 110, 103, 148, -16, -50, -126, -113, 18, -82, 4, -181, 180, 117, 21, 174, 67, 124, 111, 86, -98, -60, 203, 12, -96, -77, -87, 3, -31, 96, -27, 191, 51, 30, 59, 171, -74, -99, 16, -169, 133]
4503A33Rk81K79o0K16k53P2j58Q9l46N37J3k26L61l98j75K49j28o7J34K19j20
4525I9k49K54n6J88l55K4R4j32J25J97k64o3J07j25k11M45J85n13J91K30P6o56
4547d09O82k50l30L20K68l24k31N74j47J32k70L97n21p4M55j42l05L06M9n22K23
4568a19J73J50l79L1J98l40J77J45k04j26M94O8o39N12R2l51j71L43k09Q9m7M25
4590C12n75O3M71n93j58O21n9k51L81j23Ql98M00J27o81K15O31n43j04O69m32
4611a9k55K94J83m15L56K51k62n76O49L65p81J07P13p25k87P23j24n04L63L85
4631D41m06l03L75k86k84O40J26o31K37N22l87o46Q80k34l39j4Q89p49k49Q69
4651D51L3j026P09K55r09M15K81k71j26K35K11o01R4O60m72m29O16o3n01L27M72
$$ y = [133, 142, -139, 140, 80, 296, 43, 115, -43, 46, -300, 237, 250, 24, 385, -13, -188, 61, -67, -134, 0, 219, 99, -150, 104, 48, 236, -119, -95, -1, -133, -8, 189, -75, -138, -31, -156, -367, 78, 263, -250, -59, 171, 247, -409, 273, 23, -307, 13, 281, -43, -274, 300, 153, 285, 15, 412, -109, -183, 272, 130, -175, 131, 180, -342, -119, 54, 204, -175, -144, 54, -286, -109, 36, -168, -294, 200, 268, -371, 141, 233, -118, -289, 54, -155, -66, -113, 312, -263, -200, 271, -322, -480, 141, 82, -169, 212, 89, 97, -301, 99, 226, -455, -240, 391, -152, -256, 413, -19, -274, 20, 203, -212, 144, 395, 133, -443, 206, 571, -210, -103, 610, -115, -402, 321, 197, -307, 56, 441, 35, -268, 107, -179, -463, 177, 303, -328, -91, 431, 44, -602, 278, 44, -295, -309, 580, -169, -418, 451, 484, -542, 167, 422, -487, -72, 209, -62, -188, 47, 258, -343, -249, 411, -61, -490, 126, 63, -438, -111, 361]
4672C61p57J89M54m3n61K36M52r00N00L69m28k41N75K09j030N20M10j97n12P46
4692C52k4n61K58L91q05j73J052l38m63K06P03j267N24P65m57l00N69Jr83P06
4712A56L48l85k39M51j91o22L85N95j041Q7R34k99n83L79N19p53pQ87o07l14N17
4733B17O6o81J82O53l89o34N56L30p54K18O03p31QP34l42o80O99J69m58m4Q77
4754E99l94q32R13J86q02m9P85k07n74O39Q1p00K64N33q27k4Q06k57p81O62L70
$$ y = [361, -396, -207, 247, 204, -357, -121, 331, -569, -69, 300, -128, -369, 206, 415, -615, -95, 315, 118, -394, 352, 328, -233, 25, 416, -389, -562, 490, 152, -311, -105, 598, -669, -145, 620, 163, -137, 432, 433, -550, 156, 504, 119, -120, 331, 140, -482, -97, 498, -543, -456, 478, 179, -404, -25, 494, -259, -266, 621, 14, -300, 217, 283, -398, -216, 437, 48, -586, -30, 300, -454, -236, 367, -364, -356, 378, 36, -644, 55, 224, -234, -278, 599, 205, -627, 286, 472, -330, -379, 406, 199, -375, 264, 345, -355, -91, 442, -385, -409, 397, 140, -641, 21, 391]
$$ [...]
8191a85
##END NTUPLES=NMR FID
##END=
