##TITLE=1H_IG Biphin
 200.13MHz,DMSO-d6.
 8 sc
 
 12.1.2026
##JCAMPDX= 6.0         $$ Bruker NMR JCAMP-DX V2.0
##DATA TYPE= NMR FID
##DATA CLASS= NTUPLES
##ORIGIN= UXNMR, Bruker Analytische Messtechnik GmbH
##OWNER= pz
$$ XWIN-NMR		Version 3.5
$$ Mon Jan 12 15:25:31 2026 Russian Standard Time (UT+4h)  she@DPX200
##.OBSERVE FREQUENCY= 200.1313
##.OBSERVE NUCLEUS= ^1H
##.DELAY= (6, 6)
##.ACQUISITION MODE= SIMULTANEOUS
##.ACQUISITION SCHEME= undefined
##.AVERAGES= 8
##.DIGITISER RES= 18
##SPECTROMETER/DATA SYSTEM= spect
##.PULSE SEQUENCE= zg30
##.SOLVENT NAME= DMSO
##.SHIFT REFERENCE= (INTERNAL, DMSO, 0, 14.3821)
##AUDIT TRAIL= $$ (NUMBER, WHEN, WHO, WHERE, WHAT)
$$ ##TITLE= Audit trail, XWIN-NMR		Version 3.5
$$ ##JCAMPDX= 5.01
$$ ##ORIGIN= Bruker BioSpin GmbH
$$ ##OWNER= she
$$ F:/spectra/data/she/nmr/H-C/1/audita.txt
$$ ##AUDIT TRAIL=  $$ (NUMBER, WHEN, WHO, WHERE, WHAT)
(   1,<2026-01-12 15:23:34.60 +0400>,<she>,<DPX200>,
      <created by zg, POWCHK disabled, PULCHK disabled
       configuration hash MD5:
       00 E9 B6 7A A2 85 ED C7 34 08 36 98 17 FE 4E 26
       data hash MD5: 16K
       BF 19 B2 4A 1E 9F 16 09 75 2E 7B 66 02 9C A7 0B>)
$$ ##END=
$$ 
$$ hash MD5
$$ 28 94 FE C4 68 21 0D 74 C9 81 3A 00 2C 44 5D 08
##$RELAX= 
##$RELAX= 
##$RELAX= 
##$RELAX= 
##$RELAX= 
##$RELAX= 
$$ Bruker specific parameters
$$ --------------------------
##$DU= <F:/spectra>
##$EXPNO= 1
##$NAME= <H-C>
##$PROCNO= 1
##$TYPE= <nmr>
##$USER= <she>
##$AMP= (0..31)
100 100 100 100 100 100 100 100 100 100 100 100 100 100 100 100 100 100 
100 100 100 100 100 100 100 100 100 100 100 100 100 100 
##$AQSEQ= 0
##$AQ_mod= 1
##$AUNM= <au_zg>
##$AUTOPOS= <>
##$BF1= 200.13
##$BF2= 200.13
##$BF3= 200.13
##$BF4= 200.13
##$BF5= 200.13
##$BF6= 200.13
##$BF7= 200.13
##$BF8= 200.13
##$BYTORDA= 1
##$CFDGTYP= 0
##$CFRGTYP= 5
##$CHEMSTR= <none>
##$CNST= (0..31)
1 1 145 1 1 1 1 1 1 1 1 1 1 1 1 1 1 1 1 1 1 1 1 1 1 1 1 1 1 1 1 1 
##$CPDPRG= <>
##$CPDPRG1= <>
##$CPDPRG2= <>
##$CPDPRG3= <>
##$CPDPRG4= <mlev>
##$CPDPRG5= <mlev>
##$CPDPRG6= <mlev>
##$CPDPRG7= <mlev>
##$CPDPRG8= <mlev>
##$CPDPRGB= <>
##$CPDPRGT= <>
##$D= (0..31)
0 0.7 0 0 0 0 0 0 0 0 0 0.03 0 0 0 0 0 0 0 0 0 0 0 0 0 0 0 0 0 0 0 0 
##$DATE= 1768217013
##$DBL= (0..7)
120 120 120 120 120 120 120 120 
##$DBP= (0..7)
150 150 150 150 150 150 150 150 
##$DBP07= 0
##$DBPNAM0= <>
##$DBPNAM1= <>
##$DBPNAM2= <>
##$DBPNAM3= <>
##$DBPNAM4= <>
##$DBPNAM5= <>
##$DBPNAM6= <>
##$DBPNAM7= <>
##$DBPOAL= (0..7)
0.5 0.5 0.5 0.5 0.5 0.5 0.5 0.5 
##$DBPOFFS= (0..7)
0 0 0 0 0 0 0 0 
##$DE= 6
##$DECBNUC= <off>
##$DECIM= 32
##$DECNUC= <off>
##$DECSTAT= 4
##$DIGMOD= 1
##$DIGTYP= 9
##$DL= (0..7)
0 120 120 120 120 120 120 120 
##$DP= (0..7)
150 150 150 150 150 150 150 150 
##$DP07= 0
##$DPNAME0= <>
##$DPNAME1= <>
##$DPNAME2= <>
##$DPNAME3= <>
##$DPNAME4= <>
##$DPNAME5= <>
##$DPNAME6= <>
##$DPNAME7= <>
##$DPOAL= (0..7)
0.5 0.5 0.5 0.5 0.5 0.5 0.5 0.5 
##$DPOFFS= (0..7)
0 0 0 0 0 0 0 0 
##$DQDMODE= 0
##$DR= 18
##$DS= 0
##$DSLIST= <SSSSSSSSSSSSSSS>
$$ [...]
##$SUBNAM0= <"">
##$SUBNAM1= <"">
##$SUBNAM2= <"">
##$SUBNAM3= <"">
##$SUBNAM4= <"">
##$SUBNAM5= <"">
##$SUBNAM6= <"">
##$SUBNAM7= <"">
##$SUBNAM8= <"">
##$SUBNAM9= <"">
##$SW= 18.0517328524113
##$SWIBOX= (0..15)
0 0 2 0 0 0 0 0 0 0 0 0 0 0 0 0 
##$SW_h= 3612.71676300578
##$TD= 16384
##$TD0= 1
##$TE= 0
##$TE2= 300
##$TE3= 300
##$TEG= 300
##$TL= (0..7)
0 120 120 120 120 120 120 120 
##$TP= (0..7)
150 150 150 150 150 150 150 150 
##$TP07= 0
##$TPNAME0= <>
##$TPNAME1= <>
##$TPNAME2= <>
##$TPNAME3= <>
##$TPNAME4= <>
##$TPNAME5= <>
##$TPNAME6= <>
##$TPNAME7= <>
##$TPOAL= (0..7)
0.5 0.5 0.5 0.5 0.5 0.5 0.5 0.5 
##$TPOFFS= (0..7)
0 0 0 0 0 0 0 0 
##$TUNHIN= 0
##$TUNHOUT= 0
##$TUNXOUT= 0
##$USERA1= <user>
##$USERA2= <user>
##$USERA3= <user>
##$USERA4= <user>
##$USERA5= <user>
##$V9= 5
##$VALIST= <valist>
##$VCLIST= <CCCCCCCCCCCCCCC>
##$VD= 0
##$VDLIST= <DDDDDDDDDDDDDDD>
##$VPLIST= <PPPPPPPPPPPPPPP>
##$VTLIST= <TTTTTTTTTTTTTTT>
##$WBST= 1024
##$WBSW= 4
##$XGAIN= (0..3)
0 0 0 0 
##$XL= 0
##$YL= 0
##$YMAX_a= 115676
##$YMIN_a= -118376
##$ZGOPTNS= <>
##$ZL1= 120
##$ZL2= 120
##$ZL3= 120
##$ZL4= 120
##$ABSF1= 10
##$ABSF2= 0
##$ABSG= 5
##$ABSL= 3
##$ALPHA= 0
##$AQORDER= 0
##$ASSFAC= 0
##$ASSFACI= 0
##$ASSFACX= 0
##$ASSWID= 0
##$AUNMP= <proc_1d>
##$AZFE= 0.1
##$AZFW= 0.1
##$BCFW= 1
##$BC_mod= 2
##$BYTORDP= 1
##$COROFFS= 0
##$CY= -3
##$DATMOD= 1
##$DC= 2
##$DFILT= <>
##$DTYPP= 0
##$F1P= 0
##$F2P= 0
##$FCOR= 0.5
##$FTSIZE= 0
##$FT_mod= 4
##$GAMMA= 1
##$GB= 0.15
##$INTBC= 1
##$INTSCL= 1
##$ISEN= 128
##$LB= 0.25
##$LEV0= 0
##$LPBIN= 0
##$MAXI= 10000
##$MC2= 0
##$MEAN= 0
##$ME_mod= 0
##$MI= 1.114404
##$NCOEF= 0
##$NC_proc= 0
##$NLEV= 6
##$NOISF1= 3.799351
##$NOISF2= 2.8
##$NSP= 1
##$NTH_PI= 0
##$NZP= 0
##$OFFSET= 14.38212
##$PC= 1
##$PHC0= -3698.159
##$PHC1= -0.4076929
##$PH_mod= 1
##$PKNL= yes
##$PPARMOD= 0
##$PSCAL= 0
##$PSIGN= 0
##$REVERSE= no
##$SF= 200.129724274929
##$SI= 16384
##$SIGF1= 3
##$SIGF2= 2
##$SINO= 400
##$SIOLD= 16384
##$SREGLST= <1H.CDCl3>
##$SSB= 0
##$STSI= 0
##$STSR= 0
##$SW_p= 3205.1282051282
##$SYMM= 0
##$S_DEV= 0
##$TDeff= 0
##$TDoff= 0
##$TI= <>
##$TILT= no
##$TM1= 0
##$TM2= 0
##$TOPLEV= 0
##$USERP1= <user>
##$USERP2= <user>
##$USERP3= <user>
##$USERP4= <user>
##$USERP5= <user>
##$WDW= 1
##$XDIM= 8192
##$YMAX_p= 0
##$YMIN_p= 0
$$ End of Bruker specific parameters
$$ ---------------------------------
##NTUPLES= NMR FID
##VAR_NAME=  TIME,          FID/REAL,        FID/IMAG
##SYMBOL=    X,             R,               I
##VAR_TYPE=  INDEPENDENT,   DEPENDENT,       DEPENDENT
##VAR_FORM=  AFFN,          ASDF,            ASDF
##VAR_DIM=   8192,          8192,            8192
##UNITS=     SECONDS,       ARBITRARY UNITS, ARBITRARY UNITS
##FACTOR=    0.0002768,     1,               1
##FIRST=     0,             0,               0
##LAST=      2.2672688,     0,               0
##MIN=       0,             -118376,         0
##MAX=       2.2672688,     115676,          0
$$ Real data points
##PAGE= N=1
##DATA TABLE= (X++(R..R)), XYDATA
0@%%%%%%%%%%%%%%%%%%%%%%%%KnOj1J6j6J6j6J6j9K2k3K7l2L6l8M2m9N4n9O6p2
46c7P8q7R7j07J17j28J43j60J77j96K19k47K77l12L60m20M96o00P47r76J377k204
68a386M556k3798r7748L1970J29710P2372n3679j04670m5900M1523P2011L8611
80F3572j7689n9913n6598P920Q4779P5224k8376j11198o8687N9916J17933L4237
92A01120q7082r7805K238R0404O9641j4665o5954n3688m517M5828O1926K4737
104G2183n1059q7702k5043Q2261J02951q76j08862q7288L5325J08237N0956n3168
116C7915q3066k3724M3446N6513K3984k0583n1642m4357J1877P2417N9528l1644
128E0664r7260m8885O4037J02712J6816q5477q1689J2652P9403N3489j8006n5180
$$ y = [0, 0, 0, 0, 0, 0, 0, 0, 0, 0, 0, 0, 0, 0, 0, 0, 0, 0, 0, 0, 0, 0, 0, 0, 0, 2, -3, 3, -8, 8, -8, 8, -8, 8, -11, 11, -12, 15, -17, 19, -19, 23, -26, 28, -31, 35, -37, 41, -46, 51, -56, 61, -67, 76, -84, 93, -103, 116, -131, 146, -166, 194, -226, 270, -330, 417, -559, 818, -1386, 3170, -20628, -118376, -86406, 43304, 115676, 61997, -42673, -88573, -47050, 24961, 63572, 45883, -14030, -70628, -62708, 22071, 97295, 68919, -42279, -110966, -51050, 66883, 101120, 14038, -83767, -81529, 8875, 78516, 63851, -2103, -55791, -60308, -14480, 47446, 72183, 21124, -66578, -91621, -9360, 93591, 92715, -16147, -103435, -68110, 40127, 91083, 37915, -45151, -68875, -25429, 31084, 55068, 34485, -17157, -61514, -49637, 22780, 82308, 50664, -46596, -95481, -31444, 71268, 88084, 2607, -79082, -66430, 12973, 66462, 48456, -6724]
140f724m0637O27L8800N1132J6782m7398p3798j4726P4943Q3235r136r4323o5948
153h7171L8562R0831L2587n2971o7957j1247M2417M6903J5767k1684m4438l4272
165e2673J5431O2856M4819l5910q4237l2910O3983Q7913O996p8203o7607J6819
177e2723O9623M0470k1699m8812l0845M933L6017M4166J2138m3609o2118q115
189f0574O5155O5578j6895q2812m8392M3363P9233K1586n1200n6932m475L9482
201f883L7371P939k2941l9399k5407K0632N8522L5405l7131p5031k4386O0694
213a0615P3938j779p1935n4301K1055O2447L2291k1074m1427k4663N912L0678
225E27L4641N834l9535n0939k21O1338N3130k2332p3570l5605M3657O7213J1504
$$ y = [-6724, -47361, -46734, -7934, 43198, 59980, 12582, -61216, -75942, -999, 82236, 73100, -21223, -87171, -48609, 42222, 74809, 21838, -46119, -57366, -14949, 31954, 47721, 26037, -18401, -52673, -37242, 25614, 70433, 34523, -49714, -82624, -18641, 69272, 76268, -1935, -69542, -52723, 16900, 57370, 35671, -13141, -43986, -39053, -3036, 41130, 53268, 9659, -52459, -60574, 4581, 70159, 53264, -29548, -77940, -34577, 44656, 66242, 15042, -41890, -46365, -6883, 30488, 38427, 15486, -23913, -49320, -28688, 29834, 65239, 28108, -46923, -71309, -10615, 63323, 61544, -10391, -64692, -43637, 18810, 51101, 30027, -11400, -36063, -30151, 527, 35168, 41002, 1467, -49472, -49693, 11645, 64775, 42443, -31127, -66732, -23075, 44138, 55642]
238E5642n0084m7923J712L8425L2172M217k1746l5471j9720K1506N0540K5855
250E5125l6532o3326j5261N6640O0375p576o1830m1946K1125N2773K3644k1313
262B1898l5908j8384Q897K8261K8249M64l7542m1113O617N5185M0697k6663o4348
275c3690k4950M3969N8099M945m7089m0788M443L4949K8550K608k2286l1692j5924
288c8856K2458M5921J9482l6343n4948q211N2125M9671j1331n6315l2341K4127
300b4561M5594J6590k1709l1567j3530J1143K6667K2666n169l5928l2453J2552
312b9705N0535L0736k9126n6719j6662M2286M9670L83m2881l4758N892L1787K4781
325B6219Q46k1172k7910j0871K2411L8745J2692l4860m5220j342M7082L8970j5459
$$ y = [55642, 5558, -42365, -40653, -2228, 29944, 34161, 12415, -23056, -42776, -21270, 29270, 55125, 18593, -44733, -59994, -3354, 57021, 49445, -12385, -54331, -33206, 19567, 43211, 21898, -14010, -32394, -23497, 4764, 33013, 33477, -4065, -45178, -38561, 16624, 57321, 30658, -33690, -58640, -14671, 43428, 48373, 1284, -39504, -35061, -112, 28438, 31046, 8760, -22932, -38856, -16398, 29523, 49005, 12662, -42286, -50497, 1628, 51299, 39968, -16347, -48688, -24561, 21033, 37623, 15914, -15653, -29183, -18040, 8627, 31293, 26124, -9804, -42257, -29705, 20830, 51566, 22440, -34279, -50941, -8655, 41015, 41398, -1483, -36241, -30349, 1438, 26219, 27065, 5893, -22017, -32888, -10477, 28268, 40960, 6100, -39120, -40462, 6620, 45590, 30131]
338C0131m9200k3413K5484L9293J1102k2171k8346j0044J3229K5481J7935r064
350B0417l4193k5287J6273M5762K2944k9780m8847j0488L8697M1152k393l7962
362c705k8796O944K8199K1523o83k0283k4342o286K2292L2162N375l2950l6288
375c6838N125M2975K9755j8253m2649j6557K4979L4459P062k2843k6471p479J4968
388a1767K5268J5097j1713l1731j9508J8419L9689J5713k9944m1442n363L5859
400a423L3685m332l2568k2619P904K4665J7393m107k0265k0485j305K3105K6114
413B5762k45l0898k7107J0194L7771K1158k0188l7867j2363K4297L0710N387k0748
426E863k3700o145J5834K3578J1445j4269k9149j4587J9128L3796J0360k6792
$$ y = [30131, -19069, -42482, -16998, 22295, 33397, 11226, -17120, -27164, -13935, 11546, 29481, 20417, -13776, -39063, -22790, 22972, 45916, 16136, -32711, -43199, -4502, 36650, 34257, -3705, -32501, -25557, 2642, 24165, 23482, 3199, -21143, -27429, -5137, 27025, 32400, -550, -36838, -31713, 11262, 41017, 22764, -19885, -36442, -11463, 22996, 30058, 7215, -19256, -26735, -11767, 13501, 28598, 16885, -14846, -34354, -15935, 23754, 39467, 9523, -31919, -37282, -1423, 32262, 27930, -4638, -27257, -19353, 5312, 22705, 18598, -1667, -22152, -23457, -352, 25762, 25517, -5381, -32488, -22294, 15477, 36635, 16447, -21420, -33783, -9486, 21224, 26611, 5863, -17837, -23982, -8148, 15430, 26875, 12606, -16543, -31130, -12002, 21794, 32154, 5362]
438E362l3298r83L1388K6634p034k8677j7981Q802K2701J3671n978j9840j6411
451b1644L206K2785K1014m926k8923k1047J2484L3766J5614k0655l2724q694K2057
464g687K7316M564j9295k1086m506J5155K1139P870j5654k5333r257J9145K7723
477B0094N467k4115k5488L050K7605J9874r292k6189j4767R445K1547J1988p252
490A1967j9306j2693O818K2560J6133r454k7975j6593J4026K9428J1665j8460
502H116k6488n625K0881K2995J993j8328j9628l691J4397J9031M961j4752k0186
515a6324l443J8846K2111j18k3499k0459N240K4155J5271r447k2346j0873J0890
528i996K0582R710r590j9852j1363Q344K1252J3030j0755k3331j1716J4445K4961
$$ y = [5362, -27936, -28919, 2469, 29103, 22069, -6608, -24589, -15787, 6914, 20585, 14607, -5233, -21644, -18438, 4347, 25361, 20435, -8488, -29535, -17051, 16715, 32329, 11674, -21050, -29744, -7687, 19629, 24193, 4898, -16188, -20694, -5539, 15600, 23470, 7816, -17517, -26774, -7629, 20094, 25561, 1446, -24042, -20992, 6613, 26487, 17195, -8994, -23761, -14316, 7231, 19219, 11967, -7339, -20032, -13214, 9346, 25479, 16025, -11950, -28543, -14517, 14911, 26576, 8116, -18372, -23997, -3116, 19879, 21872, 3544, -16084, -19775, -5378, 13653, 18614, 3862, -16324, -19767, -921, 21190, 21072, -2427, -22886, -17646, 6509, 21780, 12333, -10013, -20886, -9996, 10586, 20296, 10706, -9146, -20509, -12165, 9087, 22117, 11362, -11969, -23685, -9240, 15721]
541A5721P831j7461k3147l535J7687J8882J462j5862j6469r80J4797J5862Q76
554A5664j5644j6540O2J8296J7443l237k0874j5876P772K1683J1623j0444k0584
567a0656r189J1031J9316Q603r676j8693r384R580J9132Q780j1111k0300p586
580b0153J4065K0888M640j5429j8427k072J5312J5221o53j5036j3746J949J5524
593B083J2780j739j4960j3524K601J7028J2462n689j7875j2246Q839J9401J0612
606A9773j0118j8731p872R318J6815O566r548j6376o590J0637J7031O807j1707
619F005j7243m820J2418J5993J825j3826j4633R97J5165J2715k193j4664j1764
632a4025L099J4144J0919m507j5237j0211N798J6374J0515o302j7496j0132R176
$$ y = [15721, 23552, 6091, -17056, -20591, -2904, 15978, 17440, 1578, -14891, -15871, -1074, 14788, 15664, 20, -16520, -16458, 1838, 19281, 16044, -4830, -20706, -12934, 8749, 20372, 9928, -10656, -19845, -8814, 10502, 19105, 9429, -9264, -18648, -9068, 10064, 18844, 7733, -12567, -20153, -6088, 14800, 19440, 4011, -14416, -16488, -1176, 14045, 13392, -1644, -15390, -13441, 2083, 14863, 13124, -1836, -15360, -12759, 4269, 16731, 11042, -6833, -19079, -10240, 9161, 19773, 9655, -9076, -16948, -7630, 9185, 15751, 6203, -10173, -16763, -6126, 10905, 17712, 6005, -11238, -16058, -3640, 12353, 14178, 352, -14281, -13284, 1881, 14596, 12403, -2261, -14025, -10926, 3218, 14137, 9630, -5607, -15818, -10020, 6354, 16869, 10567, -6929, -17061, -7885]
645g885J6036O533q493j5721o081R889J5277N508r747j4239n185J0072J3798L453
659A3215j1165j3173j798J2286J2858K5j3230j1903J872J3505J0683l929j3115
672c869r973M807J3937R473n635j4081r713O425J4458R063p733j4773o652P709
686f557J4501O431q840j4050m791Q700J3372L142r217j2124k624J0563J1957q4
700A0379j0607j0766J123J1665R889j967j2924r251K456J3908R151m608j3542
713e094p996M954J3262Q161o064j3336o651O285J3038O673p731j2806n153P994
727d464J1859L761p637j1410l281R227J0808J017r019j0092k11J0025R703j217
741I069j0679r255K079J1568Q646l287j1662q601M186J2374P485m576j2177p085
$$ y = [-7885, 8151, 14684, 6191, -9530, -15611, -5722, 9555, 15063, 5316, -8923, -14108, -4036, 9762, 13215, 2050, -11123, -12921, -635, 12223, 12248, -982, -12885, -11013, 2492, 13175, 9246, -3869, -13842, -9035, 4902, 14375, 8740, -5341, -15054, -8629, 5829, 14892, 7159, -7614, -14266, -6557, 7944, 14375, 5535, -8515, -13306, -4606, 8766, 11908, 2691, -9433, -12057, -1494, 10463, 10379, -228, -10994, -9871, 1794, 11683, 9716, -3208, -12459, -10003, 3905, 13056, 8448, -5094, -13090, -8136, 5126, 13287, 7223, -6113, -12764, -6479, 6559, 13232, 5501, -7305, -12458, -4464, 7395, 11156, 3519, -7891, -11172, -1945, 8863, 9880, 861, -9231, -9442, 583, 10286, 9069, -1610, -10865, -8786, 2782, 11428, 8141, -3521, -12122, -7936, 4438, 11923, 7347, -4830, -11915]
755a1915N225J2149O308n963j1324n751O181J1347M594o928j0561l501P566J0117
769G544J964p963r768q77Q792R122l92r202q658J128J0047Q490k413j0533q041
784a0760L147J0938P475l424j1298o647M019J0853O319m788j0909n518N315J0342
798E064M720n566r553l565O076R305K441o918r217j531P727Q484N81q257p829
813h038Q62Q546P549j536r317p778K118R763P172k650r504o469L200R786O374
828A0078m341r454n714L657R372N324m787q694l499N048Q544K571n558q360k412
843h225O384Q002J142o745p516j07P781P256q84q579o825J188Q578O418j578q231
859a941o305K420Q566O283k988q818o062L252Q544N077l657q438l675M260Q104
$$ y = [-11915, -6690, 5459, 11767, 5804, -5520, -11271, -5090, 6257, 10851, 3923, -6638, -10139, -2573, 7544, 9508, 1545, -8223, -9100, -308, 8814, 8422, -780, -9438, -8310, 1737, 10227, 7814, -2719, -10760, -7613, 3325, 10800, 7376, -3922, -10569, -6550, 4303, 10622, 5834, -5075, -10593, -5278, 5064, 9784, 4218, -5335, -8900, -2824, 6481, 8922, 2004, -7213, -8744, -1017, 7467, 8048, -209, -8038, -7176, 1370, 8919, 7383, -1934, -9712, -7594, 2169, 9341, 6691, -2813, -9282, -6082, 3704, 10078, 5737, -3717, -9431, -5774, 3598, 8922, 4135, -4559, -8058, -3010, 5534, 8105, 2547, -5813, -8225, -1841, 6161, 7303, 558, -6958, -7065, 716, 7972, 7088, -1491, -8316, -7128, 1450, 7868, 6290, -1941, -8246, -5826, 2740, 9023, 6035, -2783, -8845, -5593, 2951, 8028, 4371, -4067, -7742, -3482, 4622]
874D622K694m550p194k792N111P038J567n572o570o78O157O395N38p127o525L59
890f527P835O206j444p854n948J759P840N520k164p346n098K033P687N112k951
905D660p227m808L151P480L597l861p270k216M671O580J835n303o303r57N095
920h76O145L19n482n980J95O093O250r4p142o624J362P115N781j825p295m710
936f768K237O856M531k340o345m360J950O200L886k518o065l282L567O636K132
951F317m556o299j249M803N586L94n059n086R5N422N449k16n880n427J53N803
967B50N751p02o340n133J044O828M891k104o352m102K313N393L192k160n016k757
983e004K467N123K766k864n398k488L650N721J262m669n452p7N143N146j58n603
$$ y = [4622, 7316, 2766, -4428, -7220, -2109, 4929, 6496, 924, -5646, -6324, -167, 6228, 6766, -361, -6886, -6527, 1308, 7514, 6070, -1784, -7732, -5973, 1867, 7387, 5223, -2123, -7221, -5188, 2499, 7611, 4660, -2567, -7375, -4224, 3256, 6853, 2992, -4278, -6494, -1823, 4757, 6592, 1289, -5014, -5971, -876, 5269, 5588, 106, -5874, -5679, 414, 6664, 6570, -572, -7196, -5834, 1281, 7062, 5237, -2058, -6768, -4531, 2325, 6856, 4516, -1829, -6189, -4239, 1961, 5847, 3329, -2736, -6018, -2451, 4185, 6317, 1761, -4538, -5787, -984, 4602, 4996, -63, -5149, -5054, 368, 5817, 5601, -279, -5706, -5553, 250, 6001, 5299, -1041, -6174, -5130, 1698, 6589, 4485, -1867, -5969, -3656, 1737, 4929, 2769, -2247, -5004, -2537, 2586, 5352, 2488, -2910, -5398, -1748, 3973, 5235, 566, -4886, -4963, 180, 5326, 5168, -435]
999d35m758R22M598N153o94m790n108K17N534M756n77n644m714J050O157L786
1015E453k093n743k432K462M673J858k407m332j720K870M325J558l184m680j737
1030e129M059N268Q36n029n057M35N098M449n46m930m100O67M306L740j8m242
1046a93m150N30M111M590j114m944l828J980M852K436k479m192j797L673L113
1061B588J447l059l638j144K193M664J191l534m431r29M261M991J54m720m438
1076d404L6M806L782q65l835l479O64L731L429o59l582l108L82L845K855j071
1092B527m238k492K379M193J815k791m144j010L086L747N01l247l462n29L122
1107e43L942R66l545m291p07L785M328P2m352l667M28M158L038j259k791k440
$$ y = [-435, -5193, -4271, 327, 5480, 4786, -4, -5112, -4895, 639, 5395, 4818, -826, -5540, -4490, 1667, 5453, 3360, -2383, -4815, -2353, 2320, 4178, 1771, -2561, -4281, -1411, 2914, 4472, 1288, -3392, -5129, -1070, 4198, 5034, 5, -5052, -4617, 481, 4930, 4384, -546, -4646, -3979, 327, 4067, 4049, -193, -4343, -3813, 298, 4888, 3774, -1170, -4998, -3018, 1834, 4270, 1791, -2401, -4198, -525, 2588, 4035, 976, -2662, -3806, -1613, 3051, 4242, 708, -3723, -4652, -391, 4600, 4754, 34, -4404, -4368, 438, 4220, 3355, -480, -3959, -3295, 436, 3865, 3206, -376, -3484, -3102, 743, 3598, 2527, -1711, -4203, -1824, 2369, 4184, 1393, -2751, -3761, -675, 3072, 3573, 326, -3136, -3665, -543, 3399, 4365, 820, -3471, -4178, -393, 3935, 4007, -345, -4012, -3584, 574, 3612, 2353, -438, -2878]
1123b878M37K743K344o80l189k150J247L533K074j655l562k011K450L896R85k980
1139F04l856m38L228L532K02k859l355n03K877L514M34k869l712p48L858L327
1155C236N9l611l045P29L290K508j027l108k015J269K926J830j297l346r47J639
1171i10K725J205j599l884q59K333L950M21k705l617p62L347L087L51k796l270
1187b983j11K738K790M93k590l235KK981K748m25k943k500J213K865J628j317
1203A354k671j165J244K851R84j294k729j240J641L148J027k386l351o86K682
1218e91L048O40k555l219j33K875K560J34k272l020n21L258K062L55k815j754
1234a948m57L570J488j403j852k583J700K495J488j641k152q24J675K551N78k015
$$ y = [-2878, -2441, 302, 2646, 1966, -1223, -3373, -2126, 1407, 3481, 1826, -1736, -3747, -1297, 2599, 3584, 604, -3252, -3690, -462, 3070, 3272, 413, -2942, -3445, -568, 2946, 3380, 511, -3201, -3949, -91, 3236, 3295, -316, -3361, -2632, 658, 3166, 2139, -969, -2984, -1715, 1211, 3041, 1744, -1602, -2549, -910, 1815, 3020, 1421, -2463, -3322, -989, 2961, 3382, 677, -2940, -3702, -355, 2732, 3083, 287, -2983, -3094, -356, 2434, 2927, 337, -2898, -2896, 85, 2833, 2408, -535, -3035, -1822, 1043, 2671, 1354, -1317, -2482, -1238, 1613, 2597, 1303, -1426, -2666, -1025, 2123, 3150, 764, -2587, -3273, -591, 2457, 3097, 542, -2677, -2810, 65, 2625, 2759, 487, -2533, -3054, 204, 2266, 2621, -194, -1948, -2405, 1165, 2653, 1250, -602, -3185, -1485, 1010, 2498, 857, -1295, -2119, -444, 2107, 2685, 670]
1250F70k793q96K113K668R11j883k715n99K121K929J43k478k395m99K455K136
1266A888K47j863j971O5K110J362k16k315k026O95K981J324j215k278j226J801
1282f37K598M97k269k094o52J571K524Q56j545k462q63K137K169N99j988k707
1298b266p16K213K846j2j847j588N0J347J701m02j743j795J177J353J660j115
1314H63j542j238P04K589P85j485j909j158J433K515O47j185k712o41J871K397
1330A934q3j472k441K43J335J865P32j980j639k3J356J612j68j420j036J6J838
1347F69J147p21j736j158J112J460J406j144k521l36J236J823P79j088k981k15
1363b268R08K351R06j464j945k36J591J581N03j394j814l69J065J644K47j535
$$ y = [670, -2123, -3019, -906, 1762, 2673, 790, -1925, -2524, -403, 2526, 2669, 191, -2204, -2703, -248, 1888, 2135, 272, -1699, -1634, 476, 1838, 1622, -693, -2719, -2024, 957, 2281, 1066, -1212, -2438, -637, 1961, 2458, 189, -1905, -2557, -986, 1538, 2394, 849, -1613, -2476, -339, 1830, 2429, 441, -2266, -2982, -769, 2077, 2065, 218, -1370, -1320, 27, 1728, 1326, -417, -2212, -1035, 318, 1978, 863, -679, -1917, -1213, 1376, 2161, 676, -1233, -2391, -958, 1557, 2204, 1019, -1693, -2334, -463, 1934, 1851, 379, -2062, -1819, -484, 1381, 2113, 133, -1506, -1529, -173, 1439, 1271, -149, -1185, -1169, 669, 1816, 1095, -641, -1799, -687, 773, 2179, 1035, -1486, -1822, -586, 1237, 2016, 928, -2053, -2268, -1360, 991, 1897, 433, -1512, -1748, -157, 1424, 1927, 533, -1281, -1650, -585, 1059, 1306, -229]
1379b29j095L28J386J264l75j878j424J173J489J124j144j957j39Q81J960P49
1395B113j196k123p60J062J940N41r01j604p30J253K037K17j273j854K03Q68N90
1412C83L56n83r06k38J450R82m2j622r86k48J829J347r34j482r28M19K987N10
1430B294j635k093n44J061J868O22o94j943q00J418J385P87j042j821k98O94J609
1447H68K38l07j326r02J304J223J5j119p07o2J138O26J25j619q91N60J740P14
1465A618p34j669q13J094J368O16p72j388r33R15J197P60m41j277p28M98J688
1482I99N61j065j291n12J062J075n18m98l42L8N82J073o40m46j053o5J340R70
1500A270p25j272o20L04J944O71o11j734n81O36J423L60m39j316k78M29J156M56
$$ y = [-229, -1324, -996, 390, 1654, 1279, -599, -2023, -850, 639, 1763, 619, -1338, -1477, -596, 1364, 2113, 917, -1206, -1966, -904, 1036, 1577, 676, -928, -1658, -405, 1632, 1849, 576, -1278, -1075, -207, 383, 739, 156, -750, -988, 462, 1444, 1402, -220, -1206, -1454, 375, 1722, 788, -694, -1622, -1203, 1784, 2294, 659, -1434, -1978, -917, 951, 1573, 879, -1064, -1864, -446, 939, 1726, 684, -1137, -1435, -741, 868, 1106, 799, -527, -1429, -125, 1098, 1113, -6, -713, -775, 363, 989, 1114, -505, -1396, -836, 904, 1618, 884, -785, -1598, -504, 864, 1480, 708, -680, -1613, -698, 499, 1259, 818, -459, -1187, -689, 999, 1560, 495, -796, -1308, -246, 829, 311, -187, -529, -491, 91, 1164, 524, 78, -975, -1040, 300, 1270, 545, -727, -1347, -1043, 901, 1572, 961, -773, -1354, -718, 705, 1065, 626, -690, -968, -539, 617, 1073]
1518A073m0j576j004J425J261k15q36j087M64J189O07j16j247l92j73R80L79K00
1536H92j944j19M19R82J219l70j503r81Q04J343J111j494j274k61Q60R29J57m24
1554C46p65j12K22M92N29k10j245k04O05J318K95j565q88M70J407L85q94q60j91
1573h65N89O74L36k9n48r62p3R55J116k4j549j172N65J898M95j052j340J61R55
1592A30L16L3m59l45j46J03O57O83m79r02n29Q25J360l34j324j248Q33J573M89
1611A236q47j363N17M63L58J10N24j419l53j46O45J267M25j861j068P91J518L00
1629A097r74r13oJ121M76o72l06l7L41n49P48L35m26p88j066J416J225m38q65
1648b81j339Q24J510l4j182l09N32M17K51j30j32J57n47o44N39J074K35j374j014
$$ y = [1073, 1033, -543, -1547, -122, 1139, 924, 88, -999, -535, 654, 1261, 1145, -102, -494, -667, 313, 692, 892, -1052, -1171, -752, 230, 1449, 1079, -424, -1405, -601, 742, 1853, 359, -915, -1176, -316, 613, 770, 346, -419, -531, -309, 183, 712, 502, -743, -947, -342, 976, 1271, -294, -1182, -712, 695, 1080, 186, -674, -865, -276, 398, 734, 705, 157, -805, -878, 77, 1193, 1169, -380, -1552, -987, 911, 1406, 354, -986, -825, 130, 446, 479, 20, -325, -471, -368, 289, 972, 493, -409, -938, -113, 1247, 913, -411, -1659, -826, 747, 1236, 389, -974, -457, 6, 364, 474, 998, -421, -774, -920, -275, 992, 1417, -444, -1512, -721, 797, 1097, 123, -790, -796, 325, 801, 129, -177, -214, 127, -422, 326, 661, 235, -553, -1619, -203, 1022, 584, -281, -1620, -796, 714, 680, -502, -811, -279, 138, 389, 259, 127, 284, -263, -907, -368, 706, 941, -433, -1447]
1667a447P60J325N52j401r04L17J453L38j085j13L45J40m86M65K70j70j193n29
1685a363P15K411m18j548r02M30J811r9j326n34N18N71l27j32N05K07n56p42Q93
1704A14P29m17q93j102J266J461l9j797o23J207J315n21j108l61N52J51k00M17
1722A51O96M2j368o71P63J708k31j708j073J172J478R3j320m84J002K79n04o13
1740e88M19P83o64n07L93J052j43j385o48J437J190j60k518J70J273J765j020
1757H49j235m4R10n49k18LL65Q80j756n21O82K156o14j336j089J731L51M5j292
1776f82r3J067P82q00q87N66M69m14j074Q02J363k28j573p63J781J459p63j795
1794g83q30J328J407r34q49N75N10k27p77J61J128J73j480r78J271J469k29j509
$$ y = [-1447, -687, 638, 1190, -211, -1115, -798, 655, 993, -92, -205, 140, 280, -206, 259, 529, 359, -834, -1363, -648, 1763, 1345, -203, -1105, -675, 1136, 1037, -289, -823, -305, 266, -61, -193, 312, 519, -37, -779, 114, 843, 426, -467, -1569, -303, 1158, 1119, -678, -1301, -94, 1221, 700, -408, -769, -217, -66, -266, 151, 847, 889, -479, -1150, -387, 1321, 1090, -618, -1691, -519, 959, 1052, -268, -752, 250, 529, 25, -588, -169, 614, -50, -557, -164, 888, 745, -640, -1288, 149, 1339, 1179, -1339, -1169, 104, 1869, 849, -386, -430, 480, -69, -287, -284, 81, 961, -795, -1316, -634, 1522, 908, -428, -1517, 214, 565, 610, -682, -775, 292, 1074, 274, -613, -47, 422, 8, -1066, -264, 1099, 871, -702, -1465, 316, 1775, 1012, -783, -1613, -285, 1122, 188, -661, -86, 424, 197, -580, -419, 709, 882, -598, -1576, -305, 1164, 935, -574]
1812e74m97J622J064j122j574N1J158M54p71o02R57P75r96o83P26J203n03j675
1830i87r30J678J858o03j964J2J322P61p58q70K92P02l55j313L65J269P95j824
1848e50p02J453L10K70j501p88J644J119r19j558L79J527L14j014n22P92L45q79
1866b80p18O80J694p00j895j19J155J916l90k766N62O11J026p83q56M59J189l52
1884D33n03o91J562K97k151m87J913P54p62j148j023K125J393j432j888Q15J865
1901A072k27q58m67R12J1q77p27R87J892q38j839k35J208R93l43j797j33J788
1919E22N56j559n60J051J049p51j336M74J251p2j212p34J534J139o12j829k34
1936a323K003P71j249j364O46N26K09j237L54J099N4r28p27J030J490o29j447
$$ y = [-574, -1071, 551, 1615, 493, -1081, -1030, 128, 582, -189, -791, 166, 941, -55, -738, -12, 1191, 688, -987, -1917, -239, 1619, 1016, -948, -936, 386, 1147, 389, -481, -189, 513, 158, -1155, -790, 479, 1274, -550, -1252, 201, 511, 781, -720, -1508, 136, 1255, 336, -1222, -843, 684, 998, -16, -538, 254, 599, -280, -998, -318, 1376, 676, -1219, -1338, -183, 1733, 1343, -1423, -861, -250, 776, -7, -863, -404, 785, 433, -70, -761, 801, 1098, -1053, -1540, 373, 1127, 365, -783, -1806, 319, 1712, 280, -1608, -793, 1072, 845, -13, -480, 432, 443, -434, -1161, -174, 1718, 880, -959, -1194, 14, 1007, 664, -1133, -1266, 522, 1078, -481, -1041, 10, 1059, 308, -1028, -554, 697, 625, -587, -1321, 213, 1352, 740, -1089, -1323, 680, 1451, 202, -1162, -516, 10, 219, -1018, -664, 435, 489, -439, -1166, -136, 1354, 725, -722]
1953g22p25J446J281r98j359L90J697K11j244j320J398N62j64j365M16J267M8
1970H19j706j73J492J202j224j158m07K028M09j612r81Q52J292j23j212k39J128
1987C87L90q83p90P78Q52j43j518j7J341Q19j208j210M78J382M68j366q81R05
2005b16P48k61q33L73J159l42j345o68J440J080n31j822m55K000R14j337r62P09
2023c49N10q62L33p2P80O15j528n76J132J314p17j520M1J608N44p66j731L86J854
2042I96n1j222k41O64O09m02q89M20P97p4j108o13J195J031o24r95j30J203O71
2061A237j493n71N21J037m80j019K5J256L0o73o06R22L85r3j432K12J068O88r66
2080D8j266R83O91M53j306k14N23Q67q91M9o42J597k45j301m49P52J011l19p02
$$ y = [-722, -1447, -1, 1280, 282, -1077, -687, 1010, 1221, -23, -1343, 55, 617, 453, -912, -496, 771, 819, -887, -1060, 432, 1634, 410, -748, -1155, 873, 1282, -330, -1311, -459, 833, 710, -502, -741, 387, 777, -106, -896, -118, 734, 591, -927, -944, 397, 1216, 8, -1202, -724, 658, 1126, -240, -1121, -216, 532, 271, -562, -189, 970, 628, -717, -1385, 55, 1135, 604, -1218, -1673, 327, 1241, -96, -1058, -349, 161, -701, -368, -440, 340, 955, -573, -1149, -17, 1297, 580, -940, -899, 709, 1253, 487, -1244, -858, 996, 945, -277, -518, 146, 755, 353, -536, -116, 681, 607, -501, -1114, 81, 1112, 488, -507, -637, 566, 1237, -256, -827, -306, 731, 251, -768, -743, 513, 543, -130, -736, 186, 571, 478, -954, -742, 326, 1014, 48, -1218, -235, 456, 909, -397, -611, -88, 779, -112, -63, -705, 892, 647, -654, -1103, -351, 660, 341, -361]
2099c61j46R10J79j006n00O36J225o39r08J41P31M13q66l37P10O70q17p79o5J467
2119F58M24r48q68J17J201J14j085k49P10M93p03o34O27Q03j53j074j3Q08P19
2138I47j154n63L62J044J95j063o48P18P93k72o61j09Q12j07q60P3Q08K87k83
2157C19r13R3Q31M63j001n95N23P56Mq51j89P88M96q09m97L86N28n15n95J18J073
2178D13j06j18j320J114M68q1k06r06Q46M15k10m70p0N52j57o52o6Q24N55n98
2198B27p41k3Q94L65p88o16N59O82n31m44P1N11K80n44l32L37L48M3p68L5R16
2219D81J18o79q52N99R06L9q84m44O49L36j65n37L26O99Jj015j97P74L50l99o64
2240e58J24R64j08n45l27N79L14n9q96k8O59K46n14k45K68O45m42m43K42O62j28
$$ y = [-361, -507, 403, 582, -424, -924, -288, 937, 298, -610, -469, 262, 675, -191, -528, 182, 852, 35, -744, -809, 658, 1082, 134, -734, -617, 584, 698, -387, -636, 74, 567, -136, -770, -143, 660, 507, -567, -580, 228, 947, -207, -770, -408, 636, 831, -232, -880, -162, 631, 359, -302, -411, 401, 294, -566, -493, 315, 602, 319, -594, -501, 330, 793, -208, -803, -280, 476, 480, -371, -560, 228, 724, -85, -582, -196, 332, -183, -778, -660, 413, 307, 189, -1131, -17, 451, 370, 164, -742, 104, 519, 309, -161, -231, 321, 164, -488, -554, 270, 825, 227, -514, -537, 357, 722, -66, -682, -123, 559, 28, -416, -345, 166, 446, -98, -430, -93, 255, 298, -470, -435, 481, 599, -80, -932, -333, 573, 612, -272, -716, -67, 269, 104, -433, -107, 592, 593, -422, -619, 155, 505, 106, -558, -434, 530, 422, -123, -450, 129, 443, 384, -512, -540, 119, 365, -149, -394, -126, 519, 77, -366, -124, 538, 410]
2261D10M6p30L07Q49p28j17n64M97L97j19l93J4M48k85m82O0N07K86l52m28K19
2282a58M65J96q83k03N97M23k50m21j13P17J6k38j82M84J2l65m17P5O24J0k38
2303A51m45J07N44r1n13j95N76k2j36l04K89L80J21o13j66N96J47n71l46L91N36
2324D36j98j98k74MM29Q0l11p1M2J31o5j99L79k0j30m37K66M94k6l23p4j59N09
2347B85l08l00L9L88J06k78R5k36O59k11J21k04n82k88N80MP2O02m99J86o82O07
2369A56q5m67M56r7K92p0M83j215P56J1L3k51j85O15l05L9l68L56j04l6j71k74
2391d31M16K36k3l02qK29j81j49L42j94L72m87k35M11J05j6j23j8K9J28O1l94
2413b32r9N22K13l49n7P2N02J79o80k74L2L8J24Q5N4L9j15j88R2J50J26k08j86
$$ y = [410, 456, -274, 33, 882, 154, 37, -527, -30, 367, 248, -145, -131, 317, 32, -450, -390, 117, 403, 51, -377, -158, 307, 503, -380, -583, 14, 437, 187, -234, -347, 370, 386, 148, -34, 450, 462, 97, -320, -245, 379, 389, 151, -294, -187, 357, 266, -247, -442, 134, 112, -24, -328, -39, 341, 462, -151, -317, 279, 426, -145, -491, -100, 436, 238, 40, -234, -230, 199, 279, -32, -103, -61, 70, 5, -194, 185, 165, 35, -402, -136, 358, 332, 9, -65, -224, 285, -23, -323, -284, 104, 210, -68, 27, -209, 450, 239, 360, 156, -426, -714, -134, -130, -58, 544, 45, 231, -451, 156, 71, -396, 60, -37, 255, 185, 668, -547, 209, 220, 253, 2, -183, 432, 127, 166, -202, 154, 50, 14, -157, -431, -15, 221, 198, -104, -112, 117, -64, -213, 129, -65, 307, -180, -415, -4, 101, 85, -38, -56, -27, 101, 162, -232, -331, 191, 404, 55, -2, 70, 572, 751, 71, -203, -171, -133, -9, 76, 130, 169, 54, -134, -42, 108, 234, 26, -160]
2436a60m3L47M0k77M5P8P8j76n7j19L10J59k15j62J85J89k38N2Q0j15L4pj50R0
2460c2Q8q9j45K01l48k68M09K03K91Q0l35j93n9L23J0j53J21k77L27k04L5lR3
2483G5P8j88j66K98j38p8j77L05k42J45L71m71J22N9k45R3k11J71P11n86j43K45
2505B8L36k4o13L07k12P66m62j49j00j76j2O23N52r39L9L93o57M93m8j30l4j46
2527a65J11M73k39k08L3j92K50L4P6J84m80l27O68l01j29L79ML34M2j56p9k54
2549E8J98n60Q11P9j256K96O01n75l33M49P32n55m43O77k68K64n17N75J78o27
2569b16K65l07N1K14K2R3J82j76o25M65N57q72O19j76o86N29L5L23j30%l47J22
2591e8K40k92L9m3M3K83j96K92l74K94m1k25K06J6k83L3K09L7O4j80k50J92j80
$$ y = [-160, -203, 144, 184, -93, -48, 30, 108, -68, -125, -244, 66, 225, 10, -152, 33, 222, -16, 36, 116, 1, 35, 28, -122, -32, 56, -33, -178, 23, -325, -593, -184, 19, 310, 390, 55, -138, -197, 126, 136, -17, 104, -173, 154, -50, -15, -18, 75, 153, -35, -201, 97, -41, -119, -296, 9, -233, -88, 283, -188, -66, -7, -252, -159, -370, -199, 512, -74, -217, 28, 364, 340, -273, 34, -178, 588, 126, -23, -123, -299, -311, 312, 864, -75, -36, 357, -300, 193, 145, 15, -19, -165, -54, 419, 180, -28, 5, -187, 63, 97, 173, 357, -123, -450, 218, -83, -212, 167, 171, 505, 547, 391, 312, 58, 256, -304, 507, 586, -670, -374, 227, -348, -681, -232, 500, -55, -498, 179, -89, 175, -342, 233, 411, -216, 49, -258, -207, 7, 29, 122, 304, 128, -497, -32, 525, -347, 272, 96, -590, -61, -26, 297, 167, 167, -180, -58, 182, -110, -71, -114, -71, 212, 16, 308, -66, 228, 187, -38, 168, 184, -99, -66, 143, 180, 244, 64, -186, 6, -174]
2614a74L48j6j12r5j78M9l1L97k40LK88k18J04j2r8Q9J60l06j8J22j44rP2K67
2638B48j91R8n23M14J9k18K92p9j79J20j94k74O24m73N54N9j20p62J116l07k87
2659f3o24J339j91p34M18l38P16n43J57o8J52m16K05m11M90j97K88l45L28R0J34
2680C87m75k0r4K48J02j00N3l1j08J04J40j10l69M06l74K54J7k67K54J37j90J64
2702A28J61j42n8j8n7k4J27O3k95K84L0m26K15J92n90j65J121l36J6p13K04O32
2724C49j01n43M32o1R4J50n08L57k97K31l30K42j28pJ47N3k41M86j94k70k5K22
2746E8q0O8j83K49m0j27j8N7j36J48K5O7j17j81L49R0k68Q9J13l08M3l0J43J82
2770A93j03j82R7Q9l60M45l24K83k00J82Lr3k05K2j64L0L92o6o33N46K36j07L88
$$ y = [-174, 174, 158, 46, -49, -227, -178, -209, 188, -52, -49, 239, 21, 125, 113, 15, 104, 264, -42, -60, 62, -82, -91, -19, 248, 57, 155, -368, 46, 65, -153, 139, 60, -119, 1, -193, -467, 157, -316, 238, 297, 177, -585, 531, 224, -63, -687, 652, 461, -273, 145, -193, 523, -20, 137, 69, 221, -195, 10, -401, 89, -108, 180, -165, 163, 253, 387, -88, -108, -202, 46, 148, 48, 101, 70, -38, 66, 206, 96, -273, 133, -241, 13, 30, -237, 17, 154, -36, 128, 289, 147, 89, 71, 14, -10, 117, 180, -115, 169, 199, -227, -12, 180, -410, -575, 546, 210, 226, -487, -283, 349, 248, -295, 137, 76, 170, 320, -188, 169, -128, 103, -227, 15, -113, -120, 27, 80, -161, 325, 131, -139, -164, 58, -22, 46, -137, 112, 72, -55, -73, -16, -152, -4, 21, 88, -29, -210, 139, 229, -39, 50, 163, -145, -102, -132, 11, 193, 90, -92, 5, 94, -266, 179, -145, 138, -62, 120, 123, 30, -175, -153, -317, -287, 105, 39, -594, -48, 188, 81, 469]
2793D69p33L56k29L61p57O82k44L5K44k17M42j02J67j280Q44j49J49l66R65l50
2813B87j41j3j15k31N80l5l52k33k58J81j55l49J259n44K79l39m63M49J050j15
2833G42K1n47p99P29M53j333J155o02M88n02O58j55r08N82J22J63p1O67q33N5
2853H5j172J055J70n28J91M50m56K65l14j93P26n2M5q5Jj35J09j59M16m26m50
2874d57K39L34k67K4J63p3L7k69K73n6m4K37P9k51N3j25L1K9r3N9K49j20J1K17
2898B80k97j10P0K29j45l9q5m8l1j06j33O35Q1k93p5O8o1K06n7j82p1K10k3k06
2922a83N2J41j0K41j01k48j34j5K34m3J77o1J23j85J29M6j30rk41J41K67j04k92
2945b05L19k00K09Q3L0l31j7O9j19L7O9O6J46j27N1l77J06K07n3j9j09L16Pn62
$$ y = [469, -264, 92, -137, 224, -533, 149, -95, -60, 184, -33, 409, 307, 474, -806, 38, -111, 38, -328, 637, 287, 146, 133, 18, -213, 367, 332, -20, -253, -511, -330, -485, -834, 425, -119, 160, -179, -642, -193, 857, 742, 763, 216, -583, 146, 599, -734, 421, -181, 307, -195, 463, 308, -600, -18, 104, 267, 196, 863, 30, 85, -1087, -32, 138, -390, -199, 251, -205, 60, -254, -447, 279, 227, 272, 187, 188, 53, 162, 3, 419, -7, -457, -218, 116, -151, -127, 36, -37, 0, -269, 4, -52, -96, 141, 220, -31, 22, -103, -72, -43, -136, -77, 172, 52, 63, 280, -17, -127, -57, 172, 27, -12, -97, -145, -176, -282, -415, 220, 301, 8, -67, 1, -60, 146, 89, -93, -164, 46, 23, -183, -131, 10, 0, 241, 140, -108, -242, -257, -23, -66, 111, 50, 173, -12, 117, 163, 33, 24, -217, -76, 191, 87, -205, 114, -86, 123, 206, 236, -95, -112, -43, -162, -125, -56, 10, 156, 29, 80, -297, -191, 16, -37, -56, -165, 151, 158, -404]
2969d04L45J47l9J27k95K26j47K16j55J30m37NM05R2k13m0K27j77j78K57k87j87
2991c82M47j71L63k95j20m20K85N67p88Q02m95P2K44J56n02n1k59L81j26M71l55
3012a76J91l12M85o11J15M19j12J29J15n03j01J049o30k43L22k20Mm5K87l07K06
3033F2L87n46N8n03Q1P42p6o99J79N37l35o5J75n4J87p6k15J13j31J13J22O7j31
3056hJ85k15Q0q0J37J02k50k7O0L1k3m3J3l6J62j06p5J83J50j54k17L97l5j91
3080D0l60K51n2n7J42ML1R5J12l24N5K51l62lK02q1M78l18j93K36j09K27L4j72
3104A27k85J90k75j32N20j59J81n0%l35J66L4M3n43N10L4P3l7l86M20N01k04m27
3127c4m28N20J22P0P1p65J99N27l26J30J59l43J6J8p1N83n37k09L5k2J13K77k23
$$ y = [-404, -59, 88, 49, 176, -119, 107, -40, 176, 21, 151, -286, -281, 124, 216, 3, -37, 190, 13, -165, 92, -195, -382, 65, -106, 257, -38, -158, -578, -293, 274, -514, 288, -207, -135, 109, 265, -237, -288, -547, -166, -292, 179, -176, 15, -297, 188, -423, -308, 111, -1, 128, 243, -260, -361, 688, 58, -185, 137, -83, -79, -124, 163, -144, 62, 449, -97, -39, -542, -461, 281, 205, -494, -315, 222, -113, -178, -3, -57, 130, 54, -161, -48, -179, -66, 56, 123, -8, 177, -38, 42, -38, 99, 201, -49, -76, -16, 15, -8, -51, -38, -74, 88, -18, -93, 90, 240, 86, -131, 266, 231, 40, -320, -69, -121, -178, -36, -32, -1, 94, 206, -118, -63, 188, -174, -177, 25, -56, 422, 104, -89, 147, 38, 265, 299, 127, -158, 32, -243, -375, 145, -14, 167, 117, 117, -218, -52, -18, 25, -518, -8, 26, 99, 62, -324, 96, 597, 393, -34, -462, 58, 180, 250, 321, -444, -245, 282, -44, 86, 245, -98, -82, -64, -135, 448, -89, -298, -263, -285, -172, 105, -118]
3150a18K48P3m03L76j31K2n7R3k40L4J45k2j6LJ2J22o2r8j36l5J38N8m2K53k59
3175d2J15j51q5J75j13O4J20o2n0Q6j36K15k10J66k10N18O7k77R3k38J84k20K08
3198B17k82n76O51L12n12L35l0p6ln5O38n63K23j34k48J66r8J90k66J45o6k18
3220b50N54l09J8k49J61J79j50N8l7K4M4r5o6j5r4r6J27n4L12J85j41m13L32l29
3244c04K73J6J22l55L36K11l77p9j98R8L7k77M76k75O19m36p1K42R9M75o19r85
3266i72P81q3K03q8J69j26L1k53M34j30O18j341P80m82O63n76O11l34j47o8N57
3287B47k21m57N42q34N65L24n00K71N49m60R0l74M61k14nk10K75l29J31o3L17
3308A05k28J37%j00Q1J8p0J86j81M3k2l9K62j47O8kO5Q8k31R3j62l1L3J75j76
$$ y = [-118, 130, 203, -200, 176, 45, 67, 10, 103, -137, -103, 42, 20, 4, 7, 19, 141, 79, -19, -155, -190, -52, 6, -36, 217, -42, 73, -78, -163, 12, -101, -37, 83, 21, -29, 57, -79, 136, -74, 92, -118, 400, 467, 190, 283, 45, 229, 9, 217, -65, -641, 10, 322, -190, 145, 115, 39, 36, -19, 619, 56, 279, 145, -103, 63, -35, 155, -111, 34, -32, -250, 304, -5, 13, -236, -75, 104, -46, 12, -25, -1, 43, -52, -118, -133, -227, -323, -196, -250, 62, 247, 106, -307, 25, -304, -31, -15, 107, -248, 88, 299, -78, -157, -355, -257, -220, -497, -21, -296, 323, -113, -184, 58, 157, 632, 13, -972, -191, -274, -71, -159, 10, -116, -85, -338, 96, -34, 584, -757, 23, -459, 204, -372, 239, -95, -242, -310, 247, 26, -431, 111, -723, -158, 166, -334, -63, 486, 26, 116, -258, 203, -11, -16, -226, 49, -280, -149, -212, 105, -123, 14, 14, -86, -5, 13, -57, 129, -52, -9, -31, -70, 192, 45, 113, 111, 176, 264, 33, 126, -36, -67, -34, 141, -35]
3333c5M5l9oj65L03k05k2o1K74j40l6J3lr0Q0J01mM9k27J6R9J10j75J73p4K62
3359B43k48R8k43j7L58j43P2j38j08J30K16j91J57l94K81n3J21J28k37L6k01K19
3381H6Rl4l0j37L05K8j83N7j23J41k09j56L47l48K83m6P0O2q5j34K41q2k22K16
3405E6J67j9l18K15k54K27L2j60O5j92m9L46j37J08p0%l4J01pR2P6j97l27J35
3429a44J36j48m0L31j33K31l93L7J32j00J86m4k65J65N4j69K10q6l0L0Rj22O8
3452h5J51L1J07j60J8j5j67K74k0l21L1K05k14l4L56k94J70Q1J05k96k23L95J57
3475B52k35j11R3q2O7j04J77q7l6Qk0j58J78K61l01J01l8j13J0J60k17K14l8R6
3499G7k35Q2P8Q0K2N2j49J3r6R9PJ38%k59O8M0k8K48k13P3oj04R7l72J01K4P0
$$ y = [-35, 10, -29, -35, -200, 103, -102, -124, -185, 89, -51, -87, -74, -77, -167, -87, 14, 10, 59, -168, -152, -53, 57, -118, 55, -19, 243, -5, 93, -150, -167, 191, 48, 120, -18, -126, 4, 220, 29, 186, -208, 73, 20, 141, 269, 32, 68, -133, 86, 95, 61, 31, -106, 199, 227, 44, 101, -22, 119, -90, -246, 101, -247, 36, -10, 60, 122, 37, -97, 144, 62, -160, 56, 223, 204, -114, 101, -153, 74, 106, -54, 11, -181, -230, 116, -21, 87, 17, 17, -17, 84, 77, 169, 245, 48, -279, -144, -8, -156, -196, 135, 2, 233, -160, -123, 9, -91, 95, 51, -214, -49, 5, -164, 46, -40, -70, -40, -31, -153, -85, 66, 97, 204, 44, 62, 47, -120, 154, 134, -187, -156, 49, -165, -199, 157, -137, 33, 114, 219, -77, -300, 95, 252, 17, -94, -1, -83, -16, -120, 57, -30, -66, -58, -78, -236, -58, 203, -98, 3, -35, -148, -138, 22, -195, 19, -19, 77, -158, -76, 2, 82, 104, 156, 7, 20, -76, 23, 30, 168, 168, -91, -23, 17, -11, 237, 24, 97, 91, -13, 84, -288, -187, -163, -93]
3526i3J02L7k97L01R4M4r6n41M94Q5J39m49j06J94K66l20j95P51l00k83L80o50
3548d43N91J04N9o94M55m68L44K09j04o7j9Q6j89K40J97m98j12P8L88k22j51K44
3570B8j35J9P9j27J36j55R7J9p7P1J23j42R1j17r5J25o3K67k89M8j82N6O66p5
3594C68l38m2n75O46K1j37rJ13l8j03N4Qk31L74L0j51oJ44j30k6N5j8o5O0o9J17
3620E2j25j55J05M50o73L75M9QJ24j25m36L62L09m30L81r44M73K65j97k51J51
3641b32J95q1n3l77O43J39kP7k38k65k82L84p5J52l27N20pM00n56l55N38l90L70
3664A78j17l73M91q1J7K9l19K30j42O7L00l77J06o3N3O8M2j05j64J2J42J0L8n2
3688a0P7N6m9j27k8J28k49j1Q5O2l2J04k01J25K58j89mj71O0J07l2j31P1J68K1
$$ y = [-93, 9, 46, -251, 50, 144, 188, 92, -449, 45, 130, 269, -180, -286, -92, 174, -146, -341, 410, 110, -173, 207, -443, 148, 252, 311, -383, 72, -396, -52, 157, 53, -14, -33, 53, -136, 104, 301, -197, -309, -231, 157, -65, -216, 28, -107, -88, -9, -136, 0, -155, -58, -39, -116, -45, 78, -64, 27, -90, -185, -60, -123, 144, -145, -97, -279, -223, 443, 368, 30, -12, -587, 59, 80, -57, -66, 47, 9, -94, -40, -32, -263, 111, 141, -10, -16, 128, -2, -28, 27, 9, -56, 4, -65, 52, -73, -228, -123, 327, -346, 29, 78, 86, 210, 85, -351, 11, 320, -110, 271, -673, -200, 65, -132, -383, -232, -37, -118, -171, -548, 95, 234, 232, 309, 71, -194, -476, -92, -167, -15, -342, 178, 171, 571, 15, -340, 198, -192, 178, 61, -312, 179, 98, 115, 144, -175, 55, -87, -20, 280, -97, 9, -54, -1, 67, 109, 4, -160, -148, -6, 4, 42, -10, 67, 123, 74, -53, -81, 47, -202, -213, -128, -66, -98, 6, -195, -70, 188, -1, -5, -176, -116, -9, -41, -172, -101, 67, 88]
3713H8J20j97k02L37k77J17m2J29k3k57J78q0J7j11J94l35L77K6n52J163m70k64
3735f4J15N1R03j047J61n07N01n13L04O2J57j08J5m3J50l0K7p8m3j11K9rJ66k47
3759a59r6K73J63k41J26j31Q6L7j33J43j12L4J86j41j02l5N5J54k33R3P4q5J6
3782b8N2j42J97M2k01RQ5R1j67pJ19QL8j21q0Q7o5R0N6J46j15M4l6l93K81j38
3808a48J07J4j55K85j69J11J06j70N4L3j38Oj06Q5J04j19R7m6K13j15j88J40J49
3831A50k07LJ08j9pq8%m7J02j65Q8M2r6J36O4m3q9L06k6k48q9K26k4k49J91j81
3857a62M11q1j85j85NK5j8O8J96J09k62J61p9R2o7q2j22J23J28m28J36K87Q9k82
3881a23L0k54M82K18q38J27K93j75m65K37K24L82l5n2K22k55M5n6R5m67L02N8
$$ y = [88, 208, 11, -191, 146, -131, -14, -56, 73, 50, -207, -29, -109, -92, -203, -9, -344, 33, 59, -493, 670, 200, -64, 51, 102, 1005, -42, 119, -388, 113, -400, -96, -34, 123, 15, 30, -13, 137, 107, 134, 56, 13, -98, -69, -78, 88, -159, -255, 18, 181, -60, 66, -65, 21, 58, -75, 68, -44, -10, 176, 35, -67, -102, -47, 107, -126, -33, 41, -44, -28, 24, -118, 79, 121, -80, -71, 14, 105, -62, -69, 50, 58, 96, -25, -105, -18, -83, 7, 63, 209, 94, 138, 102, -291, -10, -148, -41, -27, -182, 103, -66, 45, 151, -19, 35, 68, -70, -64, -170, -85, 19, -100, -3, -49, 164, 49, -139, 1, 150, -57, -54, 54, 35, 28, -60, -60, -107, -5, -170, -82, -40, -136, 0, 64, 21, -68, 238, 212, -36, -125, 101, 77, -172, 19, -162, 249, 168, -17, -202, -197, -172, -190, -122, 74, 183, -79, 82, 3, 95, 28, -54, -176, -53, 75, -353, -217, 70, 159, -123, -93, -347, 135, 353, -485, -358, -65, -240, -705, -468, -244, 138, 103, 51, 273, 18, 63, 7, 102, -365, -63, -5]
3903eK23L2m02K22k6O3J23k95R3L1o9o0J02k9qN6p2p6J13Q1k82P8K57j54K5n9
3929c8O6j4j32q4K01P4M2q6q0OM2J11n8n0j9J85k17qK46j81j9n4o6J90j6k6j03
3956h8%K3J01k3O4Oj87R6j25j68M11j75j5K7L20k22k22l7K18l5j1J36jj21J36
3981A08p1j76n3P5K19l4m0Rp3M7m0l10L61J11k09J74j0j05Jm2j17K27q9m6O6J24
4007A07R8j96j22p6K62km2J44k98J01m5j45K81r4Q6j14K05j40J14k32J29m5M8
4030B4k02K60j34n9J44K47k67l22K46l9K23j63P1J50j55J66k83k18M07l32j68
4051d04L07J62r9l6J21r7P2n5j86K62o4Q4j13k0m1O5OJ17j19r7J15J86j78M9Q8
4076A25j98r5P5J43M8N1j65L7j73K52j45j00k8J62J97j68j32M9l6ll7K67N8j88
$$ y = [-5, 218, 250, -152, 70, 44, 107, 230, -65, 28, 59, -10, -70, 32, 3, -5, 51, -21, -97, 16, 97, -185, -107, 150, -4, 21, -38, 28, 14, -118, -202, -1, 73, 115, 29, -51, -45, -3, 108, 50, 0, -19, 166, -51, -59, 187, 6, -13, -67, -133, 57, 41, 15, -88, -88, -65, 36, 13, 77, 83, -104, -8, -133, -301, 110, -65, -80, -53, 267, 45, -177, -214, 4, -31, -42, 94, 93, -28, 108, 37, -139, -192, -117, 102, 68, 28, 37, -36, 11, -29, -339, 22, 133, -76, 98, 88, -17, -16, -58, -175, 52, -37, -83, -17, 107, 205, 9, -113, -189, 73, 71, 29, 173, -125, -24, -69, -214, 67, -27, 59, -55, 150, 10, 124, -108, 21, -24, 24, -178, 82, -52, -111, 33, 280, 13, -309, -63, -102, 121, -42, 29, 179, 24, 190, -93, -311, 96, -236, -404, -97, 65, -34, -70, 51, -46, 26, -29, -215, 47, -17, 67, -46, -66, -107, -42, -36, 81, -38, -135, -20, 166, -12, 37, 125, -73, -168, -93, 50, 98, 149, -16, 21, -152, 100, -45, -145, -173, -11, 186, 18, -114, -65, -101, -104, -141, 126, 184, -4]
4100dJ99j1l42n23J002m56P4J41k8L10q8k81L90q49J0L71J13k79K11L9P2J03j46
4123B8K38m20O1K35k37J87k71K14K15j48R8l07L04k23J28j33J30o8O9j06M4j06
4145f8P5l7q6k15N00j48R4r7j13k9l7M33l07j33J30J92l70J73J29q8q7K20K00
4168C31o10K42L38J95k21n44J40K00j19j1j19l2M95k04p2K6L81k1l1k86m1j98
4190a61j70J80q9L34M47j357R11L35l92j27M96J79q64K57L24k33o7l91Q52l29
4210A35K10n00j18P6Q01p92L13l08j52N32l64J65l2L94m45oR9o1L70n65r0L68
4232C0l46L04n04M33J16J87o32O15r9l57o5N63k25m59L25M5L50j56K26q8m94l7
4254b68P28l96j90qM80n32L8j98P6Q8L68P2k37j77r7K76L9j65L78j3j39k04j27
$$ y = [-4, 195, 184, -158, -681, 321, -135, -61, 80, 52, 362, 274, -7, 383, -466, -456, -85, 28, -251, -40, -1, 71, 174, 28, 266, -154, -93, 142, -95, 92, -179, 35, 250, 102, 200, -107, 197, -26, 102, -31, 99, 31, 100, -6, 38, -68, 7, -30, -116, -331, 169, 21, 115, 18, -95, -124, -161, 272, -35, -168, -38, 154, -216, -43, 86, -2, -89, 131, 331, -279, -37, 301, 496, 275, -269, -129, 71, -48, -59, -178, -210, 285, 81, 9, 35, 416, 395, 364, 78, 37, -161, -331, -151, -240, 94, 541, -816, 95, 430, 38, -89, 407, 586, -278, -21, 303, 70, 3, -388, 464, 135, 345, -155, -273, -197, 604, -188, 125, -183, -335, 197, -167, -2, -34, 360, -85, -91, 8, -53, 317, -248, -338, 30, -316, -12, -516, -83, 33, 220, -412, 203, 104, -253, -318, 245, 20, -439, -114, -69, 281, 125, 351, 263, -231, -268, 460, 64, -126, -134, 346, -186, -148, -346, -270, -182, 186, 258, 21, -156, -253, 23, 62, -103, 275, 262, 123, -81, -208]
4277b08N03m44k8m46P57M03k95J86n69j40Q32k1k50l53J85M82q75L56l49L42m3
4298B5O5k61m4J13R7j0K68l83J27N9Jj05J26j26P3j84J07J33j51J0M6j25Q2J62
4322A05j51k53J81L84m61R5K3M2O45m38J9K91n88m54R62m04P41j026K92pk0k72
4344b94K54P9j18o9RQ9j48n92L70K66K82l98J42J3j09N70q75M96q4p40R22k87
4366b22N05o89L13k61k92J98K42l2j08N12j11L73p21L79l63n1L0O26l27J9j45
4387a25J13L9k7J71k16l1J7M7j1k4j7Q9k14L04l21K48r4r2J65K0J16j79j12j0
4411a44R7J08j38J13k8J5lo3N2n3J38m5O9k56M1L77k17k8o5j2N5j94K50J51k96
4436g6K55j78q6N5rm12K01K07j79J74J15j60K75K5l13l60N85Q3K46j91m79J38
$$ y = [-208, 295, -149, -177, -623, 134, 537, 242, 428, -141, -281, 551, 530, 280, -73, 112, 594, -281, 75, -274, 68, 25, 90, -171, -215, -102, -5, -15, 253, -130, -3, 56, 57, -48, 78, -48, 25, -159, -52, 81, -70, -60, -14, -139, -57, 105, -46, -299, -118, 266, -195, -100, -77, -35, 610, 172, 191, 482, -106, -560, 402, -2, 739, -287, 5, -2, -22, -294, -40, 39, -79, -148, -139, -50, -198, -790, -420, -154, 128, -270, -128, -115, -224, 346, -529, -33, -117, -857, 65, -222, 283, -406, -93, -354, -646, -448, -206, -238, -346, 166, 55, 428, -293, 86, -277, -328, -298, 328, 1, 20, -125, -12, 27, 0, 171, -45, -76, -59, -12, -23, -47, -64, 25, -189, 115, -206, 42, -52, -144, 21, 41, 157, -22, -134, -144, -47, 61, -77, 36, 8, 23, 20, -43, 9, -44, 94, 49, 118, -138, -97, 280, 63, 35, -30, -42, 13, -181, 69, 220, -76, 179, 1, -85, -30, -39, -451, -250, -43, -222, -48, 67, -93, 182, 207, -106, -466, 119, 202, 448, 257, -222, -84]
4458h4J38R4n2N4k08J8J4j98K44K7J23q5j67j9l9K03M8k22J78k08K16o1m7j5R1
4483D3rL9k03J84m0r5K97m90m3L04%J0O6M5p0k70L01j63L9j7K02j60M15m79J92
4508I8R9m19J83K34K4Q6j57o7K20k55n0m84M65J72k42M16m73j06K26L1j84J1M67
4531B95m62K46k44J5j51L53j44J25K4j13J9k21L79k27K74o8j11j07J65k9N3O1
4553A32ok92j06L49K0l47Q9J04j33J61J33n0k28J06j87N06k26K8j34j8j19L71
4575A53q1L00o83M03Q7m70J85j0l8M20k94m78N50K8n6k7n4o6K37n7K0j96K85q1
4599G7N2k47J36J58ll05J09j53J63j57K71l50L02j38j92K10J05J78j21J78l91
4620a18K67L5k59J10r2OJ77N2J2j46j45m60K76L63k1n97R95l04p1K1j69M69m59
$$ y = [-84, 54, 148, 96, 150, -58, -40, -26, -224, 20, 47, 170, 85, -82, -101, -140, 63, 111, -111, 67, -141, 75, 14, -33, -48, 43, 34, 73, -130, 54, 14, -81, 216, -274, -317, -13, -13, -3, 63, 108, 38, -232, 69, -94, -55, -72, 130, -30, 385, -94, 98, 197, -222, -39, 195, 219, 305, 148, 81, 301, 46, -4, -488, -23, 149, -93, 323, -150, -256, -30, 1, -183, -172, 295, -167, 79, -165, -150, -301, 52, -92, 33, 57, -56, -37, -258, 121, -106, 168, 100, -11, -118, 47, 18, 71, 132, 126, -166, -272, 77, 97, -250, -161, -57, -190, -29, 104, 54, -174, -68, -255, 251, 25, 53, -81, -99, -218, 153, 72, 372, -311, 92, 179, -291, -106, -116, -154, 266, -28, -506, 44, 72, 16, -11, -65, -131, 106, 49, 69, -127, 158, 77, 129, -118, 18, 176, 173, -132, -23, -176, -13, -170, 101, -249, 53, -85, -277, -67, 38, 216, 95, 273, -118, 149, 184, -75, 35, -57, -51, 126, 178, 190, 44, -101, -561, -285, 78, 57, -540, 455, 151, 80, 101, -68, 401, -58]
4643e8J08N83l44p51N35j22K71q4p2m95M40L4J09Jo8J3k56P5K47L1k15j16J45
4666A1r5J02J6K44m03L84r3R3jm04L22m78J49K33j44P9j34J59J86j93m70M35l41
4689c43P7j56Q10R1l59n5K11P8o84J67M3M03k57K9j12J53j88J90l70QL66l2k0
4712E0l05J29q6K4K41o9R3J16m4k44k4K01k03J67M6l8o4K10o9o44O26n3O5o23
4736d98O54j60J07k07J52M8j62j46K57j86J04K37k72r1K2J71M1q4j02J30j09N94
4758E00n70mK22k9j52J00N32l79k73L41o04M81n18M57k85P79n90m6k24k66J029
4779E01o02j96M51J37n86P14o68N94n96L37l00L38J21P8l70J38k85j49M73p36
4799f06O84m02L51N5K63m95K20l04N19j35j51J66k16J3J26j23o2p1K01J03n9M3
$$ y = [-58, 50, 633, 289, -462, 73, -49, 222, 138, 66, -429, 11, 45, 154, 155, 87, 100, -156, -81, 166, 197, -18, -134, 11, -84, 18, 34, 278, -125, 259, 166, 259, 258, -146, 176, -302, -153, 80, -64, 15, -119, 40, 226, 33, -437, -2, -343, -266, -422, 388, 479, 120, 65, 276, 354, -330, -163, -120, 283, 26, 55, -57, 96, -92, 98, -272, -264, 102, 70, 50, -255, -126, -212, -188, 53, -16, 77, 193, 149, -95, -119, 82, -121, 46, 92, 54, -10, 200, 131, -513, 113, 60, 125, -498, 156, -4, 103, -104, 48, 96, -66, -212, 45, -141, -37, 200, -72, -163, -141, 30, 71, -13, -115, 15, -94, 500, -70, -74, 148, 119, -33, 67, 599, 220, -53, 288, -316, 165, -353, 104, -181, 598, 8, -38, -262, -528, 501, -101, -297, 154, 291, -295, 419, -249, 345, -251, 86, -214, 124, 245, 323, -47, 91, -194, -343, 130, -606, 78, -324, 27, 82, 345, -150, 70, -234, 285, 150, -1, 165, -51, -38, 88, -35, -97, -168, 33, 136, 77, 120]
4821A20j95m4mL24j71J2kk54M41l27J65Rk20K89J33k25j60J85j76J60j81J09K9
4844A7P6j68R8k0j58J04N7j85L40j59J22k44o4K31k94K91p3J46j56J5q5Q9Q6K2
4868H8j20J5rj56L85k65J84n1J4l05J78R3q7J87j79J63j94J42m2j2l04L67k43
4891a51Q3N3L4m2Q2j33oN4J28k19K2J38NJ26l10M11k14M6k87j52L21J27j85J00
4915C1j92K13O4p1r5K11j32m0K5N4R9k48J50L4k08JP8J26J7R4j71j71J03N2L5
4940E9k3N9o7o2K38J6j45J2k34R3k92L59J66k0m27J41M83Ro46L07m93M71l40R6
4964b40J55l8KN6M71k07K19j92l50Q0k39J80j83L97lM98n48j72k09j64K20N0N59
4987C42k64J60j05j64j10R1p3N5m2O3q5K69pq1K22l23K12k71P0L5M0j38K62j04
$$ y = [120, -75, -119, -123, 201, 30, 42, 40, -214, 227, -100, 65, 74, -146, 143, 276, 51, -109, 76, -100, 60, -121, -12, 17, 93, -75, 23, 3, -155, -51, 6, -179, 161, 2, 124, -120, -184, 47, -247, 44, -29, 117, -39, -24, -109, -20, 66, 88, -32, -17, -26, -182, 203, -62, 122, 71, 85, -220, -42, 51, -36, 151, -28, 135, -59, 83, 41, 29, -275, 92, -151, -68, -15, 19, -23, 59, -74, -80, -26, 102, -117, -95, 43, 48, 174, -136, 275, 61, 107, -180, -332, -11, 116, -69, 31, -161, 52, 116, 45, -50, 161, 29, -11, 14, 68, 167, -81, 69, 103, -105, -104, -26, 100, 117, 211, 40, -131, -28, 24, 59, 36, 95, 28, -34, 204, 220, 75, 87, -147, -54, -346, 13, 179, 159, -268, -127, 356, 365, -281, 26, -467, 4, -336, -240, -85, -123, -121, -65, 406, 199, 418, 226, -124, -44, -283, -103, -286, 111, 108, 606, 58, -114, -323, -487, -267, -217, 342, 78, 238, 133, -31, -141, -50, -123, -68, -110, -47, -132, 137, 130, 49, 271, -52, 160, -111, -41, -6, 34, -104, 158, 54]
5011E4n6J39k10J50j42l3J83k49J36j31J05J61p0Q4j63QMN9l5J19k66J38M4j16
5035h7J31k50J30J43j75P5M5r0o8K66m1j46M2jj39L24j51N9q7Qj1l8J67j57j7
5060f8j66M92n50K73K35k14N02k68j31j41J4j07J59o3J05k5j95K32m6k08L31j19
5082D2K3l07K56K5j9j8J94m3l92L80j95j86N2j88O12j96m37L98r3p0J59j94q0
5105b77P48m24J92J47j014k07O99j75P88O6j005K97R4J24j27Q0m8J11o6J30k59
5126a26J96j16J28q6j79K00l5J82J0o7q1l5l8j84L43j3j3P1n4l04K61p1L9p4K3
5151b3r7K29J01k26r7k07L38J22j27j03J66j3Nn8j8q3K39k54K26k36K49k09J18
5174D2L1NL5j04RJ0r9O8n7R0p7P0J40j93pp6k3K04j28M0r6RO0Q1Q6k1J00n3j72
$$ y = [54, -2, 137, -73, 77, -65, -98, 85, -164, -28, -159, -54, 107, 37, 121, -42, -34, -30, 29, -6, 113, -153, -15, 29, -87, 44, -206, -76, 67, -108, -33, 12, -78, -146, 120, 79, -67, -25, -26, -165, 159, 8, 67, -20, -12, -23, -61, 106, -51, -68, -234, 258, -292, -19, 216, 2, 504, 236, 105, -36, -22, -129, 30, -33, 72, 47, -148, 84, 38, -170, 161, 42, 65, -242, 14, 39, 20, 2, 196, 153, -239, 141, -54, -240, -188, -376, 236, 40, -397, 1, -92, -162, -3, -197, -277, 471, 47, 239, 386, -628, -835, -136, -311, 477, 543, -462, -165, -71, 53, -74, 6, -42, 69, 3, 133, -126, 70, -46, 82, -4, -183, 17, -18, 164, 174, 107, 26, -9, -47, -231, 112, 99, 86, 157, 103, -201, 60, -11, 28, -46, -23, -120, 109, 210, -16, -113, -320, 18, 140, 13, -90, 76, 63, 68, 10, -8, -91, 148, -106, 120, -116, 133, -76, 42, 73, 78, 113, 9, 18, 28, -71, -3, -60, 30, -47, 23, 163, -30, -37, -113, -136, 68, -60, -20, -116, -107, -47, 34, 120, 99, 199, 146, -26]
5203b6J18j22K34j76k6j19nJ53Q7r0J45q1j90K09P5k24J28R8k69jP3P0j10K43
5227A94l08L1Q6R2j30l45N71r2k0j34J17k37L79o1r5j2L5j82K22q5K1jNl12J43
5252a18P1K60l48J74j34k08K73l5J69M6Mk27K73m46P13l97m61L00K23m15K78k47
5274b52L52j01M46m01j02j55K55J40o8R0j95n75m4N13p0l53L19N11Q6k88j16L7
5296B9L63m8l67K23k01o75Q86p09K81Q38k38m85J91n31L75M44r41M54n34L47O73
5317C75l67K06k27M51k00l73J05p0n62K84N08J03k84j72j37K95n2N69j56o01K00
5338a05K8J94j37oj5J7J62q1k0k05K06j1o3L68l50k40J97J47k8p4j74K7P1J36
5362D4J0J12q4k75J60L4K39l44J39K6m17L05K02j62N02l79j89J08k67M95o71O8
$$ y = [-26, 92, -30, 204, 28, 2, -117, -122, 31, 118, 28, 173, 92, -98, 111, 186, -38, 90, 188, -81, -82, -9, 61, -49, 194, -114, -83, 3, 95, -35, -380, 191, 99, 79, -55, 62, -175, 204, 143, 48, 36, 71, -111, 111, 26, 47, 46, 51, -261, -118, -47, 213, -135, 39, -95, -303, -30, -65, 104, 150, 154, -73, 200, -246, 467, 70, -391, -91, 132, -283, -5, -252, 100, -1, 445, 44, -58, -213, 42, 182, 114, 204, 9, -566, -610, -97, -167, -520, -201, 310, 396, 108, -8, 29, 392, 344, -23, 200, -1, -676, 210, -499, -218, 620, 382, -103, 88, -443, -68, 376, -565, -111, -645, -298, 375, 8, 214, -13, 438, 238, -135, -30, -100, -662, -378, 130, 233, -51, -223, -360, -65, -117, 452, 296, -305, -105, -77, 117, -20, -26, -41, -24, 138, 57, 37, -168, 38, 27, -36, 332, -18, -258, -61, 86, 58, -16, -190, -163, -92, 44, 54, 166, 82, -193, -33, 1, 240, -104, 35, 61, -356, -51, 151, -11, 491, 112, -77, 31, -236, 259, -412, -344]
5384c44R8J12k96Q2K12O2L56j08j38j35K80m08J00J51L8m7L3j78L0L90o37O78
5406C31l33O8J34j2n0j05M9j74N0J67O6l21K17k20N5PL07l46l8K64o2j3L3qj89
5431a23J21j2j7rJ39p3O7o2j02J88J02l85L77l8m9O9k27L48k32r6j7O0j70J53
5455A2k83J33L83l23J11K00n9k52R1mQ4l18K35J79n95J88k0J05r9J05J21J2k43
5478b37K99j91L04k53J10r1J06j51J64r5j00R7J47k21LM2K1J50k07o2J43O8j38
5501i2N5k2P5J36r2M1L7j08Q4j94K23k29P9l3J98j65J21l0k2j79J6L66k64m5m
5526d8J72J04j65j78J12J05k42L14j92K2k4j4o5J00K8q9K38j11j39L10m12PJ35
5549c2q7n1MJ40oJ31k23N1N8N0j83K34j07J72p0R5k74NL56p42N64K18m17K7P29
$$ y = [-344, -246, -134, -430, -348, -136, -74, 282, 174, 36, -99, 181, -227, -127, 24, 62, 15, 48, -130, -100, 290, -347, 331, -2, 66, 200, 188, 138, 33, 82, -92, -42, 125, 191, -130, 87, -133, -78, -71, 236, -110, -148, 116, 54, 41, 74, 66, -123, -2, -14, -31, -40, 99, 26, 93, 31, -71, 117, 219, -166, 211, 173, 124, 193, -34, 314, 82, -14, -31, 29, -141, 12, -271, -138, 245, -78, 33, 233, 174, -78, 13, 9, 93, -225, 10, 189, -406, -218, -238, -133, -232, -127, -6, 6, -237, 62, -129, 175, -78, 32, -59, 47, -104, 60, -35, -135, -38, 109, -112, -109, -67, -46, 104, -103, -165, -22, 46, -92, -37, -59, 16, 152, 60, 101, 138, 30, 114, -80, 143, -86, -7, -40, 158, -7, 114, 84, 62, -117, -101, 265, 1, -44, -48, 124, 228, 63, -115, -3, 102, -140, 174, -18, 4, -20, -34, -99, 1, 29, -60, 178, 67, -72, 238, -174, -167, -32, -119, -170, -166, -26, -32, 99, -124, -73, -15, 35, -148, 86, -21, 151, 81, 176, -98, -93, 263, -479, 85, 303, -114, -87, 642]
5574F42k77k69L30R6m64l6j51L88k03k24J51K66r65M23LJ56R3K84K54j022M97
5595b8O4J74K9j57O3m7l73Q2Q5j39K95OO0k93J00J6l5mK33K2j70P9J9J49l23J93
5621A00l4j2j93K19k34J93n5N8j14k9J79l15J51J99o9J85j55k13K25Kp7j04J94
5644A01m6J55j53k63K82J10l05J18m8L60j77j73o2k07M80n02J40j4L49l21J42
5665c4o0M60J2l92M9K30k36k26J78l04K35P22o95J84J87o54Q07p60K2L18k09k6
5687a92K66m42J30L70k10j38M45JJ23o29Q69q94K80L20p29K78J52j15k48L21L6
5708fn3j81L66l2j10RJ5l6J25q7pK8n4n9J15j74J21J03j47K97J2k52pR8j20l7
5734g3n1J89k86J31J29k1R3m7k55R0J87j89K0J47j16j91N5J6R1J07j14O6M4L2
$$ y = [642, 365, 96, 426, 522, 58, 22, -129, 259, 56, -168, -17, 249, -716, -293, -290, -134, -41, 243, 497, -525, -28, 36, 210, 239, 82, 145, 98, -275, -193, -108, -247, 48, 54, 114, -179, -79, -63, -98, -102, 131, 153, -17, 62, 81, 230, -93, 100, 66, 54, -139, 80, -154, 39, -16, 42, -72, -101, 78, -237, -86, 113, 44, 229, 74, -139, 86, 88, 11, -93, 101, 55, 210, 57, -206, 76, 186, -119, -1, -49, 311, 134, -39, -101, -308, 172, -330, -190, -204, 145, -176, -34, -94, 366, 378, -14, 35, 265, 29, -197, -19, -323, -88, 634, -61, 123, 310, -344, 463, -297, -275, 43, -166, -192, 74, -368, -238, 132, -78, -216, 229, 230, 353, -276, 593, -301, -21, 299, -430, -152, 0, -115, -363, -42, -6, -59, -240, 126, 94, -16, -7, 8, -28, 97, 10, 3, 31, -23, -82, 33, -141, -20, 83, -64, 233, 245, -7, -14, 84, -36, -73, -124, 65, -221, -90, 39, 18, 111, 64, -191, -101, 86, -103, -83, 64, -52, -243, -188, -172, -81, 26, -88, -22, 22, 54]
5758E4q2P3l08K91R2k91K11q9J34J25m23L17P0k95K23p8l14L01O5Q1j34l0MM8
5782D5n0J62l48J18K24k04q4J36j40J48O6j40M8J29J6l17K70L0q9K5l9j38J37
5805EN3k23J47n0K14k21q4L00k4k14J36j19j4n3P1J67m2N4q6n0K15j45k07M54
5829B84k73P4p8j14P3kL02k07J2j36n1Q2l0J6r7K03o2J29J0k09k20M99j78q5N3
5854ej18J41oP1p6j58J18o2K83j74n1J14K9n1n2R1j41M6m4k2N3K03k40P1j97N6
5880a21J00K33j32j10J4k58O9K20r8J63n8P3k58M04j40p0l5q5J17j18J09Q7k50
5903a44K26k29J42j27J90M0j65K6P9r3J75m72K56J15J14k87J74l1M4O5k15m9K17
5926E1j32J84k20Q0j54J65r4J82M1m7j22k2K01r9k07L02j00p4j05J00n5J01n4
$$ y = [54, -28, 45, -263, 28, 120, -171, 40, -49, 85, 210, -213, 104, 174, -121, 102, 24, -290, 11, 76, 157, 23, -7, -3, 45, -5, 157, -191, -73, 151, -53, -137, -1, -141, 7, 73, -67, -19, 110, 126, -191, 79, 109, 20, 45, 6, -132, 5, 58, -165, -18, -68, 146, -75, -159, 141, 117, -97, 39, -80, -94, -147, -76, 91, 49, 103, 17, -33, 182, 37, -170, 284, 11, 85, 7, -107, -34, -36, 266, 59, 71, -65, -116, -34, -64, -48, -145, 58, -4, 125, 135, -74, -294, 205, 27, -58, -5, -123, 18, 12, 83, 7, -151, -33, -95, 188, 14, -37, 77, 106, 55, 3, 94, -47, -1, -45, -67, -14, 189, -51, 20, -177, -121, -21, 212, 80, -30, -16, -274, -205, 15, -83, 80, 22, 95, -163, 241, 101, 31, -4, -89, 28, -90, 19, 106, -144, 82, -147, -5, -132, 58, 98, -67, -41, 38, -55, 120, -352, -96, 19, 133, -154, 20, -11, 33, 98, -117, -166, 51, -81, 103, -117, -37, -191, -26, -120, 62, 103, 56, -66, -88, 113, 14, -193, 109, 9, -65, -170, -70, -125, -24, -78]
5949g8k0J3O2l7j41J94J41L9k12J82k47j52M40k97J91K4j73K13k7p8m6J55N4l24
5973a24K52J25k11K3j95L06o8p9O7J3j64O5J4j01N5J10j14j7m8O9J2P2j61L08
5997B09k97l26M79j19P4K1j83K65k37J17nl4k6n0J28n6K16j48O7j25l8J21J7j18
6021d8j1L0O0J64k74N7m1q4K23k4QJ19k54J41j58M0JN5R9k61J96r2J13Q7j82O7
6047C1n0L1P9j65O3p4P2jM8J10k60R1O3k47L92k41n6J3M1K01m2j4L5j4j0l59L17
6074E4l6K7J0J9j46n8J63P1j50r4m7L52k20J9J60L3j20J71j40k3rL8N2k35K70
6099A61o0k32K29q6r9K24j41J37j52o5O0L09l86j28K55k1j18QJ57O5k01Q8l0N
6123b1J05j50j18L07k57O6J38j9j89N5J25m6K2%R2j45k6JL3M9J58k16k0k0J49
$$ y = [-78, -98, -85, -23, -60, -201, -7, 134, 173, -39, 143, -104, -256, 184, -113, 78, 102, -71, 142, 115, 37, -9, 146, 200, -124, 128, 253, 42, 65, -130, 176, 108, 29, 96, 109, -55, 10, 24, -77, -22, 88, -26, -43, -91, -22, -10, 62, -99, 209, -88, -414, 65, -54, 20, 41, -142, 123, -114, 3, -2, -36, -62, -112, 16, -40, 176, 28, 95, -30, -68, 53, 70, -48, -59, -29, 31, 195, -79, -22, -63, -147, 76, 52, 60, 179, -75, 66, -92, -52, -51, 4, 103, -158, 38, -54, 59, 146, -36, 31, -19, 12, 91, -74, -11, -85, -13, -14, 34, 144, -116, -25, 38, -209, 183, -58, -114, -101, -60, 141, 99, 85, 120, 106, 96, -263, 54, 18, 45, 55, 74, -72, -130, 33, 104, -46, -140, -187, 165, -55, -36, 124, 157, 37, 208, 68, 45, 36, 74, 126, -109, 161, 101, -131, 98, 12, -87, 137, -4, 133, -19, -84, -24, 285, -101, -229, 26, 5, -113, -105, 52, 117, -84, 4, -26, -21, 84, -66, -184, 123, -134, -68, 70, 51, -138, -83, 42, -4, 18, 18, 110, -35, -61, -60, -27, 22, 180, -36, -56, -76, 73]
6148G3K5j30J45l53L32j65qO1J37j84J61k27K52l51J06J13n4M9R5j55J1M4N6q5
6172e2J2J50j39J80o8k62L5K16r1Kj68K60p3L2n5mj4L0L7K7k09K16m1j08J01J04
6198A18j44M3j80L48l5j04j60j32L00K29j34j39m3J86m3k15J8R0N3k05J82J89
6220B22k77k9J15J53q8j4l46K51j6K2J08k36K02o1N9J08m8j60n0j04K81p5N0j19
6244e2O9O4N3K5j52j12l9K2j4J55K12l9l8r6K35m13q6J85j5K46m61K66l20K94
6268a1J76P1R6k39k9m7n58O40J88l64r65J191o31L28l4j72M36k03l45K72L93j05
6290H8j05K05m15L05k21L08J02L6m02J1K73k33o6M1J70k78J93j47M04j87P8j45
6312A5Q6k45J95k15J52o6K31kK9j54k50L67q2q4j8K10j29J07p7Pk24L87l99k93
$$ y = [73, 98, -32, 113, -240, 92, -73, -81, -20, 117, -67, 94, -133, 119, -232, -126, -13, -67, -18, 77, -78, -67, -23, 33, -52, -40, 110, -29, 151, 83, -179, -144, 72, -19, -17, -185, 75, 2, 34, -21, -25, -39, -9, 28, 55, -154, 62, 21, -87, 14, 118, -26, 17, -163, 185, 150, 46, -114, -246, 54, 283, 149, 10, -33, 153, 110, -105, -87, 3, 56, -149, 33, 222, -55, -84, 31, 184, 96, 82, -264, -13, -29, -7, 101, -135, 67, 6, 65, 173, 125, -35, -85, -189, 92, 17, 67, -52, 17, 81, 134, 159, 7, -105, -144, -122, -136, 19, 231, 192, 154, 58, 293, -120, -206, -21, -36, 210, -251, 15, -305, -11, 165, 236, 332, 93, 64, 17, -541, 99, 287, -77, -1042, 149, -482, -154, -188, -360, 76, -127, -472, -200, 193, 88, -17, 188, -227, 78, -143, 165, 267, 303, -99, -88, 185, -48, -114, -73, 97, -181, 12, -135, 269, 82, 160, 15, 101, -144, 51, -164, -12, -78, 153, 151, 180, 26, -224, 143, 61, -23, -41, 169, 40, 147, 70, 77, -147, 240, -159, -452]
6336d52J90K70L35m73J44m96K93M84m31J89J10p1j16Q2pj5J4Qm7j35K32j82Q4
6359A0n8nM5k27M11r5j28M1J48l75M19l17K57j68J33j2k19J27j21P1n3N3Q6lj0
6384A0J2k67K27J01k20K0K12K0m7N4j40mJ80m46L41l17O4L35o8j74K71r2K14l50
6408f4J37L6j49J39k21J67k85K00j54J41K13j02N7j57j54J10RK53k59J99K26l25
6430A7j68K99k71L05l23M99k84j46J01P3j4j46J6l06j41P39m43J65L14j182O34
6451b62M40l03L52l01R0l39J163m33j179J043q1o22N53p92P01L51q3n30J38o8
6471a62L03j99o5K08l71M54l04J27j0J27k69K25k2J2mr0j13K29j24J75n2j86K09
6494I8J9R2q5p4j02j2j57M91j64j3J29p7j22P8K9n7p8j43Q2K12j26j04J91k40
$$ y = [-452, -262, 8, 343, -130, 14, -482, -189, 295, -136, 53, 163, 92, -24, 58, 51, 36, 50, 58, 11, -124, 108, -74, 10, -48, -53, -8, -235, 176, 81, -47, -6, 142, -233, 186, -131, 126, -42, 91, 79, -140, -13, -134, -63, -116, -63, 23, 20, 10, 22, -245, -18, 83, -137, -117, 95, 115, 68, 122, -18, -22, 158, -288, 53, -264, -200, 135, 67, -107, 164, 72, 286, -64, 73, 109, -40, 99, -122, 45, -240, -40, -194, -53, 160, 58, 115, -42, -196, -86, -77, 176, -83, 116, 342, 17, -151, 148, -123, 182, -141, 358, 74, -72, 29, 102, 88, -58, -42, -348, -489, 250, -193, -28, 286, -896, -262, 178, -125, 227, -74, 16, -323, 840, 407, -772, 271, 190, -432, 121, -671, 30, 381, 298, -232, -94, -162, 141, -58, -123, 85, -286, 168, -136, -9, -19, 108, -161, 64, 42, 54, 50, -40, -153, 76, -48, 127, 75, -111, 98, 117, 209, 124, 50, -52, -64, -221, 270, 106, 93, 222, 145, 23, 101, 130, 73, -5, -148, -66, 146, 20, -84, 107, -133]
6518a33M2J42p5K0J50j09J06j75k6K00k07n1P4J77j02j86K52j54l3l9J12kqj45
6542a70J43N6oJ34n6r1k42L3L71K0k17OJ65j24R1j9J5l19L87p2l10K07q1l62q
6567d49O69k18O8j4mM9k94K13P7J1r5k22J14M58l96N1j86J91j14Q6R9J60k07N7
6591A04j30J94k29J02p2J97J63j37m19K30J91m08K77k32jKO80m18P4l49L53l3
6613A39l57O65N2l24J9k83k51L75l97L38Jl19R93m39o11R74n84L7m02J24N53l53
6635e0m21L05k98j59P33j39pj9K35l31J74l15K77J66k29K23l0p6j92p6J37ol4
6658a32l5K02p0O6j20L49k51Q0k95J40J38l2oj09L2j79J79j81J96J10p6M8K26
6681B80k85KJ2o8O6q1j5J62k06L5n1O0J13M2O8j50K02l0j60J4Q9j67J37j47J45
$$ y = [-133, -91, 51, -24, -4, 146, 37, 143, -32, -58, 142, -65, -116, -42, 135, 33, -153, 99, -55, -88, -127, -15, -17, -25, -170, -27, 29, 23, 157, 101, 10, -232, -199, 172, 192, -25, -19, 146, 22, 113, 94, 109, -210, 177, 105, -205, 2, -79, -441, -449, 220, 2, 70, 56, 52, 101, -193, 20, 97, 108, 13, -209, -95, 363, -33, 18, -168, 23, -91, -5, 94, 254, 47, 104, -26, 168, -61, 41, -31, 166, 329, 192, -227, 3, 194, -214, 63, -169, -170, -168, 512, 94, 168, -181, 172, 139, -218, 447, 499, 175, 194, -89, -340, 35, -362, -24, -23, -342, 651, 212, -399, 575, -9, 28, -374, -250, 303, -50, -471, -166, -464, -623, 110, -29, -36, -55, 180, -151, 23, -292, -15, 151, -78, 145, 115, 39, -153, -229, -92, -98, -132, -167, 35, -35, 31, -89, 260, 9, 89, -206, -66, 72, 40, 34, -75, -43, -222, -43, -224, -28, 82, 6, 54, 280, -5, -3, 9, -59, 7, -74, -89, 73, -133, -98, -149, -89, 24, 66, 134, -16, 186, 156, -4, 10, 99, -68, 69, -78, 67]
6706F7j03K55j7k55J41j54K59j13j63J1R2J08J34j58j42K01k14K29j14o0K75l69
6728i0oJ93n4j55O3l2J35k9j48j25J20R4j2j11k71N32k63L12L9k67L7l11K81p
6752g5J78p5n0L4j24n2R1R9m1k9J66l55K92J55l03O5J48j96N8l59P2M82n7l39
6776b15J32J17K7M90o00P26o87k98m4j14L63k05K26R9L03o31K46j71L42k31j51
6797b76L94l66r6M2j13P31j95m68L21m7K0M1j14M03l21M77m82J63j56M6K8p6J96
6820A52n37L40k0M29o59P82m06M3p16K2N95j59L77o18J83L05k27M2O0k16K14J74
6842A60o8j58N5p6K11O7n2k70M50j037L30K35L20n79L88N6J37l69J07n5l8k07
6864c93L59l09K81P60j455J037m71Q07m24J34k73j87p2J22K7k6K89m84K53R6l40
$$ y = [67, -36, 219, 202, -53, 88, -66, 193, 80, -83, -72, 20, 128, 262, 104, -38, 163, -51, 178, 64, 4, 279, -90, -96, 97, 43, -112, -49, -81, 54, 25, -123, -248, -128, -34, -46, -157, -428, 104, -159, 153, 192, -75, -38, -349, -68, -75, 103, 28, -22, 12, -112, -164, -73, 26, -15, -44, 122, -233, 59, 214, -89, -24, 124, -72, -14, -373, -301, 181, 124, -215, -83, 34, 61, 551, -49, 677, -10, -308, -352, -466, -103, -308, -82, 17, 320, -311, -65, -236, 106, -125, -276, 118, -248, -344, -302, -415, 316, 121, -347, -26, -73, -53, -12, -126, 277, -44, 433, -49, 114, -42, 4, 32, -44, 152, -385, -45, -65, 364, -295, 487, 81, 124, -592, -570, 25, -134, 243, -375, -192, 113, -114, -72, -12, -228, -14, 160, 92, -66, -11, -87, 124, 191, 139, -131, 319, -718, -388, -153, 167, -412, -24, 32, 169, -200, -93, -148, -186, -393, -34, -343, -62, 698, -757, 280, -191, 616, 192, 326, 53, -134, -206, -84, -57, -83, 206, -278, -25, 71, -269]
6885b69K9J71J92O03o56L06m96N8J31j9J24k48j16J36m8K52J8m98Q3k54k9K97
6907b33J31K9j41P22n37K51l69L57r2l33R31j248J215l73j92r02L18K14L10n1
6927GJ20j94j64j49P22Jl28k43M07O19j696Q01p2K49k91M97k64k43R7j03q9O42
6949C26j13j134J222M18o14m32k7L60R5m57Q4M1N7j24j0L36q3K28k60k41q6l95
6971h09J110k19n07o8N90J07k25J63o34K50O47o40j5K86l95L17MJ69j75k99j5
6992c58M04J98l60qL28q04R72p08M7Q34N1n36m37L50k24J08j89N26o35K86K9J43
7014A7l5P2k2K71k79k53j61N31K77q9k44j74q9O8k78N83k63k4K93j18M41k84k80
7037d0O2q2J33q3j41K27j86K28l53K42o6J68j29K1j71K96j15J17Nj19Q20o67j63
$$ y = [-269, -240, -69, 123, 726, 70, 376, -120, -62, 69, 50, 174, -74, -190, -54, -102, 150, 168, -330, -247, -501, -530, -233, -102, -73, -214, 508, -29, 222, -147, 210, 118, -215, 716, -532, 683, 310, 118, -784, -466, -252, 58, 7, 127, -67, -231, -380, 342, 343, 15, -228, 179, 798, -898, -97, -169, 80, -211, 286, 22, -221, -124, -227, -316, 326, 213, -921, 301, 719, 105, -327, -354, 6, 101, -356, -272, -231, -174, -298, -308, 28, -55, 173, -87, -328, -414, -809, 301, 82, -425, -493, 97, 204, -21, 142, -492, -242, 405, -235, -250, 36, -359, -42, -38, 131, -44, -343, -358, 46, 244, -116, -124, 204, -600, 372, -336, -289, 545, 596, 60, -377, -27, -251, -143, -332, 194, -441, -155, -126, 17, -18, 54, 32, 303, 24, -229, -390, 141, 418, 329, 85, -89, -178, -110, -388, 195, -68, -92, 201, 83, 524, 240, -40, 22, -60, 73, -10, -151, 76, -110, 118, -235, 7, -59, 109, -20, 1, -170, 126, 11, 128, 133, 14, 834, 167, 4]
7060Dj04M08n64j05J07K87j5J13m9J1j38k31O72q36P12r31J425l72n59J84kO7
7082H4j23k32O09n34k30j4K78r8m4L14j74L56k56M94k88j92j4J35N7j24n3J60
7104A11o4l8k5o8R6Q7k05R2J01q5J31k21n8K69j33j92K54j38M6J03J31om5q2J21
7129A82j22j28M43n03L9J22J08P6M7l89k17o0K32r3L51k4J9O0k74k4j96M12n82
7152e21R1N20l87N10O50n08m15M0K90j17l21J06k58K09K75k40J66k06M7R1J98
7173B20l77J87k42K09L7J1k1M1j16P1M38j091M58L06j91o8J81Oj05K22k03j70
7195a97K60j00L9k1QR3J3j89L37n15K74k01K28j40J56j1rj14j34K16Q2r2q1J73
7219G5J2k66L16j47j52M1j16M4O7L47o0l33K20M1k32J61J29k18q6N1M74m29M32
$$ y = [4, -100, 308, -256, -361, -254, 33, 18, 131, 82, 93, -45, -276, 396, -440, 272, -659, 766, 394, -165, 19, 17, 84, -39, -271, 338, -196, -426, -440, -162, -260, -304, 10, -164, 192, -64, 430, 142, -50, -64, 71, 128, 4, -49, 111, 47, 9, -16, -84, 12, 99, -106, -14, 87, 2, 133, -88, -146, 123, -10, -202, 52, -86, -40, 63, 194, 188, 143, 61, 182, 60, -68, 375, -128, -89, 33, 141, 217, 264, -125, -342, -402, -170, -263, 88, 64, 83, 143, -131, -155, -351, 61, -521, -430, 90, -297, 213, 863, 355, -60, -20, 270, 153, -168, -62, -320, -111, 164, -76, 90, -116, -69, 22, 220, -157, 30, -212, -3, 34, 45, 24, 65, -51, 20, 458, -633, -175, 131, -60, -128, 53, 59, -46, 176, -27, -197, 63, -37, 2, -19, -11, 82, 95, -94, 243, -272, 2, -199, 29, -111, 45, 34, 25, -89, -223, -7, 75, -17, -98, 75, 87, -179, 137, -10, -162, -121, -237, -193, -126, 221, 161, -172, 48, 89, -143, 18, 147, -71, -157, -106, 368, -61, 371]
7242C71n29K73K82j079J041j13j07m92l4P70m34l07N36k60J99k35M0K45k53L18
7262B32n4j59j70M6O7Q4N4j02K8jj66J70o4Q5O5l6j09O8l36M42J0Jr4K5l78R7
7288a95K29P4L0l58J11J97M2j11j3M5L38k87l27J12L35m0o50N82L3k70J37j9P
7311BM77n19q61J176m21K6pj40P32n70J10k48P65m58j18l2K97n7r8N9Jj29k10
7334b23L20L5j42n4M9J30j59n0L48l95K0J19m8J12p2KK84l47m4K87J9k87l6K60
7358A28j13J66l01J48N1Ko8r4P7j60L13n7j4L4p8p0L4O1n9P9Pm5j02K01n3j4k77
7385b04K64k07K41j87J86j16J70m19K55J1k63J82l8J83q5Q8k00J94j53M5K30k49
7407g2J6J16l01J83j43n6K66J50l69K14j18o6L57k57K33l17K03j0R1l63K95J64
$$ y = [371, -158, 115, 397, -682, 359, 246, 139, -353, -387, 383, -51, -358, 178, -82, 117, -118, -78, 167, -86, 232, 178, 19, -151, -105, -38, 46, 100, -2, 26, 25, -141, 29, -35, 50, 115, 79, -30, 38, -298, 144, 154, 155, 61, 86, -292, -195, 34, 108, 138, -220, -109, 88, 130, 19, 6, 51, 389, 102, -225, -113, 222, 182, -468, 114, 147, -123, 14, -5, 2, 479, -40, -901, 275, -146, -120, -127, -267, 465, -105, 5, -243, 522, 64, -54, -86, 211, 154, 56, 115, 116, -13, -223, 97, 132, -10, -64, -15, 115, -44, -94, 254, -141, -121, -2, -50, 62, -10, -8, 276, -71, -115, 172, 191, -96, -132, 128, 15, 181, -120, 28, 79, 81, 13, -81, -4, -164, 149, 92, 78, 112, 34, -36, -2, 59, 0, 79, 86, 41, -61, 140, 87, 73, -204, 60, -147, 94, -93, 93, -23, 147, -272, -17, -6, -269, -87, -125, 58, -27, 61, -139, 55, -98, -53, 177, -72, -56, 60, -241, -58, -201, -257, 9, 159, -210, 4, -114, -180, 177, -80, 153, -164, 39, 29, 120, -243, 52, 216]
7429B16k86j36J91Q6qN3j24n2j55M08l00m2k3K77j35K68j79K0j79K61k14J43j48
7452e8o1KL6K13k52M9k5P4J06j7k53K49M2j49o6J74n5m8J49j32M9Km3O9o4L03
7478B94M12r19jL16n44J10O51l54n3j28j22J21K9l7M62k7l1j39l23J12N71o72
7500b72J35j61L31J24j26K64j80q0p7O6j1P6J9k34J79k09L39l32J91j2k47L65
7522A48j11O4q9n2K53j11r8j40J23J3J68j23mK23k47L0m3j30n3J72j30O4JJ34
7546F2O1o3%n4J12n5J1lr3j22L24l43J55j08K29j89K43k44J9k5K08j00o1N6m0
7571b0j74K74j08j2%j1O3J41j33r2R7NM9p2J64j66k55K4M15j30m9J52j47J16j30
7596AR5l32PK07M3j09K25l85K43k59K74K06j74J4k04K19J8K1kj30N3m8P7j31O0
$$ y = [216, -70, -206, -15, 71, 63, 116, -8, -60, -215, 193, -107, -149, -172, 105, -30, 238, 59, 79, -100, 161, -53, 90, -58, -119, -117, -81, 132, -120, -71, -96, -22, 84, 67, -186, 63, 105, -44, -110, 64, 9, -39, 110, -22, 27, 29, -14, 55, -9, 294, 706, -213, -214, 102, -442, -332, 319, -35, -88, -216, -338, -217, -188, -225, 237, 210, 179, 40, -283, -171, 400, -272, -137, -298, 33, 157, 31, 295, 115, 35, -42, 24, 13, 89, 108, -126, 53, -156, 183, -149, 42, 30, -217, 148, 37, 101, 12, -40, 213, 102, 4, -136, -13, 0, 168, 45, 41, 264, 17, 47, 4, -126, -179, -7, -137, -73, -72, 62, 123, 60, 60, 6, 118, 63, 74, 71, -22, -144, 180, -163, -8, -116, 113, -76, 167, -77, -58, -83, 125, 25, -36, 20, -20, -194, 80, -28, -40, -40, -51, 12, 153, 20, -72, 25, 30, 79, 7, 171, 5, -250, -226, 189, 59, 10, 162, 15, 131, 1, 96, -236, -229, -22, 21, -88, 137, -248, -5, -264, 10, 216, 42, 56, -148, 71, 89, 110, 108, -22, 31, -17, 60, -71, -11]
7621a1r1K18r6J35j91r3l7J27J1M4j38N0K30k28p1J75j35OK57%k24J12j23J66
7645I3j1j03MJ15l03Q3K89l08J09J09k19K19n8q2J76k61O9K11j20JJ27k69K33
7668A04k40J89r2%nk9P5J28J39k89mm3L6O5L4j17N6R2M5j24J13n6M7k59K56k5
7694I6j67j8l3M4J19l2m3p5O5N5M4k64K91jj50L5k41K39J26%k02K78k24M5N1J7
7720E5k8k6OrNK09l15K18j59j12k4L6K08n3j50K10j81N7j3J31r8J37K1j19j3l
7746a0j33J34J66R3k26K4J3j6J59q2j13k78K28O7r8j28J24K03j98K60p2m6k64
7769a93K16M1j12J71M8k14J60o3k86N6L18k35L80l16j01m8P4N2K0j12J71j08k8
7792a09K48p9j69J29K5K9p8J64j93M8J21K3o6r0n7J08R0l49J31J51N9j80j29K50
$$ y = [-11, -102, 116, 20, 155, -36, -129, -166, -39, -28, 16, -122, -72, 158, -70, -141, 34, -101, -95, 162, 162, -62, 50, -73, 93, 82, -21, -17, 98, -205, -122, 167, -141, -32, 77, -142, 77, 19, -63, 113, -148, -79, 132, 12, 13, 140, -129, 104, -136, 53, -39, -39, -44, -73, 2, 130, 269, -20, -24, -67, -31, 34, 68, -49, 7, 99, 144, 20, 133, 77, 124, -135, 121, 96, -71, -89, -122, -78, 41, 9, -34, -109, -44, 11, 55, -209, 82, 81, -69, -34, -275, -36, 90, 90, -112, 166, -58, -13, 38, 55, 27, 1, 7, -2, 3, 212, -103, 115, -44, -156, -180, -144, 64, 11, -139, 71, -110, -53, -66, 65, -33, 104, 125, 6, -7, -10, -143, -9, 157, 250, 24, 48, 61, 45, 204, 122, 9, -269, -41, 26, -72, -200, -76, 127, -71, 189, 117, 71, -193, 23, 64, -48, 123, 171, -43, 117, 54, -232, -176, 142, -93, 287, -29, -130, -178, -104, -52, -32, -144, 27, -81, -109, 139, 60, -109, 20, 45, 74, -4, 160, -33, 15, 136, 159, 93, 3, -54, 54, 144, -205, -74, 77, 136, -44, -173, 77]
7816G7j49j21K27k77J67J08k6j21J13q5J22p6R4j82M5K30k9k31J36m0k61K39Q5
7839D5r1J25j82n8L00Qk6k5k91J55Q3oN7m9j5J36l08K88j82N8m8J4J7m9K83j87
7865E2m7j33K15j81p4O7J62J07k58K24q5J04p7Q6r2r0PJ8Q6p8K12l26j45L56j44
7890c4J56o2Q3k65K16n9o5j23P8J74j29j2P3m6K8nm5o9J01J80j07r8j3J5M8j00
7916h0l8J79j06L4l2m8k2K02M4k40K68j98k2J92R0j21k44R5J2K43l41P8J37j35
7940e3OJ1J36M5q7j5M6j6J16j73N1j03O0j30J6J11N7l5O4l55L39J15l7Q7o72K66
7966a50K99j01K75k31r8l4p7l9J32m4p8J73j15K4L9J40j59K0K14j87p9P7j22J18
7990ck0M7M6J31r7j46J32j41k16M4J41J21l2l31L71q9L1K01j50j14O5M6j76J64
$$ y = [77, -72, -193, 34, -243, -76, 32, 6, -115, -2, -87, 35, -41, 53, -129, -84, 146, 117, -114, 22, -18, -279, -40, 45, -46, 79, -103, -161, 139, 147, 121, 96, -195, -40, 43, 37, 94, 45, 30, 166, -142, 146, -36, 22, -26, -12, 5, -44, 239, 52, 5, -128, 87, -94, -168, -101, 61, 168, -90, 134, 49, 153, 76, 162, 70, -20, -13, 5, 91, 13, 225, -101, -246, 110, -34, 122, 60, 143, -122, 94, 35, -30, -153, -75, 99, -30, -42, 31, -15, 13, 8, -37, -106, -5, 175, 68, -30, -43, -28, 20, -80, -118, 61, -45, -11, -43, -91, -113, 89, 133, -107, 161, -37, -59, 133, 223, 102, -142, -47, -35, 208, -133, -55, 82, -53, -47, -36, 100, 145, 58, 43, 89, 73, 189, 16, 67, -36, 24, -106, -90, 21, 78, 43, 107, -248, 91, 206, 169, 256, -416, -150, 149, 48, 323, 92, -6, -40, -117, -156, -24, -68, -146, 27, -88, -64, -25, 115, -44, -24, 190, 3, -76, 1, -121, -3, -23, 24, 70, 201, 104, -42, 90, -51, -267, -223, -82, 39, 7, -324, 47, -42, -11, 190, 40, -74, -9, 37, -139, 25]
8014B5J4J27k86J12J85k73l0P0R7oR4j39J23J8j07k5K13l98R3O7K2J28k01J36
8038E9O3k63k8Q5k3K50J27q6k46R4l0j62RM1K15J08o2n7j20l78M19O5j8J50j59
8063E3l3p5K8J03j38JPJ21o2K8J00k81K33n4r6j82J42K04N1l20J82j42J13L9k08
8088a86P29k30l52n34R05R8k10J52k44M6l57%K66l00K61o5K20l0j90m84M35J64
8110I4L2j71Q4P6j86O5K7j52L68k05J32J46m09J14j6k01L24j58j73J15J38J62
8132B06j20J2o9n3l8j69J15K5R3k41o4M53l20L18j95J64j18j4m1P6j63j49Q2K19
8156IJ49k45m4k06L19q7J38m3j1j14j20Q6K19q4k6j78J83O0k1j49L34k76J50k7
8180A6J3Q3j64O6k90K07k7J70J1j25M0
$$ y = [25, 39, 166, -120, -8, 177, -96, -126, -56, 41, 35, 129, -10, 113, 131, 24, -1, 212, -186, -93, -26, -4, 124, -77, 59, 122, -141, -169, -84, -107, 143, 270, 184, -62, 32, 2, -160, -151, -110, 105, 213, 151, 94, -26, -404, 15, 80, 62, 212, 53, 20, -55, -27, 76, -62, -61, -54, 67, 5, 33, 133, -148, 85, 31, -65, -247, -105, 99, 150, -170, 12, -130, -17, 22, -186, 543, 313, -39, -573, 332, 430, 220, 372, 128, 174, -183, -183, 83, -217, 44, -21, 199, 169, -21, -505, -70, 94, 126, -45, 39, 115, -71, -6, 21, -131, 237, 32, 164, 310, -99, 15, -1, -202, 122, -36, -209, -94, 44, 206, 86, 98, 29, -24, -62, -231, -116, -91, 2, -239, -303, 150, -170, 148, -47, 117, -1, -15, -56, 20, -143, -292, -210, 9, 158, -87, -131, -337, -18, -105, 33, -10, -21, -135, -255, -169, 50, -34, -60, -238, -55, 5, -16, -165, 169, -107, 43, 16, 29, 112, -52, 14, -276, -69, -96, 74, 85, -40, 0]
8191@
$$ Imaginary data points
##PAGE= N=2
##DATA TABLE= (X++(I..I)), XYDATA
0@%%%%%%%%%%%%%%JrJ6j6J6j7K5l2L7m5M9n7P1q0R0j06J22j38J58j82K07k31K59
37A38k92L24l62M07m52N01n55O12o76P48q27R09j000J104j215J339j479J634j806
56i48K001k227K488k792L155l597M147m856N809p161R251j2953K1447q0442L15
71f6363J57749J5300q5503j04868P409P6013P2056o588n3888o5627k0639M1219
83c3730Q5539L6443n9885j02819j7731R2975J02628j9219j14864p7366M7422J05693
95D5086M2558n3963p4773k5179L6228N7989L8197j7102o9493o3251J8335R6494
107C1126P0669m5914j15494m6934P9526J07565R838q8883p7675J2081P0683M9558
119E6146q115m5090m5589j2519L9003O6071K3592o0646q5521o645Q9812Q2361
$$ y = [0, 0, 0, 0, 0, 0, 0, 0, 0, 0, 0, 0, 0, 0, 0, 1, -8, 8, -8, 8, -9, 16, -16, 21, -24, 25, -32, 39, -41, 49, -57, 65, -73, 85, -97, 110, -121, 138, -154, 170, -192, 215, -237, 264, -291, 321, -355, 393, -434, 475, -525, 579, -636, 703, -776, 858, -948, 1053, -1174, 1314, -1478, 1677, -1920, 2227, -2629, 3180, -3981, 5270, -7683, 13764, -66678, -66363, 91386, 106686, 21183, -83685, -76276, -263, 71793, 65205, 11317, -54310, -74949, -33730, 51809, 88252, 28367, -74452, -92183, 792, 103420, 84201, -30663, -108029, -60607, 45086, 87644, 33681, -41092, -66271, -30043, 27946, 66143, 49041, -20452, -83703, -65368, 31126, 101795, 55881, -59613, -106547, -27021, 80544, 90382, 1499, -76176, -64095, 6588, 56146, 48031, 2941, -42648, -55167, -16164, 49907, 73499, 12853, -72668, -79313, 10499, 92860]
131I2860k6261j03607n6348N1976R0077K5519n2476o3135j4683L4159M8103K9589
143E5773j6569n8894n0368J9588Q2753N2730m6624r6109k9692P4345Q7454j682
155G2705p9896n9665J8610O0665L5238j3062l9649l4496l966L8082N5174J3065
167F2805n8471p2094K081Q0751O4662k9589r0541m0047N2236P8589J6406n0535
179A6253n3888j0241K9277M0004K2899j5185n0135l8599K3229P2266L9789m7130
191B8539q3106j8509O7746P0009j0497p0801m3993K5114N5407K7033j6828l7391
203g277k9815r25L5502M6835N994n4237n9457R524P6044N4183l4522q1401l1420
216g0972N0211O5017Q342m4949m3161l560K8092L4127J6607j6366m3865l1302
$$ y = [92860, 66599, -37008, -93356, -41380, 48697, 74216, 21740, -41395, -56078, -21919, 26184, 55773, 39204, -19690, -70058, -50470, 32283, 85013, 38389, -57720, -87412, -13067, 74387, 72705, -7191, -66856, -48246, 12419, 47657, 34595, -5054, -39550, -43516, -5434, 49740, 62805, 4334, -67760, -65679, 15072, 79734, 50145, -40396, -80443, -28207, 50382, 66788, 16253, -37635, -47876, -18599, 21405, 44304, 29119, -21016, -59615, -36386, 35880, 75669, 28539, -54567, -73076, -5330, 64679, 54182, -16619, -60612, -35498, 19909, 46942, 30114, -7277, -37092, -38017, -2515, 44320, 50314, -3923, -63380, -53856, 22188, 76371, 41849, -39552, -70972, -20761, 44256, 52598, 7649, -35512, -39072, -10980, 23147, 39754, 23388, -20477, -51779]
228e1779K3768O2069K8052m6415o8882o735O4747N7215j7033o4969l5174K7136
240b8000M8663J9779j7925l2831k4123K997L4158L9816O26n0393m9691J2999O6606
253B2681M2501l4804o7649k0037M4567N4128K735m0672l5731l14K6037K8734J0817
266C2993j7388l8003k1874K6315N3736J7154m5738n8015J347N9699M6158k0709
278C5675n8047k6944K7561M3218J5774j7843l0867k1090N110L2581L4221l338
290C6011m6543m0781J6310N9724L1948l4797n8863j2330M3438M3962k095l7548
302a564k8440K998K5167K4678O270k0050l3096j4261K8296M5724R200m4868m8123
315d8069P123N4965L7153k2209n1336k1335K6134L7904J2816j7252k7957j7203
$$ y = [-51779, -28011, 34058, 62110, 15695, -53187, -59922, 4825, 62040, 45007, -19962, -55136, -28000, 20663, 40442, 22517, -10314, -34437, -31440, 2718, 42534, 43160, -7233, -56924, -43925, 22681, 65182, 30378, -37271, -57308, -12741, 41387, 44122, 3450, -32281, -32595, -6558, 22176, 32993, 15605, -22398, -44272, -17957, 35779, 52933, 7195, -50820, -49473, 10226, 56384, 35675, -22372, -49316, -21755, 21463, 37237, 19394, -11473, -32563, -27453, 5128, 39349, 36011, -10532, -51313, -35003, 24721, 56669, 21872, -36991, -49321, -5883, 38079, 35984, -1564, -30004, -27006, -1839, 22839, 29109, 9059, -24037, -38298, -10002, 35722, 44922, 54, -48069, -40946, 14019, 51172, 28963, -22373, -43708, -17574, 20330, 33146, 15894, -12063, -29266]
327b9266P915K8928K7503o521m1822l1430J9212N1178K1959l4402m8477n338M0394
340a67L5889o682l4568k3123O149K4499K1681K318k1811k9756q066K9132L9513
353C5008K568m2294l9377J1242M8816K9193k2059m4199j6298K3404L2577R782
365B8363j6342k5065j3559R495K7593K1716j0910l6781k2679K1251M2772J2812
377C8666l3320l9939J058L8096K9505q933l1866k0455P534K3689J8864q77k2496
390d74k6287k713K9605L3931j972l8568l1930J2657M1998K1654k2088l7184j1086
403c2457K2357K8386O895j5555k2028j0188J1171K4438J4117j4272l2426j4090
415c3652K3782L6402O780l1778l2642M232L3967K3988j0325k9765j7903Q375K3516
$$ y = [-29266, -21351, 7577, 35080, 28559, -13263, -44693, -25481, 25697, 47656, 13254, -35223, -40561, -167, 35722, 29040, -5528, -28651, -22502, 1997, 23678, 25996, 4185, -25571, -33637, -4505, 35008, 37576, -4718, -44095, -32853, 15963, 45156, 23097, -21102, -37400, -13996, 18581, 28363, 12021, -13044, -26603, -17108, 10485, 32201, 21291, -15490, -38169, -16918, 25854, 38666, 5346, -34593, -33535, 4561, 34066, 25133, -6733, -27188, -19654, 4035, 22899, 22022, -474, -26761, -29474, 131, 34062, 32090, -6478, -38408, -25751, 16247, 37901, 15813, -21371, -32457, -10100, 18286, 25181, 9626, -12402, -22590, -11419, 13019, 27136, 12864, -19562, -33652, -9870, 26532, 33312, 1534, -31108, -26876, 7091, 31079, 20754, -9011, -26914, -18539, 4977]
428D977J7838k504k2033k2514O01K7411K6706n582l4790k3912J3832L5990J5789
441C1809k0589l0877o683K0939K3622L849j6414k0156o477J3593K2154R038j6390
454G418k7905q205K4421L0834J971k9943k7108N978K9766K0464j0368k6771j5459
467b4907Q464K2277J6059l963k1074j8729L763K4485J9472q558k9838j7301J5537
480a4313L0464J1098j9503k5092l488J9238J9672Q04j7659j8948k810J5561K1235
493A6259N856j7298k3981l368K3197K4545k478k7862k2231O771K7243J7284q802
506A5135k2441j2369Q093J9328J2145o611k0523j4658O926K2471J4867r895k4477
519a2009j0724J5709K4466N191j9397k2127j452J8897J8624J52j6743j6826o41
$$ y = [4977, 22815, 20311, -1722, -24236, -23635, 3776, 30482, 24900, -9890, -33802, -19970, 16020, 31809, 11220, -19657, -26340, -5401, 18221, 22070, 5656, -14500, -20977, -7384, 14770, 23808, 7418, -20487, -28692, -4271, 26563, 28534, -1409, -28517, -22539, 7227, 27691, 17323, -9448, -24907, -16443, 5834, 21893, 17930, -3144, -21873, -18110, 6375, 25847, 17289, -12549, -29850, -14313, 16151, 27249, 7746, -17346, -20834, -1596, 18076, 18880, 1221, -17727, -20537, -4976, 16259, 22115, 4817, -19164, -22532, 665, 25210, 22732, -5130, -27361, -20590, 6653, 23937, 15135, -7306, -19675, -11582, 7746, 19891, 13280, -7243, -21901, -14975, 7496, 22363, 12468, -12009, -22733, -7024, 17442, 22633, 3236, -18891, -20343, -1446, 17178, 17330, 587, -16239, -16880]
532a6880J6211J8197J744j8669k0562o28K1853K0687l344k3657j7383P403K2874
545G846J3042r136k0087j0578Q833J8147R497p759j7980j0374R058J9520R380
558A9409j2140k1154o204J6129K0740K972j8436j8943O2J7728J6231r99j6488
571a093j5515J090J6722J6214m16j7946j7347J801J9323J5699m939j9690j2698
584a8795Q045J9365J0086r461j7780p970Q636J5966O917j0135j5066n940J1562
597d570J7792M969j3608j8246l967J4789J7603N41j6080j5276K058J5947J5012
610A6964j867j6514j4246J485J5236J3550j943j5566j2467L606J7241J1425o122
623A0782j7590r669P735J6466P140r269j5183m700J0298J4669M494j1078j5411
$$ y = [-16880, -669, 17528, 19272, 603, -19959, -20587, 1266, 21953, 18609, -5048, -22431, -15028, 7846, 20888, 11752, -8335, -18913, -10080, 8067, 17564, 9805, -8175, -18549, -9491, 10029, 19409, 7269, -13885, -20089, -3960, 16780, 19752, 1316, -17627, -17565, 163, 16394, 15395, -1093, -16608, -15518, 1204, 17418, 17002, -944, -18291, -16490, 2833, 18532, 13593, -6097, -18795, -10750, 8615, 18701, 9240, -8540, -16510, -7874, 8092, 15009, 4874, -10192, -16132, -4570, 13222, 18191, 4583, -13663, -17630, -2841, 14762, 15303, -777, -16053, -13995, 1952, 16964, 15097, -1417, -15663, -14178, 1058, 14608, 12665, -2901, -15368, -11762, 5479, 16904, 10782, -6808, -16477, -8742, 7724, 14864, 5595, -9588, -14288, -3990, 10679, 15173, 4095, -11316]
636a1316l449J1449J5168K957j2706j5869QJ3858J4696o80j4556j3557L46J4904
650A253J2603k237j4153j1166L135J4088J0883m125j4812r584M964J4672Q344
663A3865o205j4834o252Q486J4214M758j0035j3620l686R979J3788K686j1545
676A599j2984j645J1742J3071J837j2945j4165N51J2529J2587o38j2920j1331
689a2712K405J2791R338l080j1998r646M821J2368Q029n556j2166o530O074J2529
703F667N974p926j3125m113Q854J3219K734r178j3173k266J0255J2894J351j0549
717A618j2896k14J1292J1091M95j1462j1329J174J1416R599j616j1671q267K581
731h189J1418P856m155j1263o741N248J1473N496o372j1850m297P581J1416L705
$$ y = [-11316, -14765, -3316, 11852, 14809, 2103, -13766, -13758, 100, 14796, 14116, -440, -13997, -13651, 1253, 13856, 11619, -2534, -13700, -10565, 3523, 14406, 10281, -4531, -14115, -9151, 5521, 13865, 7660, -7174, -13426, -4940, 9274, 14032, 3997, -9623, -13309, -3330, 10458, 13144, 1599, -11385, -13030, -1288, 11783, 13620, 675, -13490, -12939, -410, 12177, 11539, -1381, -12712, -10307, 2484, 11822, 8742, -3256, -12902, -8081, 4287, 12316, 6760, -5406, -11936, -5862, 6667, 12641, 4715, -8410, -12523, -3669, 9550, 12284, 3106, -10067, -12333, -2078, 10816, 12167, 1618, -11278, -11492, -200, 10891, 11386, -76, -11405, -10231, 1185, 10784, 9168, -2503, -10770, -8189, 3229, 11085, 6930, -4333, -11074, -5826, 5647, 11143, 4771, -7079, -11376, -3795, 7621, 11326]
745A1326q232j1616k992R170J1760J959r610j1521j240R635J1067P24r910j0298
759i778l2J0407R160p66r994q993K081J0104P730l095j0011o726M135J0084N668
774I974n280j0416m692O085J0645M282p164j0602l191P744J0528K486q294j0576
788h471j846Q845J0109J368q475j0044o80R052Q743l19q988q224J129Q994P712
803H905j992r045o586L155R142N308m118r484m942N241R803M073n623r622l558
818i343O399R590K654p149r551k342P436R802K112p579r402q42P374Q244P27q747
834f17p577L58Q147P226o86p921o140J841Q113N280l172q527m900L961Q835M492
850H713m882q574l465N452Q700K682o305q736k459O167Q867K401o235q471j777
$$ y = [11326, 3094, -8522, -11514, -2344, 9416, 11375, 1765, -9756, -10996, -1361, 9706, 10430, 520, -9778, -9810, 597, 9757, 8991, -1003, -9996, -7915, 2189, 9919, 6824, -3187, -9913, -5778, 4306, 9974, 4694, -5722, -10414, -4329, 6316, 10598, 3434, -7168, -10359, -2615, 7913, 10399, 2105, -8471, -10317, -1472, 8637, 10005, 1530, -8514, -9194, -142, 8601, 8282, -706, -8930, -7801, 1193, 8905, 6913, -2132, -8718, -5563, 3579, 8887, 4769, -4715, -9657, -4416, 5387, 9460, 3837, -5785, -9343, -2944, 6646, 9300, 2151, -7400, -9742, -2306, 7496, 9608, 2029, -7373, -8215, -841, 7403, 8130, -617, -8194, -7836, 311, 7537, 6851, -1070, -7210, -5369, 2744, 8024, 4852, -3675, -8575, -4614, 4221, 8713, 3831, -4743, -8208, -2756, 5944, 8626, 2321, -6415, -8874, -2707, 6160, 8561, 2326, -6145, -7922]
865g922O677Q284Q64p195p569n27P147O995m93p269n546J117Q059M037j942p073
881b356m659K750P051M542l332p708m197M382Q665L056n504p838k767N597P814
896E496K052n757p407k003N551P523J748n596p281r74O231O560J78o332o542Q73
912e680O816N164j537o636m331K461O221M042l390o546l113K727P203L281l662
927C020p290k899M849P228K543n282p816j879N451O944J347m976n458j434M797
942h55N862J029n334n859m42N435N548m34o012m638J620O463L821k709o441l009
958e955K955N926K912k984o053k809L135O511L075l778p109k947M408O776K467
973F530m789o458q02M712N317O76m448n194l85M282M587L79m606m227J94N384
$$ y = [-7922, -1245, 7039, 7903, 708, -6861, -7388, -241, 6754, 6261, -1008, -6554, -5437, 2622, 6659, 4717, -2356, -7015, -4265, 2786, 7328, 3996, -3712, -7909, -3527, 5138, 8194, 2690, -5148, -7915, -2318, 5496, 7548, 1791, -5616, -7619, -2068, 5455, 7203, 1607, -5674, -6648, -417, 6143, 6321, -11, -6553, -5680, 1136, 6300, 4763, -1873, -6204, -3743, 2478, 6520, 3130, -3416, -6529, -3802, 3401, 6682, 3020, -4270, -7169, -2320, 4908, 7451, 2169, -5647, -7526, -2075, 4869, 6216, 1240, -4218, -5652, -855, 5007, 6036, 702, -5157, -5599, -164, 5384, 4950, -1062, -5700, -4080, 2383, 6204, 3495, -2946, -5955, -3000, 2926, 5838, 2854, -3199, -6008, -2873, 3638, 6713, 2935, -4174, -7121, -2713, 4063, 6530, 1741, -4717, -5519, -807, 4510, 5186, 738, -4456, -4841, -559, 4028, 4407, -199, -4426, -4232, 1152]
989A152M194j481n933l743K505N760L317k639o450k113K746O048K474l450n629
1004c242k396L017N920K698l443o134k389M102N934J308m608m831l74M233M166
1019C961k24m016l664K82M025L595l68m382l571R06N087L782k242n495l349K787
1035b886N625K713l128n404j864K786N166J968k777n187k225K841N142K178l032
1050A916n124j210L481M841M6l901l885J31L907L100p1l906k879J032L984K655
1066D117j442m243l259J453M990L323k127n154k840L010N093K095l079m846j665
1081d574K646L993J888k354l750j474K392L959J251k888m214p34L582L743j18
1096C348l943l128J094L936K604j759l548k291J116L746K822j395m065k743J720
$$ y = [1152, 5346, 3865, -2068, -5811, -3306, 2454, 5771, 3132, -3318, -5431, -2685, 3363, 5837, 2387, -3242, -5638, -2621, 3299, 5997, 2554, -3580, -5969, -1867, 4067, 5375, 767, -4064, -4438, -205, 3961, 3737, -279, -3943, -3661, 364, 3959, 3591, -791, -4362, -3456, 1631, 5413, 3171, -2324, -5673, -2886, 2739, 5452, 2324, -3080, -4944, -2158, 3008, 4976, 2199, -2988, -5213, -2372, 2770, 4948, 1916, -3208, -4418, -937, 3904, 3950, 49, -3836, -3705, 202, 3302, 3231, -675, -3554, -2522, 1462, 4117, 2675, -1568, -4827, -3374, 1616, 4939, 2812, -2342, -5182, -2172, 2921, 5016, 1937, -2909, -4574, -1928, 2065, 3953, 1599, -2151, -3625, -1233, 2726, 3977, 1089, -3125, -3859, -277, 3466, 3348, -595, -3723, -2629, 1307, 3911, 2152, -1396, -3687, -2571, 1175, 3997, 2602, -1463, -4206, -2486]
1111b486M581K735k314m931k138K340M874J046k272l565j699K669L701P33k480
1126G94l037r12K562L168N22k965l268L64L377K924q26l721k731J306L995K253
1142C805j651l724k050J520L404K522j411l851k374J429L971K128j681m119j613
1157c695K317L633J109k531k892r18K466K617M6j587l008L94K200K328N9k990
1173d52k700M32L695K531j077l787j632O51L661K388j510l649j811J209L374J916
1189C239j219l433j910J633L366J521k025k957j156K007L027N13k298k484k26
1204b402K378K425l43k404k243J76K780K489m08k754k716R13L239K189j286l525
1220a492j805J358L139J972j119l077j830J806K282J660j596k709j294J591L192
$$ y = [-2486, 2095, 4830, 2516, -2415, -4553, -2213, 2661, 3707, 1435, -2130, -3829, -1160, 2541, 3274, 794, -2243, -3155, -593, 2575, 3097, 132, -3136, -2772, 605, 3529, 2703, -1018, -3749, -2443, 1552, 3805, 2154, -1570, -3620, -2100, 1304, 3826, 2415, -1436, -3810, -2381, 1590, 3718, 2037, -2082, -3695, -1378, 2255, 3364, 833, -2059, -2977, -511, 2106, 2152, 565, -2443, -2049, 151, 2479, 2538, -452, -3152, -2720, 975, 3506, 2429, -1358, -2990, -2339, 1322, 3710, 2200, -1449, -3260, -2051, 1323, 3239, 2020, -1413, -3323, -1690, 1676, 3197, 1172, -1785, -2941, -934, 2093, 2606, 308, -2176, -2402, -24, 2401, 2058, -346, -2589, -2413, 367, 2856, 2448, -306, -3022, -2109, 1130, 3319, 2033, -1492, -3297, -1939, 1200, 3172, 2053, -1024, -2854, -1048, 1234, 2894, 1298, -1411, -2705, -1114, 2078]
1235B078O61j644l179r7K047K204L8k932j827N05K625K236o40k356k122N44K774
1252I15J818p58k967k267J192L002J900n87l081j845J133K571J313j100k918n32
1268b211J702J519O89j504j291q19J981J460J84j813k025j19K319K154k70k716
1284g60j005m3K653J841j245k189k046J037K481J765o17k304j893O12J962J959
1300B208j071j736j718J148J906J529j739k139K47R38J329J055j732j833l73J679
1316c02K232j22j878k032J77K392J774n25k425p76J97J855J665J40k900j027j83
1333a738K193J863r58k315j024R59J782Q22m98k009q68J017J789M35j175j516
1349a241k79J440J851j88j867j675L33J543J937n00k042j503O74K028J189Q8k573
$$ y = [2078, 2739, 1095, -2084, -2181, -134, 2070, 2108, -824, -2651, -2146, 479, 2715, 2075, -281, -2403, -1859, 915, 2733, 1975, -992, -3259, -2067, 935, 2835, 2248, -833, -2678, -1545, 1026, 2339, 1239, -1679, -2211, -509, 1010, 1699, 195, -1096, -1915, 66, 1526, 1710, -103, -2128, -2247, 72, 2226, 1956, -760, -1765, -1808, 845, 2686, 1441, -748, -2794, -1757, 724, 2489, 1872, -432, -2325, -1713, 249, 2208, 1137, -599, -2317, -1169, 737, 2266, 527, -1612, -1365, -427, 902, 1957, 225, -1608, -1981, -302, 1930, 1808, -70, -2102, -1925, 467, 2241, 1716, -709, -1485, -1288, 567, 2232, 2372, -528, -1555, -1738, 455, 2318, 1360, -955, -1979, -1020, 762, 1584, 1086, -923, -1791, -774, 1015, 1450, 275, -1241, -1520, -80, 1771, 1583, -284, -1959, -1626, -83, 1854, 1354, -688, -2191, -1517, 511, 1700, 1788, -785]
1366g85j077J8J862K226q03j515j347K23J779J031o98j918o10Q17J723Q22j429
1383C19j193l69O58J641L66j792j355L01J273J687P1j453j892K77J880J541l76
1400A584k000j657K91J822J470p7j435j385Q52J192J276j341j030j351J307J000
1416E18Q07p82j534j13R02J667p0j352j341k43J364J104L47k031p94L76J406J478
1434A709l27j287j523j77J504J480K7j567j300K47J525J023m95j407k56P22O00
1451D98J94m48o81n69Q13P81P49j062j396m38J291J580p3j381j352K27J277J537
1469A547j14j212j602K37J216J310j32j124j331L7J030J120J4j013j580J008Q71
1486B82J070j267l50p67K89J368m16J82j346O8M59J304n2o81j413m11J710J329
$$ y = [-785, -1862, -1844, 18, 2244, 1441, -74, -1421, -1198, 581, 1612, 914, -1004, -1614, -797, 926, 1748, 319, -874, -1243, -585, 1056, 1422, -370, -1725, -1424, -151, 1536, 1607, 154, -1738, -1461, 419, 1960, 1584, -416, -2073, -1782, 40, 1510, 1433, -2, -1387, -535, 657, 1933, 592, -438, -1789, -482, 518, 1325, 543, -991, -1104, -202, 1465, 1395, 43, -1298, -1541, -177, 927, 1274, -757, -1551, -1175, 231, 1709, 1382, 95, -1428, -1605, -101, 1379, 1406, -161, -1461, -1214, 311, 1334, 839, -568, -824, -102, 498, 692, 244, -437, -1006, -193, 588, 1337, 275, -1121, -1559, -268, 1312, 1239, -142, -1494, -1267, 10, 1547, 1433, 221, -1381, -1144, 72, 1382, 1250, 126, -1205, -1168, -138, 982, 996, -17, -1597, -589, 282, 1352, 85, -265, -1032, -743, 625, 209, 391, -955, -887, -428, 876, 824, 143, -1270, -1681, 29, 1358]
1504A358r3j628j037K58J491R80j4j204j141M7P46R94M9n51j193nJ379M62L58
1523A256j443p08Q3J134P19j344l04J01L34J141n49m66n67m14R39J040N01j389
1541F4r39n53J211J739k8j742r45P9J390R08o55p50m57K88N96M62J69o95q07j36
1561h01Q45R64k32j603l78R44J314L27j504j031M09J108K60O8o64m57l71M76J077
1580G51P00q54j372p12J222J481J26j368j092L82J053M83n76m49j64K49K4L22
1598B06K95n40o19K1Q66R74n78j476o50J092J780j94j703r70R48J427m47r7l03
1617C2m3p00L57N08J018k73j590r97J491J342k38j166o68M75J170k38j079j92
1635g91N30K10K15Q8J46m34n97k1J221P7J74k311j63J177J72J440k022m09L02
$$ y = [1358, 1265, -363, -1400, -1142, 349, 1329, 1315, 111, -1030, -983, -237, 757, 806, 255, -938, -943, 436, 898, 1256, -187, -895, -812, 322, 1041, -303, -607, -506, -172, 969, 420, -46, -613, -1027, -88, 952, 1453, 64, -875, -1428, -217, 1522, 1494, -248, -1193, -1114, 276, 1184, 529, -221, -678, -390, 206, 668, 837, 142, -665, -801, 44, 1008, 776, -827, -1205, -261, 1053, 1380, -124, -1155, -746, 362, 622, 690, 26, -431, -802, -326, 751, 1451, 597, -775, -1487, -265, 1216, 1342, -26, -1118, -736, 317, 800, 224, -225, -389, -140, -116, 206, 501, -39, -658, -637, 229, 1203, 625, -851, -1501, -409, 1371, 1177, -526, -1496, -548, 879, 432, 335, 32, -11, -711, -354, 154, 1172, 899, -691, -1688, -197, 1145, 907, -259, -927, -452, 718, 480, -599, -791, -261, -51, 164, 252, 398, -36, -633, -654, 567, 644, 818, -1493, -1656, -479, -307, 1133, -889, -1298, -996]
1654i96J022N85j37m6l58k60J50J79J032l89j638o74J448J056p17j778L50J484
1672C13P28k49j645J53P20L36q3rK30k3j141n87Q93J489q88j090r88J805J443
1691A407k18j750J70L51N01k51j93K6K60o14l67Q11J205p03j485j79J207J275
1709A453j047j600k29J787R87o41j174k62J035q0l88J15O63k34r91n82J299J619
1727A730q53j769n30J262J417o67j337k43J239N43o09l92L40L78m41r65N36J139
1745G78k59j609p5J790J057r47k030j17J492N37n40m41l67J204N28j920N96J184
1763H61p83r18p91J772J428n68k002m12J961M66p67j361J94J396M21j033m70M58
1781a48O88n22o93N92J013m49j701j44J779J235r33k157P1J960P32j143j068L12
$$ y = [-996, 26, 611, 474, 428, 70, -190, -40, 139, 1171, 782, -856, -1530, -82, 974, 257, -1521, -1171, 313, 1041, 792, -853, -700, 20, 356, 273, 264, 494, 471, -670, -1257, -364, 1125, 237, -853, -1841, -36, 1407, 1189, -561, -391, -40, 461, 210, 17, 43, 303, -311, -678, 133, 1338, 635, -850, -1029, 178, 1453, 406, -1194, -1423, 364, 1351, 710, -464, -726, 309, 229, -159, -44, 619, 385, -606, -1188, 111, 1730, 877, -892, -1422, -160, 1257, 590, -747, -990, 249, 792, 183, -209, 131, 509, 68, -897, -361, 778, 519, -1090, -1165, 625, 1682, 735, -1295, -1412, 80, 617, 77, -364, -731, 473, 1001, -919, -323, 861, 78, -840, -1631, 141, 1569, 1001, -1001, -1413, 548, 1014, 247, -1114, -920, 476, 897, -136, -606, -148, 540, 18, -675, -83, 930, 481, -1220, -1364, 415, 1650, 717, -1440, -1369, 591, 1323, 180, -888, -576]
1799e76R93m36n37M66R93k71j224m72J098J235o94j722j20J650R38j136j057K64
1817f08J458J46j186m65N61L46m99n37Q36J176p98j210l23J661J088j326j830
1834a510L52J325R61r48r22Q20P57m60r91J28J240l82j005p65K86K253m54k173
1852a488L54K126O48j578j502N92J548K01j330m29J266L44p90r60J017Q57k29
1869F47j882k51J855J566j682j688J122J296j08j133l14O01Q43o66j461N86J240
1886E71J7j418M6J052J320j339j567L45J848M90j434j352R65J220J86j399r7J159
1904F13J22q36q70J174R74o32j756K2J330R94p36j431K72J938o35q76r06J367
1922A28P17n29j440L36J583pj182n09J171J096j154j388J62J585O92j149j231
$$ y = [-576, 417, -19, -556, -90, 903, 632, -592, -1064, 34, 1269, 575, -1147, -1267, 383, 1321, 185, -872, -608, 850, 996, -190, -655, -94, 252, -247, -784, 52, 1228, 430, -780, -1103, 558, 1646, 320, -1510, -1158, 167, 1128, 180, -742, 78, 835, 375, -616, -488, 752, 370, -635, -1400, -1114, 1139, 685, -1488, -1134, 992, 1640, 62, -1440, -848, 700, 901, -429, -858, 408, 752, -38, -998, 19, 876, 647, -1235, -1486, 369, 1935, 253, -1435, -313, 983, 875, -258, -572, 29, 872, 206, -1255, -669, 571, 588, -830, -784, 268, 1588, 249, -1318, -973, 875, 1365, -69, -1421, -456, 764, 950, -449, -546, 613, 735, -101, -971, 203, 1177, 545, -1211, -1189, 141, 1135, 399, -1032, -760, 1178, 543, -333, -1239, 128, 845, 316, -1124, -788, 795, 788, -394, -903, 268, 1364, 210, -1178, -1016, 569, 1261, 112, -1119]
1939a119P48J170k25j434m38J897l58q13m20J094J159n42j935M16J549R84j595
1956A38j442P49J620k31j360n47J288J002p00j376N60R31k53j059n2J149Q42r16
1974C43r86l81K188j43r49j006M94J456n52r64j63J063L78r72p70J187R63o68
1992E18j511J61J553M94j263j529J064J686r3j495o67J154P67p11r39O05R89m57
2010C26j216k8J542P83j461j083M76J528n3j249n55K93J760n23j524M53J480j86
2028G63j272n02J296J60j31j162M3J484L01j337q52R31J314j79j275m78R09M52
2046D65k26p85N03O56l74j059L76J085K28n38j549J040M30N04j077j019J698L08
2064F66o00l33k58O65K80p74k87J048O25j195p51J93J622J42j488n53N49J594
$$ y = [-1119, -371, 799, 574, -860, -1298, 599, 241, -572, -992, 102, 1261, 719, -1216, -800, 749, 1733, 138, -1304, -555, 1065, 834, -526, -1073, 215, 1217, 517, -859, -299, 632, 379, -680, -732, 417, 1259, 343, -643, -1024, 1164, 1021, 72, -934, -440, 1016, 464, -500, -663, 400, 778, -194, -964, 223, 1186, 518, -993, -832, 721, 1215, -48, -1577, -513, 1173, 1080, -415, -1082, 72, 839, 128, -811, -206, 783, 326, -890, -918, 624, 1407, -54, -1137, -661, 867, 814, -435, -990, -697, 1063, 540, -984, -531, 949, 763, -509, -1011, 285, 445, 314, -848, -805, 679, 980, -357, -1209, -278, 1036, 857, -418, -896, 13, 465, 239, -546, -43, 613, 239, -820, -444, 641, 869, 331, -1218, -178, 252, 756, -321, -1340, 358, 666, 66, -267, -525, 140, 420, -354, -641, 407, 1032, -163, -914, -721, 901, 1043, -445, -998, -449, 1145]
2082A145j29j891N57K80J241j714j53K07J525j102m04p37J338P31j197n97N86
2099c14J156Rj270p19J575O00n24j340J37J021J88p89l06Q68L16n33q97K72J321
2118G71q4q78q88R20R56k05j051k08J202N1p68n83N94Q55m94p06J53R98L09r67
2138b3r94Q37R78l29r69m27R05J068p83p69K18O03J32r40m2Q26L85p95q64N74
2158d09J191P2j028o89O55J043m55q91j30J019m4m24o83P49N19l82j082K98J147
2177D76j6j278J50J112O14q29r09k5R84K01k37p86L62M16n6l20k59R11Q7m81q83
2198g66M01J130Lp59n71M08Q42l41p43m8R32l2n24n35M31N68l67l64j68Q80j18
2219B59n87m34N06J123l34q72k61M93N83k21p82L11M40j8m73o6P04K42n90o12
$$ y = [1145, 1016, -875, -318, -38, 1203, -511, -664, -457, 1068, -34, -438, -1175, 163, 894, -303, -900, -314, 842, 851, -419, -1138, 437, 1037, 513, -827, -690, 331, 519, -270, -576, 292, 608, 75, -822, -550, 771, 687, -191, -1079, -159, 797, 592, -459, -667, 535, 586, -182, -765, -171, 684, 190, -516, -363, 635, 944, -23, -1017, -180, 798, 469, -500, -927, -22, 1046, 263, -506, -288, 315, 447, -493, -535, 291, 676, -119, -983, -409, 782, 854, -174, -863, -208, 835, 380, -511, -641, 378, 334, -90, -773, -24, 495, 113, -969, -671, 476, 460, -818, -668, 444, 1058, 229, -680, -705, 279, 480, 243, -543, -181, 235, 179, -141, -400, 511, 598, 117, -766, -365, 765, 768, 9, -562, -154, 688, 347, -396, -444, 488, 456, -68, -603, -172, 396, 29, -335, -503, 377, 259, -328, -762, -256, 867, 533, -339, -600, -107, 476, 255, -527, -216, 224, 206, -267, -333, 371, 613, 23, -589]
2239e89M34N29J27q90k75Q54K85j99n19k09Q39l5n49k85N07J32k80l54L33O45
2259E01r4n61m39L71P01m31n18j58N97O31p14n24Q91J06j97m48q6M26L47p59j7
2280c75L02N76o3n65k16N38N81p03k79j84P11K66p24j23K01L60n6n96M35L40N2
2301D78n12m79N16L84K38p06k87K87L62m26L9k0K79l7j81j69N09o7l16j46L22
2322F8J24j55n01K31J87O37k98m58L55k6K2j55O1j59K46l57j12K91L94p7n17k13
2344d12K96N5K26l20RM68l45J82p31N88K29j67j75j45Q03m25k01r2NM50N0k34
2366A14m63J84P75l96o94L63m83N80J58p4j87M91l05n89M97J21RMk77J43N07l69
2388A09m36J01K03N0Kk47K58K90n04J67L7J27P7k14l47L75L25l40j50l51O30r5
$$ y = [-589, -155, 374, 501, -389, -664, 190, 475, 276, -243, -452, 387, 352, -197, -482, 25, 157, -123, -477, -144, 501, 407, -154, -593, -222, 479, 48, -470, -628, -31, 600, -114, -638, 253, 359, 162, -286, -372, 54, 401, -358, -375, -73, 503, 440, -125, -341, 197, 778, 75, -204, -388, 323, 589, -135, -258, -57, 303, 247, -349, 86, 426, 478, -34, -513, 3, 387, 625, -81, -368, -81, 281, -145, -106, -126, 153, 116, -65, -234, 275, 208, -108, -254, 68, 192, 37, -464, -233, -46, 591, 293, -165, 190, 164, 186, 31, 92, -67, 179, -178, -290, 1, 395, 318, -199, -412, -116, -61, 165, -155, -146, 322, -23, 159, -572, 16, 245, 78, -97, -242, 561, 136, -65, -157, -152, 298, 348, 114, -349, -165, 610, 214, -480, -117, -600, -20, 138, 64, -123, 368, 63, -526, -29, 92, 101, 105, -172, -29, 478, 109, -327, -226, -23, 27, 29, -218, 40, 330, -174, -7, 30, 157, 234, 20, -327, 48, 373, 33, -117, -468, 162, 67]
2410F7l61K64k80O22J71m84J60J0l60K84m58N68m96P76n20O2q4J49m5k63N7K25
2432F4mP5m00J38Q7J63r7L4K50j18l05k09R7L72N0k45j54QL75k45k16L17J6R7
2456A50k35q5L18M2R8l31N39o83K22k0M67k25l77J66k48j72L46K19k12J85k10
2477d6R8R1q9K14j63j28J73m26K49O2K09j30l00J53K98m99K58J58j98O32j202
2498e86N43O6K36m85K74K41r84O33l06O53j00R2k99J13J51k47l8J57j09j10j65
2519b70K04p4P8N23m1n81J71J05J65j59k64o1J86Q5r9J49l76Q43l18L4m02j50
2541b52J067r46N9n6K15r34R49j96M88q60l5O24k52M17n93j55Q71N7K99p56m57
2562d46J78N2R5K96l57K76J85p60L50j36K77J79m97M8K69L16r09J71K08q5L27
$$ y = [67, -294, -30, -310, 312, 483, -1, 159, 169, -191, 93, -365, 203, -293, 483, -37, 25, -59, 90, 45, -218, -161, 64, 60, 135, -265, -127, -40, 123, 26, 60, 310, 192, -113, -322, -225, 147, 197, -48, -202, -194, 181, -64, -280, 37, 53, 150, -85, -170, 148, 190, 288, -43, 496, -187, 35, 15, 482, 257, -120, 46, -202, -374, -28, 191, -21, 164, -46, 52, 143, 54, 268, 105, -23, 150, -276, -27, 35, 244, 114, -186, -33, 265, -234, 24, 182, -16, 616, -586, -43, 23, 259, -226, 48, 289, -695, -62, -368, 285, 185, 277, -22, 91, 242, -5, -43, 114, 5, -105, -270, -66, -140, -62, 461, 420, -161, 10, 115, 280, 121, -143, -204, -18, 67, -32, 117, -259, 584, 266, 300, -102, -252, 815, -131, -72, -128, 87, -847, 102, -94, 394, -466, -501, 123, -129, 288, -305, -460, 411, 468, 767, 11, -446, -268, -216, -121, 175, -182, 94, 279, -481, -131, -267, 10, 189, -308, -260, 9, 325, -584, -413, -205, -290, 37]
2583C7r07J205N47p78j58k72K96K1k19K04j45M02k69Q2m2J43j09K9j37K56k01
2604a5Q9J46kj54J72k32J09r8k08M56Q4m61P5K94k19oO1k00j58L36l4J22j49L29
2628C37j80j13j78J76j14R0m65L26mJ36j19K26j74J46j03J67l49K33K10m31N80
2649C97k91P6j76j42L0l05M76k33l35M97j60K32j15L63k72j047J181K94q05J42
2669a93j55K32n4Q5K25j54J05rJ80m23r4K60J43j52L69j53k58j20J07R8k01M0
2691a22L17p9l53J08L79j47p5J30j03K2j23M39m16M6k83K09O3O6qP5l95Q5N28
2714C63k24k19n4N19L21j210P6O54m44L87o73J020l36k59k06L25R3l8J13j98K6
2735C6o3j6L60k71j07L4J08q7R5k08j8j19K10Q8p4l03J36K84j36J82m2N1j37J9
$$ y = [37, -870, 335, 882, 104, -54, -326, -30, -9, -228, -24, -169, 233, -36, 46, 4, 147, 38, 67, -70, 186, -15, 74, 220, 218, 64, 236, 4, 113, 15, -193, 263, 347, -114, -39, 255, 36, 30, 91, -109, -267, 69, 35, 157, 8, 337, 157, 44, -134, 42, -72, 18, -447, -121, -125, 11, -108, 118, -56, 90, -13, 154, -195, 38, 248, -183, 397, 106, 182, 6, -136, -106, -411, 65, -168, -503, -6, -166, 66, -49, 314, 42, -1005, 176, 470, -335, -193, -348, -116, -170, -85, 140, -14, 91, 82, 262, -161, -255, 5, 148, -4, 365, 212, -46, -166, -59, 39, -162, -122, 195, 116, -237, -129, 250, 103, 28, 158, 55, 77, -46, 393, -23, 23, -260, -51, 12, 78, 70, 145, -250, -165, 363, 139, -80, -134, 385, 706, -504, -428, 226, -218, 169, -504, 516, 180, -79, -285, 40, 133, 95, 208, 10, 36, -27, -43, 317, 46, -61, -27, 81, -6, 89, -119, -137, -256, -46, 42, -32, -335, -199, 85, -51, 131, 89, 140, 3, 22]
2759B2j59K23J00k65Q3k7L5M8k84M37j53k55K67l4p1k81L94L55k82O6L9o7j08
2782H3j48J86o7l66M92r9L0m33P23m28K14K56m45J02J00n20j34L90o2K55m0N2
2804A41l55J02m85M80N49p31L18o7O20n76j0K41n32M80J67k93M74j456O79N70
$$ y = [22, -137, 86, 186, -79, 4, -23, 12, 60, -224, 213, 60, -195, 72, 38, -33, -314, 80, 435, 153, 219, 258, 191, 83, -65, 121, 54, -312, 180, 81, 111, -322, 401, -27, 187, 443, -2, 100, 200, -320, -454, -64, -126, 129, 89, 141, -214, -112, -597, -117, 432, -299, 19, -48, 572, -4, -14, 227, -305, 175, 342, 49, 523, -933, -254, 316]
$$ [...]
8191b
##END NTUPLES=NMR FID
##END=
