##TITLE=1H_TG-2399
 200.13MHz,CDCl3.
 8 sc
 
 22.1.2026
##JCAMPDX= 6.0         $$ Bruker NMR JCAMP-DX V2.0
##DATA TYPE= NMR SPECTRUM
##DATA CLASS= NTUPLES
##ORIGIN= UXNMR, Bruker Analytische Messtechnik GmbH
##OWNER= pz
$$ XWIN-NMR		Version 3.5
$$ Thu Jan 22 13:32:57 2026 Russian Standard Time (UT+4h)  she@DPX200
##.OBSERVE FREQUENCY= 200.1313
##.OBSERVE NUCLEUS= ^1H
##.ACQUISITION MODE= SIMULTANEOUS
##.ACQUISITION SCHEME= undefined
##.AVERAGES= 8
##.DIGITISER RES= 18
##SPECTROMETER/DATA SYSTEM= spect
##.PULSE SEQUENCE= zg30
##.SOLVENT NAME= CDCl3
##.SHIFT REFERENCE= (INTERNAL, CDCl3, 0, 15.4869)
##AUDIT TRAIL= $$ (NUMBER, WHEN, WHO, WHERE, WHAT)
$$ ##TITLE= Audit trail, XWIN-NMR		Version 3.5
$$ ##JCAMPDX= 5.01
$$ ##ORIGIN= Bruker BioSpin GmbH
$$ ##OWNER= she
$$ F:/spectra/data/she/nmr/H-C/1/pdata/1/auditp.txt
$$ ##AUDIT TRAIL=  $$ (NUMBER, WHEN, WHO, WHERE, WHAT)
(   1,<2026-01-22 13:31:36.20 +0400>,<she>,<DPX200>,
      <created by zg, POWCHK disabled, PULCHK disabled
       configuration hash MD5:
       00 E9 B6 7A A2 85 ED C7 34 08 36 98 17 FE 4E 26
       data hash MD5: 16K
       B3 2E 9E F3 0F 7A 5F 9F 2F F0 F0 BD E1 CB 48 48>)
(   2,<2026-01-22 13:31:38.76 +0400>,<she>,<DPX200>,
      <Start of raw data processing
       efp BC_mod = 2 LB = 0.25 FT_mod = 6 PKNL = 1 PHC0 = -3780.103 PHC1 = 7.192311 SI = 16K 
       data hash MD5: 16K
       2E 71 86 63 E5 F8 1E C4 5B D8 B1 5E 43 98 AE 04>)
(   3,<2026-01-22 13:31:59.81 +0400>,<she>,<DPX200>,
      <pk PHC0 = 77.61595 PHC1 = 9.2 
       data hash MD5: 16K
       D4 8F E0 81 72 0E 20 85 57 91 CC 14 80 6A DB 93>)
(   4,<2026-01-22 13:32:03.98 +0400>,<she>,<DPX200>,
      <abs ABSG = 5 
       data hash MD5: 16K
       78 82 DC 38 AC C7 C0 F4 14 E5 62 95 45 65 40 15>)
$$ ##END=
$$ 
$$ hash MD5
$$ D6 47 80 0E 57 8B DB BE C0 C3 AA E2 8B 33 92 32
##$RELAX= 
##$RELAX= 
##$RELAX= 
##$RELAX= 
##$RELAX= 
##$RELAX= 
$$ Bruker specific parameters
$$ --------------------------
##$DU= <F:/spectra>
##$EXPNO= 1
##$NAME= <H-C>
##$PROCNO= 1
##$TYPE= <nmr>
##$USER= <she>
##$AMP= (0..31)
100 100 100 100 100 100 100 100 100 100 100 100 100 100 100 100 100 100 
100 100 100 100 100 100 100 100 100 100 100 100 100 100 
##$AQSEQ= 0
##$AQ_mod= 1
##$AUNM= <au_zg>
##$AUTOPOS= <>
##$BF1= 200.13
##$BF2= 200.13
##$BF3= 200.13
##$BF4= 200.13
##$BF5= 200.13
##$BF6= 200.13
##$BF7= 200.13
##$BF8= 200.13
##$BYTORDA= 1
##$CFDGTYP= 0
##$CFRGTYP= 5
##$CHEMSTR= <none>
##$CNST= (0..31)
1 1 145 1 1 1 1 1 1 1 1 1 1 1 1 1 1 1 1 1 1 1 1 1 1 1 1 1 1 1 1 1 
##$CPDPRG= <>
##$CPDPRG1= <>
##$CPDPRG2= <>
##$CPDPRG3= <>
##$CPDPRG4= <mlev>
##$CPDPRG5= <mlev>
##$CPDPRG6= <mlev>
##$CPDPRG7= <mlev>
##$CPDPRG8= <mlev>
##$CPDPRGB= <>
##$CPDPRGT= <>
##$D= (0..31)
0 0.7 0 0 0 0 0 0 0 0 0 0.03 0 0 0 0 0 0 0 0 0 0 0 0 0 0 0 0 0 0 0 0 
##$DATE= 1769074295
##$DBL= (0..7)
120 120 120 120 120 120 120 120 
##$DBP= (0..7)
150 150 150 150 150 150 150 150 
##$DBP07= 0
##$DBPNAM0= <>
##$DBPNAM1= <>
##$DBPNAM2= <>
##$DBPNAM3= <>
##$DBPNAM4= <>
##$DBPNAM5= <>
$$ [...]
##$SUBNAM3= <"">
##$SUBNAM4= <"">
##$SUBNAM5= <"">
##$SUBNAM6= <"">
##$SUBNAM7= <"">
##$SUBNAM8= <"">
##$SUBNAM9= <"">
##$SW= 18.0517328524113
##$SWIBOX= (0..15)
0 0 2 0 0 0 0 0 0 0 0 0 0 0 0 0 
##$SW_h= 3612.71676300578
##$TD= 16384
##$TD0= 1
##$TE= 0
##$TE2= 300
##$TE3= 300
##$TEG= 300
##$TL= (0..7)
0 120 120 120 120 120 120 120 
##$TP= (0..7)
150 150 150 150 150 150 150 150 
##$TP07= 0
##$TPNAME0= <>
##$TPNAME1= <>
##$TPNAME2= <>
##$TPNAME3= <>
##$TPNAME4= <>
##$TPNAME5= <>
##$TPNAME6= <>
##$TPNAME7= <>
##$TPOAL= (0..7)
0.5 0.5 0.5 0.5 0.5 0.5 0.5 0.5 
##$TPOFFS= (0..7)
0 0 0 0 0 0 0 0 
##$TUNHIN= 0
##$TUNHOUT= 0
##$TUNXOUT= 0
##$USERA1= <user>
##$USERA2= <user>
##$USERA3= <user>
##$USERA4= <user>
##$USERA5= <user>
##$V9= 5
##$VALIST= <valist>
##$VCLIST= <CCCCCCCCCCCCCCC>
##$VD= 0
##$VDLIST= <DDDDDDDDDDDDDDD>
##$VPLIST= <PPPPPPPPPPPPPPP>
##$VTLIST= <TTTTTTTTTTTTTTT>
##$WBST= 1024
##$WBSW= 4
##$XGAIN= (0..3)
0 0 0 0 
##$XL= 0
##$YL= 0
##$YMAX_a= 113579
##$YMIN_a= -170238
##$ZGOPTNS= <>
##$ZL1= 120
##$ZL2= 120
##$ZL3= 120
##$ZL4= 120
##$ABSF1= 15.59264
##$ABSF2= -2.459211
##$ABSG= 5
##$ABSL= 3
##$ALPHA= 0
##$AQORDER= 0
##$ASSFAC= 0
##$ASSFACI= 0
##$ASSFACX= 0
##$ASSWID= 0
##$AUNMP= <proc_1d>
##$AZFE= 0.1
##$AZFW= 0.1
##$BCFW= 0
##$BC_mod= 2
##$BYTORDP= 0
##$COROFFS= 0
##$CY= -3
##$DATMOD= 1
##$DC= 0
##$DFILT= <>
##$DTYPP= 0
##$F1P= 0
##$F2P= 0
##$FCOR= 1
##$FTSIZE= 16384
##$FT_mod= 6
##$GAMMA= 0
##$GB= 0
##$INTBC= 1
##$INTSCL= 3.241238e-09
##$ISEN= 128
##$LB= 0.25
##$LEV0= 0
##$LPBIN= 0
##$MAXI= 10000
##$MC2= 0
##$MEAN= 0
##$ME_mod= 0
##$MI= 1.114404
##$NCOEF= 0
##$NC_proc= -8
##$NLEV= 6
##$NOISF1= 3.799351
##$NOISF2= 2.8
##$NSP= 0
##$NTH_PI= 0
##$NZP= 0
##$OFFSET= 15.48687
##$PC= 1
##$PHC0= -3702.487
##$PHC1= 16.39231
##$PH_mod= 1
##$PKNL= yes
##$PPARMOD= 0
##$PSCAL= 0
##$PSIGN= 0
##$REVERSE= no
##$SF= 200.130006972936
##$SI= 16384
##$SIGF1= 3
##$SIGF2= 2
##$SINO= 0.751879
##$SIOLD= 32768
##$SREGLST= <19F.Aceton>
##$SSB= 0
##$STSI= 16384
##$STSR= 0
##$SW_p= 3612.71676300578
##$SYMM= 0
##$S_DEV= 0
##$TDeff= 16384
##$TDoff= 0
##$TI= <>
##$TILT= no
##$TM1= 0
##$TM2= 0
##$TOPLEV= 0
##$USERP1= <user>
##$USERP2= <user>
##$USERP3= <user>
##$USERP4= <user>
##$USERP5= <user>
##$WDW= 1
##$XDIM= 16384
##$YMAX_p= 510404852
##$YMIN_p= -9844581
$$ End of Bruker specific parameters
$$ ---------------------------------
##NTUPLES= NMR SPECTRUM
##VAR_NAME=  FREQUENCY,     SPECTRUM/REAL,   SPECTRUM/IMAG
##SYMBOL=    X,             R,               I
##VAR_TYPE=  INDEPENDENT,   DEPENDENT,       DEPENDENT
##VAR_FORM=  AFFN,          ASDF,            ASDF
##VAR_DIM=   16384,         16384,           16384
##UNITS=     HZ,            ARBITRARY UNITS, ARBITRARY UNITS
##FACTOR=    0.220516191357247, 1,           1
##FIRST=     3099.38736346686, 0,            0
##LAST=      -513.329399538923, 0,           0
##MIN=       -513.329399538923, -9844581,    0
##MAX=       3099.38736346686, 510404852,    0
$$ Real data points
##PAGE= N=1
##DATA TABLE= (X++(R..R)), XYDATA
$$ [...]
7034a351599k54796j12672j12137L59823N19351M28979L09040L31572m62513j26095
$$ -1351599 -1606395 -1719067 -1831204 -1471381 -952030 -523051 -214011 117561 -344952 -471047
7024d71047o82230j88580M6858L55176M31963J35271K72975K16557o23205K95802
$$ -471047 -1153277 -1341857 -1294999 -939823 -507860 -372589 -99614 116943 -506262 -210460
7014b10460k80361o23780M19092l91899j41643N47973j5793O46465M61108j80776
$$ -210460 -490821 -1114601 -695509 -1087408 -1229051 -681078 -696871 -50406 410702 229926
7004B29926o69978q86832m93342K41669L53052j40179O4105N3283J03131L98837
$$ 229926 -440052 -1326884 -1820226 -1578557 -1225505 -1365684 -1301579 -1248296 -1145165 -746328
6994g46328l0759J07405j04074r1848l13569L60661M43290K36412l81923J13969
$$ -746328 -777087 -669682 -773756 -865604 -1179173 -818512 -375222 -138810 -520733 -406764
6984d06764o38008q46585o17786L64413P58821P74315J89974K81633J57594j04178
$$ -406764 -1044772 -1891357 -2509143 -2144730 -1385909 -611594 -421620 -139987 17607 -86571
6974h6571n41861M72o83245P2160j90103J08785R2851R43779k59977J91549k71185
$$ -86571 -628432 -627960 -1311205 -1239045 -1429148 -1320363 -1227512 -283733 -543710 -352161 -623346
6963f23346K53999J96680r54651L2426M20937L6127J150352n2321l1042l82897
$$ -623346 -369347 -172667 -1127318 -1094892 -673955 -637828 512524 460203 429161 46264
6953D6264q42414n9773k12098l98317J66216K02218L04273n5568j38405J4649
$$ 46264 -796150 -855923 -1068021 -1466338 -1300122 -1097904 -793631 -849199 -987604 -972955
6943i72955o97977k32399K01320P22095L60857N47921n3098J93659m25257o02372
$$ -972955 -1670932 -1903331 -1702011 -979916 -619059 -71138 -124236 69423 -355834 -958206
6933i58206O02099M39125o9848j5061l034o04800q383J58718l6312L39132J36990
$$ -958206 -356107 83018 13170 -1891 -4925 -609725 -618108 -459390 -495702 -156570 -19580
6922a9580j7125p74940P0996L91977L73796j88991N07041K85656k04598M35601
$$ -19580 -36705 -811645 -740649 -348672 25124 -163867 343174 628830 424232 859833
6912H59833K62372n89942N9880l35440l66495n61331m230O88605P76256m58506
$$ 859833 1122205 532263 592143 256703 -109792 -671123 -675353 13252 789508 331002
6902C31002N06510o52735K61208p61516o9811k4865R69267j97943L78995j748591
$$ 331002 837512 184777 445985 -315531 -385342 -410207 559060 361117 740112 -1008479
6892a008479j334311p48701O77128J527300N95436J24542m31917l30085o4533
$$ -1008479 -2342790 -3091491 -2414363 -887063 -291627 -167085 -599002 -929087 -993620
6883i93620M4781r7137k64926L17389K4276k55819k02395j55731P30264l77604
$$ -993620 -948839 -1045976 -1310902 -993513 -969237 -1225056 -1427451 -1583182 -852918 -1230522
6873a230522M17719N78101J69913O84492L6757k27036k39505k72924j259792M38001
$$ -1230522 -812803 -234702 -64789 619703 656460 429424 189919 -83005 -1342797 -904796
6863i04796l20969L84125K37696J033007l85061q0457m52935k57033N89785N25552
$$ -904796 -1225765 -841640 -603944 429063 44002 -36455 -489390 -746423 -156638 368914
6853C68914P62503j04782o357j029125J42787K9068J08588l75364M21197r45705
$$ 368914 1131417 1026635 1020278 -8847 133940 163008 271596 -103768 317429 -628276
6843f28276m56021o94718L69003m23428O33289N86253P44001J20067j32495r13481
$$ -628276 -1084297 -1779015 -1410012 -1833440 -1200151 -613898 130103 250170 117675 -795806
6833g95806K53442o0128m31515k97096j10825N78437j52445N32156K98703l863
$$ -795806 -542364 -602492 -1034007 -1331103 -1441928 -863491 -1015936 -483780 -185077 -188940
6823a88940m4543l20522m27890R1829N41755K17075P14143o28146j08213j07393
$$ -188940 -233483 -554005 -981895 -890066 -348311 -131236 582907 -45239 -153452 -260845
6813b60845K46245o02007M52025n82037P2273k1735K08809k04141K51452M52699
$$ -260845 -14600 -616607 -164582 -746619 -674346 -696081 -487272 -691413 -439961 12738
6803A2738n27027k06782n51766p56472j11724Q62854K77975L59571J4929j3013
$$ 12738 -514289 -721071 -1272837 -2029309 -2141033 -1278179 -1000204 -640633 -625704 -638717
6793f38717O0027p16221n1698N25041O11424L14748j8730l57050J16525k80067
$$ -638717 -578690 -1294911 -1346609 -821568 -210144 104604 85874 -271176 -154651 -434718
6783d34718Q8234K97001K52589q75563r66977k28026K06026Q8268N33247M58746
$$ -434718 -346484 -49483 203106 -672457 -1639434 -1867460 -1661434 -1573166 -1039919 -581173
6773e81173P2933j46721l25492k54583L83848O30152J58098m35640m87937m49997
$$ -581173 -508240 -654961 -980453 -1235036 -851188 -221036 -62938 -498578 -986515 -1436512
6763a436512k10624k75889K63553L80591K83146j30411O9731J89777p75406L34456
$$ -1436512 -1647136 -1923025 -1659472 -1278881 -995735 -1126146 -1056415 -866638 -1642044 -1307588
6753a307588J07766K9266J30063J80107j26808L18153j088549N57362j1180L59002
$$ -1307588 -1199822 -1170556 -1040493 -860386 -987194 -669041 -1757590 -1200228 -1211408 -852406
6743h52406m8170L92496j58802r5488J62771L8105L71986k14255m21626m89463
$$ -852406 -900576 -508080 -666882 -762370 -599599 -561494 -189508 -403763 -825389 -1314852
6733a314852o4363K3320L04298J66913J314478L43613k96847l61835m41870M67417
$$ -1314852 -1379215 -1355895 -1051597 -884684 429794 773407 476560 114725 -327145 140272
6723A40272q67534m96400m38653P74614L56344p189M97474r1529l933k60067m48073
$$ 140272 -727262 -1223662 -1662315 -887701 -531357 -538546 -41072 -132601 -136534 -396601 -844674
6712h44674M12017n48253K82267O00M05075r68322o53114J39374N86134N42949
$$ -844674 -432657 -980910 -698643 -698043 -292968 -1261290 -1914404 -1775030 -1188896 -645947
6702f45947K46361k69364N32499L26723R8779n60476l4626l18712J37905n27822
$$ -645947 -399586 -668950 -136451 190272 289051 -271425 -306051 -624763 -486858 -1014680
6692a014680l4981K78218J7294R41177J00176m6560k73809j04225n00946L23079
$$ -1014680 -1049661 -771443 -754149 187028 287204 240644 -33165 -137390 -638336 -315257
6682c15257j960l10239l98894L11843K33237P04590j74121N1137o35468m11879
$$ -315257 -317217 -627456 -1026350 -714507 -481270 223320 49199 100336 -535132 -947011
6672i47011m93625N80937L47991q0004K04604J62905m63446q6033L741k7968L18700
$$ -947011 -1440636 -859699 -511708 -591712 -387108 -224203 -687649 -773682 -769941 -797909 -479209
6661d79209l20878k14158j044713M6248K77271O65939M70589q8395j42331j83383
$$ -479209 -800087 -1014245 -2058958 -2012710 -1735439 -1069500 -598911 -687306 -829637 -1013020
6651a013020m59127n2555L67204K11609P46348J11159J08166k92118o51073J50079
$$ -1013020 -1472147 -1524702 -1157498 -945889 -199541 -88382 19784 -272334 -923407 -773328
6641g73328M20674J3236K85406m02146l84748r32844p8268m23262K97507Q14987
$$ -773328 -352654 -339418 -54012 -456158 -840906 -1773750 -1852018 -2275280 -1977773 -1162786
6631a162786J175295M49336J30422j038475q40837k95247k22519M11441O42946
$$ -1162786 12509 461845 592267 -446208 -1287045 -1582292 -1804811 -1393370 -750424
6622g50424M466L3130L26409k16072N13033M04801K01166j88381j09340m22837
$$ -750424 -745958 -712828 -386419 -602491 -89458 315343 516509 328128 218788 -204049
6612b04049J30740l24935l10150k6320j6359L09572l45605M52114j82586K85460
$$ -204049 -73309 -398244 -708394 -734714 -751073 -441501 -787106 -334992 -517578 -232118
6602b32118K8500k69141j31789O5720L88780K49093n89550k27487L80802k66870
$$ -232118 -203618 -472759 -604548 -538828 -150048 99045 -490505 -717992 -337190 -604060
6592f04060p14123R2813j82898P76380N62102L93868L43834P3670N296m98684
$$ -604060 -1318183 -1225370 -1408268 -631888 -69786 324082 667916 741586 746882 248198
6582B48198l41731k66827M079L26204P23890n61815j25104k10186l84162J86657
$$ 248198 -93533 -360360 -356281 -30077 693813 131998 6894 -203292 -587454 -400797
6572d00797K26276j22686Q5098j31737m28715J78715J43453k04899l28887q7437
$$ -400797 -174521 -297207 -212109 -343846 -772561 -593846 -450393 -655292 -984179 -1071616
6562a071616K64450J80827K21126N3837P43629K95358l37496m82951k18586k52653
$$ -1071616 -807166 -626339 -405213 -351376 392253 687611 350115 -132836 -351422 -604075
6552f04075Q3894K23860Q1804n14889o3923J03220P16391j10340m8039j25421
$$ -604075 -520181 -296321 -214517 -729406 -793329 -690109 26282 -84058 -132097 -257518
6542b57518P3569l53565n19768j13955J19542j84227J82056L3615L77561j088511
$$ -257518 -183949 -537514 -1057282 -1171237 -1051695 -1235922 -1053866 -1020251 -642690 -1731201
6532a731201l91782M9805R16885J043491k1929k50110l41586n07211l50874M12604
$$ -1731201 -2122983 -2073178 -1156293 -112802 -134731 -384841 -726427 -1233638 -1584512 -1171908
6522a171908L43599L55021O62518O21186n02130n78622o64541J06908M00684N40721
$$ -1171908 -828309 -473288 189230 810416 308286 -270336 -934877 -827969 -427285 113436
6512A13436O1761k19513l71707L66089j03289L61850l7465J75786k60687L76917
$$ 113436 175197 -44316 -416023 -49934 -153223 208627 171162 346948 86261 463178
6502D63178o10917n55912o02724P26528J087511M56385P7097p40016m54459o90301
$$ 463178 -147739 -703651 -1306375 -579847 507664 964049 1041146 301130 -153329 -843630
6492h43630K35294J165810R89866K54912K9089j105265r7720j0019L11812j58758
$$ -843630 -608336 557474 1547340 1802252 1831341 726076 628356 618337 930149 771391
6482G71391P85505p23262n02287K71696M74694K1814J13298n3503o01700j6328
$$ 771391 1556896 833634 331347 603043 1077737 1099551 1212849 1159346 557646 541318
6472E41318o25835J64882r5199k69707k35739Q30800M29956j86666k00372Q2123
$$ 541318 -84517 80365 -14834 -284541 -520280 310520 740476 553810 353438 435561
6462D35561j88249j06303J38704k56482J55982L79330l8040k85106L12572q23254
$$ 435561 247312 141009 279713 23231 179213 558543 520503 235397 547969 -275285
6452b75285K34608J5011M17519n7745L85080l7264L31443m36294m85694J2852
$$ -275285 -40677 -25666 391853 334108 719188 681924 1013367 577073 91379 104231
6442A04231M57693P18219M21712K93941n45292p47264r24611R73142J234322K72310
$$ 104231 561924 1280143 1701855 1995796 1450504 703240 -221371 751771 1986093 2258403
6432B258403o79326m01103p96225K14401K45441M50288K47943N17039p82691n71765
$$ 2258403 1579077 1177974 381749 596150 841591 1291879 1539822 2056861 1274170 702405
6422G02405n77395j28690k08942P65692j29137M18413J82737p9857J86315j32500
$$ 702405 125010 -3680 -212622 553070 423933 842346 1025083 945226 1131541 999041
6412I99041k09482N26875j54431Q13381K69903K14226n20807K1705m29120o34399
$$ 999041 789559 1316434 1162003 1975384 2245287 2459513 1938706 1960411 1531291 896892
6402H96892o87308L31275j96179j88620P28263L85991J05508N04240J69564J28095
$$ 896892 209584 540859 344680 156060 884323 1270314 1375822 1880062 2049626 2177721
6392B177721l42869q29243l09935k00361K13619R01160O03366J92886J61305j25172
$$ 2177721 1834852 1005609 695674 495313 708932 1610092 2213458 2406344 2567649 2442477
6382B442477K25238o7902j31025p7562J05630j008836N05994O75596M39137j64318
$$ 2442477 2667715 2599813 2468788 2391226 2496856 1488020 1994014 2669610 3108747 2944429
6372B944429N4386q11656q1707K91935L18333J98142K51151J86060J730j70844
$$ 2944429 2998815 2187159 2105452 2397387 2715720 2913862 3165013 3351073 3352803 3181959
6362C181959J90216j02508N58219L26341L16154J24460J39722l13777n14454k95278
$$ 3181959 3372175 3269667 3827886 4154227 4470381 4594841 4734563 4420786 3906332 3611054
6352C611054M14772J58695J23401P86490N68199N24900N39009K32898J98279k6095
$$ 3611054 4025826 4184521 4307922 5094412 5662611 6187511 6726520 6959418 7157697 7131602
6342G131602J39411M48415j04297l97823N60815K17280J172656Q64952R13718
$$ 7131602 7271013 7719428 7615131 7217308 7778123 7995403 9168059 10033011 10946729
6333A0946729k99742N67552N04881J416085N68411J713416J530743J402554K43250
$$ 10946729 10646987 11214539 11719420 13135505 13703916 15417332 16948075 18350629 18593879
6324A8593879J502631P46955J106599O92717N96988n68970n89983n72345J28484
$$ 18593879 20096510 20843465 21950064 22642781 23239769 22670799 22080816 21508471 21636955
6315B1636955K17166l66222k35903m70475M5017q32223R3526m5483k48459p6154
$$ 21636955 21854121 21487899 21251996 20781521 20826538 19994315 20087841 20042358 19793899 19717745
6305A9717745P78601R5251J131683J271298J234775J072848N99841P02808J314288
$$ 19717745 20496346 20591597 21723280 22994578 24229353 25302201 25902042 26604850 27919138
6296B7919138J667833J321527J812181K350108J890564K274058J712021J618385
$$ 27919138 29586971 30908498 32720679 35070787 36961351 39235409 40947430 42565815
6288D2565815J646412J327462K14944k93829j534244j020681j409213j189236
$$ 42565815 44212227 45539689 45754633 45460804 43926560 42905879 41496666 40307430
6280D0307430k201513k540676k545363j582434k171509q97033r89777n75315r40767
$$ 40307430 38105917 35565241 33019878 31437444 29265935 28368902 27379125 26803810 25863043
6271B5863043m72019l35381J74755J90559m1614l17957J49940L30717J334852
$$ 25863043 25391024 25055643 25230398 25420957 25379343 25061386 25211326 25542043 26876895
6262B6876895P58848J067940P06556J810911R40641R42198Q42830J322425J89719
$$ 26876895 27635743 28703683 29410239 31221150 32161791 33103989 33946819 35269244 35458963
6253C5458963M67263k40165k42265j02759j045980j731854j208369j025143j875112
$$ 35458963 35926226 35686061 35443796 35341037 34295057 32563203 31354834 30329691 28454579
6244B8454579o98350r13113j162714p07317q48574L40196J82550l1978J55066
$$ 28454579 27756229 26843116 25680402 24973085 24124511 24464707 24647257 24615279 24770345
6235B4770345o43641N7507k53952P87126P31389J598746J168861J178923R71034
$$ 24770345 24126704 24184211 23930259 24717385 25448774 27047520 28216381 29395304 30366338
6226C0366338N29137J895196K277596K476967K611946K129554K028270J696021
$$ 30366338 30895475 32790671 35068267 37545234 40157180 42286734 44315004 46011025
6218D6011025K444127K784863K499572K776437K809679K486132K533941J757678
$$ 46011025 48455152 51240015 53739587 56516024 59325703 61811835 64345776 66103454
6210F6103454J289168R678j766070k107053l092199l177971k366887k315762j826572
$$ 66103454 67392622 67402300 65636230 63529177 60436978 57259007 54892120 52576358 50749786
6201E0749786j441602q05141K9157n71862m92256Q03983Q65596R03568J509692
$$ 50749786 49308184 48503043 48532200 47960338 47468082 48272065 49137661 50041229 51550921
6192E1550921K067553K262782K433485K845199L255773M257746L722332M462708
$$ 51550921 53618474 55881256 58314741 61159940 64415713 68673459 72395791 76858499
6184G6858499M796516M501372N398863N348121N384006L680828K396716L55997
$$ 76858499 81655015 86156387 91555250 96903371 102287377 105968205 108364921 108720918
6176A08720918j612123l519591m097411m422047n219662n768135o146638n910251
$$ 108720918 107108795 103589204 99491793 95069746 89850084 84081949 77935311 72025060
6168G2025060m826911m730869l361977l033010j890140j377424p33114j239712
$$ 72025060 67198149 62467280 59105303 56072293 54182153 52804729 52071615 50831903
6160E0831903k74828j202349J25881M16408J209577N52938J660209N46473K535936
$$ 50831903 50557075 49354726 49480607 49897015 51106592 51659530 53319739 53866212 56402148
6151E6402148J706464K812491K521449L118884K786574K720827K048982N02703
$$ 56402148 58108612 60921103 63442552 66561436 69348010 72068837 74117819 74620522
6143G4620522p32961j583834l561696m321435l681556l725602l506343l355896
$$ 74620522 73887561 72303727 68742031 64420596 60739040 57013438 53507095 50151199
6135E0151199k996742l340030k996489k564673j403054j805828r25375j053276
$$ 50151199 47154457 43814427 40817938 38253265 36850211 35044383 34119008 33065732
6127C3065732j848233k251088j278225j109786p42929J151238O44930N35103N7991
$$ 33065732 31217499 28966411 27688186 26578400 25835471 26986709 27631639 28166742 28224733
6118B8224733j202133j621742j092455l32734k32702L06214k33556M24542m57319
$$ 28224733 27022600 25400858 24308403 23975669 23742967 24049181 23815625 24240167 23782848
6109B3782848q26258r97287L4491l43315P8361m53479k29245j630859r68699j222566
$$ 23782848 22956590 21959303 21993794 21650479 21728840 21275361 21046116 19415257 18446558 17223992
6099A7223992j02627j36438P24087k63331j22613p10432n4238L4450L52926q76172
$$ 17223992 17121365 16984927 17709014 17445683 17323070 16612638 16558400 16592850 16945776 16069604
6089A6069604o14434r26624K47290n99956k46282p45961N10203k30810K43571
$$ 16069604 15455170 14528546 14775836 14175880 13929598 13183637 13693840 13463030 13706601
6080A3706601r97206k31199l99761k43555m27364j35513j57525m35717n91250
$$ 13706601 12709395 12478196 12078435 11834880 11407516 11272003 11114478 10678761 10087511
6071A0087511o39175O5188l08768O86032o10151l11092m88383k41156q50625K53580
$$ 10087511 9448336 9513524 9204756 9890788 9280637 8969545 8481162 8240006 7389381 7642961
6061G642961m8270J05846k13969l36499p57734k26819m96675Q6612J72183k59687
$$ 7642961 7594691 7700537 7486568 7150069 6392335 6165516 5668841 5755453 5927636 5667949
6051E667949m97612m45295K22788m59349k62971K46972m2438L01881k57772n01563
$$ 5667949 5170337 4725042 4947830 4488481 4225510 4472482 4430044 4731925 4474153 3972590
6041C972590p7717q68041l90309M15038N12201M67378O97246m3048R3048j79834
$$ 3972590 3894873 3026832 2636523 3051561 3563762 4031140 4728386 4685338 4778386 4598552
6031D598552p18259m21169K07687m82252m26823O82353J21084l33686j90910Q60167
$$ 4598552 3880293 3459124 3666811 3184559 2757736 3440089 3561173 3227487 3036577 3896744
6021C896744L63984N51428L46005l45567q66968j70789p14140O94243k7107J69764
$$ 3896744 4260728 4812156 5158161 4812594 3945626 3774837 3060697 3754940 3727833 3897597
6011C897597j33684m64594q69705k23073J22492O01865K97312m809j75046K60187
$$ 3897597 3763913 3299319 2429614 2206541 2329033 2930898 3228210 3223401 3048355 3308542
6001C308542l95722k89613p9483k7303n20992N2196K75047M37501L2018M11045
$$ 3308542 2912820 2623207 2543724 2516421 1995429 2047625 2322672 2760173 2792191 3203236
5991C203236l59934N91813j63977O26940l06784o3238l21831K55827j234151K9801
$$ 3203236 2843302 3435115 3271138 3898078 3591294 3528056 3206225 3462052 2227901 2257702
5981B257702M10575N22636k3351n46353q1486j93286j82174n44870R111N7832
$$ 2257702 2668277 3190913 3167562 2621209 2539723 2346437 2164263 1619393 1628504 1686336
5971A686336P89679o44846O89523m90882j59400j370548l66567j04070O36004
$$ 1686336 2476015 1831169 2520692 2029810 1870410 499862 133295 29225 665229
5962F65229J11102L23632L2696k66281o78898K10106N36698j53686j28837L32615
$$ 665229 776331 1099963 1132659 866378 187480 397586 934284 780598 651761 984376
5952I84376q2281J55201P30066J035602J80366m85697r5288n25245q53149R0167
$$ 984376 902095 1057296 1787362 2822964 3003330 2517633 2422345 1897100 1043951 1134118
5942A134118l14080M90129P52964N21431K20567K41727j023072o6125k34075k32281
$$ 1134118 820038 1310167 2063131 2584562 2805129 3046856 2023784 1957659 1723584 1491303
5932A491303R0951N45830j43563l23675n66087Q9749j48699l90074j73485j5906
$$ 1491303 1582254 2128084 1984521 1660846 1094759 1184508 1035809 645735 472250 456344
5922D56344J25496j9550N79133L34510l16391r5139k97861m44431j16830k05338
$$ 456344 581840 562290 1141423 1475933 1159542 1064403 766542 322111 205281 -57
5912e7M31118j70298L05019k50824K95614L70737N32834p37209n46079l4854q3482
$$ -57 431061 260763 565782 314958 610572 981309 1514143 776934 230855 196001 112519
5901A12519L99500K57038L85227J358863P6918J94335l98621j50415m1366p20636
$$ 112519 512019 769057 1154284 2513147 2590065 2784400 2385779 2235364 2193998 1473362
5891A473362L58610M68350M36500j67923n72429J9933n36414l08131o53802K13870
$$ 1473362 1831972 2300322 2736822 2568899 1996470 2016403 1479989 1171858 518056 731926
5881G31926J49651L38756K99526j69615l43452p91937K49844J22062l20696O68929
$$ 731926 881577 1220333 1519859 1350244 1006792 214855 464699 586761 266065 934994
5871I34994k71541l26754k99077L44189N36811j40604R23754O53646O20816p81623
$$ 934994 663453 336699 37622 381811 918622 778018 1701772 2355418 2976234 2194611
5861B194611m72670q38184k38877r48355O33224J42704M17500N46475J97301M55408
$$ 2194611 1721941 883757 644880 -303475 329749 472453 889953 1436428 1633729 2089137
5851B089137j7677m97728O380N3203k86249J91893m24447n04810M75193L79198
$$ 2089137 2071460 1573732 1580112 1633315 1347066 1538959 1114512 609702 1084895 1464093
5841A464093J28434l10351J58089K17560L585M3652j35736q0677j14240l88767
$$ 1464093 1592527 1282176 1440265 1657825 1661410 1705062 1569326 1488649 1374409 985642
5831I85642k17510K00431M84364L26907j085992o68220l78901J37791O01865J138542
$$ 985642 768132 968563 1452927 1779834 693842 25622 -353279 -215488 386377 1524919
5821A524919L04312O44822j89727j48663j185888K61591l32085N37061j72300
$$ 1524919 1829231 2474053 2284326 2135663 949775 1211366 879281 1416342 1244042
5812A244042j5530j09482j8473j21227M13536Q34865J71413o16409L09873J008782
$$ 1244042 1228512 1119030 1100557 979330 1392866 2227731 2399144 1782735 2092608 3101390
5802C101390l58909l0188n00157l59733k16919K89365J23352P54767L53521N8119
$$ 3101390 2742481 2712293 2212136 1852403 1635484 1924849 2048201 2802968 3156489 3214608
5792C214608l19531j00272o51796K68659L18184M3478K9866J80094O3474k90101
$$ 3214608 2895077 2794805 2143009 2411668 2729852 2773330 2803196 2983290 3046764 2756663
5782B756663L14409j21699L71111M33781l62946M55426J13646M72670R1146k85175
$$ 2756663 3071072 2949373 3320484 3754265 3391319 3846745 3960391 4433061 4524207 4239032
5772D239032m70135M36160J95374K83646J37555l12859N43642L23213n0552j145975
$$ 4239032 3768897 4205057 4400431 4684077 4821632 4508773 5052415 5375628 5325076 4179101
5762D179101o4171P5648k0980j79075N3802M68782R5468P8193j17082P41458k56799
$$ 4179101 4114930 4190578 4169598 3990523 4044325 4513107 4608575 4686768 4569686 5311144 5054345
5751E054345K94222P4210N83230J60992K07343q100K95610J47756j78495M38981
$$ 5054345 5348567 5422777 6006007 6166999 6374342 6366242 6661852 6809608 6631113 7070094
5741G070094M9819K72269P0339K48600m21273J111929L97533J03547l8043K70175
$$ 7070094 7119913 7392182 7462521 7711121 7289848 8401777 8799310 8902857 8864814 9134989
5731I134989k52161J44854j09026N93998O42412M80096N24077J122468R73628
$$ 9134989 8882828 9027682 8918656 9512654 10155066 10635162 11159239 12281707 13255335
5722A3255335p70618M59659k5008M19222K99047M96490L20396J023557O66384
$$ 13255335 12484717 12944376 12919368 13338590 13637637 14134127 14454523 15478080 16144464
5713A6144464Q78264Q22353K63181O88846Q22754M00794K02916L38189J592001
$$ 16144464 17022728 17845081 18108262 18797108 19619862 20020656 20223572 20561761 22153762
5704B2153762K72267L46134J071834Q12214Q81807J208554J532660J928045R41606
$$ 22153762 22426029 22772163 23843997 24656211 25538018 26746572 28279232 30207277 31148883
5695C1148883J001783J678248J949483K306608K924398L486010L901003M197799
$$ 31148883 32150666 33828914 35778397 38085005 41009403 44495413 48396416 52594215
5687E2594215M233988M492754M425433O103214N994676P511970P731444R756327
$$ 52594215 56828203 61320957 65746390 71849604 77844280 85356250 93087694 102844021
5679A02844021J1023416J2839424J4728982J6630734J9429615K1891022K3349140
$$ 102844021 113867437 126706861 141435843 158066577 177496192 199387214 222736354
5672B22736354K3721162K0804577J2401102K076869j1042836k1757957k6945178
$$ 222736354 246457516 267262093 279663195 281740064 270697228 248939271 221994093
5665B21994093k7248258k5096033k2332373j9059853j4889006j2192714r327919
$$ 221994093 194745835 169649802 147317429 128257576 113368570 101175856 91847937
5658I1847937p427514p364866o632904n331770m053249l529001k698817k569012
$$ 91847937 84420423 77055557 70422653 65090883 61037634 57508633 54809816 52240804
5650E2240804k444344j587647k017036k079623j038694j270224k056538k181568
$$ 52240804 49796460 48208813 46191777 44112154 43073460 41803236 39746698 37565130
5642C7565130k132633k037519q78962j506963j312540K51702m47270o47839l76025
$$ 37565130 35432497 33394978 32516016 31009053 29696513 29948215 29500945 28853106 28477081
5633B8477081j258334j036866j79166L3452o25924j83082j54454j44831k96052
$$ 28477081 27218747 26181881 26002715 26036167 25410243 25227161 25072707 24927876 24631824
5624B4631824L19220o59910n42756m84335p24283o41542p50925p49225k97740
$$ 24631824 24951044 24291134 23748378 23264043 22539760 21898218 21147293 20398068 20100328
5615B0100328l45919p47034K96819Q61911r11723m55821k24567o75351j473n64954
$$ 20100328 19754409 19007375 19304194 20166105 19254382 18798561 18573994 17898643 17897170 17332216
5605A7332216n44407J05693n06950J16467l52839j00739o00760p87753J04583
$$ 17332216 16787809 16893502 16386552 16503019 16150180 16049441 15448681 14660928 14765511
5596A4765511J98852j47241o26971j270577o04897j018037m92920m287J69014
$$ 14765511 14964363 14817122 14190151 12919574 12314677 11296640 10803720 10799433 10968447
5587A0968447J86763l78966m35179q28119p39372m33310L33135j55268L58214
$$ 10968447 11155210 10776244 10341065 9512946 8773574 8340264 8673399 8518131 8876345
5578H876345m39380l17802l97871k98394n36423n6277R41063R87910K38853m92075
$$ 8876345 8436965 8119163 7721292 7422898 6886475 6830198 7771261 8759171 8998024 8505949
5568H505949m80093p16511j44760j33388N77179N77367K43468l44152o64113K30148
$$ 8505949 8025856 7309345 7164585 7031197 7608376 8185743 8429211 8085059 7420946 7651094
5558G651094N34413R1877r81836k67345p15657m61227l80835L21926N02975p4834
$$ 7651094 8185507 8277384 7295548 7028203 6312546 5851319 5470484 5792410 6295385 6220551
5548F220551p08655P66339l03368O3022J04516N24349J84371N8699m20387p5613
$$ 6220551 5511896 6278235 5974867 6037889 6142405 6666754 6851125 6909824 6489437 6413824
5538F413824n52677j04463L88406M19628K97256Q40932k08341l10096j457862
$$ 6413824 5861147 5756684 6145090 6564718 6861974 7702906 7494565 7184469 5726607
5529E726607o51001k6021j71748J56786L95422Q79313L86534N46636M43013J62128
$$ 5726607 5075606 5049585 4877837 5034623 5430045 6309358 6695892 7242528 7685541 7847669
5519G847669K00032q27399k30945p73661q03932K39990J562170N33992M11918
$$ 7847669 8047701 7220302 6989357 6215696 5411764 5651754 7213924 7747916 8159834
5510H159834M86179M31992m13932j49526o00801o82955O13519n13950L3113L24327
$$ 8159834 8646013 9078005 8664073 8514547 7913746 7230791 7844310 7330360 7363473 7687800
5500G687800J139503N4443J06737j76003K94426L1437L18289j90163M41139K97962
$$ 7687800 8827303 8881746 8988483 8812480 9106906 9138343 9456632 9266469 9707608 10005570
5490A0005570J63156o7838P10431O28232J226128J282481P66324m70565L72311
$$ 10005570 10168726 10100888 10811319 11439551 12665679 13948160 14714484 14243919 14616230
5481A4616230L28516K49644J161669Q93930Q60430J199248J119083J294856J214479
$$ 14616230 14944746 15194390 16356059 17249989 18110419 19309667 20428750 21723606 22938085
5472B2938085J400105J140533J941274J500146J574058K647632L314152L074801
$$ 22938085 24338190 25478723 27419997 28920143 30494201 33141833 36455985 39530786
5464C9530786L843980M188511M969724O557195P042349P832781R272759J0057201
$$ 39530786 43374766 47563277 52533001 59090196 66132545 73965326 83238085 93295286
5456I3295286J1817574J2278560J3223483J2345790Q710956L251252k452312r069891
$$ 93295286 105112860 117391420 130614903 142960693 151671649 154922901 152470589 143400698
5448A43400698j2015052j2746409j2313374j1469476j0617095q493531p338815
$$ 143400698 131385646 118639237 106325863 94856387 84239292 75745761 68406946
5441F8406946p097186n862845m746080m363874l441309k271028j978658j296421
$$ 68406946 61309760 55446915 50700835 46336961 42895652 40624624 38645966 37349545
5433C7349545j261312o74048p02824o06400l08386L68361J64477K75368j25491
$$ 37349545 36088233 35414185 34711361 34104961 33796575 34164936 34329413 34604781 34479290
5424C4479290J30801L22043L62003M63390J30083K23685J79165n48484n89532
$$ 34479290 34610091 34932134 35294137 35757527 35887610 36111295 36290460 35741976 35152444
5415C5152444j68118q54187n83948r68638j213645o54702j79033j290511j188589
$$ 35152444 34984326 34130139 33546191 32577553 31363908 30709206 30530173 29239662 28051073
5406B8051073j012537J92641N27347J162180J138190Q67450M09170j61493O86928
$$ 28051073 27038536 27231177 27758524 28920704 30058894 30926344 31335514 31174021 31860949
5397C1860949J407310J347539J117315J275984J284993J487048K124838J596583
$$ 31860949 33268259 34615798 35733113 37009097 38294090 39781138 41905976 43502559
5389D3502559J714026J804863J951495J701154M44417q4522q4664m48613k23665
$$ 43502559 45216585 47021448 48972943 50674097 51118514 51033992 50949328 50500715 50277050
5380E0277050k24408n54036j425700j670130n29768k36652r15613M29635O18746
$$ 50277050 50052642 49498606 48072906 46402776 45873008 45636356 44720743 45150378 45769124
5371D5769124J579470P82337J379030J367146L107498L639763M926224N406471
$$ 45769124 47348594 48130931 49509961 50877107 53984605 57624368 62550592 67957063
5363F7957063N800575O210551O962329N244815K509951j91495k426502m668082
$$ 67957063 73757638 79968189 86930518 92175333 94685284 94493789 92067287 87399205
5355H7399205o781654o582599o336158n316818m469309l149208l654239l793619
$$ 87399205 80617551 74034952 67698794 62381976 57912667 54763459 51109220 47315601
5347D7315601k755985k740762l439395k678485k225890k365129j720579j861188
$$ 47315601 44559616 41818854 38379459 35700974 33475084 31109955 29389376 27528188
5339B7528188j013445j723099o36044j519607j070564j046219k59907j359570
$$ 27528188 26514743 24791644 24155600 22635993 21565429 20519210 20259303 18899733
5331A8899733j275890n31316q74913K9935J83763n0133l3990P261n61562o71369
$$ 18899733 17623843 17092527 16217614 16247549 16431312 16381179 16347189 16354450 15792888 15121519
5321A5121519r78063l22373k29983k84474j77201N75359j31570m17616j401879
$$ 15121519 14143456 13821083 13591100 13306626 13129425 13704784 13573214 13155598 11753719
5312A1753719p11407k79476l47580L35464k44649n15647J26096L13618M3837k4552
$$ 11753719 11042312 10762836 10415256 10750720 10506071 9990424 10116520 10430138 10473975 10449423
5302A0449423j91223P2014n83784m88193P02590K17403k95643m51471J68575m45909
$$ 10449423 10258200 10330214 9746430 9258237 9960827 10178230 9882587 9431116 9599691 9153782
5292I153782P20457l07428M67390K52353O79930l32613k58469K1405l66466q11904
$$ 9153782 9874239 9566811 10034201 10286554 10966484 10633871 10375402 10396807 10030341 9218437
5282I218437k34854r27219j166303L23870l7172k67990L79838P56711N17747L50513
$$ 9218437 8983583 8056364 6890061 7213931 7176759 6908769 7288607 8045318 8563065 8913578
5272H913578r5751l70589o03038l52720k00355o8747K94760P03887J76386o63350
$$ 8913578 8817827 8447238 7844200 7491480 7291125 7222378 7517138 8221025 8397411 7734061
5262G734061O6599M83490K70353k00382J54485k3945k87011N71372N7835L90153
$$ 7734061 7800660 8284150 8554503 8354121 8508606 8484661 8197650 8769022 8826857 9217010
5252I217010K27753P40630P36006q6534J75092P1756Q47617K7393N83207Q87834
$$ 9217010 9444763 10185393 10921399 10834865 11009957 11081713 11929330 11956723 12539930 13427764
5242A3427764J486969J069661J170770K88874O68528L41025J812674P48322J480406
$$ 13427764 14914733 15984394 17155164 17444038 18112566 18453591 20266265 21014587 22494993
5233B2494993J407074P39798R06820p24098n14608r29715j045436j726065o20085
$$ 22494993 23902067 24641865 25548685 24824587 24309979 23380264 22334828 20608763 19988678
5224A9988678j011327m41701p28195R2445r9967K85013l97591k18675n24078p34216
$$ 19988678 18977351 18535650 17807455 17899900 17799933 18084946 17687355 17468680 16944602 16210386
5214A6210386m68063j94120o3988J109385J276748K89263j29658p66003n20343
$$ 16210386 15742323 15548203 15484215 16593600 17870348 18159611 18029953 17263950 16743607
5205A6743607M77790L81492k70897L11882P77136N55571k48504j111669k80386
$$ 16743607 17221397 17602889 17331992 17643874 18421010 18976581 18728077 17616408 17336022
5196A7336022r53472n50393k41853j52616o65984M2353O05152l30870J28345j96619
$$ 17336022 16382550 15832157 15590304 15437688 14771704 14814057 15419209 15088339 15216684 15020065
5186A5020065m1872k37667K2440m67409q8555m92020J00683K06490P501L32056
$$ 15020065 14978193 14740526 14762966 14295557 14207002 13714982 13815665 14022155 14029656 14361712
5176A4361712N00608l69828l78088K38615j62902q08017k28962m07672n93725
$$ 14361712 14862320 14492492 14114404 14353019 14190117 13382100 13153138 12745466 12151741
5167A2151741n66852L51748M67830j86089l63023j535431r44130J66835m58644
$$ 12151741 11584889 11936637 12404467 12218378 11855355 10319924 9375794 9542629 9083985
5158I083985j61391k18403K46510k50640r71435q90225k00586P30980P61776O08939
$$ 9083985 8922594 8704191 8950701 8700061 7728626 6838401 6637815 7368795 8130571 8739510
5148H739510L03301k49373l93373m7562n98254L36776m93510J79603k66130j53040
$$ 8739510 9042811 8793438 8400065 8352503 7754249 8091025 7597515 7777118 7510988 7357948
5138G357948O1989N92168O82219J121811J47630l82981p55213m71289M22015L29905
$$ 7357948 7419937 8012105 8694324 9816135 9963765 9580784 8825571 8354282 8776297 9106202
5128I106202o1952L54444k8924p98537r45006j06708N8944K39377K84749k86503
$$ 9106202 9044250 9398694 9369770 8571233 7626227 7519519 7578463 7817840 8102589 7816086
5118G816086m27564J13908p56444K4057M00342Q3572j2135m69508n118m00373
$$ 7816086 7388522 7502430 6745986 6770043 7170385 7253957 7241822 6772314 6767196 6366823
5108F366823p4246L68294p9776K90317q0295q55135k68220L63055O21367K89283
$$ 6366823 6292577 6660871 6581095 6871412 6791117 5935982 5667762 6030817 6652184 6941467
5098F941467J53607L11786j13392K51738Q7K39234L83710n91960n08365J7402
$$ 6941467 7095074 7406860 7293468 7545206 7545293 7784527 8168237 7576277 7067912 7085314
5088G085314N98648P02813J046053N50182P9998K5782j648099k63156L15277Q50979
$$ 7085314 7683962 8386775 9432828 9983010 10063008 10088790 8440691 8177535 8492812 9343791
5078I343791N55990J248714R39203P15883M52715L92565J111874J109145K015407
$$ 9343791 9899781 11148495 12087698 12803581 13256296 13648861 14760735 15869880 17885287
5069A7885287J555339J928312J454412K599378K324195K440975J769875J679539
$$ 17885287 19440626 21368938 22823350 25422728 27746923 30187898 31957773 33637312
5061C3637312k14133o76689k577931k936894k428608j702114j619278j713131
$$ 33637312 33423179 32746490 30168559 27231665 24803057 23100943 21481665 19768534
5053A9768534j569952j271003j127909j717450r31975n54540J88150L71017l59460
$$ 19768534 18198582 16927579 15799670 14082220 13150245 12595705 12783855 13154872 12795412
5044A2795412j279323k07836m89075n06765k3353K47520o2603j78454K13709o00798
$$ 12795412 11516089 11308253 10819178 10312413 10289060 10536580 10473977 10295523 10509232 9908434
5034I908434L25062k28354M55310n42847J34791o15883p86617o28601R18134R27930
$$ 9908434 10233496 10005142 10460452 9917605 10052396 9436513 8649896 8021295 8939429 9867359
5024I867359J73247J78800p39935r5256l33069o51456j62290K91584k15125k165
$$ 9867359 10040606 10219406 9479471 9384215 9051146 8399690 8237400 8528984 8313859 8311694
5014H311694J56897O53326K57457K57837J75069M711l57348M28194J51343L4993
$$ 8311694 8468591 9121917 9379374 9637211 9812280 9816991 9459643 9887837 10039180 10074173
5004A0074173n21752j008771J72072m49217K26346N68837J58099K20890O61342
$$ 10074173 9552421 8543650 8715722 8266505 8492851 9061688 9219787 9440677 10102019
4995A0102019j96941J22404o800l0396n6026n9106n9567J42212p6254J73823J66105
$$ 10102019 9905078 10027482 10020682 9990286 9934260 9875154 9815587 9957799 9881545 10055368 10221473
4984A0221473Q10544J159589J081147M6894j08156r44804n65702n40243N34554
$$ 10221473 11032017 12191606 13272753 13319647 13211491 12266687 11700985 11160742 11695296
4975A1695296J622905R65453J219131M4799j13612M10469l65027l22345N92864
$$ 11695296 13318201 14283654 15502785 15547584 15433972 15844441 15479414 15157069 15749933
4966A5749933Q25427J261760O59628J375184J012626J413871J161202J348192
$$ 15749933 16575360 17837120 18496748 19871932 20884558 22298429 23459631 24807823
4958B4807823K87489J396955K321185K473928L009071L602935K546224L125312
$$ 24807823 25095312 26492267 28813452 31287380 34296451 37899386 40445610 43570922
4950D3570922L030106L966949N088538N511224M995477N135429K589639J141262
$$ 43570922 46601028 50567977 55656515 61167739 66163216 71298645 73888284 75029546
4942G5029546j176644k134574l405686k993273m194837l588141l136774k675090
$$ 75029546 73852902 71718328 68312642 65319369 61124532 57536391 54399617 51724527
4934E1724527j697800k014783o89465K31954J083397L20950J082225P83824J205194
$$ 51724527 50026727 48011944 47322479 47554433 48637830 48958780 50041005 50824829 52030023
4925E2030023J013432J510733K214204K782506L069752L997792M626894O006342
$$ 52030023 53043455 54554188 56768392 59550898 62620650 66618442 71245336 77251678
4917G7251678N736269O549922O714729P255934O602534M810018L200643J592837
$$ 77251678 82987947 89537869 96252598 103508532 110111066 114921084 118121727 119714564
4909A19714564m58428l233183m785056n743685o400668p167999n380307n496993
$$ 119714564 119256136 116022953 111237897 105494212 99093544 91925545 86545238 81048245
4901H1048245m533731l574491l816866k702995r69001j403189j076119r23690
$$ 81048245 76514514 72940023 69123157 66420162 65451161 64047972 62971853 62048163
4893F2048163q70718j881520j546996j495979l22077R12613J728063K170444K324151
$$ 62048163 61177445 59295925 57748929 56252950 55930873 56843486 58571549 60741993 63066144
4884F3066144K627046K037327K749025L084058L938354K502681L058361J277592
$$ 63066144 65693190 67730517 70479542 73563600 77501954 80004635 83062996 84340588
4876H4340588K36235j393755k714730l939951l800220l384343l342996l125281
$$ 84340588 84576823 83183068 80468338 76528387 72728167 69343824 66000828 62875547
4868F2875547j961255j147915j80348l92627j41932N90896J018284Q35599J654943
$$ 62875547 60914292 59766377 59586029 59193402 59051470 59642366 60660650 61496249 63151192
4859F3151192J936864K036456J639750K557922L621689M075671M358537M645564
$$ 63151192 65088056 67124512 68764262 71322184 74943873 79019544 83378081 88023645
4851H8023645N359222N276486N482681O862759P413852O887430Q256567Q778118
$$ 88023645 93382867 98659353 104142034 111004793 118418645 125306075 133562642 142340760
4843A42340760R334107R445058R156540P911687P187457M716083K802414L32274
$$ 142340760 151674867 161119925 170276465 178188152 185375609 190091692 192894106 193226380
4835A93226380j017097m710536o188657p650322r154591r547334r814085r511191
$$ 193226380 192209283 187498747 181310090 173659768 164505177 154957843 145143758 135632567
4827A35632567q920361q365558p836051o843724p366244o639325n704452m148831
$$ 135632567 126712206 118346648 110510597 103666873 96300629 89661304 83956852 79808021
4819G9808021m484983l002555m076225l133999l236019l432595l241128k530723
$$ 79808021 75323038 72320483 68244258 65110259 61874240 58441645 55200517 52669794
4811E2669794j959425j242987j554214r12143j686355j386621j441589k266528
$$ 52669794 50710369 49467382 47913168 47001025 45314670 43928049 42486460 40219932
4803D0219932j434600k013309q41320k93451q80539p88604o23523j059232l87709
$$ 40219932 38785332 36772023 35930703 35637252 34756713 33968109 33344586 32285354 31897645
4794C1897645q37974l92921j795264j156254j881433m63284j251587m60315N28231
$$ 31897645 31059671 30666750 28871486 27715232 25833799 25370515 24118928 23658613 24186844
4785B4186844R76529l57865p44564j118221m64039n07644j011444l52103r7845
$$ 24186844 25163373 24805508 24060944 22942723 22478684 21971040 20959596 20607493 20509648
4776B0509648l23536r61753l75038l95016k71962M64785O57931p6616o94444j184539
$$ 20509648 20186112 19224359 18849321 18454305 18182343 18647128 19305059 19228443 18533999 17349460
4766A7349460m30216j97374j2820j57940k10393m02573p56988m49073K39410K69388
$$ 17349460 16919244 16721870 16709050 16551110 16340717 15938144 15181156 14732083 14971493 15240881
4756A5240881m98533M89371K39215q31940p49868q33680n00101k94395K82455
$$ 15240881 14742348 15231719 15470934 14638994 13889126 13055446 12555345 12260950 12543405
4747A2543405l41488J3079k98280J41239p08562o25605L61848R1805r16295J09117
$$ 12543405 12201917 12214996 11916716 12057955 11349393 10723788 11085636 11177441 10261146 10370263
4737A0370263N1393k5749j61646J15357M30450K6062N19525L5670J027j47531
$$ 10370263 10421656 10395907 10234261 10349618 10780068 10806130 11325655 11361325 11362352 11214821
4727A1214821J5188K73246J71555L21297l67259N50605j74199M91957n33965j157621
$$ 11214821 11230009 11503255 11674810 11996107 11628848 12179453 12005254 12497211 11963246 10805625
4717A0805625r39837K04649Q0805K44469J18665M11660K19016o77921r26152j20420
$$ 10805625 9865788 10070437 10151242 10395711 10514376 10926036 11145052 10467131 9540979 9420559
4707I420559m47809k69616k55173K54435j06474j6071L56480L04182L8966N3860
$$ 9420559 8972750 8703134 8447961 8702396 8595922 8579851 8936331 9240513 9279479 9333339
4697I333339J40674n64886k65898k58859j33682P3922p0234o39537k52216m82118
$$ 9333339 9474013 8909127 8643229 8384370 8250688 8324610 8254376 7614839 7362623 6880505
4687F880505M00482R66R51063J21564M93079l88887N47553o52396L99574O91002
$$ 6880505 7280987 7281953 8233016 8354580 8847659 8458772 9006325 8353929 8753503 9444505
4677I444505j9646n09511M08979r72605l71148j45067L40947P90818K90556P43754
$$ 9444505 9424859 8915348 9324327 8351722 7980574 7835507 8176454 8967272 9257828 10001582
4667A0001582J04428J90215n45104l64711r45767n38541k09060O01685m42191
$$ 10001582 10106010 10296225 9751121 9386410 8440643 7902102 7693042 8294727 7852536
4658G852536N09226R1746l59710J24763K79494J01914J68820k10415p60380k5446
$$ 7852536 8361762 8453508 8093798 8218561 8498055 8599969 8768789 8558374 7797994 7772548
4648G772548n9799K79826P22790N2081J18087J03805r57294n38046M14631P17029
$$ 7772548 7712749 7992575 8715365 8767446 8885533 8989338 8032044 7493998 7908629 8625658
4638H625658N89327J88329l42335k96198L22162j79354o61697P80093P11979k6363
$$ 8625658 9214985 9403314 9060979 8764781 9086943 8907589 8245892 9025985 9737964 9711601
4628I711601j08865j83456k24808P71161L25312O28405m80001r700p68243k65125
$$ 9711601 9602736 9419280 9194472 9965633 10290945 10919350 10439349 10429649 9661406 9396281
4618I396281j87914R6324M26510Q84925K21943K71906o45797n21328K33912n78868
$$ 9396281 9208367 9304691 9731201 10616126 10838069 11109975 10464178 9942850 10176762 9597894
4608I597894k15017m41075K45369L4729k4157P5021M31895K49154K82387L61947
$$ 9597894 9382877 8941802 9187171 9221900 9197743 9272764 9704659 9953813 10236200 10598147
4598A0598147M00517k14355k23493R5481N50625l53912L88826k97557k81510j26433
$$ 10598147 10998664 10784309 10560816 10656297 11206922 10853010 11241836 10944279 10662769 10536336
4588A0536336k32787R37941Q09028m233m85223l18745j452177l16075m92581n85754
$$ 10536336 10303549 11241490 12050518 12046285 11561062 11242317 9790140 9474065 8981484 8395730
4578H395730Q46428M76468Q3026N814m42248l36203k77252q37632l87792j19862
$$ 8395730 9242158 9718626 9801652 9807466 9365218 9029015 8751763 7914131 7526339 7406477
4568G406477j2620m0365Q89807k40227Q63976L61183o5957n80831m70902o00748
$$ 7406477 7393857 7353492 8243299 8003072 8867048 9228231 9162274 8581443 8110541 7509793
4558G509793R9547L87838P39331N04217m72983M66984j022163l16250j07569K2032
$$ 7509793 7609340 7997178 8736509 9240726 8767743 9234727 8212564 7896314 7788745 7810777
4548G810777L21630K88346J62613r1674l61188n90532j68986n87545L88935N00398
$$ 7810777 8132407 8420753 8583366 8491692 8130504 7539972 7370986 6783441 7172376 7672774
4538G672774N15780k79539k7656q70444K45121j90210j8253N39212Q44585n9471
$$ 7672774 8188554 7909015 7881359 7010915 7256036 7065826 7047573 7586785 8431370 8371899
4528H371899J2919O4905L62040j51198r23138K60736k42185j29116m31847j84101
$$ 8371899 8384818 8449723 8811763 8660565 7737427 7998163 7755978 7626862 7195015 7010914
4518G010914j40327m3439M76278M31978m713n95224K35144O1310n83677p58044
$$ 7010914 6870587 6827148 7303426 7735404 7730691 7135467 7370611 7431921 6848244 6090200
4508F090200J75157l2805J72259L59622K7890j30413j36131o89870n31950K82942
$$ 6090200 6265357 6232552 6404811 6764433 6792323 6661910 6525779 5835909 5303959 5586901
4498E586901j17174k84173Q7252N96359k67374N7482O9766p67582k99912j8887
$$ 5586901 5469727 5185554 5272806 5869165 5601791 5659273 5729039 4961457 4661545 4642658
4488D642658O50850Q69671L82701j06467L20152K15899Q0258o83370n32889l33484
$$ 4642658 5293508 6163179 6545880 6439413 6759565 6975464 7055722 6372352 5839463 5505979
4478E505979M3706L03422M72152M76287k01903r321r26447k96239j87434O21770
$$ 5505979 5549685 5853107 6325259 6801546 6599643 6590322 5663875 5367636 5180202 5801972
4468E801972m93631Q85957O0724P99284j55079M9533k19646J19886j87736M92285
$$ 5801972 5308341 6194298 6255022 7054306 6899227 6948760 6729114 6849000 6661264 7153549
4458G153549K80241j14137o23247q2773K31840Q48184l11756k53983m59419n82412
$$ 7153549 7433790 7319653 6696406 6613633 6845473 7693657 7381901 7127918 6668499 6086087
4448F086087n46413r98103J36078R5384R33046M14009K24273l99284K15662K52371
$$ 6086087 5539674 4541571 4677649 4773033 5706079 6120088 6344361 5945077 6160739 6413110
4438F413110K37094r1305l0648m48448L6396r4383q29309O80907N23011j58751
$$ 6413110 6650204 6558899 6528251 6079803 6116199 6021816 5192507 5873414 6396425 6237674
4428F237674J7733l8289m15427L01155K85322L65293K29245j22431j46217L23572
$$ 6237674 6255407 6217118 5801691 6102846 6388168 6753461 6982706 6860275 6714058 7037630
4418G037630j05650j55883K19908O71783J04313m19812N05031l2071N53928K26313
$$ 7037630 6931980 6776097 6996005 7667788 7772101 7352289 7857320 7825249 8379177 8605490
4408H605490O5776n72155M65464j22264O3058N11093N80191K08498K2923q08929
$$ 8605490 8671266 8099111 8564575 8442311 8505369 9016462 9596653 9805151 9828074 9019145
4398I019145j21788J03453k80444l05759j67298L2868J94281J39238o1757n10034
$$ 9019145 8897357 9000810 8720366 8414607 8247309 8280177 8474458 8613696 8551939 8041905
4388H041905R71200J57803J77839R50276Q1373K00090o06056k36527l2989M11899
$$ 8041905 9013105 9170908 9348747 10299023 10380396 10580486 9974430 9737903 9704914 10116813
4378A0116813M79644P93273j99758J211807J5225r1669J50319N54746p21074N43106
$$ 10116813 10596457 11389730 11189972 12401779 12417004 12325335 12475654 13030400 12309326 12852432
4368A2852432p80997p46758n36013P15121R65041J133745P59376J31786k9156
$$ 12852432 12071435 11324677 10788664 11503785 12468826 13602571 14361947 14493733 14464577
4359A4464577l43586m1672j53619L53956l24768Q48315M05462Q84712R741M25078
$$ 14464577 14120991 14079319 13925700 14279656 13954888 14803203 15208665 16093377 16103118 16528196
4349A6528196O00806M95209N52469N54897L56451Q54160K076631J216612Q00517
$$ 16528196 17129002 17624211 18176680 18731577 19088028 19942188 22018819 23235431 24035948
4340B4035948J297634Q65594R15751R00696J365483J180417J923103Q85335K349420
$$ 24035948 25333582 26199176 27114927 28015623 29381106 30561523 32484626 33369961 35719381
4331C5719381J808844K314706J726636K340518J448375K903604K933828L704517
$$ 35719381 37528225 39842931 41569567 43910085 45358460 48262064 51195892 54900409
4323E4900409M550483N444273N947722O097034O222398P423768P701522Q095452
$$ 54900409 59450892 64895165 70842887 76939921 83162319 90586087 98287609 106383061
4315A06383061J0077201J2308431J4611715J5905489J8593102K2142147K6100109
$$ 106383061 116460262 128768693 143380408 159285897 177878999 200021146 226121255
4308B26121255L0378557L5160806L9022914M4121665M7113514M3902129L2127199
$$ 226121255 256499812 291660618 330683532 374805197 421918711 465820840 497948039
4301D97948039J2456813j0751878l5242620m8512681n1662847m9194658m2670493
$$ 497948039 510404852 499652974 464410354 415897673 364234826 315040168 272369675
4294B72369675l5775198l0362171k5621045k1144245j7201096j4109295j2431226
$$ 272369675 236594477 206232306 180611261 159467016 142265920 128156625 115725399
4287A15725399j0452454r433780p475152o777851n027880m868533m170404m355928
$$ 115725399 105272945 95839165 88364013 81586162 76558282 71689749 67519345 63163417
4279F3163417l585484l859304l025912k426836k379544j830937k099387k358007
$$ 63163417 59577933 55718629 52692717 50265881 47886337 46055400 43956013 41598006
4271D1598006k009752k038703k060222j537356r55868r96543n87281r91664j240464
$$ 41598006 39588254 37549551 35489329 33951973 32996105 31999562 31412281 30420617 29180153
4262B9180153q43795r73660j130487l32646n12502l88424j792701j885364q69545
$$ 29180153 28336358 27362698 26232211 25899565 25387063 24998639 23205938 21320574 20451029
4253B0451029q68174l80244j57893K38985j54830j047295j021545J57732P8016
$$ 20451029 19582855 19202611 19044718 19283703 19128873 18081578 17060033 17217765 17295781
4244A7295781j05693K33617m95390p11122l37898l68890M88399n13225n17996
$$ 17295781 17190088 17423705 16928315 16217193 15879295 15510405 15998804 15485579 14967583
4235A4967583l95656m10863o26729K2668l0098j81714l80073p72719j351950q32049
$$ 14967583 14571927 14161064 13534335 13557003 13526905 13345191 12965118 12192399 10840449 10008400
4225A0008400n94573Q7785N82883M14149O83745k04166l58284n89291j90519j60106
$$ 10008400 9413827 9501612 10084495 10498644 11182389 10978223 10619939 10030648 9840129 9680023
4215I680023M26789l80158K69515q19254L02929p59209J097177K62427M94673
$$ 9680023 10106812 9726654 9996169 9176915 9479844 8720635 9817812 10080239 10574912
4206A0574912o42448p78783j186341j49938k64809q4536O02839P5265Q63605m86192
$$ 10574912 9932464 9153681 7967340 7817402 7552593 7468057 8070896 8146161 9009766 8523574
4196H523574n07538M28336N95739k88514M26849Q4384J97673j02184j3942R2479
$$ 8523574 8016036 8444372 9040111 8751597 9178446 9262830 9460503 9358319 9344377 9436856
4186I436856J13005n41748m43886q28644p17738m77553n3359L00389M70412K67147
$$ 9436856 9549861 9008113 8564227 7735583 7017845 6540292 6486933 6787322 7257734 7524881
4176G524881l29298l77598n39516j078658l16205l3873m80528M89562M92073r2019
$$ 7524881 7195583 6817985 6278469 5199811 4883606 4849733 4369205 4858767 5350840 5258821
4166E258821n22995m28794o03372l1038J88895J74271J67976M74893Q58916p5030
$$ 5258821 4735826 4307032 3703660 3672622 3861517 4035788 4203764 4678657 5537573 5462543
4156E462543r3908j79347P2394o81985k94242J31350Q85858L22396N17833n05107
$$ 5462543 5368635 5189288 5261682 4579697 4285455 4416805 5302663 5625059 6142892 5637785
4146E637785l95517n87148L9159L44700o4125m26839J72039r98153o20117K2687
$$ 5637785 5242268 4655120 4694279 5038979 4974854 4548015 4720054 3721901 3101784 3124471
4136C124471J088527R19673J37047K58416j14477m02420m32256n15370o1090L69930
$$ 3124471 4212998 5132671 5269718 5528134 5413657 5011237 4578981 4063611 4002521 4372451
4126D372451o33963N535J73620M16476l8508J15381k16083p08600o96582m00618
$$ 4372451 3738488 3744023 3917643 4334119 4295611 4410992 4194909 3486309 2789727 2389109
4116B389109O69996k29000m89054L31465J85769o00977l07556j38549M15389M01486
$$ 2389109 3059105 2830105 2341051 2672516 2858285 2257308 1949752 1811203 2226592 2628078
4106B628078O13858l07017L01357N23666l77819J11736q86538n54620k02032J01857
$$ 2628078 3241936 2934919 3236276 3759942 3382123 3493859 2607321 2052701 1850669 1952526
4096A952526l63600M45954k46419J165090N55378N46418L40096k23236o34105
$$ 1952526 1588926 2034880 1788461 2953551 3508929 4055347 4395443 4172207 3538102
4087C538102j042894k01735n42558L04642J51936N31450J07938O80943K58978
$$ 3538102 2495208 2293473 1750915 2055557 2207493 2738943 2846881 3527824 3786802
4078C786802L46143l12195L79742p39622r26435n60622l83621j70668N79920J057023
$$ 3786802 4132945 3820750 4200492 3460870 2534435 1973813 1590192 1419524 1999444 3056467
4068C056467Q84666R7966J85937m21673j110357r62472M34266K44385j203L6913
$$ 3056467 3941133 4039099 4225036 3803363 2693006 1730534 2164800 2409185 2407982 2444895
4058B444895r4724L07745k94886K4248K93596M13099m98362j81936J71693o40544
$$ 2444895 2350171 2657916 2363030 2387278 2680874 3093973 2595611 2413675 2585368 1944824
4048A944824P00998J74696J15109r2394l55032q8199k80570J46042k82977P6458
$$ 1944824 2645822 2820518 2935627 2843233 2488201 2400002 2119432 2265474 1982497 2058955
4038B058955M35782L27995J08848K06060l35713N26390j398203o14108q02748
$$ 2058955 2494737 2822732 2931580 3137640 2801927 3328317 1930114 1316006 513258
4029E13258K4761J36005J112519J129932P26250k35309q0438n43014k91005l32257
$$ 513258 538019 674024 1786543 2916475 3642725 3407416 3326978 2783964 2492959 2160702
4019B160702q0625Q29192Q03952J702490L26795L06847n74655r2230l0546p94293
$$ 2160702 2080077 2909269 3713221 5415711 5742506 6049353 5474698 5382468 5351922 4557629
4009D557629q11230o0650L26816M0539O38363J44868m03811j80060q70813j324036
$$ 4557629 3746399 3685749 4012565 4053104 4691467 4836335 4432524 4252464 3381651 2057615
3999B057615p8328r8418P16340Q66405R33996n80874r63870l89614l31761M1475
$$ 2057615 1979287 1880869 2597209 3463614 4397610 3816736 2852866 2463252 2131491 2172966
3989B172966N93287M64204k32631l3930L719K18267P62726L4787p93209J9480
$$ 2172966 2766253 3230457 2997826 2963896 2967615 3185882 3948608 3983395 3190186 3209666
3979C209666q5190j061589L6134N83564L74384L6927P73422m07629o76445k04119
$$ 3209666 3124476 2062887 2099021 2682585 3056969 3093896 3867318 3459689 2783244 2579125
3969B579125l98434l21800Q45817K66585M84908j42284O57255O1621L74154n31059
$$ 2579125 2180691 1858891 2704708 2971293 3456201 3313917 3971172 4032793 4406947 3875888
3959C875888j123725j026199m98182j12822M16838J216820N74417L18696K25098
$$ 3875888 2752163 1725964 1227782 1114960 1531798 2748618 3323035 3641731 3866829
3950C866829M442p75799o97061n52946q952n19568K45291m32619R35711L10853
$$ 3866829 3871271 3095472 2398411 1845465 1836513 1316945 1562236 1129617 2065328 2376181
3940B376181K23204O8573Q89860j15276R81985L79903m67734q06147k03504j86365
$$ 2376181 2599385 2667958 3557818 3442542 4424527 4804430 4336696 3530549 3327045 3140680
3930C140680L60535J35261q1270m9926K72642m417n76300Q15480L65306j37950
$$ 3140680 3501215 3636476 3555206 3505280 3777922 3773505 3197205 4012685 4377991 4240041
3920D240041k10853l61636n0234L9783r1519K14194j74095j48989L22492j39244
$$ 4240041 4029188 3667552 3617318 3657101 3565582 3779776 3605681 3456692 3779184 3639940
3910C639940m14019j75557l58989L13731L2290K76731j43683p0559P29105l3281
$$ 3639940 3225921 3050364 2691375 3005106 3037396 3314127 3170444 3099885 3828990 3795709
3900C795709J4690q18118k93417K89933L84832j77314J12829k78934R99233M92159
$$ 3795709 3810399 2992281 2698864 2988797 3373629 3196315 3309144 3030210 4029443 4521602
3890D521602K77267n5899L89384m67568K68995n6456N25970j41410q9880p9066
$$ 4521602 4798869 4742970 5132354 4664786 4933781 4877325 5403295 5261885 5172005 5092939
3880E092939k29602R4128n71218J051609K59937J14448l35886k61124o44545n8607
$$ 5092939 4863337 4957465 4386247 5437856 5697793 5812241 5476355 5215231 4570686 4512079
3870D512079k08504k35302M2355J033707O70520n587n85934p12574M4574M63281
$$ 4512079 4303575 4068273 4110628 5144335 5814855 5809268 5223334 4510760 4555334 5018615
3860E018615Q13380P00548l83993l48222n85312o53672m43478K22991K60049k26567
$$ 5018615 5831995 6532543 6148550 5800328 5215016 4561344 4117866 4340857 4600906 4374339
3850D374339j04747J9390J068605M50910J84711J13369j217183k5422n83005m5679
$$ 4374339 4269592 4288982 5357587 5808497 5993208 6106577 4889394 4863972 4280967 4235288
3840D235288K68866P89612L93057L80291k87975j172262l7433N89867K75599m15957
$$ 4235288 4504154 5293766 5686823 6067114 5779139 4606877 4569444 5159311 5434910 5018953
3830E018953R0020p74059l5376l94453K36862j42067o1672L1727M57115R1169
$$ 5018953 5108973 4334914 4299538 3905085 4141947 3999880 3938208 3969935 4427050 4518219
3820D518219N59753K44042j06219N85621j087585j80032J66469O43939n07834
$$ 4518219 5077972 5322014 5215795 5801416 4713831 4533799 4700268 5344207 4836373
3811D836373J78636q3665j01794L86087M56413M71223M24479o6473k95903o31218
$$ 4836373 5015009 4931344 4829550 5215637 5672050 6143273 6567752 6501279 6205376 5574158
3801E574158m96925p12346N1340N06176M32816J08554L00831n46515O2043L03482
$$ 5574158 5077233 4364887 4416227 4922403 5355219 5463773 5764604 5218089 5280132 5583614
3791E583614J378667K75931n61643p82867n17565l64209l24536N61966l61809
$$ 5583614 6962281 7238212 6676569 5893702 5376137 5011928 4687392 5249358 4887549
3782D887549L98017P45533K75738k37855n65516J0022p5776j38186L86887p61107
$$ 4887549 5285566 6031099 6306837 6068982 5503466 5513488 5437712 5299526 5686413 4925306
3772D925306p4635N21019K06951M64072J10104Q9807l794L91686M4343l60241
$$ 4925306 4850671 5371690 5578641 6042713 6152817 6242624 6238830 6630516 6674859 6314618
3762F314618N30974l03397m91622J75409l524j97001K28550J23426M12104q9263
$$ 6314618 6845592 6542195 6050573 6225982 6222458 6025457 6254007 6377433 6789537 6700274
3752F700274j91208l36263M75062r0190J43612o2071O0084m97539K56618k65620
$$ 6700274 6509066 6172803 6647865 6557675 6701287 6639216 6699300 6201761 6458379 6192759
3742F192759P0089n09722m80K4539n60668l33133K47622K73922J127941L70222
$$ 6192759 6262848 5753126 5752646 5777185 5216517 4883384 5131006 5404928 6532869 6903091
3732F903091q1448J79154n33778j42444J5085J079188k36776L33373k7440L99277
$$ 6903091 6821643 7000797 6467019 6324575 6339660 7418848 7182072 7515445 7488005 7887282
3722G887282O47955m83148j197037l57917m48477j53997J6739K16474P36323L88759
$$ 7887282 8535237 8052089 6855052 6497135 6048658 5894661 5911400 6127874 6864197 7252956
3712G252956J48068J24012o89840p34638o53120m97646N76030J79744M70609K78356
$$ 7252956 7401024 7525036 6835196 6100558 5447438 4949792 5525822 5705566 6176175 6454531
3702F454531K35613j98008m80207O64450r7885k93193l78953N27056j08822N82200
$$ 6454531 6690144 6492136 6011929 6676379 6578494 6285301 5906348 6433404 6324582 6906782
3692F906782q7264L77550m72175K44394M9683J09712K42081M94805J84239m60056
$$ 6906782 6819518 7197068 6724893 6969287 7018970 7128682 7370763 7865568 8049807 7589751
3682G589751p5124M02190M01278j26577M05469m01351O6325o10092m19312k2509
$$ 7589751 7514627 7916817 8318095 8191518 8596987 8195636 8261961 7651869 7232557 7210048
3672G210048N57814J54717Q42167M53615m08057p47750K4048o7870M46761M92047
$$ 7210048 7767862 7922579 8764746 9218361 8810304 8062554 8086602 8018732 8465493 8957540
3662H957540J12411L37581L36777J24425N58548L41693J590492Q98230l7167l78541
$$ 8957540 9069951 9407532 9744309 9868734 10427282 10768975 12359467 13257697 13220530 12841989
3652A2841989j47412J60014Q36161O89841M96650J4560k46472j424110o19680
$$ 12841989 12694577 12854591 13690752 14380593 14877243 14891803 14645331 13221221 12601541
3643A2601541j225573o962j5202k17059K77385j15701J21512J22569L42996k69224
$$ 12601541 11375968 11369006 11353804 11136745 11414130 11298429 11419941 11542510 11885506 11616282
3633A1616282L09195k74253J29161L82654Q11759r0005P59779O14660P85650J321077
$$ 11616282 11925477 11651224 11780385 12163039 12974798 12884793 13644572 14259232 15044882 16365959
3623A6365959J215470O56165J336054J241389J682238R82760K74158j367260j839695
$$ 16365959 17581429 18237594 19573648 20815037 22497275 23480035 23754193 22386933 20547238
3614B0547238k192066j058802O7967p2792J12685p05016p87422j035748q36974
$$ 20547238 18355172 17296370 17364337 17291545 17404230 16699214 15911792 14876044 14039070
3605A4039070k81289L87889l06018O44019K58257j40554m51157Q14035P70288
$$ 14039070 13757781 14145670 13839652 14483671 14741928 14601374 14150217 14964252 15734540
3596A5734540N39922j35888K69945L6214M38831P40891R96617J136009P93862
$$ 15734540 16274462 16138574 16408519 16444733 16883564 17624455 18621072 19757081 20550943
3587B0550943J232734k12098k73112r85998k30984j006250k83995j225945r35723
$$ 20550943 21783677 21571579 21298467 20312469 20081485 19075235 18791240 17565295 16629572
3578A6629572k79592l7261M7872o4188o0037m86724K45980m40405L45179K06233
$$ 16629572 16349980 16312719 16360591 16296403 16236366 15749642 15995622 15555217 15900396 16106629
3568A6106629O56639N78204l3563m58190j84009M05900L3420K59751N61216R13845
$$ 16106629 16763268 17341472 17307909 16849719 16665710 17071610 17105030 17364781 17925997 18839842
3558A8839842M80892N74562R81213Q07187J11914k64900n81390o84680k91857
$$ 18839842 19320734 19895296 20876509 21683696 21795610 21530710 20949320 20264640 19972783
3549A9972783K96383j31928K49368l32734j23413K80971M07348M68253j96527
$$ 19972783 20269166 20137238 20386606 20053872 19930459 20211430 20618778 21087031 20890504
3540B0890504l79051j73338k36917r288M58911m7852J02830J03084Q23552j98177
$$ 20890504 20511453 20338115 20101198 20091910 20550821 20502969 20605799 20708883 21532435 21334258
3530B1334258m40056p1854K70758O51248J94210N77634Q36974J93692K76050m39980
$$ 21334258 20894202 20822348 21093106 21744354 21938564 22516198 23353172 23546864 23822914 23382934
3520B3382934N23537Q76077N00449k0656O21289L07141n25348l81577R2429N90143
$$ 23382934 23906471 24782548 25282997 25262341 25883630 26190771 25665423 25283846 25376275 25966418
3510B5966418J11196L45487M48633P19900M70399L50109J150027L74169N10899
$$ 25966418 26077614 26423101 26871734 27591634 28062033 28412142 29562169 29936338 30447237
3501C0447237N69060j77816O39902J367782J013253J041685Q35232R20343M65012
$$ 30447237 31016297 30838481 31478383 32846165 33859418 34901103 35736335 36656678 37121690
3492C7121690N40260J047208K170746J474740R70056J143680J155368K274430
$$ 37121690 37661950 38709158 40879904 42354644 43324700 44468380 45623748 47898178
3484D7898178J165643K932109J870922K170997K157750K717372K554136M173179
$$ 47898178 49063821 51995930 53866852 56037849 58195599 60912971 63467107 67640286
3476F7640286L981604L822515L086579L477415L075551M122780L344627L838583
$$ 67640286 71621890 75444405 78530984 82008399 85083950 89206730 92551357 96389940
3468I6389940L618436K334829J43719j343725j781312l481155l577673l790931
$$ 96389940 100008376 102343205 102486924 101143199 99361887 95880732 92303059 88512128
3460H8512128l765700m240440m307872m089075l690572l771967l080575k734842
$$ 88512128 84746428 80505988 76198116 72109041 68418469 64646502 61565927 58831085
3452E8831085k680034k267218k286085k542389k154880j689541q38454r21715
$$ 58831085 56151051 53883833 51597748 49055359 46900479 45210938 44372484 43450769
3444D3450769j091368j239604j513670j124117m1268p27640l8256k10741o30851
$$ 43450769 42359401 41119797 39606127 38482010 38440742 37713102 37674846 37464105 36833254
3435C6833254j333295k54861n14247L26722O43865O78504j204245j182316m61647
$$ 36833254 35499959 35245098 34730851 35057573 35701438 36379942 35175697 33993381 33531734
3426C3531734o92199k27123q44007o27485n74486q75642j343995j082790q19439
$$ 33531734 32839535 32612412 31768405 31140920 30566434 29690792 28346797 27264007 26444568
3417B6444568m37116q40194q30144k18807j57195O5551l82291o6423l68674l71559
$$ 26444568 26007452 25167258 24337114 24118307 23961112 24026663 23644372 23577949 23209275 22837716
3407B2837716m51705l04963m70211J75968p76615M97530J47773j46767J11703
$$ 22837716 22386011 22081048 21610837 21786805 21010190 21507720 21655493 21508726 21620429
3398B1620429J93698l4813K78711m92515k85340o03293j114697o74614m3121O0656
$$ 21620429 21814127 21779314 22058025 21565510 21280170 20676877 19562180 18887566 18844445 18905101
3388A8905101P0258l42448q89669j207810p39717j01939m70858o52225k5590m6058
$$ 18905101 18975359 18632911 17743242 16535432 15795715 15693776 15222918 14570693 14545103 14499045
3378A4499045l2318K75992Q0658j18207L56371m28558j383469n49211M3916L10817
$$ 14499045 14466727 14742719 14823377 14705170 15061541 14632983 13249514 12700303 12744219 13055036
3368A3055036O29887J52752k81764q605m1779K74389O19394m46066m34470m10712
$$ 13055036 13684923 13837675 13555911 13547306 13505527 13779916 14399310 13953244 13518774 13108062
3358A3108062j188342m47376j03896K63505O33088J59742O71198r0597o01311
$$ 13108062 11919720 11472344 11368448 11631953 12265041 12424783 13095981 13005384 12404073
3349A2404073k67102k72262J04408p03680K09998p46456j1695l28688J72008q7460
$$ 12404073 12136971 11864709 11969117 11265437 11475435 10728979 10717284 10388596 10560604 10473144
3339A0473144K31631k6704o4896q96810K90399l60640M35497J92238M65544o2097
$$ 10473144 10704775 10678071 10613175 9716365 10006764 9646124 10081621 10273859 10739403 10677306
3329A0677306k84466n86604m40351n17010K56103M0984K80242N6952J38455K92506
$$ 10677306 10392840 9806236 9365885 8848875 9104978 9145962 9426204 9483156 9621611 9914117
3319I914117n68336N82943q07058m00289J18317K56214J6673O26275O5054K09891
$$ 9914117 9345781 9928724 9121666 8721377 8839694 9095908 9112581 9738856 9803910 10013801
3309A0013801L59731k36872j75577m25567j67531m1614J3464l11093O87760L56990
$$ 10013801 10373532 10136660 9961083 9535516 9367985 9326371 9339835 9028742 9716502 10073492
3299A0073492J8252J51677j91383m24208K51046q41595m42821l41572q6810M11121
$$ 10073492 10091744 10243421 10052038 9627830 9878876 9037281 8594460 8252888 8166078 8577199
3289H577199M97394Q56648l53357M3619j117504m55106n01249j11704K97580M77506
$$ 8577199 9074593 9931241 9577884 9621503 8503999 8048893 7547644 7435940 7733520 8211026
3279H211026O56529j3789m0239j96217o98923o92860l17859k6299L2016l48941
$$ 8211026 8867555 8853766 8813527 8617310 7918387 7225527 6907668 6881369 6913385 6564444
3269F564444M74103J61866Q23599O55604k37179K18605n50015j54569l88973p85312
$$ 6564444 7038547 7200413 8024012 8679616 8442437 8661042 8111027 7956458 7567485 6782173
3259F782173J68277k10092m61107J057192k2076k1233L34458L2774m28802K42053
$$ 6782173 6950450 6740358 6279251 7336443 7314367 7293134 7627592 7660366 7231564 7473617
3249G473617R0082L75076K05010r49996l27779p09996n50363L61696N97688n3173
$$ 7473617 7563699 7938775 8143785 7193789 6866010 6156014 5605651 5967347 6565035 6511862
3239F511862J37839J62984O8330J1113P532O62921O65716K64396j124242j165094
$$ 6511862 6649701 6812685 6881015 6892128 6899660 7562581 8228297 8492693 7368451 6203357
3229F203357j050436R2410N01599N57450Q81456O38035N23554N80091p7509k71039
$$ 6203357 5152921 5245331 5746930 6304380 7185836 7823871 8347425 8927516 8850007 8578968
3219H578968j34437j53449O0881J44030o623L59948M60007M10792j4861j40848
$$ 8578968 8444531 8291082 8351963 8495993 8489370 8849318 9309325 9720117 9705256 9564408
3209I564408k26207K13401l11445J8646M66454J09761j07594M7408K71456k56083
$$ 9564408 9338201 9551602 9240157 9258803 9725257 9835018 9727424 9774832 10046288 9790205
3199I790205L30457r1463R0764j1487m77629j26786L44075N42681J8497k63600
$$ 9790205 10120662 10029199 10119963 10108476 9630847 9504061 9848136 10390817 10409314 10145714
3189A0145714L46448r1088l62195K02884n37442K94949O37039J091048J75818
$$ 10145714 10492162 10401074 10038879 10241763 9704321 9999270 10636309 11727357 11903175
3180A1903175J24702J023316p4609n98489p68729J4789Q40936L7223P55423M59553
$$ 11903175 12027877 13051193 12976584 12378095 11609366 11624155 12465091 12502314 13257737 13717290
3170A3717290J8038M73692P21544J60006o6265L1624L22595J105441K07699J28795
$$ 13717290 13735328 14209020 14930564 15090570 15024305 15055929 15378524 16483965 16691664 16820459
3160A6820459k08002l2095L43387O50765J90769M45783J31454K92891k97162j07005
$$ 16820459 16612457 16580362 16923749 17574514 17765283 18211066 18342520 18635411 18338249 18231244
3150A8231244L60564K55101J418575L24062o26780m5579l26470N32732Q01556
$$ 18231244 18591808 18846909 20265484 20589546 19962766 19917187 19590717 20123449 20925005
3141B0925005J232639O93146K99210k72258n10154o3827Q48895J027562J050497
$$ 20925005 22157644 22850790 23150000 22877742 22367588 22303761 23152656 24180218 25230715
3132B5230715J318073R84331N31134l57935O50994N31144N34969j36451k34502
$$ 25230715 26548788 27533119 28064253 27706318 28357312 28888456 29423425 29286974 29052472
3123B9052472j108990o19631r67572M14807L71073j55281K65678l89298n37099
$$ 29052472 27943482 27323851 26356279 26771086 27142159 26986878 27252556 26863258 26326159
3114B6326159k32734k77197m48979M43191R54806N38030Q2283J361609M20312
$$ 26326159 26093425 25816228 25367249 25810440 26765246 27303276 27385559 28747168 29167480
3105B9167480N11633m79821p1730R7063q1879r4697l13490p09641M05255l786
$$ 29167480 29679113 29199292 29127562 29224625 29142746 29048049 28734559 28024918 28430173 28426387
3095B8426387k01137o48902j111656j72920k67567q44340n48616q29576l93807
$$ 28426387 28225250 27576348 26464692 26291772 26024205 25179865 24631249 23801673 23407866
3086B3407866j018429n62143l67898l63012J89777o2392m32707o90952J498n89265
$$ 23407866 22389437 21827294 21459396 21096384 21286161 21223769 20791062 20100110 20101608 19512343
3076A9512343j11887m50042n14564l58771m96202o74901m52603o81706L1256j000681
$$ 19512343 19400456 18950414 18435850 18077079 17580877 16905976 16453373 15771667 15802923 14802242
3066A4802242r5648j80674O7953k52085j218125P6714k53580j11760n60365l52854
$$ 14802242 14706594 14525920 14593873 14341788 13123663 13200377 12946797 12835037 12274672 11921818
3056A1921818o13086k89622m94259R69538J68001l84874l65418m76661j37829
$$ 11921818 11308732 11019110 10524851 11494389 11662390 11277516 10912098 10435437 10297608
3047A0297608o85860r07525q02780M02138L40764J01149q9586N39651K78950j22032
$$ 10297608 9611748 8704223 7901443 8303581 8644345 8745494 8655908 9195559 9474509 9352477
3037I352477o13203J00405r16728p4188j12533N257K91875k29146k94104j021015
$$ 9352477 8739274 8839679 7922951 7848763 7736230 7741487 8033362 7804216 7510112 6489097
3027F489097M7125l18638k08539m79281R9694J25536R63519L58267P3646j108412
$$ 6489097 6536222 6217584 6009045 5529764 5629458 5754994 6718513 7076780 7150426 6042014
3017F042014o87079m42280Q3260L81829k46003P6321O18847l1201O2642P99084
$$ 6042014 5354935 4912655 4995915 5377744 5131741 5208062 5826909 5795708 5858350 6657434
3007F657434m75096l55911p72425q99503m12189n55085k94883M08130m03r5866
$$ 6657434 6182338 5826427 5054002 4154499 3742310 3187225 2892342 3300472 3300069 3204203
2997C204203J39177R116l03167M92476n1344j23709J40918K31794L83571j20816
$$ 3204203 3343380 3352496 3049329 3541805 3490461 3366752 3507670 3739464 4123035 4002219
2987D002219r44432o53054l2984L66966L13792J7621L32288R14552j28180q9437
$$ 4002219 3057787 2404733 2371749 2738715 3052507 3070128 3402416 4316968 4188788 4099351
2977D099351j28314k53873n76954M31316M8875J72798K43098M9281k78048L9212
$$ 4099351 3971037 3717164 3140210 3571526 3620401 3793199 4036297 4085578 3807530 3846742
2967C846742o43417o07180l72030Q1998P5078M30059o7677J75912O47927l34278
$$ 3846742 3203325 2596145 2224115 2306113 2381191 2811250 2743573 2919485 3567412 3233134
2957C233134m30710o1733j121922n28650M27732K80858N03808J43661L15943P4116
$$ 3233134 2802424 2740691 1618769 1090119 1517851 1798709 2302517 2446178 2762121 2836237
2947B836237M87135l68399j4316M28410k03378o19064m49738m48068K88444O680
$$ 2836237 3323372 2954973 2940657 3369067 3165689 2546625 2096887 1648819 1937263 1943943
2937A943943n30253J45815n5987O15537M860r99113l10662m3125J98342l69082
$$ 1943943 1413690 1559505 1503518 2119055 2123915 1124802 814140 771015 969357 600275
2927F00275N61848K64725l4014J46143J043893m9850J10111K7762q71347l44693
$$ 600275 1162123 1426848 1392834 1538977 2582870 2533020 2643131 2670893 1799546 1454853
2917A454853l8745L00532N92103j90336K68220m47547p16771k89939j04678N56046
$$ 1454853 1416108 1716640 2308743 2118407 2386627 1939080 1222309 932370 827692 1383738
2907A383738N2526j4036n35623k0894M18076L67734j17820L2572O47836P2595
$$ 1383738 1436264 1422228 886605 865711 1283787 1651521 1533701 1566273 2214109 2286704
2897B286704M2692q59884p98266m3365M03956J47873Q66206M34279J37174j87415
$$ 2286704 2329396 1469512 671246 627881 1031837 1179710 2045916 2480195 2617369 2429954
2887B429954l64308p43135n97407n89778n31450j41069R9460l82895O17011J184687
$$ 2429954 2065646 1322511 725104 135326 -396124 -537193 -437733 -820628 -203617 981070
2877I81070O02009r6511q62166j2843n59795k63555j57782p9573L31043M99615
$$ 981070 1583079 1486568 624402 611559 51764 -211791 -369573 -449146 -118103 381512
2867C81512R31099K49002l74202J0791l29048p01187j73857N55683l35673J68964
$$ 381512 1312611 1561613 1187411 1198202 869154 167967 -5890 549793 214120 383084
2857C83084K53870P32586J73954J24301k65152K23873r17233m01443P8043O16085
$$ 383084 636954 1369540 1543494 1667795 1402643 1626516 709283 307840 385883 1001968
2847A001968M12207M28678K85351l97587j91030p7144k6899n96846n366L85669
$$ 1001968 1414175 1842853 2128204 1730617 1539587 1462443 1435544 838698 833332 1219001
2837A219001R3761q4673K62428m30519j29318j41245l48968k85102j71174K82148
$$ 1219001 1312762 1228089 1490517 1059998 930680 789435 440467 155365 -15809 266339
2827B66339L51947J09n06398p21552l8157q8537j89906Q18301o86575J44294J05218
$$ 266339 618286 618395 111997 -609555 -647712 -736249 -926155 -107854 -794429 -650135 -544917
2816e44917P2157O22036M02113l71330J39698o21450j235269o64060Q5472J131798
$$ -544917 -472760 149276 551389 180059 319757 -301693 -1536962 -2201022 -2115550 -983752
2806i83752P55760O82387P7008K58736k32120m73728o18745R7362J50565j37431
$$ -983752 -227992 454395 531403 790139 558019 84291 -534454 -437092 -286527 -423958
2796d23958l76301o10763J31447P31237J142503L51863M51300k26443j09829k4024
$$ -423958 -800259 -1411022 -1279575 -548338 594165 946028 1397328 1170885 1061056 1037032
2786A037032p04208p2764n24752L54230M1353Q20933M0805L88392o11735O09223
$$ 1037032 332824 260060 -264692 89538 130891 951824 992629 1381021 769286 1378509
2776A378509l47484l54433m82882L62551j98969Q4192n23253J71619m61500Q3408
$$ 1378509 1031025 676592 193710 556261 357292 441484 -81769 89850 -371650 -288242
2766b88242k85030k98808K28163j91605l06696P2268M20904J12797O54079L55727
$$ -288242 -573272 -872080 -643917 -835522 -1142218 -1069950 -649046 -536249 117830 473557
2756D73557l77914P87516L71863o30415o22514k08492J66231o63815M98105O14571
$$ 473557 95643 883159 1255022 624607 2093 -206399 -40168 -703983 -205878 408693
2746D08693J30652r27151j03888j3924j96823j67560Q58223o76979k35713O7982
$$ 408693 539345 -387806 -491694 -505618 -702441 -870001 -11778 -688757 -924470 -856488
2736h56488j44437K39108N27484l66726l31255J13421j97759M11218Q6359N50715
$$ -856488 -1000925 -761817 -234333 -601059 -932314 -818893 -1016652 -605434 -519075 31640
2726C1640J06767R9305j62398K30523N79005p5875r89146l60795k49928n36946
$$ 31640 138407 237712 75314 305837 884842 808967 -180179 -540974 -790902 -1327848
2716a327848Q31077L39938P90274n36305Q19617m33879J69160l99043O73798p75182
$$ -1327848 -496771 -156833 633441 97136 916753 482874 652034 252991 926789 151607
2706A51607R3792m11309N23438l12947K73305J31118n5493J80197P7915n0111
$$ 151607 245399 -165910 357528 44581 317886 449004 393511 573708 651623 601512
2696F01512M25118K37767n44435m5558l88300l21791q14582l1299K60775J21311
$$ 601512 1026630 1264397 719962 674404 286104 -35687 -850269 -881568 -620793 -499482
2686d99482k45954o78581O07069N30404j0629L22401l38907R2051J34329j56559
$$ -499482 -745436 -1424017 -816948 -286544 -297173 25228 -313679 -221628 -87299 -243858
2676b43858k9527j5828P64l09726n8090J50348J14955J43722q6607j98465p1072
$$ -243858 -273385 -289213 -288449 -598175 -656265 -505917 -390962 -247240 -333847 -532312 -603384
2665f03384R1914M31925l7707m48641J12486L5323m29472m24592L98714N58400
$$ -603384 -511470 -79545 -117252 -565893 -453407 -418084 -847556 -1272148 -873434 -315034
2655c15034Q55454m98481K10266j61807p11070l03537J30867J30412R56585K30050
$$ -315034 540420 41939 252205 90398 -620672 -924209 -793342 -662930 293655 523705
2645E23705J16052j49155K33492m15410k33868r6469N21359m26495J94761K54452
$$ 523705 639757 490602 724094 308684 74816 -21653 499706 73211 267972 522424
2635E22424M09757l50129J95640J43207k81358l56978p0768K90233O3487j127021
$$ 522424 932181 582052 777692 920899 639541 282563 211795 502028 565515 -561506
2625e61506q95581n28554j5165O7080O87785K03972k1309p19891N72496J47448
$$ -561506 -1457087 -1985641 -2000806 -1933726 -1245941 -1041969 -1063278 -1783169 -1210673 -1063225
2615a063225L71817P69314J62744k03709K3088l56984j7240P06437j23272K33313
$$ -1063225 -691408 77906 240650 36941 60029 -296955 -314195 392242 268970 502283
2605E02283k74N94203K47272K86439n89735m32218K70844L1737p95572k02480
$$ 502283 502009 1096212 1343484 1629923 1040188 607970 878814 910551 114979 -87501
2595h7501J146585m02553L00926k1906L9669j35969J50375m66806m06558J33857
$$ -87501 1059084 656531 957457 935551 975220 839251 989626 522820 116262 250119
2585B50119k7679M4174k35997J16551l97179j2611Q0185L6615l83463P05271M5621
$$ 250119 222440 266614 30617 147168 -250011 -262622 -182437 -145822 -529285 175986 221607
2574B21607N84193j17628O79998l44888J14507k58956P8960j95310N25761L7979
$$ 221607 805800 688172 1368170 1023282 1137789 878833 957793 762483 1288244 1326223
2564A326223j4854k091m28416q7714q45213L6726j1792N47089P03586K26856n12683
$$ 1326223 1311369 1309278 880862 793148 -52065 -15339 -27131 519958 1223544 1450400 937717
2553I37717l9662l52457m48375J7526j18419N5427N57895j93024P0712K79623
$$ 937717 898055 545598 97223 114749 -3670 51757 609652 416628 487340 766963
2543G66963j2007J71717k12661j19039m58438m02243n31119J77173o31906K28202
$$ 766963 754956 926673 714012 594973 136535 -265708 -796827 -619654 -1251560 -1023358
2533a023358k68237K06942L78562M24674k30190K53661k3976M34739n40457O8919
$$ -1023358 -1291595 -1084653 -706091 -281417 -511607 -257946 -281922 152817 -387640 -318721
2523c18721J68319p4238q37174o8113M14009K52858L58630L93341M52775M7866
$$ -318721 -150402 -224640 -1061814 -1129927 -715918 -463060 -104430 288911 741686 789552
2513G89552N15539n61043l41596q21351N11573J19391n02999J09659J75046m13818
$$ 789552 1305091 744048 402452 -418899 92674 212065 -290934 -181275 -6229 -420047
2503d20047r7781k59535O62171Q58788K79461L28419m85177j92881K68913j96642
$$ -420047 -517828 -777363 -115192 743596 1023057 1351476 866299 673418 942331 745689
2493G45689K26020L19514M52744j36910l5945n19818N4671l02414O42416J88712
$$ 745689 971709 1291223 1743967 1607057 1571112 1051294 1105965 803551 1445967 1634679
2483A634679L68658k87507m64444j351238j80068K70626k96169P1758Q83787K25997
$$ 1634679 2003337 1715830 1251386 -99852 -279920 -9294 -305463 -233705 650082 876079
2473H76079R7709n96261M03836J40990o59230N21308q08717M83417j26022Q55496
$$ 876079 973788 377527 781363 922353 263123 784431 -24286 459131 333109 1188605
2463A188605l48416J235542L21364J3222l63560m97028p64354o32570n5762N4567
$$ 1188605 840189 2075731 2397095 2410317 2046757 1549729 785375 152805 97043 151610
2453A51610P51075j613J91643L23011M45762k99318J14489k25114J86142N51555
$$ 151610 902685 901072 1092715 1415726 1861488 1562170 1676659 1451545 1637687 2189242
2443B189242K52782q88857K47225Q38738Q47116K47012k68977k03026o23234l74944
$$ 2189242 2442024 1553167 1800392 2639130 3486246 3733258 3464281 3261255 2638021 2263077
2433B263077L4655L29472J88416M86348L27418L40495m85915j91065P5491l38834
$$ 2263077 2297732 2627204 2815620 3301968 3629386 3969881 3483966 3292901 3368392 3029558
2423C029558o84785M6065M21039Q41715M84542N18672J90801m50034p36093q79474
$$ 3029558 2344773 2390838 2811877 3653592 4138134 4656806 4847607 4397573 3661480 2782006
2413B782006m9609Q97532P45552j67364l22756Q39092Q65151r6426q9188M35338
$$ 2782006 2732397 3629929 4375481 4208117 3885361 4724453 5589604 5493178 5403990 5839328
2403E839328n60730k34736k14523K48079Q58242L90415q16M5097M81922J57226
$$ 5839328 5278598 5043862 4829339 5077418 5935660 6326075 6325259 6370356 6852278 7009504
2393G009504l86248n94601r35471l37522j32178J19961J303334Q37314R53826
$$ 7009504 6623256 6028655 5093184 4755662 4623484 4743445 6046779 6884093 7837919
2384G837919P4591M22599l27543l345J93264M91403P28613J152788j95728K31111
$$ 7837919 7912510 8335109 8007566 8004221 8197485 8688888 9417501 10570289 10374561 10605672
2374A0605672j68255O36061Q65510O95665R83042J417981P61794R51287R66450
$$ 10605672 10437417 11073478 11938988 12634653 13617695 15035676 15797470 16748757 17715207
2365A7715207O57916N66841P49826J070453J594400J436194J765678Q60088J261714
$$ 17715207 18373123 18939964 19689790 20760243 22354643 23790837 25556515 26416603 27678317
2356B7678317J639595J510307J552234K816526J771840K740108L371082L478928
$$ 27678317 29317912 30828219 32380453 35196979 36968819 39708927 43080009 46558937
2348D6558937M799454N219965N908421O600799O165963N627701O870126P311204
$$ 46558937 51358391 56578356 62486777 69087576 75253539 80881240 87751366 95062570
2340I5062570R051083J0337037J2576317J4621335J8170704K0236696K3914486
$$ 95062570 104113653 114450690 127027007 141648342 159819046 180055742 203970228
2333B03970228K6799546L1150674L4118137L5272912L0920728K0710863N626603
$$ 203970228 230769774 261920448 296038585 331311497 362232225 382943088 388569691
2326C88569691j1741839k8503243l6395225l8277642l5400817l1215527k5755969
$$ 388569691 376827852 348324609 311929384 273651742 238250925 207035398 181279429
2319A81279429k1717552j7870336j5191616j2169741j0687251r061400p483136
$$ 181279429 159561877 141691541 126499925 114330184 103642933 94581533 87098397
2312H7098397n820200n781265n791697n160052m798747l919899m247758l078992
$$ 87098397 81278197 75496932 69705235 64545183 59746436 55826537 51578779 48499787
2304D8499787k996091k352134k339366j918933j827937k430228k784517j608973
$$ 48499787 45503696 43151562 40812196 38893263 37065326 34635098 31850581 30241608
2296C0241608j361262q67258q98484p26787m49067j237200j218614j125503k90716
$$ 30241608 28880346 28013088 27114604 26387817 25938750 24701550 23482936 22357433 22066717
2287B2066717n33922m89242m28368j088186j706454j090657o67436J09124m18754
$$ 22066717 21532795 21043553 20615185 19526999 17820545 16729888 16062452 16171576 15752822
2278A5752822Q0272K4876m66373l67012q39869K0288m18031k44071j31312N8478
$$ 15752822 15833094 15857970 15391597 15024585 14184716 14205004 13786973 13542902 13411590 13470068
2268A3470068q78249m65063j236219l80543j3401N50272m94783j66432r18372
$$ 13470068 12591819 12126756 10890537 10509994 10496593 11046865 10552082 10385650 9467278
2259I467278q6200l79179J07132k91809J74458N51424p39065q20017q81404k79630
$$ 9467278 9381078 9001899 9109031 8817222 8991680 9543104 8804039 7984022 7102618 6822988
2249F822988r80485o0642N6896Q76286Q1646J27740m48223q5341l27111r5743
$$ 6822988 5842503 5781861 5838757 6715043 6796689 6924429 6476206 6390865 6063754 5968011
2239E968011J79843r30339r99939j72026O41852O49717L81622j039546j94831
$$ 5968011 6147854 5217515 4217576 4045550 4687402 5337119 5718741 4679195 4484364
2230D484364l71936n64727k11171R74004R56467M95238p92649r0312o81628m30314
$$ 4484364 4112428 3547701 3336530 4310534 5267001 5762239 4969590 4879278 4197650 3767336
2220C767336j86945j45446J78531p78789k91680j34045N78661L32809M10917J31169
$$ 3767336 3580391 3434945 3613476 2834687 2543007 2408962 2987623 3320432 3731349 3862518
2210C862518K11737n3601j55358q01246j60646l88003K8987R6627L28287R2942
$$ 3862518 4074255 4020654 3865296 3064050 2903404 2515401 2544388 2641015 2969302 3062244
2200C062244J25320m85966o90798K42957J28106j18252Q8772k84274J3354L28625
$$ 3062244 3187564 2701598 2010800 2253757 2381863 2263611 2352383 2068109 2081463 2410088
2190B410088m11670m22139M1617J79112N3839K7462L49423l26261L65856K43348
$$ 2410088 1998418 1576279 1617896 1797008 1850847 1878309 2227732 1901471 2267327 2510675
2180B510675j79245j56458k69382k3235Q4927P88611M21618N5978n05157m91505
$$ 2510675 2331430 2174972 1905590 1882355 1967282 2755893 3177511 3233489 2728332 2236827
2170B236827q7268m24382P6o570L19478k64185k98894K47860M07093J51734j56050
$$ 2236827 2149559 1725177 1725253 1718683 2038161 1773976 1475082 1722942 2130035 2281769 2125719
2159B125719J21257L51998l78980m01032k45229K7877p60643K74415M41310R27152
$$ 2125719 2246976 2598974 2219994 1818962 1573733 1601610 840967 1115382 1556692 2483844
2149B483844n9471L01652o269j66962n29289q27350l79956j012185P7430K21985
$$ 2483844 2424373 2726025 2719756 2552794 2023505 1196155 816199 -195986 -118556 103429
2139A03429O85028l93360M22190L43100J66008o78916K48730r12409j38753k8022
$$ 103429 788457 395097 817287 1160387 1326395 647479 896209 -16200 -154953 -182975
2129a82975j82448l83844N38286k55741O70049N49882N96126K67453p24460k1765
$$ -182975 -365423 -749267 -210981 -466722 203327 753209 1349335 1616788 892328 870563
2119H70563m35602n67429j08897P20101O11674N10342m6221N00499j96283l25306
$$ 870563 434961 -132468 -241365 478736 1090410 1600752 1554531 2055030 1858747 1533441
2109A533441J4543L65974k54667l06957r04415q7270K59426J95039P18068J0220
$$ 1533441 1547984 1913958 1659291 1352334 447919 360649 620075 815114 1533182 1543402
2099A543402n65377K27397m2692q41379k22715M4743L96021L01056L2604l45489
$$ 1543402 978025 1205422 1162730 321351 98636 143379 539400 840456 873060 527571
2089E27571K27366l65048m21732J1641L65777R49694M52451n4478K35996m18824
$$ 527571 754937 389889 -31843 -20202 345575 1295269 1747720 1693242 1929238 1510414
2079A510414j191449k72063k88949K64685M04463k73972K65945J41399Q94458
$$ 1510414 318965 46902 -242047 22638 427101 153129 419074 560473 1454931
2070A454931n13797N3799m61122J00952J39386N60569K7888J06467N95691J32901
$$ 1454931 941134 994933 533811 634763 774149 1334718 1362606 1469073 2064764 2197665
2060B197665K36807O94433L10059K4264n52045k43905m08644n77995p954n79431
$$ 2197665 2434472 3128905 3438964 3463228 2911183 2667278 2258634 1680639 1672685 1093254
2050A093254k75774l57596K08304J01005j09036m227L75207l70614N5608m43596
$$ 1093254 817480 459884 668188 769193 660157 655930 1031137 660523 716131 272535
2040B72535l6786k82095M10875j02312K64768n17820j15432K34815N71021J38875
$$ 272535 235749 -46346 364529 262217 526985 9165 -106267 128548 699569 838444
2030H38444k84078J8229o40169j17370n08231K07832K03186J00117L32852P01447
$$ 838444 554366 572595 -67574 -184944 -693175 -485343 -282157 -182040 150812 852259
2020H52259N3254L61196n94925M74644k70159n56208j92247L3773K84015K81476
$$ 852259 905513 1266709 671784 1146428 876269 320061 127814 161587 445602 727078
2010G27078K72866m82169K9264p21143O17763k17091O44858k44499J96452p17955
$$ 727078 999944 517775 547039 -174104 443659 226568 871426 626927 823379 105424
2000A05424k26104m54337R15852k44526J085829k35176p37898l26086L55743o42596
$$ 105424 -120680 -575017 340835 96309 1182138 946962 209064 -117022 238721 -403875
1990d03875j90024M59883N87261N03451r9106K47168o49685j39335o8547j6217
$$ -403875 -593899 -134016 453245 956696 857590 1104758 455073 315738 247191 230974
1980B30974q4501j45097J03419O53170l5735l15033r7557L81671m75j88529m60037
$$ 230974 146473 1376 104795 757965 722230 407197 309640 691311 690836 502307 42270
1969D2270P93699l60084K30835J04167L59008J91439m22982l23480M19512l68278
$$ 42270 835969 475885 706720 810887 1169895 1361334 938352 614872 1034384 666106
1959F66106j29055m5063j82147j069889j06061O56580N34202P82201M60908J2463
$$ 666106 537051 491988 309841 -760048 -866109 -209529 324673 1106874 1567782 1580245
1949A580245j113694r24462l18357J159443L21579Q26818p11900l88765q50146
$$ 1580245 466551 -457911 -776268 383175 704754 1531572 819672 430907 -419239
1940d19239o55361R07563Q33624K88863K62514q83717j177256J88040k45615M76573
$$ -419239 -1074600 -167037 666587 955450 1217964 334247 -843009 -654969 -900584 -424011
1930d24011l60382K75891l32850J44812l42018M14167l15166K93934m82540Q2607
$$ -424011 -784393 -508502 -841352 -696540 -1038558 -624391 -939557 -645623 -1128163 -1045556
1920a045556L20691J176692L78475m0455J25611n50881k39911j98434K19943J008950
$$ -1045556 -724865 451827 830302 789847 915458 364577 124666 -73768 146175 1155125
1910A155125q2096j64260m82161o02842n54273O930J88296K27428K79808J60157
$$ 1155125 1073029 908769 426608 -176234 -730507 -723577 -535281 -307853 -28045 132112
1900A32112l48029L2830Q8210l72490j87589N7869M82859K62319J670j99501j71425
$$ 132112 -215917 -183087 -94877 -467367 -654956 -597087 -114228 148091 149761 -49740 -221165
1889b21165o26533K3810M00705L51786R22271K0483j76828o24931j62851p4592
$$ -221165 -847698 -823888 -423183 -71397 850874 871357 694529 69598 -93253 -167845
1879a67845k07456O91006Q03569k32919J109j18557K65154l68097M64789J24118
$$ -167845 -375301 315705 1119274 886355 887464 768907 1034061 665964 1130753 1254871
1869A254871p19407N3139n25892O56027l22577K07168M81060K69538o27465l81714
$$ 1254871 535464 588603 62711 718738 396161 603329 1084389 1353927 726462 344748
1859C44748k37669N63337l86249j68987R76288m44759j5692l7990k3832j14096
$$ 344748 107079 670416 284167 115180 1091468 646709 631017 593027 569195 455099
1849D55099K86127k34844j36639m87703q4014L5115o22596R1080p30488J33855
$$ 455099 741226 506382 369743 -117960 -201974 -166859 -789455 -698375 -1428863 -1295008
1839a295008O664Q07173J77635R06421p40468m15271p9996R474n33116J96585
$$ -1295008 -1288344 -481171 -303536 602885 -137583 -552854 -632850 -623376 -1156492 -959907
1829i59907K96008K63758l5700l06540L40036O66134L81411J10091m1975p485
$$ -959907 -663899 -400141 -435841 -742381 -402345 263789 645200 755291 713316 705831
1819G05831J42031l07398O3088k70366n53357N18828K27334P34139R71359m07175
$$ 705831 847862 540464 603552 333186 -220171 298657 525991 1260130 2231489 1824314
1809A824314o75762M7130n04921m41285n21490O8924P7748K41183O45970N8012
$$ 1824314 1148552 1195682 690761 249476 -272014 -203090 -125342 115841 761811 819823
1799H19823l58778O56900l77447k27298j05776J47420l0727l61020N261k031l3388
$$ 819823 461045 1117945 740498 513200 407424 554844 524117 163097 168358 166327 132939
1788A32939j67779Q7452j01680k09511K46954p67740M4631l53554N40593M11343
$$ 132939 -34840 52612 -49068 -258579 -11625 -779365 -734734 -1088288 -547695 -136352
1778a36352L77831K3643j84044j5392n29020k8157M01958R6009k58527q9551m30351
$$ -136352 241479 265122 81078 65686 -463334 -491491 -89533 6476 -252051 -341602 -771953
1767g71953J339084j89690Q2710n90705K62361n04706j08904j71994O19674N4721
$$ -771953 567131 377441 460151 -130554 131807 -372899 -481803 -653797 -34123 20598
1757B0598J13510L08345m32720j01295l39015k85586M22524N7126N69263N04343
$$ 20598 134108 442453 9733 -91562 -430577 -716163 -293639 -236513 332750 837093
1747H37093m76436m17477n21969j24977n9212L62178M88227m94890j52967n34884
$$ 837093 360657 -56820 -578789 -703766 -762978 -400800 87427 -407463 -560430 -1095314
1737a095314R1542j0960N41808N58940O7823j87394K05066J37281J12625m95100
$$ -1095314 -1003772 -1014732 -472924 86016 153839 -33555 171511 308792 421417 -73683
1727g3683m13539m45134K69997M81333J002956P0408k01430k50082n00515L93096
$$ -73683 -487222 -932356 -662359 -181026 821930 892338 690908 440826 -59689 333407
1717C33407R1997K61253N58340o76952n49202q21971K42729J035N48214J195813
$$ 333407 425404 686657 1244997 568045 18843 -803128 -560399 -559364 -11150 1184663
1707A184663M89521q38203p05825j52084n55161L3631m42097Q23232O24118L53725
$$ 1184663 1674184 835981 130156 -21928 -577089 -543458 -985555 -162323 461795 815520
1697H15520k92759k98012m51495k90614n64221J21045O37987L16334K93808l34678
$$ 815520 522761 224749 -226746 -517360 -1081581 -960536 -322549 -6215 287593 -47085
1687d7085r74193n2126N72209O39153Q04454M59160m77943n06216l37422O9858
$$ -47085 -1021278 -1073404 -501195 137958 942412 1401572 923629 417413 79991 149849
1677A49849m1584J02058J67186Q4956m2636K80340k67584L63596J9892j12849
$$ 149849 108265 210323 377509 462465 419829 700169 432585 796181 816073 703224
1667G03224J19207r72644j11791M26340k64353j93777L78841j69553M6401j41496
$$ 703224 822431 -150213 -262004 164336 -100017 -293794 85047 -84506 -38105 -179601
1657a79601j19781O99425L03902m78644R9770L44843o04333l80707M8957N12220
$$ -179601 -299382 400043 703945 225301 325071 669914 65581 -315126 -266169 246051
1647B46051m47562J76192k07709J93972J88747L51364j40815k31287m59508J95594
$$ 246051 -201511 -25319 -233028 -39056 149691 501055 360240 128953 -330555 -134961
1637a34961j37471k71524m51197j30266J126717j36284J88141M28982Q62659o34622
$$ -134961 -272432 -543956 -995153 -1125419 1298 -134986 53155 482137 1344796 710174
1627G10174n05680m59974M21357J75608J25939J90486J70957m0224o72130n4592
$$ 710174 204494 -255480 165877 341485 467424 657910 828867 788643 116513 61921
1617F1921L11819j11065m63980P047r8192J71009J54858R08531K56374r6859r02910
$$ 61921 373740 262675 -201305 -194258 -292450 -121441 33417 941948 1198322 1101463 198553
1606A98553m89192l50116Q5990K13606L5514P19770m78857o43667K97507K40L62504
$$ 198553 -290639 -640755 -554765 -341159 -305645 414125 -64732 -708399 -410892 -410652 -48148
1595d8148L40613j42215l08133K36844Q63302j95736K80191n37698J26581k6860
$$ -48148 292465 150250 -157883 78961 942263 746527 1026718 489020 615601 588741
1585E88741n06749J50994j3469P06635J03799K82954r21362o4127j02038O1426
$$ 588741 81992 232986 219517 926152 1029951 1312905 391543 327416 225378 286804
1575B86804L71738j51102l49004o95503J52741J62729l4459M5836K92646m33529
$$ 286804 658542 507440 158436 -537067 -384326 -221597 -256056 -210220 82426 -351103
1565c51103o23347k81505N44287N01844M24207q1304k30132j24257l6859n47622
$$ -351103 -974450 -1255955 -711668 -209824 214383 133079 -97053 -221310 -258169 -805791
1555h05791N12922l47590j65011l11419O07704M37210L21706J40222m2058k74503
$$ -805791 -292869 -640459 -805470 -1116889 -509185 -71975 249731 389953 347895 73392
1545G3392l26224K1086l87293R81065R6681R15438R9244n57001p59202J4104m49285
$$ 73392 -252832 -231746 -619039 362026 458707 1374145 1473389 916388 157186 171290 -277995
1534b77995n41287l03307L13562M80466N85197n94331O6512l89321k21251L26410
$$ -277995 -819282 -1122589 -809027 -328561 256636 -337695 -271183 -660504 -881755 -555345
1524e55345M33007N23097J42848J9506o21317J26280r28567K06139k82100J82210
$$ -555345 -122338 400759 543607 563113 -58204 68076 -860491 -654352 -936452 -754242
1514g54242L61427N7579l3550K73774M0681P20118j87907l99406l90128l21248
$$ -754242 -392815 -335236 -368786 -95012 -54331 665787 477880 78474 -311654 -632902
1504f32902J41383k2800O76874P02246K09238r0280n06079j76250p02408r6141
$$ -632902 -491519 -514319 162555 864801 1074039 983759 477680 301430 -400978 -497119
1494d97119J85307j7488K10354M218o39509l13780K34671J29534K57908K55224
$$ -497119 -311812 -329300 -118946 -114728 -754237 -1068017 -833346 -703812 -445904 -190680
1484a90680j25561o14957K27038l569n23546J58134K89056k49570J141175M6210
$$ -190680 -316241 -931198 -704160 -707729 -1231275 -1073141 -784085 -1033655 107520 153730
1474A53730j67500l70779k46305J85597K05422r9335j93879l76506l77370L22850
$$ 153730 -13770 -384549 -630854 -445257 -239835 -339170 -533049 -909555 -1286925 -964075
1464i64075P75442R6424Q6588K25821k40968l31761q4790P64695K75804j90781
$$ -964075 -188633 -92209 -5621 220200 -20768 -352529 -437319 327376 603180 412399
$$ [...]
##END NTUPLES=NMR SPECTRUM
##END=
