##TITLE=1H_EC-3370(33)
 200.13MHz,DMSO.
 8 sc
 
 15.1.2026
##JCAMPDX= 6.0         $$ Bruker NMR JCAMP-DX V2.0
##DATA TYPE= NMR SPECTRUM
##DATA CLASS= NTUPLES
##ORIGIN= UXNMR, Bruker Analytische Messtechnik GmbH
##OWNER= pz
$$ XWIN-NMR		Version 3.5
$$ Thu Jan 15 13:30:28 2026 Russian Standard Time (UT+4h)  she@DPX200
##.OBSERVE FREQUENCY= 200.1313
##.OBSERVE NUCLEUS= ^1H
##.ACQUISITION MODE= SIMULTANEOUS
##.ACQUISITION SCHEME= undefined
##.AVERAGES= 8
##.DIGITISER RES= 18
##SPECTROMETER/DATA SYSTEM= spect
##.PULSE SEQUENCE= zg30
##.SOLVENT NAME= CDCl3
##.SHIFT REFERENCE= (INTERNAL, CDCl3, 0, 15.6543)
##AUDIT TRAIL= $$ (NUMBER, WHEN, WHO, WHERE, WHAT)
$$ ##TITLE= Audit trail, XWIN-NMR		Version 3.5
$$ ##JCAMPDX= 5.01
$$ ##ORIGIN= Bruker BioSpin GmbH
$$ ##OWNER= she
$$ F:/spectra/data/she/nmr/H-C/1/pdata/1/auditp.txt
$$ ##AUDIT TRAIL=  $$ (NUMBER, WHEN, WHO, WHERE, WHAT)
(   1,<2026-01-15 13:29:14.50 +0400>,<she>,<DPX200>,
      <created by zg, POWCHK disabled, PULCHK disabled
       configuration hash MD5:
       00 E9 B6 7A A2 85 ED C7 34 08 36 98 17 FE 4E 26
       data hash MD5: 16K
       EA BB 84 4E 8B 97 59 C1 A0 04 B6 E9 E4 18 AC 77>)
(   2,<2026-01-15 13:29:17.07 +0400>,<she>,<DPX200>,
      <Start of raw data processing
       efp BC_mod = 2 LB = 0.25 FT_mod = 6 PKNL = 1 PHC0 = -3859.777 PHC1 = 9.592306 SI = 16K 
       data hash MD5: 16K
       3C 9C EA 74 58 F4 20 71 95 C4 0A C8 C7 4B 8E 21>)
(   3,<2026-01-15 13:29:37.43 +0400>,<she>,<DPX200>,
      <pk PHC0 = 154.6415 PHC1 = 5.4 
       data hash MD5: 16K
       29 DA 85 71 59 D0 FA 16 EC 8C 7E 0F 3E 8D 65 E5>)
(   4,<2026-01-15 13:29:43.84 +0400>,<she>,<DPX200>,
      <abs ABSG = 5 
       data hash MD5: 16K
       CE EB 22 AF 9E 03 ED F3 E5 E9 B7 A8 0A 5B BD 26>)
$$ ##END=
$$ 
$$ hash MD5
$$ 9D DC D4 B5 59 23 D5 08 73 EF BE F5 28 72 AB 3F
##$RELAX= 
##$RELAX= 
##$RELAX= 
##$RELAX= 
##$RELAX= 
##$RELAX= 
$$ Bruker specific parameters
$$ --------------------------
##$DU= <F:/spectra>
##$EXPNO= 1
##$NAME= <H-C>
##$PROCNO= 1
##$TYPE= <nmr>
##$USER= <she>
##$AMP= (0..31)
100 100 100 100 100 100 100 100 100 100 100 100 100 100 100 100 100 100 
100 100 100 100 100 100 100 100 100 100 100 100 100 100 
##$AQSEQ= 0
##$AQ_mod= 1
##$AUNM= <au_zg>
##$AUTOPOS= <>
##$BF1= 200.13
##$BF2= 200.13
##$BF3= 200.13
##$BF4= 200.13
##$BF5= 200.13
##$BF6= 200.13
##$BF7= 200.13
##$BF8= 200.13
##$BYTORDA= 1
##$CFDGTYP= 0
##$CFRGTYP= 5
##$CHEMSTR= <none>
##$CNST= (0..31)
1 1 145 1 1 1 1 1 1 1 1 1 1 1 1 1 1 1 1 1 1 1 1 1 1 1 1 1 1 1 1 1 
##$CPDPRG= <>
##$CPDPRG1= <>
##$CPDPRG2= <>
##$CPDPRG3= <>
##$CPDPRG4= <mlev>
##$CPDPRG5= <mlev>
##$CPDPRG6= <mlev>
##$CPDPRG7= <mlev>
##$CPDPRG8= <mlev>
##$CPDPRGB= <>
##$CPDPRGT= <>
##$D= (0..31)
0 0.7 0 0 0 0 0 0 0 0 0 0.03 0 0 0 0 0 0 0 0 0 0 0 0 0 0 0 0 0 0 0 0 
##$DATE= 1768469354
##$DBL= (0..7)
120 120 120 120 120 120 120 120 
##$DBP= (0..7)
150 150 150 150 150 150 150 150 
##$DBP07= 0
##$DBPNAM0= <>
##$DBPNAM1= <>
##$DBPNAM2= <>
##$DBPNAM3= <>
##$DBPNAM4= <>
$$ [...]
##$SUBNAM3= <"">
##$SUBNAM4= <"">
##$SUBNAM5= <"">
##$SUBNAM6= <"">
##$SUBNAM7= <"">
##$SUBNAM8= <"">
##$SUBNAM9= <"">
##$SW= 18.0517328524113
##$SWIBOX= (0..15)
0 0 2 0 0 0 0 0 0 0 0 0 0 0 0 0 
##$SW_h= 3612.71676300578
##$TD= 16384
##$TD0= 1
##$TE= 0
##$TE2= 300
##$TE3= 300
##$TEG= 300
##$TL= (0..7)
0 120 120 120 120 120 120 120 
##$TP= (0..7)
150 150 150 150 150 150 150 150 
##$TP07= 0
##$TPNAME0= <>
##$TPNAME1= <>
##$TPNAME2= <>
##$TPNAME3= <>
##$TPNAME4= <>
##$TPNAME5= <>
##$TPNAME6= <>
##$TPNAME7= <>
##$TPOAL= (0..7)
0.5 0.5 0.5 0.5 0.5 0.5 0.5 0.5 
##$TPOFFS= (0..7)
0 0 0 0 0 0 0 0 
##$TUNHIN= 0
##$TUNHOUT= 0
##$TUNXOUT= 0
##$USERA1= <user>
##$USERA2= <user>
##$USERA3= <user>
##$USERA4= <user>
##$USERA5= <user>
##$V9= 5
##$VALIST= <valist>
##$VCLIST= <CCCCCCCCCCCCCCC>
##$VD= 0
##$VDLIST= <DDDDDDDDDDDDDDD>
##$VPLIST= <PPPPPPPPPPPPPPP>
##$VTLIST= <TTTTTTTTTTTTTTT>
##$WBST= 1024
##$WBSW= 4
##$XGAIN= (0..3)
0 0 0 0 
##$XL= 0
##$YL= 0
##$YMAX_a= 202300
##$YMIN_a= -236490
##$ZGOPTNS= <>
##$ZL1= 120
##$ZL2= 120
##$ZL3= 120
##$ZL4= 120
##$ABSF1= 15.65434
##$ABSF2= -2.397513
##$ABSG= 5
##$ABSL= 3
##$ALPHA= 0
##$AQORDER= 0
##$ASSFAC= 0
##$ASSFACI= 0
##$ASSFACX= 0
##$ASSWID= 0
##$AUNMP= <proc_1d>
##$AZFE= 0.1
##$AZFW= 0.1
##$BCFW= 0
##$BC_mod= 2
##$BYTORDP= 0
##$COROFFS= 0
##$CY= -3
##$DATMOD= 1
##$DC= 0
##$DFILT= <>
##$DTYPP= 0
##$F1P= 0
##$F2P= 0
##$FCOR= 1
##$FTSIZE= 16384
##$FT_mod= 6
##$GAMMA= 0
##$GB= 0
##$INTBC= 1
##$INTSCL= 3.241238e-09
##$ISEN= 128
##$LB= 0.25
##$LEV0= 0
##$LPBIN= 0
##$MAXI= 10000
##$MC2= 0
##$MEAN= 0
##$ME_mod= 0
##$MI= 1.114404
##$NCOEF= 0
##$NC_proc= -7
##$NLEV= 6
##$NOISF1= 3.799351
##$NOISF2= 2.8
##$NSP= 0
##$NTH_PI= 0
##$NZP= 0
##$OFFSET= 15.65434
##$PC= 1
##$PHC0= -3705.135
##$PHC1= 14.99231
##$PH_mod= 1
##$PKNL= yes
##$PPARMOD= 0
##$PSCAL= 0
##$PSIGN= 0
##$REVERSE= no
##$SF= 200.129973455222
##$SI= 16384
##$SIGF1= 3
##$SIGF2= 2
##$SINO= 0.751879
##$SIOLD= 32768
##$SREGLST= <19F.Aceton>
##$SSB= 0
##$STSI= 16384
##$STSR= 0
##$SW_p= 3612.71676300578
##$SYMM= 0
##$S_DEV= 0
##$TDeff= 16384
##$TDoff= 0
##$TI= <>
##$TILT= no
##$TM1= 0
##$TM2= 0
##$TOPLEV= 0
##$USERP1= <user>
##$USERP2= <user>
##$USERP3= <user>
##$USERP4= <user>
##$USERP5= <user>
##$WDW= 1
##$XDIM= 16384
##$YMAX_p= 399696539
##$YMIN_p= -724510
$$ End of Bruker specific parameters
$$ ---------------------------------
##NTUPLES= NMR SPECTRUM
##VAR_NAME=  FREQUENCY,     SPECTRUM/REAL,   SPECTRUM/IMAG
##SYMBOL=    X,             R,               I
##VAR_TYPE=  INDEPENDENT,   DEPENDENT,       DEPENDENT
##VAR_FORM=  AFFN,          ASDF,            ASDF
##VAR_DIM=   16384,         16384,           16384
##UNITS=     HZ,            ARBITRARY UNITS, ARBITRARY UNITS
##FACTOR=    0.220516191357247, 1,           1
##FIRST=     3132.90260670062, 0,            0
##LAST=      -479.814156305162, 0,           0
##MIN=       -479.814156305162, -724510,     0
##MAX=       3132.90260670062, 399696539,    0
$$ Real data points
##PAGE= N=1
##DATA TABLE= (X++(R..R)), XYDATA
$$ [...]
8482D21773O5608k39336k06733q0222J85690L55363k20188R8840J30634k47028
8472B64401K7463L5006j01751J45746j63743L5259J46076j64869p2536K02615
8462C53667L12034n8547m62208j045r250k91544J3145p288L47064K70957j01232
8451C65753J02220k28316k32086R6417q0926o6972K15755j3081j6146J99135J3534
8440C55287k56138P8109q1275O4515o3496P8960N8464n5509k87728j95294J19576
8429a84529M8841J55997k7212J91458r9154l84828J47189L3824j29396j49326
8419c97136K78893Q9836n5858K794J06638m8262j14841J14487O1610M438R3549
8408A36148k0248j86017M0018J44168l9774q3634J2860P592K49956l7810r8438
$$ y = [421773, 487381, 248045, 41312, -38910, 146780, 502143, 281955, 380795, 511429, 264401, 291864, 326870, 225119, 370865, 207122, 242381, 388457, 223588, 151052, 353667, 665701, 607154, 144946, 143901, 134651, -156893, -143748, -151036, 196028, 466985, 365753, 467973, 239657, 7571, 103988, 23062, -43910, 171845, 158764, 142618, 341753, 355287, 99149, 177258, 95983, 160498, 97002, 175962, 234426, 178917, -108811, -304105, -184529, -135688, 20309, -6903, 184555, 85401, -299427, -152238, -118414, -247810, -397136, -118243, -28407, -84265, -81471, 25167, -23095, -137936, -23449, 38161, 42599, 136148, 115900, -70117, -30099, 114069, 74295, -9339, 3521, 11113, 261069, 223259, 124821]
8397A24821k4132N1803n4732M4187m6710J39402k4349l38695L8784J02253k8710
8386a6078J14841q9718J10778J49436j11682j4838L3028j15322r4599k26276J27579
8375a32851J88327j07369j16308R4056r6235J48187O1727j425l3750J00898P7334
8364A82591Q0611k87088r6392R7450r4038K00720j42670p9775K55248J3673k54257
8353a23927n5728n5629m3611J68873K8202r2955J61192J10801p2964j8246L21879
8342C27887j04550m9331k73023J683L65465K5116l27494k4408o1767J8759N2364
8331d9299k12796Q5796K23856O342k77294p336J49659J5899q2799o7882j8950
8320b34804k499r3504J35949n6096K02406k04493n2423K92094l8872n3796j87163
$$ y = [124821, 100689, 152492, 97760, 141947, 95237, 234639, 210290, -128405, -89621, 12632, -16078, 98763, 9045, 119823, 269259, 157577, 142739, 175767, 60445, -34154, -260430, -132851, 55476, -51893, -168201, -74145, -170380, -22193, 39534, 38109, 4359, 105257, 182591, 263202, -23886, -120278, -22828, -116866, 83854, -58816, -138591, 116657, 130330, -123927, -179655, -235284, -278895, -110022, -81820, -174775, -13583, 97218, 24254, 6008, 327887, 223337, 174006, -99017, -97334, 268131, 293247, -34247, -58655, -120422, -101663, -49299, -262095, -176299, 47557, 53899, -223395, -230731, -81072, -65173, -147972, -215854, -234804, -237303, -330807, -194858, -250954, -48548, -253041, -305464, -13370, -52242, -106038, -293201]
8309b93201p2382N0168K36159N4127j9131m5716J97907L30229l28164k61685j82137
8298c33826J66463l1725O6301q3387j6293n5297J4824j42850J26050L71250l79635
8287b98125K19128P0001J39499j05756l81145j07629K74270p583m3149N7110J68803
8276a4576l2763o4788K6779j35942J15076J23078n5080k32603j54049J847J26112
8265b96909K9554O4875K16229j11809k25196O7565K79241K29943k9383k20587
8255C523j47925Q4988J51734m503l9672j9777k24204R0600J86589j58966k21438
8244b99051J24341K6901K4409R5738j06674k9872o4772M3238k4489J40210j69093
8233b39114J11762K53440j35545k71187r7361K07356j6429n0855L820J19928K63708
$$ y = [-293201, -365583, -315415, -79256, -25129, -44260, -89976, 107931, 438160, 109996, -151689, -333826, -167363, -199088, -132787, -216174, -232467, -287764, -272940, -415790, -289740, 81510, -298125, -78997, -8996, 130503, 24747, -356398, -464027, -189757, -197340, -240489, -183379, -14576, -47339, -112127, -85348, -221290, -106214, 16864, -38216, -270819, -424868, -423021, -296909, -267355, -202480, 13749, -98060, -323256, -255691, 23550, 253493, 224110, 3523, -144402, -59414, 92320, 87817, 48145, 28368, -195836, -105236, 81353, -77613, -299051, -174710, -147809, -123400, -27662, -134336, -164208, -228980, -185742, -210231, -70021, -239114, -127352, 126088, -9457, -280644, -378005, -170649, -187078, -237933, -234113, -114185, 149523]
8222A49523n5362o4111k71956l30704k0815K34278J24160L27706P6140j68876
8212a7j18381q4898J38543J21127m4644n1873j38741k08089J05522J58568K2217
8201a00666N1107p6854J79350J09763k35285l5292j75167k43010j71073J022221
8191C25094K82166m26697J32242j65772l06472J73611Q0107R736k64405L1100
8181a29290K9313J3603j74246J63191K15880k11724L7043r6229j05027q3680J01173
8170b39993J22581L15528p065k65718L3972j02669J1155J43046j19841k8974k32956
8159c70934j15635J34015j7951K31867J05753O6285Q9804m96238K25299N2331
8149i5404j83932j13466P5916R875J09188K09664l00538l8319K70106j7498r2769
$$ y = [149523, 94161, 30050, -241906, -572610, -593425, -359147, -234987, 92719, 168859, -17, -118398, -203296, -64753, 56374, 11730, -40143, -178884, -386973, -281451, -122883, -100666, -49559, -126413, 52937, 162700, -72585, -107877, -283044, -526054, -697127, 325094, 607260, 180563, 312805, 147033, -159439, 14172, 94279, 104015, -160390, -129290, -99977, -86374, -260620, -97429, 118451, -93273, -56230, -152459, -257486, -341166, -239993, -117412, 198116, 191051, -74667, -40695, -143364, -132209, 10837, -109004, -137978, -370934, -486569, -352554, -370505, -138638, -32885, 33400, 123204, -373034, -147735, -95404, -279336, -392802, -316886, -307011, -197823, 11841, -288697, -327016, -56910, -74408, -167177]
8138a67177j33509J61768J54043J78929n9517j4575O1994k67625j29289o136K64812
8127D3718l11628l0474K47191P861Q5368n0011L3717P3884N7334j60683l8618
8116d2341K07251l9325j84961q9977n1073k17422J58125n9402K28155J06867n5166
8105c9269J0217K7073j07585r9772J1203J9235k1573R9243J44208j58022K01725
8094H6683J83769L7624j89519N2733j29375o6229k2452m8804o7419J34608J78804
8083A50423j78640r86K46480k82316j41778p5643l1977O3353p836j8110J07554
8072a69476j92330M8827O9612J99317L90226k64071L5599O191k7051j83955J29640
8061D2529l2265l31672J38051l902L25907J86979p9684Q0641m99788L4035p2244
$$ y = [-167177, -300686, -138918, 15125, 194054, 134537, 119962, 181956, -85669, -214958, -221094, 43718, -267910, -298384, -51193, -43332, 42036, -7975, 25742, 99626, 156960, -3723, -42341, 164910, 125585, -59376, -149353, -200426, -417848, -259723, -319125, -90970, 15897, -39269, -29052, -1979, -109564, -209336, -198133, -178898, -200471, -101228, 42980, -115042, 86683, 270452, 308076, 118557, 171290, 41915, -24314, -46766, -95570, -162989, -28381, 150423, -28217, -29203, 217277, -65039, -206817, -282460, -314437, -251084, -258920, -277030, -169476, -361806, -312979, -243367, -44050, 346176, 82105, 117704, 123895, 96844, -87111, 42529, 10264, -321408, -183357, -187259, 138648, 325627, 245943, 326584, -173204, -139169, -211413]
8050b11413p9321R3890K2176k56490L6906K49121j50540p2213J06713m916O1756
8039b04331n2467L22650L1384k88060j25586k1240K36826P5079j83282k30099
8029d39126J32336P6566j47796K25632J21131l4981j55460o8777j7615J40338
8019a67752R7443n7045p3787M6929k92799K67615J72743n6601J089l46996J08996
8008c00165j991k694J11802j81414J27297J92239j93953k7438k00428M49641J22536
7997I5432r1148j35353l5923q488J2590M032P4436j84930j7610N0130R6553J32001
7985h278K9293m5802Q7079k45501M1547K07714R2809P6517k9483m7128j42264
7974A6503k65809j39832J42503o83J08054N5243R0271j24799k09037J75090L1105
$$ y = [-211413, -290734, -196844, -174668, -431158, -394252, -145131, -295671, -367884, -261171, -266087, -204331, -256798, 65852, 97236, -190824, -316410, -337650, -100824, -25745, -209027, -439126, -306790, -230224, -378020, -152388, -31257, -66238, -221698, -290475, -308090, -167752, -70309, -127354, -201141, -154212, -447011, -179396, -6653, -63254, -62165, -409161, -300165, -302156, -304850, -193048, -374462, -247165, -54926, -248879, -276317, -476745, -27104, 95432, 4284, -131069, -166992, -175480, -162890, -158858, -84422, -269352, -286962, -236832, -140279, -8278, 21015, -24787, 62292, -183209, -141662, 66052, 158861, 235378, 205895, 158767, 16503, -249306, -389138, -246635, -247318, -139264, -84021, 6250, -118549, -327586, -152496, -121391]
7963a21391M7173k04019j29818L24683P627Q3901k9121Q390m8693j47544J80991
7952b7821Q5537J3858M1366o5060J29088p4098l27634j71722L82990j73689M8298
7941a38887k25613Q3229J23043J8327J17201J12302J48264m28150l85848L40443
7931b35689K55078j20606j56913n8087K29649N3338o7216o7818m6802J29572R506
7920g5988O0385J74196L5067j18840j99184J91434j82730K4285J76042k97461
7910b12794j50357J99628j2182Q3061l67113K59744o7480J13225n6421j09318
7900c20007L3706q7460Q5657K23482K28937m8367j73581J26896m1227j35353J60951
7889E3634k73387Q4852Q4279l43996J76697o7915N0989K26893K546L3255k01447
$$ y = [-121391, -74218, -278237, -408055, -83372, -75745, 8156, -20965, -12575, -61268, -208812, -27821, 57716, 71574, 112940, 47880, 176968, 102870, -224764, -396486, -13496, -187185, -138887, -364500, -281271, -158228, -139901, -22700, 89602, 237866, -190284, -576132, -235689, 19389, -101217, -258130, -316217, -86568, -33230, -100446, -168264, -215066, -85494, -75988, -15603, 158593, 193660, 74820, -124364, 67070, -115660, -91375, 84667, -212794, -363151, -163523, -175705, -92644, -459757, -200013, -267493, -154268, -210689, -320007, -286301, -373761, -288104, -64622, 164315, 115948, -57633, 69263, 28036, -107317, 53634, -219753, -134901, -50622, -394618, -217921, -285836, -234847, -7954, -5408, 27847, -173600]
7878a73600k8394R0614o2375P5544j00042n4680N5866j9720K0985R8592N4215
7867d2995K11656J33099j40559k00983M0613L6769o6715J71444j88474K309Q2438
7856C8602Q9788j07253j8065J17011p2769k21580P9464j34075L8196J53496J36892
7845I9707j54353J51233K3611Q0818j83320K01495r0619m7427k53092K19109j0373
7834C6789K66724j50079l07013J74318n6208K10380j58281L6946O5527m8450m3760
7823B6893P5334j76384R8918J23660j2980l31012j8847n2105l8329j51028L14858
7812a41022L17755k5324n9932j37158j0691m93052P098J249929J24303o71956
7802A59950k1648J28803J33796N6311j55494k404J17132J21228q2732l88295R399
$$ y = [-173600, -201994, -111380, -173755, -98211, -198253, -252933, -197067, -216787, -195802, -97210, -42995, 168661, 301760, 161201, -39782, 831, 37600, -29115, 142329, -46145, -43836, 38602, 128390, 21137, 3072, 120083, 47314, -174266, -94802, -228877, -190681, -37185, 99707, -54646, 96587, 120198, 201016, 17696, 219191, 128572, 81145, -171947, 47162, 36789, 303513, 153434, -153579, 20739, -35469, 174911, 16630, 53576, 119103, 70653, 26893, 102227, -74157, 24761, 148421, 135441, -195571, -214418, -266523, -304852, -455880, -141022, 176733, 151409, 91477, -45681, -56372, -549424, -542326, 707603, 831906, 159950, 138302, 267105, 400901, 457212, 301718, 299314, 416446, 537674, 454942, 66647, 76046]
7791G6046J26381J99914j44986k01826K82123k04292j74556K1846j79243L5971
7781a62622K31727k9250l5711o9027K88475n2782j25749J05038j31110P549J13728
7770A40266K5594l58966L4359P5218J88216n014j93861K6547J63185n2950j01415
7759e8821m0704M8152K5141Q4819J18536j72363j32194R4354o7935j93113M4298
7748b49830m5791L27433R8165m04800R7265o635p3415J64925J28289j43009P4196
7737c3207m5447O8779k10720l8932K94333L7064P3036j32624M059q5991N9892
7726i758o6887K82128N0661j20308j32933J46013o1525n9595m2059J14136r6622
7715C251k20128q2291J39523J97449J08209j78640j3292L33359L071j25971K19600
$$ y = [76046, 202427, 402341, 257355, 55529, 337652, 133360, -41196, -19350, -198593, -162622, 69105, 39855, 4144, -64883, 223592, 170810, 45061, 150099, 18989, 26538, 140266, 165860, -193106, -158747, -83529, 104687, 99673, -94188, -67641, 95544, 42594, -58821, -99525, -51373, -26232, 58587, 177123, 4760, -127434, -33080, -101015, -294128, -249830, -295621, 31812, 129977, -274823, -177558, -184193, -257608, -92683, 35606, -107403, -33207, -78654, -9875, -220595, -259527, 34806, 71870, 144906, 12282, 16341, -69650, -9758, -76645, 205483, 256144, 135836, 2903, 148916, 87391, 27796, -14263, 99873, 3251, -216877, -299168, -159645, 37804, 146013, -32627, -45919, 287440, 290511, 164540, 384140]
7704C84140n50770k5432J47379j02405J17548J09528J1136l05099q4311L777N6946
7693b37563J63838n6338R497K44330k0323J0010j68228P5511j62477q4480L5469
7682a90754j44694K28589K09307j98329k05071K80398k21860K02867J33012j02873
7672i408J33109R4171k01708q5647J90013j26710M9303j62281R0081L08130m3730
7661B35323p6528k64027J88007j41240m22669J40469J41882L25239q6821J40474
7651A80109p9622N9191o8570m6694j45488J77462J47752J14078J22872k69009
7641A92081j8213j58353P2120J6245j98219J80822o0013N9309j32318K86721J03857
7630C44039m3104p2464l07656j87579K46023L18821J900j18988R9668N86j11989
$$ y = [384140, -166630, -192062, -44683, -147088, -29540, 79988, 91124, -213975, -298286, -294509, -237563, -73725, -130063, -120566, 123764, 103441, 113451, -54777, 20734, -141743, -226223, -190754, -335448, -106859, 102448, -95881, -300952, -20554, -242414, -39547, 93465, -9408, 123701, 217872, 16164, -69483, 120530, -6180, 43123, -119158, -29077, 279053, 235323, 158795, -105232, 82775, -58465, -481134, -340665, -198783, 126456, 39635, 180109, 100487, 159678, 91108, 44414, -101074, 76388, 224140, 338218, 461090, 192081, 173868, 15515, 87635, 103880, -94339, 86483, 26470, 85779, -46539, 240182, 344039, 300935, 228471, -79185, -266764, -20741, 298080, 299980, 180992, 280660, 281246, 169257]
7619A69257M6691l7035l4638L8824j54638K03967J58137j59949k97482J2215J68986
7608A14335J70062k04379j01769o7864J8828J94189J0910l4781q5490r7519K9104
7597e4374o059p6223K35082J18541l41398R2725K41161J21172L6585k53740P2836
7586A86308N3654k15863j2765k00082N1838K20994j02227K38312J09080j54118
7576A75131j4190p7624k74056L21692J01527j06169n7062O0395J02291n7734n1278
7565A22923o0071l4354J37154j53397M8983O8961K43699J00355o7136M7586N3196
7554E07899j32795K73143q1713o5517K03732N8038r4564J83913l8424J48467M43102
7543A405281N05471K5957J3158J79682k21447l91339o238l14240j90600q50k22068
$$ y = [169257, 215948, 178913, 144275, 183099, 28461, 232428, 390565, 230616, -66866, -54651, 114335, 284397, 80018, -21751, -89615, -70787, 123402, 134312, 99531, 14041, -83478, -54374, -60433, -136656, 98426, 216967, -124431, -31706, 209455, 330627, 367212, 113472, 186308, 239962, 24099, 11334, -188748, -136910, 84084, -18143, 220169, 329249, 175131, 160941, 83317, -190739, 130953, 232480, 126311, 69249, 129644, 231935, 174201, 122923, 62852, 28498, 165652, 12255, 61238, 130199, 373898, 474253, 407117, 454703, 507899, 375104, 648247, 566534, 501017, 704749, 762787, 668223, 852136, 813712, 962179, 1405281, 1910752, 1936709, 1949867, 2129549, 1908102, 1516763, 1510525, 1196285, 1005685, 1004835, 782767]
7532G82767k46281k1870k5428j72693L1834j31866J0225J18501l892R1734k77581
7521A55450j2928R2441J33866j6782l5547N6989k51102J00997J87320M785k83945
7510A31544N4812k3071J37902K09273M79908k27834k64486n3654j5606N1951j10989
7499C69750j05537M7362l0319j62544L8796K35676N0143n7344J23945j41194j10437
7488B58297N9363j02885O8299K56578j27661j1891J90693J80523l48705j75861
7478B46750M13946r3619k73199J09095m8691k35904Q6922K14130K01250P9627
7468G00307j70346j24917O2358j12318J08314k03516J32845q3676j26608K32718
7458D15161l3640J48735j20126Q090o5421P0797j32515j90064M37857k09837m9885
$$ y = [782767, 536486, 514616, 489188, 316495, 348329, 216463, 226688, 345189, 341297, 433031, 155450, 142522, 234963, 368829, 352047, 316500, 373489, 122387, 223384, 410704, 415489, 131544, 186356, 163285, 301187, 510460, 990368, 762534, 498048, 444394, 428788, 480739, 369750, 264213, 311575, 281256, 118712, 157508, 393184, 443327, 385983, 509928, 368734, 258297, 317660, 214775, 283074, 539652, 411991, 400100, 590793, 771316, 422611, 246750, 660696, 567077, 293878, 402973, 354282, 118378, 205300, 419430, 620680, 700307, 529961, 405044, 467402, 355084, 463398, 259882, 392727, 309051, 182443, 415161, 381521, 530256, 410130, 418220, 352799, 423596, 291081, 101017, 538874, 329037, 279152]
7447B79152J14583j5317j65543P8887J44700l15047L19461J16343m0020R5565
7437F12764j42081l20181q002O391J18000L24837n5720j19767j11468R0884L3557
7426D29214K38656l43161J34430L47381L0420n3155j78012M5840j22689j49669
7416C79255m7523L79886O2549j22361k14621j9469p9019N0016K88746r4761r9075
7405D83623K1671k86121R5172K21563L7669P6586j11315k12607l13631M54475
7395D67085J0458j12729K00830j16483J31930J33543j10987j9461J28940N9509
7385G72635n9556r1941l935Q012P9965L454l9306k14618j08985J06544j83347
7374B68922q6320o4172Q3811j58249J53519J64160j93234p3076L8842Q3013O6313
$$ y = [279152, 393735, 378418, 212875, 291762, 436462, 121415, 440876, 557219, 517199, 612764, 470683, 150502, 142500, 148891, 266891, 591728, 536008, 416241, 304773, 395657, 429214, 667870, 324709, 459139, 806520, 836940, 783785, 605773, 651613, 528924, 379255, 331732, 711618, 774167, 651806, 437185, 417716, 338697, 388713, 677459, 582698, 483623, 505294, 219173, 314345, 535908, 573577, 650163, 538848, 326241, 12610, 467085, 477543, 364814, 565644, 449161, 581091, 714634, 603647, 584186, 713126, 772635, 713079, 621138, 617203, 625215, 705180, 708634, 669328, 454710, 345725, 452269, 268922, 182602, 118430, 202241, 43992, 197511, 361671, 168437, 95361, 134203, 217216, 283529]
7363B83529J34867m6697Q3072K56265k1421m42081j35340q0882M61835Q0394j39210
7352D34331R8279k00952o5732o080L15643j27500j2340J9906j91101J99092N90
7341D64136J88696o1393k78407L525J03775Q0810j60786m22698K56335r779K82454
7330D46668k37820l41092J57427Q5181J46791k5779O6246o3016j02233J03317
7320B35690k1625k05140k1547P1702Q418O7329M04834j16098j21683j52500K9104
7309A78484K272r4423J0670L0538j20337J49787J36259k21263J5070K43566l2663
7298B97960j6890m8908j01259k47719P1382m9018Q8603R7396k1865r9217j01049
7287a30584J75783j23344J85419J6650K5480j21105j09585L7112Q189k31139K46628
$$ y = [283529, 418396, 371699, 454771, 711036, 689615, 247534, 112194, 31312, 493147, 573541, 434331, 532610, 331658, 265926, 259846, 575489, 447989, 435649, 455555, 264454, 463546, 464136, 652832, 591439, 313032, 316557, 420332, 501142, 340356, -82342, 173993, 164214, 446668, 208848, -132244, 25183, 110364, 257155, 231376, 297622, 234606, 132373, 235690, 214065, 8925, -12622, 59080, 67498, 134827, 539661, 423563, 301880, 149380, 178484, 180756, 86333, 97003, 127541, 7204, 156991, 293250, 71987, 87057, 330623, 297960, 281070, 232162, 130903, -116816, -45434, -94452, -5849, 91547, 69682, -29535, -130584, 45199, -78145, 107274, 123924, 149404, 28299, -81286, -44174, -35985, -267124, -20496]
7276b0496L22759p2347k38094q3300k1389q7765J63654K33847J20396J47040o6491
7265C97814j08264q983J65100k66382j8110M6538k09952j01460m4498K70161J36307
7254B58271n2586j5162j79043j57944K51907J19401j5824q2212J19470K6582J3956
7243B86816m0605l26462J4600J47575R8493J22038j85974p0766K5476K25332R3260
7232C89783l00882K6652J20934j05618J83496j8591j71856k08758O4975k6097
7222d5962J1688N5239J12158J62454L937k51757M2510J97371k17606K27936j12847
7211A85121n9350M3898j34793J58591j92391n8626R9401J0432j04232K28663k49934
7200g3220l1868J60346j63963L1625o4269O3946L4823K19751j11656J11668l6538
$$ y = [-20496, 302263, 229916, -8178, -91478, -112867, -200632, -36978, 196869, 317265, 464305, 397814, 289550, 280567, 445667, 179285, 161175, 207713, -2239, -103699, -148197, 121964, 258271, 205685, 190523, 11480, -146464, 105443, 224844, 209020, 126808, 246278, 272860, 286816, 246211, -80251, -65651, 81924, 180417, 302455, 116481, 45715, 71191, 296523, 389783, 88901, 115553, 236487, 130869, 314365, 295774, 123918, -84840, -19865, -45962, -34274, 20965, 133123, 295577, 299514, 47757, 90267, 287638, 70032, 297968, 185121, 125771, 169669, 34876, 193467, 1076, -57550, 41851, 52283, -51949, 176714, -73220, -105088, 55258, -108705, -77080, -141349, -77403, -42580, 177171, 65515, 177183, 140645]
7189A40645j34835q202P2097l8121p3642J269k82793J42385J1964L60204J23425
7178C14396k41829Q898j08934J79855q5208j9723q8570k4645J10878K96968k19645
7167A22441p8518J4610R2106N1416j47572j02082J4027J91657P6873n9934l7348
7156A37676j70825J33717K64287l38051L6282R0190r9018N2586l5797J04754J64074
7145C39875J26628j01067k4060j2922j14499r5055o9014J68555N6162j8946j02257
7134A53400R7020p0774J7384K77946J667q1000J45548j83594o6277r0644r4204
7123A06472j30240M49007p9818k79474o892j8779m6329J57828Q5138M4270J2732
7112B93915k48743K8127J00587j49229j27923J47264l5171Q8884K00948J1173
$$ y = [140645, 5810, -2392, 69705, 31584, -42058, -40789, -323582, -181197, -169233, 190971, 314396, 72567, 81465, -27469, 152386, 67178, 47455, -41115, -65760, 45118, 342086, 122441, 43923, 58533, 150639, 202055, 54483, -47599, -33572, 158085, 234958, 175024, 137676, -33149, 100568, 364855, 26804, 63086, 153276, 54258, 106844, 71047, 175801, 339875, 466503, 365436, 341376, 328454, 213955, 118900, 49886, 218441, 274603, 255657, 153400, 250420, 179646, 197030, 474976, 476643, 395643, 541191, 357597, 291320, 200676, 106472, -23768, 425239, 345421, 65947, 59055, 40276, -6053, 151775, 236913, 281183, 293915, 45172, 73299, 173886, 24657, -103266, 43998, 8827, 97711, 298659, 309832]
7102C09832k89554k49980J06295J41151J51855O8645j20653q1819p8755J1706
7092c1277m2584j53342K56300K58334k06440o8216O6795j71687P7218K35586m6912
7081A73775j39242k56750j5994N1047R1050K24209J12200K1578m7039k89404L8513
7070c6057o7584o1882L66849j07080j75066M6104N9359K69852m3728p4958j33900
7059D1909j01387j8686R9649K5350J27647j25165k82408R9522o3658K65618J17545
7048A85936j23560o0005j66863K27669P0353K5351j59974p9147J97589j45952
7038b8603M9855J3191K53535O6811k37281K21819j77554L8188K03714l6348O7022
7027D34349n1785k79729m5455J57306o6613K0056K12868J11704k4166j59316j41213
$$ y = [309832, 20278, -229702, -123407, 17744, 169599, 238244, 117591, 35772, -42983, -31277, -73861, -227203, 29097, 287431, 80991, 12775, 79570, -92117, -14899, 220687, 173775, 34533, -222217, -238211, -187164, -96114, 128095, 240295, 261873, 214834, -74570, -36057, -103641, -165523, 201326, 94246, -80820, -34716, 24643, 294495, 250767, 175809, 41909, -59478, -78164, 21485, 46835, 174482, 49317, -233091, -133569, -197227, 68391, 185936, 62376, 2371, -164492, 63177, 133530, 158881, -1093, -80240, 117349, -28603, 21252, 34443, 287978, 354789, 117508, 339327, 161773, 199961, 403675, 367327, 434349, 382564, 102835, 57380, 214686, 148073, 168129, 380997, 492701, 468535, 309219, 168006]
7016A68006j85626J39373K4819O6891p3971J77130l2686k05260J08407O7273P6118
7005C30474k29558j62311K09092K1996j94547L17035n6494j00958J02201k4535
6995B12395N758K70915j74971j51126O9526P0097k41843L8212N1469l5313L96691
6984E11810j58967k05041K07340J10316j04266j09529Q3590J09467k67091k2454
6974A55175P7109o1689j0347O3809O4750M79133j07871m00415J2723J32033j46689
6963B57721m5890J97313J05813j69567Q3032j52679l3233m6006O393L90467j02683
6952D90681j01177n88J84840l9478n9869J0546j03711n5966m974p2301J72889
6941D20892j68046K30016k90637n4899K10871J50848j6448k01988j17532j01425
$$ y = [168006, -17620, 121753, 146572, 213463, 139492, 316622, 283936, 78676, 187083, 254356, 330474, 100916, -61395, 147697, 169693, -24854, 292181, 235687, 134729, 236930, 212395, 218153, 489068, 314097, 162971, 232497, 302594, 60751, 98963, 150432, 115119, 511810, 352843, 147802, 355142, 465458, 361192, 251663, 335253, 444720, 177629, 155175, 232284, 170595, 160248, 224057, 288807, 767940, 660069, 259654, 272377, 404410, 257721, 211831, 409144, 514957, 345390, 428422, 275743, 242510, 196504, 202897, 593364, 490681, 389504, 388916, 573756, 534278, 474409, 484955, 381244, 325278, 320304, 248003, 420892, 252846, 482862, 192225, 137326, 348197, 499045, 482597, 280609, 163077, 61652]
6931F1652J34349j44995n0487M4306J12581L87686Q7379j68360j28358Q7716q8148
6920C35321J14781P4866Q8133j19896j31205J56662J09954l12385j3359J42614
6910D45486J21204J77663j32891m4670m179P7680L53r5066O8900j04590Q7408
6899E97298l616q4972J03276j51953r8501j73433K60335K35758k7784l77582j12467
6888A66359J63871J92112J08265m9540j11109j20149n216q7524k49882K25225
6878B32412J68287j36501Q4790K82780p1029k32745J48359J80822k29900J14552
6868E41827l5667l4576J24952K1393k08m0675K176O6597J137K9903j21735K4746
6856E79870K4490m6386K90927J08709o7489o8976m8516n6708K74361l49617M9153
$$ y = [61652, 196001, 51006, 519, 44825, 157406, 545092, 632471, 464111, 335753, 423469, 335321, 450102, 524968, 613101, 493205, 362000, 518662, 628616, 316231, 302872, 445486, 566690, 744353, 611462, 566792, 562613, 640293, 640646, 545580, 614480, 509890, 597298, 593682, 508710, 611986, 460033, 361532, 188099, 448434, 684192, 656408, 278826, 166359, 330230, 522342, 630607, 581067, 469958, 349809, 344593, 257069, 7187, 232412, 400699, 264198, 348988, 631768, 560739, 327994, 476353, 657175, 427275, 541827, 506160, 471584, 596536, 617929, 617721, 577046, 579222, 645819, 646956, 676859, 555124, 579870, 604360, 557974, 848901, 957610, 890121, 821145, 772629, 715921, 990282, 640665, 689818]
6845F89818J49998j65208m2746J45811m7915j96072R6307k695k64451j01810R7636
6834C58673J96463L24484j23555n5852r3527R7705j96922K84890K58317r9586
6824I51090K7192r9758q7115m658J4205N87L9552j6840J27010j07612o4131L65347
6812A144869j52134n8547Q415r7405p8124J25124J7700k15809J02216K34637j61037
6801H69905O2106P1655j59028j8428L15827n0722j83869M8209M5101J42445J22696
6790A265897M4883r2853k09195j15085L11912p1847M4033k4271p8723o3709J34071
6779A145113j28865j07627J55594K02375j82299K01758L45751m2473j68236j34966
6769A286125J89135j31689K16024N6537k39274j71544N2544M12862K8763K23263
$$ y = [689818, 839816, 674608, 631862, 777673, 729758, 533686, 629993, 627298, 362847, 261037, 358673, 555136, 879620, 756065, 700213, 606686, 704391, 507469, 792359, 1050676, 951090, 978282, 878524, 791409, 786751, 800956, 801543, 841095, 824255, 951265, 843653, 779522, 1144869, 992735, 934188, 942603, 845198, 767074, 892198, 909898, 694089, 796305, 1030942, 869905, 932011, 1003666, 844638, 826210, 1142037, 1091315, 907446, 955655, 1000756, 1143201, 1265897, 1310780, 1217927, 1008732, 893647, 1205559, 1133712, 1177745, 1153474, 1074751, 1011042, 1145113, 1016248, 908621, 1064215, 1266590, 1084291, 1286049, 1631800, 1589327, 1421091, 1286125, 1475260, 1343571, 1559595, 1616132, 1376858, 1205314, 1257858, 1670720, 1699483, 1922746]
6759A922746J18021J07043l2558o6181j21298O6396J99779J07931K31908J71387
6749B705174J44287m5972J84994K69994J18914j09734j13520K48668q52K18639
6739C620592J8134k40769Q9603n596J44317k28370j15850n3542j71460R3344M7319
6728C197722J23363K5099l63335l9216l46260J86567l41767k82829K16803J0195
6718B386342p9041j00105J64294N6718j08834j37673J19097M6656k1547k75289
6708B050618R1538J14522q2960J5034n6269j7109K21917K37708K3067J316P105
6697B606487M9901j40498k04093K16064K64212N0611j20506J59960n9623L15370
6687C137885K57835j85634K88846K99662J20019J89482j409J96693j3938K84931
$$ y = [1922746, 2040767, 2147810, 2115252, 2049071, 1927773, 1994169, 2193948, 2301879, 2533787, 2705174, 2849461, 2803489, 2988483, 3258477, 3377391, 3267657, 3154137, 3402805, 3401953, 3620592, 3638726, 3397957, 3487560, 3481964, 3626281, 3397911, 3282061, 3228519, 3057059, 3150403, 3197722, 3321085, 3346184, 2982849, 2943633, 2597373, 2783940, 2442173, 2159344, 2376147, 2386342, 2307301, 2207196, 2371490, 2428208, 2319374, 2181701, 2300798, 2347454, 2325907, 2050618, 2142156, 2256678, 2173718, 2188752, 2132483, 2115374, 2337291, 2574999, 2598066, 2599382, 2606487, 2656388, 2515890, 2311797, 2527861, 2792073, 2842684, 2722178, 2882138, 2822515, 3137885, 3395720, 3210086, 3498932, 3798594, 3918613, 4108095, 4106686, 4303379, 4289441, 4574372]
6677D574372M30992J91139j58048K33752L5751L10234J1392j33204j39298m10985
6667D946097k58934M1252L089q9717k09284j07060J48025j95929J35813k00457
6657D212895m47218o4300N0014j93791n9991p527O385j75900j36171J34414m3526
6646C275284m4116L74820P0022K8043j45546Q0069q7439P3724K45392j66989n6362
6635C646902K05917j0167k27038n8723L05349k9323j94664L36618l2491j27206
6625C815174P4388j13925p1257p3130K13302N2566J736J6536Q0019l6625r3021
6614C865763J75618J20846q967j06903P3885L49107q8305j46301J33269J71421
6604D539433J66128J63150J27851k40192L9558J12795j2707J13338k36313P8983
$$ y = [4574372, 5005364, 5196503, 5038455, 5272207, 5307958, 5618192, 5629584, 5496380, 5357082, 4946097, 4687163, 4728415, 4731504, 4641787, 4432503, 4325443, 4473468, 4277539, 4413352, 4212895, 3765677, 3701377, 3751391, 3557600, 3497609, 3490082, 3496467, 3320567, 3184396, 3318810, 3275284, 3231168, 3605988, 3676010, 3704053, 3558507, 3638576, 3551137, 3624861, 3870253, 3703264, 3646902, 3852819, 3842652, 3615614, 3556891, 3862240, 3832917, 3638253, 3974871, 3942380, 3815174, 3889562, 3775637, 3704380, 3631250, 3844552, 3897118, 3898854, 3915390, 3995409, 3958784, 3865763, 4041381, 4162227, 4153260, 4046357, 4120242, 4469349, 4381044, 4234743, 4368012, 4539433, 4705561, 4868711, 4996562, 4756370, 4795928, 4908723, 4896016, 5009354, 4773041, 4852024]
6594D852024J86830L99402l3622R1767m8614K62137K5276J89728J80043k77432
6584E827539J50971M6452J75707K05966L68870M2142K84572n7785K55287j13038
6574G186683J14534L23208J05443K24536J27245K09717L32779J72959L5837R0421
6564H923362j04115J96325K32738L28360K02115J50952K18817J66735J19628R9661
6554A0534578K0138Q6770J50646K99508p5922J53052K89668q5524K13542r9626
6544A1486830J30603N64075L021j53452J6976q0092M395M7928N9816j19318k4
6533A1960758n8741o732j61510J49780j62578k56372N8456j56438n4782m7285
6523A1264556J5595j14333k32209P1379m8754n67499l1783n0560n0597n2466J89909
$$ y = [4852024, 5038854, 5438256, 5404634, 5496401, 5447787, 5709924, 5735200, 5924928, 6104971, 5827539, 5978510, 6024962, 6200669, 6406635, 6775505, 6817647, 7102219, 7044434, 7299721, 7186683, 7301217, 7624425, 7729868, 7954404, 8081649, 8291366, 8624145, 8797104, 8832941, 8923362, 8819247, 9015572, 9248310, 9576670, 9778785, 9929737, 10148554, 10315289, 10434917, 10534578, 10554716, 10641486, 10792132, 11091640, 11015718, 11168770, 11458438, 11372914, 11586456, 11486830, 11617433, 12181508, 12184529, 12031077, 12048053, 11967961, 11972356, 12020284, 12080100, 11960782, 11960758, 11902017, 11895285, 11733775, 11883555, 11720977, 11464605, 11523061, 11366623, 11311841, 11264556, 11280151, 11165818, 10933609, 11004988, 10956234, 10388735, 10356952, 10306392, 10255795, 10203329, 10393238]
6512A0393238k42908j02745L6913k42535O7985j00421J15429l07687M6890N1505
6502I715664j00955m0927k16931L0579m6367r535J74497k11525R8757M8759q2672
6491I359344J20493j18970j59395k61373k91237J43452R0136L448j22272J59896
6481H923522j90512l81902l7750j8197J27618K66900J325k01833k26051n4448
6471H208672K03659j85957p6752p7961J75184j99632j47298q6693k94578j19775
6461G398869n2766P7923j02985J04775R602p7L3643n9167j45222k5486O6260k15745
6449G089624l31979K4032l4k09019j42917L094j1527j54358N468o1950j10864
6438F099570j40945J06838L73805J02429k09148j37594P2758n5610Q0376J64860
$$ y = [10393238, 10150330, 10047585, 10084498, 9841963, 9909948, 9809527, 9924956, 9617269, 9664159, 9715664, 9614709, 9573782, 9356851, 9387430, 9341063, 9331528, 9506025, 9294500, 9393257, 9442016, 9359344, 9479837, 9360867, 9201472, 8940099, 8648862, 8792314, 8882450, 8885898, 8763626, 8923522, 8733010, 8351108, 8313358, 8295161, 8422779, 8689679, 8691004, 8489171, 8263120, 8208672, 8412331, 8226374, 8149622, 8071661, 8246845, 8047213, 7899915, 7813222, 7518644, 7398869, 7346103, 7424026, 7321041, 7425816, 7435418, 7435341, 7468984, 7409817, 7264595, 7239109, 7305369, 7089624, 6757645, 6781677, 6781643, 6572624, 6429707, 6432801, 6421274, 6266916, 6272384, 6210434, 6099570, 5958625, 6065463, 6439268, 6541697, 6332549, 6194955, 6267713, 6212103, 6292479, 6457339]
6428F457339j6558m34041j40416L28486J02516Q9385J28141J40697l8478j01833
6418F515238J13079m7747p6132R7842o2956J52650K25134M4219j01935m7213l8599
6407F773580J99336m9181r0408K9146K57505r7302J92441o0100k48991N10030
6397G416056K7146k03003R5463K45977L22788J85929K18460O3556k63590N761
6387H114543O5074q7691J72884K62319J38461l7576k29987L2440J95912k6532
6377H599847q8557O8397r0121l60673j92356k58866k7003P8716l15301k22962
6367G191121j00808N2634j37377j92087l6762k13776j09552l9179p9251K67110
6357F602073p5476j64950j99994Q5450j6274l5706L44268j44073j89052M8946
$$ y = [6457339, 6440781, 6006740, 5866324, 6194810, 6297326, 6386711, 6514852, 6655549, 6617071, 6515238, 6628317, 6580570, 6504438, 6602280, 6539324, 6691974, 6917108, 6961327, 6859392, 6812179, 6773580, 6972916, 6923735, 6833327, 6862473, 7119978, 7022676, 7215117, 7155017, 6906026, 7416056, 7443202, 7240199, 7335662, 7581639, 7904427, 8090356, 8308816, 8372372, 8108782, 8114543, 8179617, 8091926, 8264810, 8527129, 8665590, 8628014, 8398027, 8430467, 8626379, 8599847, 8511290, 8579687, 8489566, 8128893, 7936537, 7677671, 7650668, 7729384, 7414083, 7191121, 7090313, 7142947, 7005570, 6813483, 6776721, 6562945, 6453393, 6414214, 6334963, 6602073, 6526597, 6361647, 6161653, 6247103, 6230829, 6195123, 6539391, 6395318, 6206266, 6255212]
6347F255212J78257J52229j86229J58518j12256j40775K54627K63715R3292j10000
6337F806590m1397N8323O0474J45961R0688k8466J69020J00369K67770L53644
6327G982976M4888K08127K93101J20836K48218Q7541Q4247J84261Q9305K51353
6317I594853J92842K23013K76833j802L11193J07039K45660J40494J82877j18400
6307A1154602K5620K23040J70078J58667n9343k73538K94896J66884j65933R6554
6297A1791527K59682J73354r959O3642j87386J52559K98348J95076k3325P0561
6287A2784079J73508J42366p6472k0805K70069J57969j0460K58538L4368r0282
6277A3622878J79325K5452l5369J57676J2785Q7041Q6334k5444P9269j159j96500
$$ y = [6255212, 6433469, 6585698, 6399469, 6557987, 6445731, 6304956, 6559583, 6823298, 6916590, 6806590, 6765193, 6823516, 6883990, 7029951, 7120639, 7092173, 7261193, 7361562, 7629332, 7982976, 8027864, 8235991, 8529092, 8649928, 8898146, 8985687, 9069934, 9254195, 9343500, 9594853, 9787695, 10010708, 10287541, 10285739, 10596932, 10703971, 10949631, 11090125, 11273002, 11154602, 11180222, 11403262, 11573340, 11732007, 11672664, 11399126, 11694022, 11860906, 11694973, 11791527, 12051209, 12224563, 12214604, 12278246, 12090860, 12243419, 12541767, 12736843, 12713518, 12784079, 12957587, 13099953, 13023481, 13002676, 13272745, 13430714, 13420254, 13678792, 13713160, 13622878, 13802203, 13827655, 13792286, 13949962, 13962747, 14049788, 14136122, 14110678, 14189947, 14188788, 13992288]
6266A3992288j70229K33320R51N5600j56395N5190j20110j83606k77902q2255
6256A3346852J07509j14873J32804l67025j97048J76429j66677K7707k36430j32664
6246A2576584j7306m03452k2606j13025k2144l95819J33808k5501l90263l01355
6236A1018921n9555r7612j35140J5166l75364m75663J98978m1209L136q3001j60307
6225I808350j38565m03039j48321R705l68154m6707k42041j83273r5528R7933
6215H290360J24123k16516l19105j65852k76073L5204N4652P0061j24645l33712
6205G138497l5429P6942n7262k31564j70687m4223K43350l305l22845k3779l6157
6194F533538O4905O129j3451m5222k83853R6997k06663j27537j92140L4947K59161
$$ y = [13992288, 13822059, 14055379, 14056330, 14111930, 13955535, 14010725, 13890615, 13707009, 13429107, 13346852, 13454361, 13339488, 13472292, 13105267, 12908219, 13084648, 12917971, 12945678, 12709248, 12576584, 12559278, 12155826, 12133220, 12020195, 11998051, 11602232, 11736040, 11710539, 11320276, 11018921, 10959366, 10861754, 10726614, 10741780, 10366416, 9890753, 10089731, 10048522, 10051658, 9968657, 9808350, 9669785, 9266746, 9118425, 9128130, 8759976, 8713269, 8471228, 8287955, 8192427, 8290360, 8414483, 8197967, 7878862, 7713010, 7436937, 7472141, 7526793, 7596854, 7472209, 7138497, 7103068, 7180010, 7122748, 6891184, 6720497, 6676274, 6919624, 6916319, 6593474, 6569695, 6533538, 6598443, 6604572, 6591121, 6545899, 6262046, 6359043, 6152380, 6024843, 5832703, 5867650, 6126811]
6183F126811R2790m58677J33235K69394J71450q5161j20378n0858N4374j56833
6173E976147n8940J08314J05989M4093l2591j51376n7405L47602O7310j37161
6163F211982k36942k01619K55504k5783K70258J52095l06172K66152N0484j91909
6153F244050JJ24540J18716k46589N6939J19591K66267j72538j11655L01288J64703
6142F865313O828O2943j2481l4140r9410R3722N3619K09791J46157j86258L8041
6131G144125J47244j88214j37389k55050J20168J91999m6146j27467j60913P0172
6121F758529j14251j43919L90K44338j77727K45777J49705l59348j50168n625
6111F447701R4917q4935n1949O523k21397K33871k7098p9140Q122p4747m06157
$$ y = [6126811, 6219601, 5760924, 5894159, 6163553, 6335003, 6249842, 6129464, 6078606, 6132980, 5976147, 5917207, 6025521, 6131510, 6175603, 6143012, 5991636, 5934231, 6281833, 6349143, 6211982, 5975040, 5773421, 6028925, 6003142, 6273400, 6425495, 6119323, 6385475, 6435959, 6244050, 6244051, 6368591, 6487307, 6240718, 6297657, 6417248, 6683515, 6510977, 6399322, 6700610, 6865313, 6872141, 6935084, 6922603, 6888463, 6789053, 6882775, 6936394, 7146185, 7292342, 7106084, 7144125, 7291369, 7103155, 6965766, 6710716, 6830884, 7022883, 6976737, 6849270, 6688357, 6758529, 6644278, 6500359, 6500749, 6745087, 6567360, 6813137, 6962842, 6603494, 6453326, 6447701, 6542618, 6457683, 6405734, 6412257, 6190860, 6424731, 6397633, 6318493, 6326615, 6251868, 5845711]
6100E845711o522J14060p7901L00466k54462m57775j90057j04319L84492k89447
6090E264246j169k08k69108j32819j54414J16268R828J6576J32325N4803Q0195
6079E116523J47223j03399J3977j62273n4163P5396J14411k51932O4330r108k05421
6068D745564j7417P4712j97109N5474J81045K8599J52138L32145j76931k63157
6058D915063O5567k0723J25480J3007K18110K0658j7417k15099J11687P2944o7018
6047E222259j76271L43676j34589R3693l2451j09641j45386J39280j02601j17693
6037D980276L36861j24755P7633J00760J82697l50811r8631Q8882j22145m4073
6027E026694J53432l20161P5958K73646L6198J07449k62964Q8787m7763l13825
$$ y = [5845711, 5839189, 5953249, 5875348, 6175814, 5921352, 5463577, 5273520, 5169201, 5553693, 5264246, 5263077, 5262869, 4993761, 4860942, 4706528, 4822796, 4832624, 4849200, 4981525, 5036328, 5116523, 5263746, 5160347, 5174324, 5012051, 4957888, 5033284, 5147695, 4895763, 4960093, 4950985, 4745564, 4728147, 4802859, 4605750, 4661224, 4842269, 4870868, 5023006, 5355151, 5178220, 4915063, 4980630, 4959907, 5085387, 5098394, 5316504, 5337162, 5319745, 5104646, 5216333, 5289277, 5222259, 5045988, 5389664, 5255075, 5348768, 5316317, 5206676, 5061290, 5200570, 5097969, 4980276, 5317137, 5192382, 5270015, 5370775, 5553472, 5202661, 5104030, 5192912, 5070767, 5026694, 5180126, 4859965, 4935923, 5209569, 5245767, 5353216, 5090252, 5179039, 5131276, 4817451]
6017D817451l8893q4618L55201K19237j13094J52085j49725j67892P7147J26931
6007E193830p9058L6753j37591J20703L2364K9743J42605j48274R0603m2408M5297
5996E284567J70271j00026p7961L7247N36272m360j18873J86399P3086m7809k46000
5985E692813J42165M60095L2286k21784J71173P2253J0012k11315R9020M12374
5975F659092M8183k7046J52731J23016O6765J57760J8591j33410j02218J90721
5965G154185K8703J84753K92594L6104l9742j15714J48397L37451K57999J59642
5955H444372Q3693j6726K21488K41334L24700l8865K08443j256L65988l5593j443
5944I796135J49887L39807j91703J06524L12425n9604J96908L6158R1604J14852
$$ y = [4817451, 4778558, 4693940, 5049141, 5268378, 5155284, 5307369, 5157644, 4989752, 5066899, 5193830, 5114772, 5151525, 5013934, 5134637, 5167001, 5196744, 5339349, 5191075, 5281678, 5239270, 5284567, 5454838, 5354812, 5276851, 5314098, 5850370, 5846010, 5727137, 5913536, 5986622, 5938813, 5692813, 5834978, 6295073, 6327359, 6105575, 6276748, 6349001, 6359013, 6147698, 6246718, 6659092, 6707275, 6680229, 6832960, 6955976, 7022741, 7180501, 7199092, 7065682, 6963464, 7154185, 7182888, 7367641, 7660235, 7696339, 7656597, 7540883, 7689280, 8026731, 8284730, 8444372, 8528065, 8511339, 8732827, 8974161, 9298861, 9259996, 9468439, 9467183, 9833171, 9797578, 9796135, 9946022, 10285829, 10094126, 10200650, 10513075, 10453471, 10650379, 10686537, 10778141, 10892993]
5934A0892993M2806J10449J70014j7239M8912K00263N4553j8686K29801K63376
5924A1977242L91049J38668j6936J74230P3116N0946j34558J51702K14960M60931
5914A3481350L09450j37740m6579K27279J31767K66509M62663O9365l9069N30838
5904A5255833Q7856k0631M32755K21823M71931J50276J8404M5493J6327L76484
5894A7056551M75903K1805K50248R5672M51417J37563J82249J38418K43352L73889
5884A9427067j2388J85270M01238J37625K34928K00590J15159K06138K11748J97045
5874B1304420L50861O4337K8946J86404M34578J02898j39571L33094K49975J80260
5864B3096202K50347k1307j19633O1870K48529J68366R172L39628l5307j56109
$$ y = [10892993, 10935799, 11046248, 11216262, 11199023, 11247935, 11448198, 11502751, 11484065, 11713866, 11977242, 12368291, 12506959, 12490023, 12664253, 12737369, 12788315, 12653757, 12805459, 13020419, 13481350, 13790800, 13653060, 13606481, 13833760, 13965527, 14232036, 14694699, 14764064, 14724995, 15255833, 15343689, 15323058, 15755813, 15977636, 16449567, 16599843, 16618247, 16663740, 16680067, 17056551, 17532454, 17554259, 17804507, 17900179, 18351596, 18489159, 18671408, 18809826, 19053178, 19427067, 19414679, 19599949, 20001187, 20138812, 20373740, 20574330, 20689489, 20895627, 21107375, 21304420, 21655281, 21719618, 21748564, 21934968, 22369546, 22472444, 22332873, 22665967, 22915942, 23096202, 23346549, 23325242, 23205609, 23267479, 23516008, 23684374, 23693546, 24033174, 23997867, 23841758]
5854B3841758l14P1539L29556j9763j0881j60258j39304J69115k5757p6612j53051
5843B3826028o269K75023K00285J01356l0512P1922J57108k68411j82710J60261
5833B4304081J57961k7455k7791J08308l555k98429r4611K38873O5724L40634
5823B4763740J45708k75646l35327J96055J50192K27331J1654k06740K03035k1647
5813B4858355Q5286J87559K3044l4117J20490J53227J49909j31933o1555L53480
5803B5703745L65741j74274k59568N4085K26267K54105J84459J53954L71172J78562
5793B7058248q0147k28430K64465L92355O7235p1895M2479K21065L42346j86928
5783B7820793j15759J68879J64126L93628K13588l9023n6403J18006j37530K05788
$$ y = [23841758, 23841444, 23912983, 24242539, 24222776, 24211895, 24051637, 23912333, 24081448, 24055691, 23979079, 23826028, 23819759, 24094782, 24295067, 24396423, 24365911, 24437833, 24594941, 24326530, 24143820, 24304081, 24462042, 24434587, 24406796, 24515104, 24511549, 24213120, 24118509, 24357382, 24423106, 24763740, 24909448, 24633802, 24298475, 24494530, 24644722, 24872053, 24883707, 24676967, 24880002, 24858355, 24943641, 25131200, 25154244, 25120127, 25240617, 25393844, 25543753, 25411820, 25350265, 25703745, 26069486, 25895212, 25635644, 25689729, 25915996, 26170101, 26354560, 26508514, 26879686, 27058248, 26978101, 26749671, 27014136, 27406491, 27473726, 27401831, 27444310, 27665375, 28007721, 27820793, 27705034, 27873913, 28038039, 28431667, 28645255, 28606232, 28549829, 28667835, 28530305, 28736093]
5773B8736093L6879q3891J40527J32491N3291K13900j16497k09591O3242K31711
5763B9198155k50634K1633J62496j15542K00771j67807r3684K17335j38892k45167
5753B8788664j20545J2682p5549j14435M7494l01449k7378j17940k20226K7251
5743B7898569o2371P446j5257k08007J00600k20602k2036p3655k69603p3590q3979
5732B6977515j48844q4935k40375J13153k16887l63949R7747r1854m17146j13469
5722B5510956k45508k01585J2608q9817N5379j11767o953q1193r6901o3210l32749
5711B4349260j68456k4037J67153M6664j08360J25948j52974k96081M875k68903
5701B3675089Q8037Q9464k87960j7679j43603k3535K25175k075J406J365j41541
$$ y = [28736093, 28772972, 28689081, 28829608, 28962099, 29015390, 29229290, 29112793, 28903202, 28966444, 29198155, 28947521, 28969154, 29131650, 29016108, 29216879, 29049072, 28955388, 29172723, 29033831, 28788664, 28668119, 28680801, 28605252, 28490817, 28538311, 28236862, 28209484, 28091544, 27871318, 27898569, 27836198, 27843644, 27828387, 27620380, 27720980, 27500378, 27478342, 27404687, 27135084, 27061494, 26977515, 26828671, 26743736, 26503361, 26616514, 26399627, 26035678, 26133425, 26041571, 25624425, 25510956, 25265448, 25063863, 25076471, 24986654, 25042033, 24930266, 24923313, 24842120, 24745219, 24682009, 24349260, 24180804, 24156767, 24323920, 24370584, 24262224, 24388172, 24235198, 23939117, 23943992, 23675089, 23763126, 23852590, 23564630, 23546951, 23403348, 23379813, 23604988, 23602913, 23604319, 23605684, 23464143]
5690B3464143q2284q5091K25926j56111N0003J89830K90901k15334n0006m2556
5680B3589421J94444K82277n2680K1599r114J26631R020J77254K45161P7168J92602
5669B4853783R1414M3375J01711L06473O0962M34518J41296j10915O1272J71649
5659B6155538L53092K69590L06972J27114M30321N74575J8735O1988M95723J81125
5649B8974773J8026K64490M11528R7214N44460N37089L17239K81399q9759K00789
5639C1557248O19116K56895N61381L00200J21777L19979K60848L71448N14800
5630C4883692M88985L468L71836O70853K80203J81833K82743L61916M44869N71905
5620C8542303N44723R6227L08646N05368L64716K68712K75269K13874N36374L83455
$$ y = [23464143, 23381859, 23296768, 23522694, 23366583, 23416586, 23606416, 23897317, 23681983, 23631977, 23589421, 23783865, 24066142, 24013462, 24035061, 24025947, 24152578, 24161598, 24338852, 24584013, 24661181, 24853783, 24945197, 24988572, 25090283, 25396756, 25457718, 25892236, 26033532, 25922617, 25983889, 26155538, 26508630, 26778220, 27085192, 27212306, 27642627, 28217202, 28235937, 28297925, 28793648, 28974773, 28992799, 29257289, 29668817, 29766031, 30310491, 30847580, 31164819, 31446218, 31356459, 31557248, 32176364, 32433259, 32994640, 33294840, 33416617, 33736596, 33997444, 34368892, 34883692, 35372677, 35376145, 35747981, 36418834, 36699037, 36880870, 37163613, 37525529, 37970398, 38542303, 39087026, 39183253, 39491899, 39997267, 40361983, 40630695, 40905964, 41119838, 41656212, 42039667]
5610D2039667M50655L73078O3404L06577M93982L53336P2608K14011Q8283M81630
5600D4937231J05537K30488L77198J60032K17739M45204m4002J46600P0114R3889
5590D6740030P30748J91987K33936L83363N05810J32346O4590L41170L58283M50215
5580E0132478L09503K48569L78108K44505K51766N47024M00615M27799L08549
5571E3248916M70526N25016L54297O46098N59151K58226N65193N10957O24875
5562E7763255O11592N24086N79076P36411K84718N37555Q04647P23428Q69824
5553F3434592M19531O10138O79937P05524R40670J084733N25422O69178Q16480
5544F9886205J161278J127907R47114J083201Q11944R37613J290289Q42251J444464
$$ y = [42039667, 42490322, 42863400, 42926804, 43233381, 43727363, 44080699, 44153307, 44367318, 44455601, 44937231, 45042768, 45273256, 45650454, 45810486, 46028225, 46473429, 46429427, 46576027, 46646141, 46740030, 47470778, 47662765, 47896701, 48280064, 48785874, 48918220, 48982810, 49323980, 49682263, 50132478, 50441981, 50690550, 51068658, 51313163, 51564929, 52111953, 52512568, 52940367, 53248916, 53719442, 54244458, 54598755, 55244853, 55804004, 56062230, 56627423, 57138380, 57763255, 58374847, 58898933, 59478009, 60214420, 60499138, 61036693, 61841340, 62564768, 63434592, 63854123, 64464261, 65144198, 65849722, 66790392, 67875125, 68400547, 69069725, 69886205, 71047483, 72175390, 73122504, 74205705, 75017649, 75955262, 77245551, 78087802, 79532266]
5535G9532266J239591J259683J509630J192612J771953J557966J517126J758070
5527I1338897J654094J739299J756120J828430J978323K393043J979309K194140
5519A06861655K334480K309910K732148K705291K948378K697278K891266L132563
5511A28612969L178405L256262L411383L558436L953076M035810L915923M011882
5503A57934146M428374M983958N101789M937287M772822N301281N851924N672482
5495A98984063N843937O268745O187488O697486O856365O876384P056813P412433
5487B52183714P520376P601049P982319Q176473Q161705P969468Q253614Q228868
5479C16077586Q061828Q026396P786903P473963P422473O996088O516530O419107
$$ y = [79532266, 80771857, 82031540, 83541170, 84733782, 86505735, 88063701, 89580827, 91338897, 92992991, 94732290, 96488410, 98316840, 100295163, 102688206, 104667515, 106861655, 109196135, 111506045, 114238193, 116943484, 119891862, 122589140, 125480406, 128612969, 131791374, 135047636, 138459019, 142017455, 145970531, 150006341, 153922264, 157934146, 162362520, 167346478, 172448267, 177385554, 182158376, 187459657, 193311581, 198984063, 204828000, 211096745, 217284233, 223981719, 230838084, 237714468, 244771281, 252183714, 259704090, 267305139, 275287458, 283463931, 291625636, 299595104, 307848718, 316077586, 324139414, 332165810, 339952713, 347426676, 354849149, 361845237, 368361767, 374780874]
5471C74780874N561193M802605M520510L532174L090705K125825R21750L60903
5463C99696539m44498j311199k043741l009796l941445m668454n147194n547807
5455C73582405o214658o832278p244127p551788p804008q213514q106650q286761
5447C13328621q299912q322027q140745q370097q086406p931033p930053p588685
5439B48659663p411835p447533p032349p000779o732494o319788o303137n981572
5431A94430176n869923n655634n499337n244852m947563m896457m599656m471468
5423A53245286m415640m121159l926976l799349l962469l867725l357260l289281
5415A22505427l089835k924495l133580k908185k870828k738337k858116k325326
$$ y = [374780874, 380342067, 385144672, 389665182, 393197356, 396288061, 398413886, 399335636, 399696539, 399252041, 397940842, 395897101, 392887305, 388945860, 384277406, 379130212, 373582405, 367367747, 360535469, 353291342, 345739554, 337935546, 329722032, 321615382, 313328621, 305028709, 296706682, 288565937, 280195840, 272109434, 264178401, 256248348, 248659663, 241247828, 233800295, 226767946, 219767167, 213034673, 206714885, 200411748, 194430176, 188560253, 182904619, 177405282, 172160430, 167212867, 162316410, 157716754, 153245286, 148829646, 144708487, 140781511, 136982162, 133019693, 129151968, 125794708, 122505427, 119415592, 116491097, 113357517, 110449332, 107578504, 104840167, 101982051, 99656725]
5407I9656725k547429k450096k189218k382946j970979j806681k193282j761390
5399H2354704j727766j846660j763542j894291j715732j669144j452382j477368
5391F8807819j444767j206528j090527j340216j460526j161841j294574r74672
5383E8834168r85704j126708j197396r19217r38904o95973q46866j108839j239021
5374D9775540q88236n94860r61850j002670o81962o98470o58835p66635p55499
5365D2766523m44554p78187m97154m15694o74264n85281o01748o49992n95553
5356C7524096m26945n21247l20180n51863m68198n05908p65882l32621l50745
5347C3280507l43846o49290n58925k27124j7531m29075m18855n04772l15329k71719
$$ y = [99656725, 97109296, 94659200, 92469982, 90087036, 88116057, 86309376, 84116094, 82354704, 80626938, 78780278, 77016736, 75122445, 73406713, 71737569, 70285187, 68807819, 67363052, 66156524, 65065997, 63725781, 62265255, 61103414, 59808840, 58834168, 57848464, 56721756, 55524360, 54605143, 53666239, 52970266, 52123400, 51014561, 49775540, 48887304, 48292444, 47330594, 46327924, 45645962, 44947492, 44288657, 43522022, 42766523, 42321969, 41543782, 41046628, 40630934, 39956670, 39371389, 38769641, 38119649, 37524096, 37097151, 36575904, 36255724, 35703861, 35235663, 34729755, 33963873, 33631252, 33280507, 32936661, 32287371, 31728446, 31501322, 31483791, 31054716, 30635861, 30131089, 29815760, 29544041]
5337B9544041k16347m24723l03169j87497l55085l13304r9391k0229m87063m92784
5327B6644449l69183j41514m86870k17816n6866j18826j44278l54000k69853L2155
5317B4517398q2453k02389q5756J747j75864n41657l52420K6864Q670l14508p1431
5306B2728201l84801J05476Q7895j63133k10258k15201m6301j69713j10578k17055
5296B1404532l45537k17051m5234q8631k33725k6728r5180k60802j90113j01702
5286A9799829k29133m2976j27977k53657n9803o9962m6111j04197k41644j92396
5276A8431973k43820o3334j27l1378k3361j86245j80137n5241Q8161Q8380Q9354
5265A7914225o3359l8026q8074k2663J20236L3985k21515r025j37502p59J34024
$$ y = [29544041, 29327694, 28902971, 28599802, 28412305, 28057220, 27743916, 27644525, 27624296, 27137233, 26644449, 26275266, 26133752, 25646882, 25429066, 25372200, 25253374, 25109096, 24755096, 24485243, 24517398, 24434945, 24232556, 24146800, 24148547, 23972683, 23431026, 23078606, 23105470, 23114140, 22799632, 22728201, 22343400, 22448876, 22536771, 22373638, 22163380, 21948179, 21901878, 21732165, 21621587, 21404532, 21058995, 20841944, 20796710, 20708079, 20474354, 20447626, 20352446, 20091644, 19901531, 19799829, 19570696, 19527720, 19399743, 19146086, 19086283, 19016321, 18970210, 18866013, 18624369, 18431973, 18188153, 18124819, 18124692, 18093314, 18069953, 17883708, 17703571, 17648330, 17736491, 17824871, 17914225, 17850866, 17812840, 17724766, 17702103, 17822339, 17856324, 17634809, 17625784, 17488282, 17487523, 17621547]
5254A7621547n7096K48065J79853J79525j91905K05504o9175l44700K49496K72407
5244A8293521j07591J25059K58833J86394P0145J85237K70774K93876N45520K4134
5234B0145902M6907m9215J42328j16294L08389l23698L2143j76544j36114J10493
5224A9984297J79171j7175k87596J97981J26895R9990j32867J28479n6733j21739
5214B0100703P5424P6676K8658K67897J86324p9529r5758n686J43314j8603p8994
5203B0600426j10673O7901N0214K76085L2304O0910L05334j4661J08995P8442
5193B1455277M82184J87650Q2280J64401J16549L73594J0615K21126N42251L99485
5183B4035412J110J74255M74445L93214M41922O88934P33593N86005N27274O01425
$$ y = [17621547, 17564451, 17812516, 17992369, 18171894, 17979989, 18185493, 18116318, 17771618, 18021114, 18293521, 18185930, 18310989, 18569822, 18756216, 18826361, 19011598, 19282372, 19576248, 20121768, 20145902, 20192809, 20143594, 20285922, 20169628, 20478017, 20154319, 20186462, 20009918, 19873804, 19984297, 20163468, 20146293, 19858697, 20056678, 20183573, 20283563, 20150696, 20279175, 20222442, 20100703, 20176127, 20252803, 20281461, 20549358, 20735682, 20656153, 20560395, 20554709, 20698023, 20679420, 20600426, 20489753, 20557654, 20607868, 20883953, 20916257, 20977167, 21282501, 21267840, 21376835, 21455277, 21937461, 22125111, 22207391, 22371792, 22488341, 22861935, 22872550, 23093676, 23635927, 24035412, 24036522, 24210777, 24685222, 25078436, 25520358, 26209292, 26942885, 27528890, 28056164, 28657589]
5173B8657589O99622L61542L85011K72071N65920L78537j08020k81205k35641
5164C0695426m68830o05049o87302o34558q38402p77103r38796p88772p85210
5155B4171404q98899p53555n81768o25567o65434k12469n36744m57169m13566
5146A9026233k86999o25488l84743j44629m52396k31406k44469j33406j36017
5137A6386680p3611j81430j4632J7625p3268k23000j24568q1928k05746k33215
5127A5192907J22720k17735j1544J12788k45391j7798N5438K34128J11951L0226
5117A5367690K29117K89185j37080K19881O8901n0328L01792K70253K99772K33411
5107A7092594l0407L25489M55154l0122O0144j87938k35721K28615L6117L84367
$$ y = [28657589, 29357211, 29718753, 30103764, 30375835, 30941755, 31320292, 31212272, 30931067, 30695426, 30226596, 29621547, 28934245, 28299687, 27461285, 26684182, 25745386, 24956614, 24171404, 23272505, 22518950, 21937182, 21311615, 20646181, 20433712, 19896968, 19439799, 19026233, 18739234, 18113746, 17729003, 17584374, 17131978, 16900572, 16656103, 16522697, 16386680, 16313069, 16131639, 16117007, 16134632, 16061364, 15838364, 15713796, 15631868, 15426122, 15192907, 15315627, 15097892, 15086348, 15199136, 14953745, 14935947, 14991385, 15225513, 15337464, 15367690, 15596807, 15885992, 15748912, 15968793, 16037694, 15987366, 16289158, 16559411, 16859183, 17092594, 17062187, 17387676, 17842830, 17812708, 17872852, 17684914, 17449193, 17677808, 17713925, 18098292]
5097A8098292K55846J12065L58668J46762J48739L34417K88012J60511M78705
5088B0382017O41895J95084M13806L04050J84025N37772M54919N37801L06326
5079B3957695M31760K22179L43049L84714L87587K55181L42217J72060M00288
5070B6896730J82223J05222n3565P0229J20079R0904N0379p9545O6265k60797
5060B7188124n4974j24380m05812k51043K3688n1163j68093k88005l86162m23380
5050B5058800l74492k69988l60357l78047k83718o49860j66998l77772k59581
5041B1937987k82384l58371n04907n05365m58314k86708k0539k47824m14939m54523
5031A8404113j49350l05984m38110l66739p4377l30673l15144l2096l04510J02530
$$ y = [18098292, 18354138, 18466203, 18824871, 18971633, 19120372, 19454789, 19742801, 19903312, 20382017, 21023912, 21218996, 21632802, 21936852, 22120877, 22658649, 23113568, 23651369, 23957695, 24389455, 24611634, 24954683, 25339397, 25726984, 25982165, 26324382, 26496442, 26896730, 27078953, 27184175, 27130610, 27200839, 27320918, 27411822, 27462201, 27382656, 27448921, 27188124, 27133150, 27008770, 26602958, 26351915, 26375603, 26324440, 26156347, 25868342, 25482180, 25058800, 24684308, 24414320, 24053963, 23675916, 23392198, 22742338, 22575340, 22197568, 21937987, 21655603, 21297232, 20792325, 20286960, 19828646, 19541938, 19521399, 19273575, 18858636, 18404113, 18254763, 17948779, 17510669, 17143930, 17069553, 16738880, 16423736, 16391640, 16087130, 16189660]
5021A6189660o6922k88363m06209j67510l02016J7697j87865m89484o4089J44695
5011A4379594m6214j51174n40562k99796j19715J80682k60968k77165j1191J40885
5001A2994376r9227k80869l07066n0264J01444j54561l19336j74577P7613j13632
4991A1673901j0462k75948k60305N5119j3653j46697p1253j21115P4209j00834
4981A0802962k1915l74203j25136O5627P65j76612k09797j6716K01058k88462
4971I857571j85796j33101L6788J77471j46434J60847K23973k80728m60582k8850
4961I221159Q7776J28669o68n8573J39610j0900j73487j37898K79031k72856k65424
4950H936439K83971N3684n339J89684K17699N28965J45291M53758L34726P30722
$$ y = [16189660, 16122738, 15834375, 15428166, 15260656, 14958640, 14976337, 14788472, 14298988, 14234899, 14379594, 14333380, 14182206, 13641644, 13341848, 13222133, 13402815, 13141847, 12864682, 12853491, 12994376, 12895149, 12614280, 12307214, 12256950, 12358394, 12203833, 11884497, 11709920, 11787533, 11673901, 11663439, 11387491, 11127186, 11182305, 11168652, 11021955, 10950702, 10829587, 10903796, 10802962, 10781047, 10406844, 10281708, 10347335, 10348100, 10171488, 9961691, 9944975, 10146033, 9857571, 9671775, 9538674, 9575462, 9752933, 9606499, 9767346, 9991319, 9710591, 9250009, 9221159, 9308935, 9437604, 9436936, 9378363, 9517973, 9507073, 9333586, 9195688, 9474719, 9201863, 8936439, 9220410, 9274094, 9268755, 9458439, 9676138, 10205103, 10350394, 10804152, 11138878, 11869600]
4940A1869600O32919P74144N14934L32035L0368l53686m88573m44416n54953n17348
4930A1795024l29050n28043J45981j89002p2233l17430o9781M25641O2952N8248
4920A0982307K45237J3230j43496O8607r5295J17242J36701j27119P1629k778
4910A1266265k46640j29458M6670l1509k54810j80804k02021j7550l43600k29228
4900I677315Q9678k68292l46996j24667j03070j60621q4765K0627j92663l32800
4890H173746k53698l53589K17055k57472r6637j80604k69617k22518k7461j1862
4880F717343j22564j67376k49090L33170k06533m24649j8750K9676j39546m6337
4870E705344J01184k3180k1075j98340m37826o6127J42659k88654O7409P1327
$$ y = [11869600, 12502519, 13276663, 13791597, 14123632, 14154000, 13800314, 13311741, 12867325, 12312372, 11795024, 11465974, 10937931, 11083912, 10894910, 10822677, 10505247, 10435466, 10861107, 10924059, 10982307, 11227544, 11240774, 11097278, 11165885, 11070590, 11187832, 11324533, 11197414, 11269043, 11266265, 11019625, 10890167, 10936837, 10905328, 10650518, 10469714, 10267693, 10250143, 9906543, 9677315, 9766993, 9498701, 9151705, 9027038, 8923968, 8763347, 8678582, 8699209, 8506546, 8173746, 7920048, 7566459, 7783514, 7526042, 7429405, 7248801, 6979184, 6756666, 6729205, 6717343, 6594779, 6427403, 6178313, 6511483, 6304950, 5880301, 5861551, 5891227, 5751681, 5705344, 5806528, 5783348, 5762273, 5563933, 5126107, 5059980, 5202639, 4913985, 4981394, 5052721]
4860E052721j07130l2450j222k8634L3828j66090R0766N5682k51537k58411K75122
4849D662645o1737j37715K7018Q9951k16458P6842o7963L6267j80348K23271K82522
4838D734295J16488p5207j37042r9695j12875L4348r8586J21924k7486m1137p3720
4827D341307l45199K40973J03988j7634J22951m9544K22080P1087l0338m0575
4817D619096l3645J32752k4723l53923l2263K09983J60129j463O9865j30505K21390
4806D836693J35796J30461n9642K57162J24064J10347o4068k5373K75727N60473
4796F281640N11497M51836P75083Q64024M40853K25332l2674j04185l55167l95708
4786H662531o80948n35212m67031n78195r0618k9224o9056l8653m47875o3597
$$ y = [5052721, 4945591, 4913141, 4911919, 4883285, 4917113, 4751023, 4841789, 4897471, 4645934, 4387523, 4662645, 4600908, 4463193, 4490211, 4580162, 4363704, 4440546, 4372583, 4408850, 4228502, 4451773, 4734295, 4850783, 4775576, 4638534, 4538839, 4425964, 4460312, 4361726, 4483650, 4456164, 4415027, 4341307, 3996108, 4237081, 4341069, 4323435, 4446386, 4396842, 4618922, 4690009, 4659671, 4619096, 4585451, 4718203, 4693480, 4339557, 4307294, 4517277, 4677406, 4675943, 4745808, 4615303, 4836693, 4972489, 5102950, 5043308, 5300470, 5424534, 5534881, 5470813, 5445440, 5721167, 6281640, 6793137, 7244973, 8020056, 8884080, 9324933, 9550265, 9517591, 9413406, 9058239, 8662531, 7981583, 7446371, 6979340, 6401145, 6310527, 6281303, 6212247, 6173594, 5725719, 5662122]
4776E662122K71455K11729K86592J5976j58683J57443P158J11935J32646j18605
4766F579768K85541J49109K45176L80498K98355K14654p8173K37412K47264Q4147
4756H643751o0373R204K27983K42994j63152k79011J76144l8477q2091K77443
4746H954415K86800l6855r4152L2054J30261J08672j72300Q4606K95446R6642
4736I685589r457j39132J38033o1188J9144l5475j51601J19362j09352K1105J53984
4725I631012j07236R5714k71017M400J66476l3091J60196l86359j25295k45349
4715H889451m31438K23281l21361J94200J68001k16816k28068k32383o7065j98079
4705G779723k51871l5714k23722k9310N8617j2839m0775J15004j31047j72424
$$ y = [5662122, 5933577, 6145306, 6431898, 6447874, 6289191, 6446634, 6453792, 6565727, 6698373, 6579768, 6865309, 7014418, 7259594, 7640092, 7938447, 8153101, 8074928, 8312340, 8559604, 8643751, 8583378, 8592582, 8820565, 9063559, 8900407, 8621396, 8797540, 8759063, 8676972, 8954415, 9241215, 9204360, 9110208, 9142262, 9272523, 9381195, 9208895, 9293501, 9588947, 9685589, 9676132, 9537000, 9675033, 9613845, 9632989, 9597514, 9445913, 9565275, 9455923, 9477028, 9631012, 9523776, 9619490, 9348473, 9352873, 9519349, 9486258, 9646454, 9260095, 9134800, 8889451, 8458013, 8681294, 8359933, 8554133, 8722134, 8505318, 8277250, 8044867, 7977802, 7779723, 7527852, 7492138, 7268416, 7239106, 7297723, 7284884, 7244109, 7359113, 7228066, 7055642]
4695G055642q393k86967l6166r2519k486N6839j1089P1929m7802L5244n0242o1218
4683F622772n0570l45658J23773O3245J23953k66884J01778o8728n3931Q3407
4673F333157P2647Q1035j00851l7198K07398J90115q0525l529J33984J48561k74426
4662F670368j33505Q1458P9273K46067N0358K0044L91973K2330j42617K06511
4652G492260L3031K16311O5677K39127K22302J73968K21394L05553K68732J97848
4642I436203L36504M60052K56965L96934R09355O60648P95532P32618J223805
4633A5208616J116279J448424K361315L438114M055995N225115N487859M330811
4625D2672528K162438J56627j719838k393759l159444l613768k946353j908735
$$ y = [7055642, 7047249, 6760282, 6724116, 6631597, 6629111, 6685950, 6674861, 6746790, 6698988, 6734232, 6683990, 6622772, 6572202, 6226544, 6350317, 6413562, 6537515, 6270631, 6372409, 6303681, 6249750, 6333157, 6405804, 6486839, 6385988, 6348790, 6556188, 6746303, 6665778, 6662249, 6796233, 6944794, 6670368, 6536863, 6618321, 6697594, 6943661, 6994019, 7014063, 7406036, 7428366, 7285749, 7492260, 7525291, 7741602, 7807279, 8046406, 8268708, 8442676, 8664070, 8969623, 9238355, 9436203, 9772707, 10232759, 10489724, 10886658, 11796013, 12456661, 13252193, 13984811, 15208616, 16324895, 17773319, 20134634, 23572748, 27628743, 32853858, 38341717, 42672528, 44834966, 44991593, 43271755, 40877996, 37718552, 34104784, 31158431, 29249696]
4617B9249696j563228q31183k95736M05281J476175J906731K573468K743399L543880
4608C9208483L623674L520612L616633L115045L242378L717696M232251M794892
4600F9071664N054728M883270L856274L175124K486784K570031K870784K911580
4592I6880239L702048L007261J892210O17916q38893j845616k455037k293416
4584I8666712k351498k028349k473829l269418l853872m472008m426482m360650
4576G1430606m598825m114027l972113m056778l920185l729880l914476l925933
4568C9198389l486037l260888l144634k582080k062909j970049j622814j059162
4560B0009816q64339j123496j164868q75225o06465l94690n86250n85489m40624
$$ y = [29249696, 27686468, 26855285, 26559549, 26964830, 28441005, 30347736, 32921204, 35664603, 39208483, 42832157, 46352769, 49969402, 53084447, 56326825, 60044521, 64276772, 69071664, 74126392, 79009662, 82865936, 86041060, 88527844, 91097875, 93968659, 96880239, 100582287, 103589548, 105481758, 106099674, 105260781, 103415165, 100960128, 98666712, 96315214, 94286865, 91813036, 88543618, 84689746, 80217738, 75791256, 71430606, 66831781, 62717754, 58745641, 54688863, 50768678, 47038798, 43124322, 39198389, 35712352, 32451464, 29306830, 26724750, 24661841, 22691792, 21068978, 20009816, 19145477, 18021981, 16857113, 15981888, 15375423, 14980733, 14394483, 13808994, 13368370]
4551A3368370o81103o50601m74989l42461j11314j87875k32680l36496l61213
4542I989638p16513k28023j71748j15115j71871k38880j25093P7607l89500N7349
4532G967851j75571m29231J03287j7421n09770k91383J17992M1793j64366l56956
4522F286225r7410J15598j03414k70149L30397J50531k88953j84138M5235q7578
4512E896344k50936j86122R96P890j0798k5174N4270q1045p6098r2175q7226J48343
4500E298269J44667m51528K55451L42371j80030j2045M9389l88751n1879O9530
4490E075444K38510J53466k31327k97843K37501K02708r9726J25781o0000P6541
4480E421055K64412N9949j89426j8588K10748L2851J60565J24656m12907p3859
$$ y = [13368370, 12687267, 12036666, 11561677, 11219216, 11107902, 10920027, 10687347, 10350851, 9989638, 9273125, 9045102, 8873354, 8758239, 8586368, 8347488, 8222395, 8300002, 7910502, 7967851, 7792280, 7363049, 7466336, 7448915, 6939145, 6647762, 6765754, 6807547, 6643181, 6286225, 6188815, 6304413, 6200999, 5930850, 6261247, 6411778, 6122825, 5938687, 5983922, 5896344, 5645408, 5459286, 5460282, 5468172, 5457374, 5432200, 5486470, 5405425, 5329327, 5237152, 5149926, 5298269, 5442936, 4991408, 5246859, 5589230, 5409200, 5397155, 5446544, 5057793, 5005914, 5075444, 5313954, 5467420, 5236093, 4938250, 5175751, 5378459, 5278733, 5404514, 5344514, 5421055, 5685467, 5745416, 5555990, 5537402, 5748150, 5781001, 5941566, 6066222, 5653315, 5579456]
4470E579456K41188j32293L04523K1406K00238K18525l3912O3175M35346L25654
4460G223306p0449R4574Q2997K27344L59978K94248m7457K27582M0235J80598
4450H612956N55653K15907N89219M41892L94293L23429O18136P42211P75543J015319
4440A4284558N93509J241475J018016J269102J210292J408135K097212K437952
4432B5560251K928577L219518L911561M761096O016653P606093R515199J2673193
4424G6192141J6621787K0657373K2340460J9909231J3437401M226806m452307
4417A68932892j0402353j5076598j8194191j8906611j7849537j5229356j2318693
4410F0955553r744773p511668n941865m466625l613569k789655k608742k008494
$$ y = [5579456, 5820644, 5688351, 5992874, 6014280, 6214518, 6433043, 6399131, 6462306, 6897652, 7223306, 7152857, 7247431, 7330428, 7557772, 7917750, 8211998, 8164541, 8392123, 8432358, 8612956, 9168609, 9384516, 9973735, 10415627, 10809920, 11133349, 11751485, 12493696, 13269239, 14284558, 14878067, 16119542, 17137558, 18406660, 19616952, 21025087, 23122299, 25560251, 28488828, 31708346, 35619907, 40381003, 46397656, 54003749, 63518948, 76192141, 92813928, 113471301, 135811761, 155720992, 169158393, 173385199, 168932892, 158530539, 143453941, 125259750, 106353139, 88503602, 73274246, 60955553, 51210780, 43699112, 37757247, 33290622, 29677053, 26887398, 24278656, 22270162]
4402B2270162j608400j439587j407153j134491q75206q25592r16540j051717n52449
4393A2459027n49752o74815m31759l83286l30444l36252k50110n20704l53647
4384H628258m0957k91984k55917k88363k89929l22369j24518m28820m05472j79148
4374F000781j20128j28955P7079l38472J24440p5625m33641N0704j86145l14137
4364D655901k56063Q3751l47070J49605l099j00706l9777j69137k59428j72217
4354C541760L94183m19018J75490j44950P212j69162k77234l9333Q8172O4271
4344C221391j83071j53895m3172P0157p3636j25654K80244K11760j64944k33758
4334B805422J12847j61912j95766l5963j50611k28071P3598J04527J34476o9310
$$ y = [22270162, 20661762, 19222175, 17815022, 16680531, 15805325, 14979733, 14063193, 13011476, 12459027, 11909275, 11234460, 10802701, 10419415, 10088971, 9752719, 9502609, 8981905, 8628258, 8587301, 8295317, 8039400, 7751037, 7461108, 7138739, 7014221, 6585401, 6179929, 6000781, 5880653, 5751698, 5828777, 5490305, 5614745, 5539120, 5105479, 5156183, 4970038, 4655901, 4399838, 4483589, 4136519, 4286124, 4283025, 4182319, 4142542, 3973405, 3713977, 3541760, 3935943, 3516925, 3692415, 3547465, 3554677, 3385515, 3108281, 3068948, 3157120, 3221391, 3038320, 2884425, 2841253, 2911410, 2837774, 2712120, 2992364, 3204124, 3039180, 2805422, 2918269, 2756357, 2560591, 2524628, 2374017, 2145946, 2219544, 2324071, 2458547, 2389237]
4324B389237j65655K94083k8030l15552N0659N2029J26886J63187J4424M3638
4314B624906J76782J6090l06281j7089J08521q5351j68855m5976J51350j12018
4304B342079K2450L36027j63765O824k67278J28993J64605j20430L8280K27669
4294B715454q8808m3463l7328l6526p4249m6167J42837L7198j11799k7688p6407
4283B353054l3556J19651J9831j69965L7432J92545j31686j98061j01255k2981
4273B065009R9417p1081P9149r6330K7860J7564R9943k82906j20855J33706r9280
4262A852196N7664J65211j10044k98343K8435J23824l4108O8428j18095j99246
4252A535922q9470l7979O805J96928p7927J28291M57323j19912l61732L7109j74454
$$ y = [2389237, 2223582, 2517665, 2489635, 2174083, 2224742, 2276771, 2403657, 2566844, 2581268, 2624906, 2801688, 2817778, 2511497, 2494408, 2602929, 2517578, 2348723, 2302747, 2454097, 2342079, 2364529, 2700556, 2536791, 2543615, 2276337, 2405330, 2569935, 2449505, 2487785, 2715454, 2626646, 2583183, 2545855, 2509329, 2435080, 2388913, 2531750, 2568948, 2457149, 2429461, 2353054, 2319498, 2439149, 2458980, 2289015, 2326447, 2518992, 2387306, 2189245, 2087990, 2065009, 2164426, 2093345, 2172494, 2076164, 2104024, 2121588, 2221531, 1938625, 1817770, 1951476, 1852196, 1909860, 2075071, 1965027, 1666684, 1695119, 1818943, 1784835, 1853263, 1735168, 1535922, 1446452, 1408473, 1415278, 1612206, 1534279, 1662570, 2119893, 1999981, 1638249, 1675358, 1500904]
4241A500904J63162m08552j17494L91115k3585K59322r4983k74657j02321J78882
4231A471793J16381k15736j65300j84693r2522K09523J80155J11791j98233l5933
4221A197226N0721j00730P4265K3290J3723J59542k11705j3151L5589K10627Q4808
4210A524205J05756R3906Q466L4066O8925k20241k824k01050j92280l6152Q1545
4199A264322O5163j57063j64860K4801j03499R1627J21279M3743J0587K33917
4189A430017j57800j13237j20793q2018O0791R1717R3639l60658m9065j38792
4179F53801j50247K68021J46966M0402L5648n3970J76361n2275k668m0316k25321
4168G96402K20691K10667L4171j30684j46565J27366J60417J44402r8832j52474
$$ y = [1500904, 1664066, 1255514, 1138020, 1529135, 1505550, 1764872, 1669889, 1395232, 1292911, 1471793, 1588174, 1372438, 1207138, 1022445, 929923, 1139446, 1319601, 1431392, 1233159, 1197226, 1247947, 1147217, 1221482, 1244772, 1258495, 1418037, 1206332, 1193181, 1228770, 1439397, 1524205, 1629961, 1723867, 1732333, 1766399, 1835324, 1615083, 1612259, 1411209, 1218929, 1182777, 1264322, 1329485, 1172422, 1007562, 1032363, 928864, 1020491, 1141770, 1185513, 1196100, 1430017, 1272217, 1158980, 1038187, 956169, 1016960, 1108677, 1202316, 841658, 792593, 653801, 503554, 771575, 918541, 958943, 994591, 940621, 1116982, 1064707, 1062039, 1021723, 796402, 1017093, 1227760, 1261931, 1131247, 984682, 1112048, 1272465, 1416867, 1318035, 1165561]
4158A165561O4611J7177j0339j502j08829l8041j68095J57718L2632j8707J2361
4147A104547J68502k32994R6038J71812j00330J8399L0713j94645j15576J58296
4137A104762L7295l5540P1973J65745J77334n1050l19075L5820j24779O7450r3525
4126A036410L12315P7966P8932J02342l10136O13L08602L65667N7092j60127j10051
4115A759625R4305J63200m32456J49160M4981j20532l18246j5204k40033K7798
4105A112598K82788J00491j61673k3115l2501m5609J05419R2912o5869P3112K225
4094A440778j83103K30689K83163o4865l77870O8746j7405L2412M7364N0199p0006
4083A440102J25702l20803J78214K4180N3186j26752J05877Q549J70821q6181
$$ y = [1165561, 1230172, 1247349, 1237010, 1235508, 1126679, 1088638, 920543, 1078261, 1110893, 1092186, 1104547, 1273049, 1040055, 1136093, 1307905, 1207575, 1225974, 1256687, 1062042, 946466, 1104762, 1142057, 1106517, 1178490, 1344235, 1521569, 1470519, 1151444, 1187264, 1062485, 1129935, 1036410, 1348725, 1426691, 1505623, 1607965, 1297829, 1298442, 1607044, 1972711, 2029803, 1869676, 1759625, 1853930, 2017130, 1584674, 1733834, 1778815, 1658283, 1340037, 1324833, 1084800, 1112598, 1395386, 1495877, 1334204, 1311089, 1278588, 1232979, 1338398, 1431310, 1365441, 1438553, 1440778, 1257675, 1488364, 1771527, 1706662, 1328792, 1397538, 1380133, 1412545, 1459909, 1510108, 1440102, 1565804, 1245001, 1423215, 1447395, 1500581, 1373829, 1479706, 1488255, 1659076, 1572895]
4073A572895Q9591J74749M41203n3805j53928L65313J14864K16666J10145p6401
4063B801292M26738K51349M08754L64371K08684M24812M76546N63670R16822J027211
4053G870249J318572K071988K215459K474139K237066J484958M60819m99439j125909
4044A8507902j623957j956209j648399j814463j672844j125921p79704p72448
4036G113957l54794l26271m25206k67294m41973m5038q1953l58869m67862Q8732
4026D433429k45729k89127j56902m21348k30492M6921j88641l15042l07316k03491
4016B122262J0461q2516l4584k08776J35640L4345j43640k85089j44451N3556
4006A457208p225P163k34588r820J46566j8874J22658j70218K6344r4081K5690
$$ y = [1572895, 1662486, 1837235, 2278438, 2224633, 2070705, 2436018, 2550882, 2767548, 2877693, 2801292, 3228030, 3479379, 3888133, 4252504, 4461188, 4886000, 5362546, 5926216, 6843038, 7870249, 9188821, 11260809, 13476268, 15950407, 18187473, 19672431, 20133250, 19633811, 18507902, 16883945, 14927736, 13279337, 11464874, 9792030, 8666109, 7886405, 7113957, 6759163, 6432892, 6007686, 5740392, 5298419, 5253381, 5171428, 4812559, 4344697, 4433429, 4187700, 3898573, 3741671, 3320323, 3089831, 3136752, 2948111, 2633069, 2325753, 2122262, 2132723, 2050207, 2015623, 1806847, 1942487, 1976832, 1833192, 1548103, 1403652, 1457208, 1449983, 1457146, 1222558, 1212738, 1359304, 1340430, 1463088, 1292870, 1319214, 1225133, 1250823]
3995A250823J98335J626O0785k41944p9630l3423J53578l5257k95788K9169J05650
3984A113924m2165j67970R1127O3299K304j7894J43572p0407j54393j92582q2744
3973F86071k1370Q7023k18486L24040r9708q1425J47404j49856M7446n1248j77631
3962D92260p2486M0817J37161j38552R1593N2688r0346L0228j25384K09314L17343
3951I44636K9885m5007o4527k86270m7187J09622q6864K8302o7807J79610j07904
3940E86489m6057N8201P4173k92019r2071J33955L0511K24558j05805j85306J29419
3929E16048r3865m3752J98L14143J6465j43709J5620K19379P293l21192K7422
3918E14050J32769j27726J0001n9921m6175K96868J18289O2106j89361L990j53501
$$ y = [1250823, 1449158, 1450784, 1511569, 1269625, 1189995, 1156572, 1310150, 1274893, 979105, 1008274, 1113924, 1071759, 903789, 994916, 1058215, 1060519, 1042625, 1186197, 1115790, 961397, 768815, 686071, 664701, 751724, 533238, 857278, 757570, 676145, 823549, 673693, 721139, 669891, 492260, 419774, 460591, 597752, 459200, 550793, 603481, 513135, 543363, 417979, 627293, 944636, 974521, 929514, 864987, 578717, 531530, 641152, 554288, 582590, 514783, 694393, 586489, 540432, 598633, 672806, 380787, 288716, 422671, 453182, 677740, 571935, 386629, 516048, 422183, 378431, 378629, 692772, 709237, 565528, 581148, 800527, 807820, 486628, 514050, 646819, 519093, 529094, 469173, 422998, 719866, 838155, 900261, 710900, 714890, 561389]
3907E61389n178k90637L9739Q5400k7154M024K6489r255K00591K18180J06733
3896I10321p7635J71829j52448k74200p691N4279m43P3231k30461j00768K05425
3885E71439j12321m551P0181N262n4047j15469K01594J69950j83929j60309K13328
3874F01128O4948O0092N3246Q0841j23644O1733k24973j40955J04178j98910j09444
3863B28240K14122J9993j08649o5033J26425j928J2598l76975M2713L44126J20161
3852E55793j28090r7969J32343l7544J49524k62116j64082J92192J70848n2809
3842D58090j32710K76660j9997j94107J630j52609J05558k937m1903M9901k7350
3831C20226J5882N1693N515K1284P379q7406j07297J10254j5304p2495J68002
$$ y = [561389, 556211, 265574, 305313, 390713, 363559, 367583, 394072, 384817, 585408, 803588, 910321, 832686, 1004515, 852067, 577867, 570176, 624455, 624012, 697243, 466782, 366014, 571439, 459118, 454567, 524748, 530010, 475963, 360494, 562088, 732038, 548109, 387800, 601128, 666076, 726168, 779414, 860255, 736611, 798344, 573371, 432416, 536594, 337684, 228240, 442362, 462355, 353706, 288673, 415098, 413170, 425768, 48793, 91506, 435632, 555793, 427703, 329734, 462077, 424533, 574057, 311941, 147859, 340051, 510899, 458090, 325380, 602040, 582043, 387936, 389566, 236957, 342515, 339578, 297675, 347576, 320226, 336108, 387801, 393316, 414600, 421979, 334573, 227276, 337530, 322226, 249731, 417733]
3820D17733j44208m5966L66055k16803N5011Q5683j2346Q0060r9888j6122o1045
3809D08164j20273J64931K45443j93148j16179L1489j65133j3103J70366q4361
3799C28196L4928J64373J0200J1600N0701N2716l5632n75j69465J09524L953k6909
3787E33610j7385r0449J43264l2369j64284l0362L17662L9352k66282p8444j42216
3776B12097Q0407N9133p6255J15502J87698k37941J42925m9487j35953J90877
3766D89003j07381L7774K65252j95152J44860n7183Q1630J16395l8092l3058j62604
3755E41444r2054N3176L35526j19375o9101J14038q6404L0186M2967J72652J79955
3744A103010j91097o8128q9081p0957P44j14839Q7602K8050m3436k8943M0762
$$ y = [417733, 273525, 227559, 593614, 376811, 431822, 517505, 505159, 585219, 485331, 469209, 408164, 287891, 452822, 698265, 505117, 388938, 420427, 255294, 242191, 412557, 328196, 363124, 527497, 537697, 549297, 599998, 652714, 617082, 616507, 447042, 556566, 560519, 533610, 516225, 425776, 569040, 536671, 372387, 342025, 659687, 699039, 432757, 354313, 212097, 292504, 351637, 275382, 390884, 578582, 340641, 483566, 434079, 298126, 489003, 381622, 419396, 684648, 489496, 634356, 577173, 658803, 775198, 737106, 704048, 541444, 449390, 502566, 838092, 718717, 649616, 763654, 677250, 707436, 750403, 923055, 1103010, 911913, 843785, 754704, 683747, 684491, 569652, 657254, 685304, 641868, 612925, 653687]
3733F53687L8406M1313L0214o7078j07152N5448l3140K0535j88049J73215r4171
3722E23228k08415J06285K62117L3207j48577M8618k26606J1168M47122K2648
3712H70795p5712k3452k1842j48926o3739P7157o7634l9782m1315K27150M2196
3701G34896J47714Q5548J25179k45421j91247k24554O3708j67217j81211K78368
3691D25763J01682R2957O158j17079L25060j07867J2249r4625J20434N0826j99631
3680F15927j15185j11407J46429M8525R128k40691j08920K27169L18966j81361
3670F08580j71168P7440N0870J86780k04207k5264Q8068m4188r6936M6704O870
3659E23549j828K1683J49215j17755L109j79141j1908J43747j09880L6046J2652
$$ y = [653687, 692093, 733406, 763620, 696542, 589390, 644838, 611698, 632233, 444184, 617399, 523228, 314813, 421098, 683215, 716422, 567845, 616463, 389857, 401025, 848147, 870795, 795083, 771631, 749789, 600863, 537124, 614281, 546647, 506865, 465550, 692700, 734896, 882610, 968158, 1093337, 847916, 656669, 432115, 495823, 328606, 147395, 425763, 527445, 620402, 626560, 509481, 834541, 726674, 738923, 644298, 764732, 815558, 615927, 500742, 389335, 535764, 584289, 593417, 352726, 243806, 470975, 789941, 608580, 437412, 514852, 565722, 752502, 548295, 523031, 611099, 566911, 469975, 516679, 523549, 521721, 543404, 692619, 574864, 577973, 398832, 386924, 530671, 420791, 456837, 469489]
3648D69489J23361j98501P9655J00750M5352j545k93370Q9204P1786j21954J29383
3637D93610J36751J60914J30219J2447l60185k03099m9264L01019k5822j64928
3627D31662Q4022J29675J73831r6811n8993k99282j29735k5196L5473K22539K30567
3616F97752M2011J03324q52p0944k1278j35322j21485M382L701N5342j03741J90150
3604F43040L1601Q285r2889p8659O3852k480J01425K13432k08321l3018l00451
3593C45817Q3897K24518j13983J88653j57124R2977j14845J26155j9387j20534
3583E36144J15217r190K60378j40502l77921L15050k0063k27370J60235J60316
3573G72294J30470J20282j01910j46114j9523K17694o3455n3356o2823Q3297l90067
$$ y = [469489, 592850, 394349, 474004, 574754, 620106, 618561, 325191, 414395, 486181, 364227, 493610, 630361, 791275, 921494, 933941, 573756, 370657, 321393, 622412, 596590, 431662, 515684, 645359, 819190, 722379, 663386, 364104, 234369, 209173, 244646, 467185, 697752, 739763, 843087, 842235, 771291, 750013, 614691, 493206, 497588, 501289, 556631, 452890, 643040, 674641, 682926, 590037, 511378, 575230, 572750, 674175, 887607, 679286, 646268, 345817, 429714, 654232, 540249, 728902, 571778, 664755, 549910, 676065, 656678, 536144, 651361, 642171, 902549, 762047, 384126, 699176, 679113, 451743, 611978, 772294, 902764, 1023046, 921136, 775022, 755499, 973193, 909738, 856382, 793559, 876856, 486789]
3562D86789J30173K48524K41738j51766j39858j73526N1597P8538K51163K201
3552A025573j36013l4401R4068k04088J19980L38939j51315j71011J18280K80097
3542A280109k08419m534K84231J4195k38580j14101K4770q4449J47085J67397
3532A267704J6846L5235j21052q9873J0553J46244J34356J46039M0002l41780
3522A244274j53123L45640K72736j15645j52123L44934j2409l55788j52989K86646
3512A552153J31175J0307K21711k54860j2921J93504k25989J38348j04100J54483
3502A803811j91635O0614K33210q6383O965M27057m47j91211q7437n3643J45659
3491B066560J05501J15643r726n4986J48603j07946R9156J32011j32697o6193
$$ y = [486789, 616962, 865486, 1107224, 955458, 815600, 642074, 693671, 772209, 1023372, 1025573, 889560, 855159, 949227, 745139, 865119, 1204058, 1052743, 881732, 1000012, 1280109, 1071690, 1067156, 1351387, 1365582, 1127002, 1012901, 1037671, 953222, 1100307, 1267704, 1284550, 1319785, 1198733, 1108860, 1119413, 1265657, 1400013, 1546052, 1586054, 1244274, 1091151, 1436791, 1709527, 1593882, 1441759, 1786693, 1774284, 1418496, 1265507, 1552153, 1683328, 1693635, 1915346, 1660486, 1647565, 1841069, 1615080, 1753428, 1649328, 1803811, 1612176, 1672790, 1906000, 1819617, 1826582, 2253639, 2253192, 2061981, 1974544, 1920901, 2066560, 2172061, 2287704, 2277978, 2222992, 2371595, 2263649, 2362805, 2494816, 2362119, 2295926]
3481B295926L50922q8053j25941O9855n551K55538K66690j94427M892k22364K21601
3470B829088K49105K19928J11493Q6158K20359N5177J65781K1263j2498J06801
3460D052655M26231M6779K4339j02115M3135R0420M89425L21585K90743j09968
3450E573229L42628O18813K94776K40027M49648L81792M92896M44199M19553L19595
3440I577156K06915P34191N06125K79844r9992j64051k43066R241M4655m38959
3430A0412059k27856l70089l49046p0594m06472k14196J51319l17208n63243n32603
3420G512071j6365j84176k99032l33941n12971l22800k89289J8939j77478l51697
3410E043261j71268k79312j52792O4879J10766l03050l31863j71914k46648k8782
$$ y = [2295926, 2646848, 2558795, 2432854, 2502709, 2497158, 2752696, 3019386, 2824959, 2829851, 2607487, 2829088, 3078193, 3298121, 3409614, 3495772, 3716131, 3771308, 3937089, 3958352, 3945854, 4052655, 4478886, 4525665, 4550004, 4447889, 4491024, 4581444, 5070869, 5392454, 5683197, 5573229, 5915857, 6534670, 6829446, 7069473, 7519121, 7900913, 8393809, 8838008, 9257561, 9577156, 9784071, 10518262, 11024387, 11304231, 11204239, 11040188, 10797122, 10806363, 10851018, 10412059, 10184203, 9814114, 9465068, 9394474, 8988002, 8773806, 8925125, 8607917, 8044674, 7512071, 7495706, 7311530, 7012498, 6678557, 6165586, 5842786, 5553497, 5572436, 5394958, 5043261, 4871993, 4592681, 4439889, 4504768, 4615534, 4312484, 3980621, 3808707, 3562059, 3533277]
3400C533277j23980j5800J9021O311Q3011K3976l20751k23738p3570l9932r7256
3389B770569J56075K80900o7703k9783o3683k15673j58046J9966k29658q7343
3379B375621J04232J100o2115M616J03822J1261r4295K37995r199K5054j48513
3368B549579j41361M05679j22010j51206L8438o1814P1377J66089j35620n1442
3358B567709Q083K07067n0545O3021j66439l73371L00282L08400N8475k92729
3348B629953j4115m3733j11184k3585Q1534k95360k73204k927O7742J62620L54894
3337B532635k35854k18438p7770l56667q7069n4431j1525P4700R2458l9364j31388
3326A487287j34858Q67k4934J30554J64423R6712k54172j20438J02789J058o9002
$$ y = [3533277, 3409297, 3393497, 3412518, 3418829, 3501840, 3525816, 3205065, 2981327, 2907757, 2867825, 2770569, 2926644, 3207544, 3139841, 3110058, 3046375, 2830702, 2672656, 2692622, 2462964, 2375621, 2479853, 2480953, 2418838, 2423454, 2527276, 2538537, 2444242, 2682237, 2673038, 2698092, 2549579, 2408218, 2813897, 2691887, 2540681, 2579119, 2517305, 2588682, 2754771, 2619151, 2567709, 2575792, 2782859, 2732314, 2795335, 2628896, 2255525, 2555807, 2864207, 2922682, 2629953, 2615838, 2572105, 2460921, 2437336, 2518870, 2223510, 1950306, 1947379, 2015121, 2177741, 2532635, 2296781, 2078343, 2000573, 1643906, 1556837, 1502406, 1490881, 1565581, 1658039, 1618675, 1487287, 1352429, 1353296, 1328362, 1458916, 1623339, 1720051, 1465879, 1345441, 1448230, 1449288, 1380286]
3315A380286K1730j81821K00185J519K15244p2469k28961q5674J64806J94846
3305A609691M9324K95333P1832J08444j9009l03482l55636L5106J55844j2441
3295A635006O6549l47392l86479L77228q9988j4340N6689m7239j45897M7121J72524
3284A323782k00820J48291J39326J78684L4242j40318O3991j35561Q0337k2631
3274A469323J75854M68883N1788K33023J94402P7699o5212k20507k42504k27485
3264A915264J6842m91556J1747j92598k70600J06476K48136K9338j21265k37076
3254A014708J66611k17522J40943Q2819k72029O4719P6184j0152p1082K40689
3244A215888o6214R0500J22485P6453J86856q5624j85727K3231j98492J54997
$$ y = [1380286, 1402016, 1220195, 1420380, 1421899, 1637143, 1564674, 1335713, 1250039, 1414845, 1609691, 1659015, 1954348, 2026180, 2134624, 2115615, 1812133, 1456497, 1491603, 1647447, 1635006, 1701555, 1354163, 967684, 1344912, 1254924, 1240584, 1297273, 1250034, 1104137, 1151258, 1323782, 1122962, 1271253, 1410579, 1589263, 1623505, 1483187, 1547178, 1411617, 1491954, 1469323, 1645177, 2114060, 2165848, 2398871, 2593273, 2670972, 2605760, 2385253, 2142749, 1915264, 1932106, 1440550, 1452297, 1259699, 989099, 1095575, 1343711, 1373049, 1251784, 1014708, 1181319, 963797, 1104740, 1187559, 915530, 980249, 1056433, 1046281, 975199, 1215888, 1149674, 1240174, 1362659, 1439112, 1625968, 1540344, 1354617, 1377848, 1179356, 1334353]
3234A334353j0604j00710j83305M8133j12533j12035n6916J49223N5337j76392
3224H34551k72484K16050j5013L8732l08j86300O4656j33756J98274k33668o2489
3213D48245L77914J52976k75608j66037K34382O7351k00977O0288m5016M8692
3203G02210J29737j04739j49590N6149J17955J17380j14273p9043P9229L2202
3193G87217K1838J15699M7681k26786l4585j78874J8961r0682J89956J37944m0104
3182G48265j26620n5555J95537K02323k99682j9131Q8548j71557N0675Q3103J71966
3171H67872Q9830N7246N4188K0903j57215j12657Q3312M0633K9395l45995K29476
3160H56988J77264N1301j54628m3729L27709K1950j7569j30565K42608n0433o2222
$$ y = [1334353, 1323749, 1223039, 1039734, 1087867, 975334, 863299, 806383, 955606, 1010943, 834551, 562067, 778117, 763104, 801836, 801528, 615228, 679884, 546128, 744402, 510734, 448245, 826159, 979135, 703527, 537490, 771872, 839223, 638246, 698534, 653518, 702210, 831947, 727208, 577618, 633767, 751722, 869102, 754829, 675786, 755015, 787217, 809055, 924754, 972435, 745649, 711064, 532190, 551151, 460469, 650425, 788369, 748265, 621645, 566090, 761627, 963950, 664268, 645137, 733685, 562128, 612803, 695906, 867872, 957702, 1014948, 1069136, 1090039, 932824, 820167, 903479, 944112, 973507, 627512, 856988, 1034252, 1085553, 930925, 887196, 1214905, 1236855, 1219286, 1088721, 1331329, 1280896, 1218674]
3149A218674j17501p7888m732J868l0321K8048j7660M5830N8048K48773m4408
3138A308731k33186J75382K28530L6314K04489o9352J98706q1507j45107L34865
3128A957865K57699l2139N5184R9645K99715K54574K22850k09703N0475J02987
3118C059152N1165q3794j07890J30677K8498R1979J65985O4511P8627K89750r8490
3107C670170L2756p6479J4942J38900J35951l16171L61899K15491n2385J78872
3097D303946J38933L77321L48963K85063N11020K72950K90380J11384O2699l1027
3087F671632m12287m96600m10013j76978n99941k54583J1584j4817j09501l40640
3077C867856k35730J17117J95147l02951j14032J09616J02004j49450p7192j8612
$$ y = [1218674, 1101173, 1023285, 1018553, 1020421, 990100, 1018148, 1000488, 1046318, 1104366, 1353139, 1308731, 1075545, 1250927, 1479457, 1515771, 1720260, 1650908, 1849614, 1768107, 1623000, 1957865, 2215564, 2183425, 2238609, 2338254, 2637969, 2892543, 3115393, 2905690, 2956165, 3059152, 3110317, 3026523, 2918633, 3049310, 3077808, 3169787, 3335772, 3400283, 3478910, 3768660, 3670170, 3702926, 3626447, 3641389, 3780289, 3916240, 3600069, 3961968, 4177459, 4125074, 4303946, 4442879, 4820200, 5169163, 5454226, 5965246, 6238196, 6528576, 6639960, 6702659, 6671632, 6259345, 5762745, 5352732, 5175754, 4575813, 4321230, 4332814, 4317997, 4208496, 3867856, 3632126, 3749243, 3944390, 3641439, 3527407, 3637023, 3739027, 3589577, 3512385, 3493773]
3067C493773Q7918l0128q9905l3916J73114J48594j70339M8844J33659j6493k39901
3056C505220l03692q5169O9722k18561k66285K5921j27105k42489m0252l5552
3046B281758l82118j58389K29101K51970n4350j55137K36205k63798j47906k2425
3036A814911p2579j38456k6009p9056K68148p4008o3028j13023M734M648m77535
3025A048747J3958J0172L8146J0612P2871J06933J79972j57031j03590J9007j76146
3014A063651k06076J0383L22506j8427P0748j9313j65702n4253j86478J6927J06272
3003I40238q7932J16639j24019K8755K77664r4203O1821J09144k98588J42232
2993A071751K18385j50786j64364j73100J66364k5038k37457p1011J54196r387
$$ y = [3493773, 3581691, 3551563, 3461658, 3427742, 3600856, 3749450, 3579111, 3627955, 3761614, 3745121, 3505220, 3201528, 3116359, 3186081, 2967520, 2701235, 2727156, 2600051, 2357562, 2317310, 2281758, 1899640, 1741251, 1970352, 2222322, 2167972, 2012835, 2249040, 1985242, 1837336, 1814911, 1742332, 1603876, 1577867, 1498811, 1766959, 1692951, 1629923, 1516900, 1521634, 1526282, 1048747, 1062705, 1072877, 1111023, 1121635, 1194506, 1301439, 1481411, 1324380, 1220790, 1239797, 1063651, 857575, 867958, 1190464, 1172037, 1242785, 1223472, 1057770, 1003517, 817039, 833966, 940238, 852306, 968945, 844926, 873681, 1151345, 1057142, 1118963, 1228107, 929519, 1071751, 1290136, 1139350, 974986, 801886, 968250, 943212, 705755, 634744, 788940, 779553]
2983G79553j49594L15678j1541l76731Q987K57127K46260j54791j52115k47853
2973E14980p5738r1257o3698J30751M41619J69945j57918Q4661j33123r4160Q6468
2962H12530l37483O472q9272L5276K08064k6975j1330j18938K90290q3827l73068
2951C11739J27603P1368j52700j12985r965J53150N4093K6394R9795j47321J27249
2940E48420n9337l33111k372K52429Q1307k7600Q2940j44128r5222m385l808r6205
2928A98928M0124m8022n448J40044N981k2632N2437J27001j41025k09532j17992
2917A9864n2864L11078J56127l08065L3700J2965K19935R7811k04058j1031q557
2906B66905j51063M8401m9890P2877J91696o5175J07355j60188J63808J66157
$$ y = [779553, 629959, 945637, 934096, 557365, 566352, 823479, 1069739, 914948, 762833, 514980, 439242, 347985, 284287, 415038, 856657, 1026602, 868684, 953345, 820222, 726062, 812530, 475047, 481519, 392247, 427523, 635587, 608612, 597282, 478344, 768634, 684807, 311739, 439342, 510710, 358010, 245025, 235060, 388210, 442303, 468697, 568492, 421171, 548420, 489083, 155972, 153600, 406029, 487336, 459736, 542676, 398548, 303326, 298941, 295133, 198928, 239052, 191030, 185582, 325626, 331607, 308975, 361412, 488413, 347388, 137856, 19864, -33000, 278078, 434205, 126140, 159840, 172805, 392740, 490551, 286493, 275462, 266905, 115842, 164243, 114353, 187230, 378926, 313751, 421106, 260918, 424726, 590883]
2896E90883j64447j40397N3577J69255j65111k38402Q6781J04603J11799J29513
2886E38054l8581J68548k98757k46535P4180q7479J14817l6769j47522j43409
2876a03453J15034o2226P1401j68647K15157J49785j19779N1311k6958j75879
2866e4254N8292K6030r3888K2995K76315J06990o2146k7576j4643q5441J72893
2855C25567j47377k30418J99917r5023j39917J51512m6276j5269M739j7819J51296
2844A40932r8011J37138J10617K3402j27492m0279m3468j4454Q0234l1279J9887
2833A57227l6727j42318j4547P3575J16181j6391j79333J4493O6270P4559N6900
2822A69889k36736j15916K4102K52323K36460j12317k16878J21253r2796J72721
$$ y = [590883, 426436, 286039, 339616, 508871, 343760, 105358, 192139, 296742, 408541, 538054, 499473, 668021, 369264, 122729, 196909, 109430, 224247, 187478, 39956, -103453, 11581, -50645, 20756, -147891, 67266, 217051, 97272, 148583, 121625, -54254, 4038, 30068, -63820, -40825, 235490, 342480, 280334, 252758, 238115, 152674, 325567, 178190, -52228, 147689, 52666, -87251, 64261, 17985, 2716, 7455, -10364, 140932, 42921, 180059, 290676, 314078, 186586, 146307, 102839, 88385, 168619, 137340, 157227, 120500, -21818, -36365, 37210, 153391, 137000, -42333, -27840, 38430, 112989, 169889, -66847, -182763, -158661, 93662, 330122, 217805, 927, 122180, 29384, 202105]
2812B02105p3205k53398L16423L7574k93340q9864j39268K87430K62990o8653
2802A88794m8909J01769k9102o8465J00330J1547l03338R8595K30864k58406k0884
2791B795R0174n0678n7650j86624p9698J96880M5033O7474K55606N8524p5353
2780B66483Q7684k73416O404J2325J90915K0735k32142N5525k01609J46168N5314
2769A34386n4359K49537j42107m09721j81718J61848R5278J03943J31018L5612
2759A23717J6459k24094L4736K00966m604L1836p2474K8728q2133k20287K35424
2748F8274o4361j91350L07745j50654J00848K179j44243O8286l27442R8596R3347
2737a38775M9089K82838l8166P0343P6730k4692j36540R4911J0849j69485m8486
$$ y = [202105, 128900, -124498, 191925, 229499, -63841, -153705, -292973, -5543, 257447, 188794, 139885, 241654, 212552, 144087, 244417, 255964, -47374, 51221, 282085, 23679, 2795, 92969, 42291, -15359, -201983, -281681, -84801, -39768, 27706, 283312, 341836, 266483, 354167, 80751, 87155, 99480, 290395, 311130, 78988, 134513, -67096, 79072, 134386, 80027, 329564, 187457, -222264, -403982, -242134, -146856, -42913, 88105, 123717, 140176, -83918, -49182, 151784, 147180, 179016, 106542, 135270, 53137, -167150, 68274, 3913, -187437, 120308, -30346, 70502, 72681, -71562, -3276, -330718, -232122, -138775, -89686, 193152, 154986, 225329, 302059, 277367, 140827, 235738, 246587, 77102, 28616]
2726B8616j69058O2662K0296L2683m1701j07922J27470K31076j38038J1502K2802
2715H0388P469M4450L6477k11171n7624J38764L07314j24699k50308O2558n1660
2704a8042N6013k4262j38449J56701J19836K03921k54030m83719K56558J77801
2694E2328M0277J07295j36699m34843L35358J38796O4082K00333j19146m1760
2684B06021j98858r7787O6922j01738N1121q4492j28460R3398p0027J03328J05184
2673e5388N6189j27451o6157r2458o7837M6908J82168K14827l7225P3807j61730
2662c4347j96588M42314K6321j92409K40466O1499p0541k27744j09434J33724
2652G3261m7354k16773L31888j44405j2342r1238J0069r2534K20138k553K1066
$$ y = [28616, -140442, -77780, -57484, -24801, -66502, -174424, -46954, 184122, 46084, 57586, 80388, 87857, 132307, 168784, -42387, -100011, 38753, 346067, 221368, -28940, 33618, -18042, 37971, 13709, -124740, 31961, 151797, 355718, 101688, -382031, -125473, 52328, 92605, 199900, 63201, -371642, -36284, 102512, 166594, 366927, 247781, 206021, 7163, -90624, -23702, -125440, -74319, -158811, -287271, -193873, -263900, -160572, -55388, 801, -126650, -192807, -285265, -353102, -306194, -124026, 90801, 53576, 127383, -34347, -230935, 211379, 237700, 45291, 285757, 347256, 276715, 48971, -60463, 73261, 25907, -190866, 141022, -3383, -15725, -106963, -96894, -189428, 30710, 28157, 49223]
2641D9223k64736l9589J86674R7487m618J0482o0748j95983J34908j08176J65235
2630b9841J33333m3684n1513k4455K53292K82219k52024p7415q5059O9440J7998
2619A92291j62413J3423J59398q563k28330n2398J63355k02941K61452P6711k85645
2608g3660k8856K65400Q6599k44751k9969n631P3052q9687k33744J56471K37419
2597A12643k72681N2314M43761K9836J0762l192l58170k19890o8596J31105n2841
2586a94949J31133J16108j78542o7439J32637J54163l16306l3729K01275J59306
2576A03657n5335j78041j67046L55119k10472J93602J2578L9768j22156r0885
2566a19211O3520l2555R8649J55792N2464L27363j79586q1184j37036R876J08459
$$ y = [49223, -215513, -255102, -68428, 29059, 24441, 34923, -25825, -221808, -86900, -195076, -29841, 103492, 59808, 8295, -16160, 237132, 519351, 267327, 189912, 104853, 174293, 192291, 29878, 43301, 202699, 194136, -34194, -86592, 76763, -126178, 135274, 211985, -73660, -102516, 162884, 249483, 4732, -25237, -30868, 42184, -47503, -281247, -124776, 112643, -160038, -107724, 336037, 365873, 376635, 373443, 15273, -204617, -273213, -142108, -194949, -63816, 52292, -126250, -193689, -61052, 93111, -223195, -256924, -55649, 103657, 48322, -129719, -296765, 58354, -152118, 41484, 54062, 93830, -28326, -119211, -55691, -88246, 10403, 166195, 218659, 546022, 366436, 285252, 148216, 158092, 266551]
2555B66551k40922J88470j97995k18178q8888L56156j26465k79335R1538J47100
2545a01968j42415J25777J78171p8797p3768K60748O2524l31068l9367J56077
2535A5914J43507k602J28393q522l76183Q8745K40632j33563J16503O7882k43121
$$ y = [266551, 25629, 214099, 16104, -202074, -290962, 65194, -61271, -340606, -249068, -101968, -244383, -118606, 59565, -19232, -93000, 167748, 230272, -100796, -140163, 15914, 159421, 156819, 285212, 276690, -99493, -10748, 229884, 96321, 212824, 280706, 37585]
$$ [...]
##END NTUPLES=NMR SPECTRUM
##END=
