##TITLE=1H_CG-1229
 200.13MHz,CDCl3.
 8 sc
 
 26.1.2026
##JCAMPDX= 6.0         $$ Bruker NMR JCAMP-DX V2.0
##DATA TYPE= NMR SPECTRUM
##DATA CLASS= NTUPLES
##ORIGIN= UXNMR, Bruker Analytische Messtechnik GmbH
##OWNER= pz
$$ XWIN-NMR		Version 3.5
$$ Mon Jan 26 14:01:16 2026 Russian Standard Time (UT+4h)  she@DPX200
##.OBSERVE FREQUENCY= 200.1313
##.OBSERVE NUCLEUS= ^1H
##.ACQUISITION MODE= SIMULTANEOUS
##.ACQUISITION SCHEME= undefined
##.AVERAGES= 8
##.DIGITISER RES= 18
##SPECTROMETER/DATA SYSTEM= spect
##.PULSE SEQUENCE= zg30
##.SOLVENT NAME= D2O
##.SHIFT REFERENCE= (INTERNAL, D2O, 0, 15.4747)
##AUDIT TRAIL= $$ (NUMBER, WHEN, WHO, WHERE, WHAT)
$$ ##TITLE= Audit trail, XWIN-NMR		Version 3.5
$$ ##JCAMPDX= 5.01
$$ ##ORIGIN= Bruker BioSpin GmbH
$$ ##OWNER= she
$$ F:/spectra/data/she/nmr/H-C/1/pdata/1/auditp.txt
$$ ##AUDIT TRAIL=  $$ (NUMBER, WHEN, WHO, WHERE, WHAT)
(   1,<2026-01-26 13:59:46.46 +0400>,<she>,<DPX200>,
      <created by zg, POWCHK disabled, PULCHK disabled
       configuration hash MD5:
       00 E9 B6 7A A2 85 ED C7 34 08 36 98 17 FE 4E 26
       data hash MD5: 16K
       4F 23 22 06 45 1C 2C 86 EB 93 CF E0 18 4E 08 F8>)
(   2,<2026-01-26 13:59:49.37 +0400>,<she>,<DPX200>,
      <Start of raw data processing
       efp BC_mod = 2 LB = 0.25 FT_mod = 6 PKNL = 1 PHC0 = -3700.997 PHC1 = 7.592309 SI = 16K 
       data hash MD5: 16K
       FD FD E1 5D 22 15 1B 12 48 F8 7F F6 C0 2E 2B C4>)
(   3,<2026-01-26 14:00:20.39 +0400>,<she>,<DPX200>,
      <pk PHC0 = 0.6056414 PHC1 = 4.4 
       data hash MD5: 16K
       06 37 6D 79 FD 77 06 93 36 FF FE 3F EF 5C 8B BB>)
(   4,<2026-01-26 14:00:23.78 +0400>,<she>,<DPX200>,
      <abs ABSG = 5 
       data hash MD5: 16K
       C2 73 23 3B 55 01 02 84 DE 12 B8 A6 4E D5 06 A1>)
$$ ##END=
$$ 
$$ hash MD5
$$ 52 B9 24 E2 8D 90 64 39 2A 26 A6 89 B9 11 7C 63
##$RELAX= 
##$RELAX= 
##$RELAX= 
##$RELAX= 
##$RELAX= 
##$RELAX= 
$$ Bruker specific parameters
$$ --------------------------
##$DU= <F:/spectra>
##$EXPNO= 1
##$NAME= <H-C>
##$PROCNO= 1
##$TYPE= <nmr>
##$USER= <she>
##$AMP= (0..31)
100 100 100 100 100 100 100 100 100 100 100 100 100 100 100 100 100 100 
100 100 100 100 100 100 100 100 100 100 100 100 100 100 
##$AQSEQ= 0
##$AQ_mod= 1
##$AUNM= <au_zg>
##$AUTOPOS= <>
##$BF1= 200.13
##$BF2= 200.13
##$BF3= 200.13
##$BF4= 200.13
##$BF5= 200.13
##$BF6= 200.13
##$BF7= 200.13
##$BF8= 200.13
##$BYTORDA= 1
##$CFDGTYP= 0
##$CFRGTYP= 5
##$CHEMSTR= <none>
##$CNST= (0..31)
1 1 145 1 1 1 1 1 1 1 1 1 1 1 1 1 1 1 1 1 1 1 1 1 1 1 1 1 1 1 1 1 
##$CPDPRG= <>
##$CPDPRG1= <>
##$CPDPRG2= <>
##$CPDPRG3= <>
##$CPDPRG4= <mlev>
##$CPDPRG5= <mlev>
##$CPDPRG6= <mlev>
##$CPDPRG7= <mlev>
##$CPDPRG8= <mlev>
##$CPDPRGB= <>
##$CPDPRGT= <>
##$D= (0..31)
0 0.7 0 0 0 0 0 0 0 0 0 0.03 0 0 0 0 0 0 0 0 0 0 0 0 0 0 0 0 0 0 0 0 
##$DATE= 1769421585
##$DBL= (0..7)
120 120 120 120 120 120 120 120 
##$DBP= (0..7)
150 150 150 150 150 150 150 150 
##$DBP07= 0
##$DBPNAM0= <>
##$DBPNAM1= <>
##$DBPNAM2= <>
##$DBPNAM3= <>
##$DBPNAM4= <>
##$DBPNAM5= <>
$$ [...]
##$SUBNAM3= <"">
##$SUBNAM4= <"">
##$SUBNAM5= <"">
##$SUBNAM6= <"">
##$SUBNAM7= <"">
##$SUBNAM8= <"">
##$SUBNAM9= <"">
##$SW= 18.0517328524113
##$SWIBOX= (0..15)
0 0 2 0 0 0 0 0 0 0 0 0 0 0 0 0 
##$SW_h= 3612.71676300578
##$TD= 16384
##$TD0= 1
##$TE= 0
##$TE2= 300
##$TE3= 300
##$TEG= 300
##$TL= (0..7)
0 120 120 120 120 120 120 120 
##$TP= (0..7)
150 150 150 150 150 150 150 150 
##$TP07= 0
##$TPNAME0= <>
##$TPNAME1= <>
##$TPNAME2= <>
##$TPNAME3= <>
##$TPNAME4= <>
##$TPNAME5= <>
##$TPNAME6= <>
##$TPNAME7= <>
##$TPOAL= (0..7)
0.5 0.5 0.5 0.5 0.5 0.5 0.5 0.5 
##$TPOFFS= (0..7)
0 0 0 0 0 0 0 0 
##$TUNHIN= 0
##$TUNHOUT= 0
##$TUNXOUT= 0
##$USERA1= <user>
##$USERA2= <user>
##$USERA3= <user>
##$USERA4= <user>
##$USERA5= <user>
##$V9= 5
##$VALIST= <valist>
##$VCLIST= <CCCCCCCCCCCCCCC>
##$VD= 0
##$VDLIST= <DDDDDDDDDDDDDDD>
##$VPLIST= <PPPPPPPPPPPPPPP>
##$VTLIST= <TTTTTTTTTTTTTTT>
##$WBST= 1024
##$WBSW= 4
##$XGAIN= (0..3)
0 0 0 0 
##$XL= 0
##$YL= 0
##$YMAX_a= 77362
##$YMIN_a= -113906
##$ZGOPTNS= <>
##$ZL1= 120
##$ZL2= 120
##$ZL3= 120
##$ZL4= 120
##$ABSF1= 15.59762
##$ABSF2= -2.454231
##$ABSG= 5
##$ABSL= 3
##$ALPHA= 0
##$AQORDER= 0
##$ASSFAC= 0
##$ASSFACI= 0
##$ASSFACX= 0
##$ASSWID= 0
##$AUNMP= <proc_1d>
##$AZFE= 0.1
##$AZFW= 0.1
##$BCFW= 0
##$BC_mod= 2
##$BYTORDP= 0
##$COROFFS= 0
##$CY= -3
##$DATMOD= 1
##$DC= 0
##$DFILT= <>
##$DTYPP= 0
##$F1P= 0
##$F2P= 0
##$FCOR= 1
##$FTSIZE= 16384
##$FT_mod= 6
##$GAMMA= 0
##$GB= 0
##$INTBC= 1
##$INTSCL= 3.241238e-09
##$ISEN= 128
##$LB= 0.25
##$LEV0= 0
##$LPBIN= 0
##$MAXI= 10000
##$MC2= 0
##$MEAN= 0
##$ME_mod= 0
##$MI= 1.114404
##$NCOEF= 0
##$NC_proc= -6
##$NLEV= 6
##$NOISF1= 3.799351
##$NOISF2= 2.8
##$NSP= 0
##$NTH_PI= 0
##$NZP= 0
##$OFFSET= 15.47474
##$PC= 1
##$PHC0= -3700.391
##$PHC1= 11.99231
##$PH_mod= 1
##$PKNL= yes
##$PPARMOD= 0
##$PSCAL= 0
##$PSIGN= 0
##$REVERSE= no
##$SF= 200.130009398001
##$SI= 16384
##$SIGF1= 3
##$SIGF2= 2
##$SINO= 0.751879
##$SIOLD= 32768
##$SREGLST= <19F.Aceton>
##$SSB= 0
##$STSI= 16384
##$STSR= 0
##$SW_p= 3612.71676300578
##$SYMM= 0
##$S_DEV= 0
##$TDeff= 16384
##$TDoff= 0
##$TI= <>
##$TILT= no
##$TM1= 0
##$TM2= 0
##$TOPLEV= 0
##$USERP1= <user>
##$USERP2= <user>
##$USERP3= <user>
##$USERP4= <user>
##$USERP5= <user>
##$WDW= 1
##$XDIM= 16384
##$YMAX_p= 310532475
##$YMIN_p= -2411466
$$ End of Bruker specific parameters
$$ ---------------------------------
##NTUPLES= NMR SPECTRUM
##VAR_NAME=  FREQUENCY,     SPECTRUM/REAL,   SPECTRUM/IMAG
##SYMBOL=    X,             R,               I
##VAR_TYPE=  INDEPENDENT,   DEPENDENT,       DEPENDENT
##VAR_FORM=  AFFN,          ASDF,            ASDF
##VAR_DIM=   16384,         16384,           16384
##UNITS=     HZ,            ARBITRARY UNITS, ARBITRARY UNITS
##FACTOR=    0.220516191357247, 1,           1
##FIRST=     3096.95986731158, 0,            0
##LAST=      -515.756895694199, 0,           0
##MIN=       -515.756895694199, -2411466,    0
##MAX=       3096.95986731158, 310532475,    0
$$ Real data points
##PAGE= N=1
##DATA TABLE= (X++(R..R)), XYDATA
$$ [...]
8049 809437 786458 764675 591127 510021 785680 545855 534008 482101 469100 639086 624027
8038 624027 549024 875808 781601 550528 516839 450730 458978 657778 733360 819657 718926
8027 718926 664549 665637 608996 645225 650861 709744 708253 576227 592967 694011 714214 696763
8015 696763 655805 804675 878570 843301 839674 757387 670534 712920 589511 539426 582335
8004 582335 663500 559868 522329 522486 452657 364357 309454 414132 639016 522215 382529
7993 382529 468846 632694 626834 656400 472000 446027 238505 271598 483532 692083 766276
7982 766276 676886 644425 557996 498747 477471 548313 659682 599379 735080 636981 672394
7971 672394 593315 543926 570914 577481 487136 556076 687820 825378 683455 554890 548675
7960 548675 555488 704817 910447 1000822 931616 723915 402487 720251 849500 624089
7950 624089 677734 602473 437371 409964 321011 397936 687726 824374 837153 775891 738512
7939 738512 680592 673801 617962 903286 787588 672951 756589 717500 594493 577262 395703
7928 395703 643203 640247 689709 784813 743510 490383 307262 326300 382852 740091 648229
7917 648229 508406 700364 677358 357331 453403 665574 761006 662547 786815 876559 923136
7906 923136 779711 859234 946781 933534 714779 709466 738837 742497 704083 860644 1014662
7895 1014662 869177 486726 545927 618908 587250 460434 563327 688474 729467 711835
7885 711835 706075 732638 718809 651227 642117 700678 988570 954350 812739 815257 928372 764354
7873 764354 599213 518878 635653 684091 813238 704100 807962 813385 855041 711166 796291
7862 796291 711291 729030 666459 739651 761695 792818 712485 661917 724883 757209 754073 814289
7850 814289 648728 663256 661618 662511 833262 771279 674178 751815 643427 582991 539141 590839
7838 590839 834256 995632 957298 925194 1068519 1065081 1233753 1229769 990193 916644 1090837
7827 1090837 1240915 1354270 1296489 1184430 1030518 1035280 894011 1002555 933382 943261 896278
7816 896278 771739 565001 786508 913952 975199 863877 959720 1075931 1177618 1026452
7806 1026452 1096229 1100330 1199937 1137995 1228738 1083780 1237565 1221710 1332449 1291234 1338795
7795 1338795 1183901 1216325 1184341 1177836 1324938 1303922 1131980 1148360 978459 948935 1178006
7784 1178006 1177802 1054088 1102147 1106235 1223933 1282922 1086014 949011 1000775 1014994 949553
7773 949553 1132845 1161249 1001703 980707 1161798 1208797 1082403 1146016 1196437 1433749 1317709
7762 1317709 1247354 1484085 1510308 1508075 1628930 1722988 1750788 1786705 1730797 1754118 1649930
7751 1649930 1569763 1404604 1473175 1444301 1371849 1403486 1459132 1261441 1102500 1285899 1402746
7740 1402746 1418089 1492429 1398816 1352799 1592807 1673542 1533798 1688701 1726553 1705248 1600560
7729 1600560 1760045 1852104 2077950 1962050 1941263 1751835 1784079 1766261 1916365 1789620
7719 1789620 1763851 1637107 1739613 1734076 1727691 1754408 1818453 1674534 1406496 1503068 1979656
7708 1979656 2038710 1992316 1961915 2044426 1897121 2027164 2151547 2170121 2065773 2011134 2042988
7697 2042988 1994252 2055558 2124924 2071828 2107966 2139043 2148388 2194402 2186154 2172181 2108350 1995560
7685 1995560 1878039 2222415 2199158 2117428 2019950 2124585 2043063 1953064 1954932 2111986 1856133
7674 1856133 1982979 2028180 1963693 1824866 1947674 2005760 2325836 2287609 2168463 2331086
7664 2331086 2437887 2268590 2543037 2628020 2506549 2223914 2445060 2282289 2347515 2563265
7654 2563265 2489799 2465368 2479685 2482849 2434801 2528852 2430384 2346949 2476990 2417422 2303352
7643 2303352 2408508 2172297 2325682 2384936 2462580 2219078 2193722 2342468 2374597 2083629
7633 2083629 2175571 2232752 2460283 2575216 2300359 2331881 2324011 2134265 2334814 2488995
7623 2488995 2470289 2416145 2622681 2617798 2538115 2604538 2493919 2588973 2845232 2919984 2894799
7612 2894799 2894574 2895637 2816127 2771742 2743784 2714650 2820689 2730004 2531098 2556834 2678565
7601 2678565 2566449 2466337 2449232 2220413 2188660 2398129 2313918 2209857 2142981 2040785
7591 2040785 2391652 2414083 2418352 2292727 2182624 2144492 2195653 2325928 2442691 2570051
7581 2570051 2494909 2479928 2491395 2604666 2557521 2460068 2523089 2511278 2380291 2437858 2466390
7570 2466390 2285781 2377796 2397864 2251056 2340480 2505961 2366010 2413099 2404540 2335495 2179759
7559 2179759 2359030 2315813 2205825 2036685 2001216 2177929 2135722 2118070 2254117 2192471
7549 2192471 2074732 2104903 1987306 1996593 2140281 2159204 2156129 2191563 2188879 2401235 2384044
7538 2384044 2284112 2099674 2318000 2432653 2538939 2415804 2499266 2466056 2428543 2259343
7528 2259343 2380719 2349101 2347030 2131167 2193379 2252373 2037167 1994696 1939809 1949061 1883579
7517 1883579 1652633 1685333 1660121 1660947 1562187 1604822 1759083 1883158 1809304 1840693 1930688
7506 1930688 2083955 1970785 1883651 1738511 1617703 1766067 1855810 1702138 1768368 1725747
7496 1725747 1750644 1718327 1670232 1611457 1599057 1611315 1586916 1617886 1593640 1566035 1639390
7485 1639390 1752688 1774445 1660950 1645365 1572028 1468385 1656971 1714347 1689179 1508966
7475 1508966 1548471 1706954 1692076 1405152 1537900 1538752 1549792 1374189 1401017 1295981 1290206
7464 1290206 1249299 1287471 1219108 1461482 1346794 1473822 1446679 1271648 1322451 1269167 1225522
7453 1225522 1391389 1214630 1136535 1036869 977124 937254 1097673 960474 984144 1081493 961675
7442 961675 999283 957836 965691 1209545 1031181 1075903 1110945 1058360 1084331 1060950 1165772
7431 1165772 1225935 1386759 1301704 1353803 1371719 1372619 1373351 1187724 1220888 1173146 1186847 1315325
7419 1315325 1345321 1239383 1089434 752488 792574 1002778 939790 950217 742853 819373
7409 819373 689152 805123 874427 931675 819123 1022148 1018219 935034 938012 1129659 977998
7398 977998 1084732 983242 1010294 1051148 1091770 1056028 968062 1057879 959892 889508 998616
7387 998616 1002020 865898 736025 647188 739915 737325 843123 670699 689696 577760 495047
7376 495047 568409 599557 734629 770071 709038 682248 678788 712729 404945 514578 681095
7365 681095 515724 734470 901881 711263 754742 763435 801067 913198 940415 881804 875306
7354 875306 734785 680143 686337 736684 700681 849261 895343 862876 778988 680834 733012
7343 733012 854203 886453 778638 677594 606724 559212 514230 571022 715967 658428 599392
7332 599392 499554 499647 626234 533292 571673 493149 454711 241015 305646 463594 435677 363895
7320 363895 446067 446766 634241 588345 542552 372064 432851 519522 367438 307790 375423
7309 375423 501665 565737 518107 703729 706765 539008 439854 457799 639264 643219 538485
7298 538485 591314 629982 466351 480341 424971 472567 516128 543170 580866 501664 358907
7287 358907 368860 559265 289739 296684 429982 388282 326732 448882 206915 289513 332078
7276 332078 259102 308929 377937 388979 297252 271180 285045 329945 321452 314841 317202 391129
7264 391129 295501 351530 481511 422769 328702 417288 581193 640062 623120 521404 445909
7253 445909 541145 393533 267865 441356 612154 343079 336743 295684 95968 29068 295304
7242 295304 296991 393624 140449 23664 211001 245352 286010 233514 351407 540421 502421
7231 502421 355167 466080 495152 536010 489490 516910 446356 525421 387197 418112 505126
7220 505126 295053 206850 145945 235337 158476 133057 23795 101563 62072 86368 263826
7209 263826 309619 75634 116383 22916 121665 458811 303366 186396 177313 101292 155739
7198 155739 156784 280666 159226 206363 394918 331293 182129 211866 340349 256890 224920
7187 224920 274457 289572 441873 314656 85136 149130 89328 765 175294 237987 193360
7176 193360 229250 55042 18035 164034 23205 -245 93550 201982 127315 8266 -117610
7165 -117610 -4063 94510 146481 132946 189100 152163 215747 200506 169894 174844 154087 328848
7153 328848 260462 241758 278988 385468 442344 607234 591145 468166 407587 160353 153183
7142 153183 408700 258258 250617 130546 230801 152601 195010 -8891 -80234 45311 -40271
7131 -40271 -12279 20117 -80305 -164913 144647 292498 345902 295789 92938 96253 157001
7120 157001 374042 273785 317490 524390 398252 279014 164327 123640 140695 62030
7110 62030 37246 5404 189446 158358 114674 33507 -243243 -145761 -66669 -203224 -227635
7099 -227635 -205278 84809 79622 34521 -3159 28190 49947 170670 177459 233306 143953 14960
7087 14960 241486 414655 314077 145172 324598 288802 136345 169282 294646 358002
7077 358002 352962 91799 112662 181946 140252 128392 255101 283298 146703 -7341 133733
7066 133733 118024 150790 126016 81556 242807 287573 130449 217764 102313 -151952 -194884
7055 -194884 -144324 32648 63587 19941 -68093 -16058 -25938 -115707 29384 89397 -39315
7044 -39315 -53070 -10249 101623 78829 173377 271134 207562 157701 28622 91784 418748
7033 418748 261229 128651 187971 198391 199831 142866 211510 67056 149569 347727 291562
7022 291562 263118 186195 110522 36405 264123 77606 64494 162882 143964 -46822 -36573
7011 -36573 182611 234680 33407 152782 -36751 155678 202040 -12084 114134 155370
7001 155370 7009 -2207 -46978 208679 305226 90011 -130561 -90115 -37635 -99125 -46200
6990 -46200 -116171 -163478 -305997 -139749 -199646 -74628 -162286 -111296 -6085 183932 -8843
6979 -8843 -79979 -55456 131432 19331 134980 46361 68048 -3406 19988 -11573 72547
6968 72547 52650 143801 81877 164463 -75357 -43464 178357 171808 47644 135310 20764
6957 20764 167658 92883 40990 -7823 -48284 14806 134217 227917 212832 5316 16498
6946 16498 78063 78687 126497 197841 219277 39828 148249 322505 253329 212401 74994
6935 74994 106619 228975 31557 -17340 -91358 -250336 -324901 -107677 40372 135683 60203
6924 60203 95097 -74784 -169330 -156745 46181 87923 67965 -37593 71787 -260032 -139594
6913 -139594 110890 236522 96850 -34710 22687 140303 164819 214208 22281 20366 -28922
6902 -28922 -20724 22662 206531 -21722 -19730 58874 167367 43116 55349 -225811 -149193
6891 -149193 -180454 -380937 -239194 21565 -27268 3745 -174407 -111766 -44602 -43151 -127444
6880 -127444 -4503 -69083 -71509 -96477 -53761 72403 132215 -37538 91414 242915 -117050
6869 -117050 -20818 49277 166484 221232 350013 306222 176991 -8881 23445 48243 239773
6858 239773 366474 241704 182257 205928 179423 142831 -7407 -1826 -123385 71570 -1563
6847 -1563 -125606 -267375 -345367 -314948 -115107 -162912 -156403 -49208 -113875 -184941 -125034
6836 -125034 12366 5973 -133558 -6117 6011 25905 -76979 -47231 -30934 38661 111890
6825 111890 54774 96597 72156 -210789 -9059 64224 -60492 -54281 58854 1704 105480
6814 105480 -104709 -159899 37638 142893 -39891 -198230 -181077 1026 -53768 -18232
6804 -18232 147559 219092 92335 8018 119045 190016 122671 181325 330355 192283 71447
6793 71447 176800 127927 -108727 6322 74722 38006 -77027 -269426 -190036 -124498 -186293
6782 -186293 -52237 -63110 -58469 -15342 -95849 -302041 -88043 100835 -15079 -101783 -178403
6771 -178403 -116217 -137479 -28212 27994 32071 12247 -29199 -13921 65077 112259 -518
6760 -518 -29353 -112982 -133115 -62791 103675 130801 19942 12850 40585 -27219 148109 154704
6748 154704 215841 241624 103637 -91382 85668 237087 181979 65034 247857 110740
6738 110740 -92805 -49622 11949 -59578 -86854 -100848 -145016 -278178 -291498 -369406 -166700
6727 -166700 -204067 -282671 -124164 -89463 -293128 -297206 -244709 -347496 -232412 -84562 -47087
6716 -47087 132411 -89688 -220681 -24863 -197554 -63157 63140 -15446 -75478 -168618
6706 -168618 -94038 86627 13001 -168792 -154994 -126796 -201325 -385989 -549184 -249797 -108157
6695 -108157 -294219 -183239 -24156 26727 -88521 -231498 -158151 -23649 -68278 -1813
6685 -1813 257017 109240 94389 -44698 -98577 27981 42865 191919 259486 12767 86753
6674 86753 138049 210709 141271 95765 178692 125950 -93896 -84897 156578 -4596 -303174
6663 -303174 -275646 -108768 -241976 -145352 -170768 -193922 -148579 -179550 -289232 -245387 -187030
6652 -187030 -280293 -91645 -21804 -65780 -1471 34827 -60733 -135929 -254924 -53207 102756
6641 102756 382437 268062 5112 50608 234819 80745 194050 131139 77450 124627
6631 124627 -122902 -247921 106050 -17200 -135561 35327 -90296 -123243 -50354 -2704
6621 -2704 -206421 -304848 -202956 -76221 -69920 -92649 -140244 -152847 -220048 -454020 -332679
6610 -332679 -290560 -172671 -65070 23064 132256 46697 145196 18373 14948 129799 91897
6599 91897 65204 196983 76895 -27462 8470 39286 31861 64424 -170271 -198006 -91985
6588 -91985 -27537 -108147 -100504 -261555 -57727 -85846 -201963 -217258 -169223 -298739 -148183
6577 -148183 -127243 -178484 -247878 -210309 2491 -37345 -82004 260109 216223 140231 187081
6566 187081 167224 195886 230333 -26538 -15410 266691 276290 218985 75282 31221 -3101
6555 -3101 -120703 -178450 -26389 -75521 -264066 -509071 -445169 -364639 -277825 -294898 -222647
6544 -222647 -197447 -115223 -51152 -135195 -170776 -118898 -163909 -154606 -67988 -10032 -3693 134582
6532 134582 23553 100437 155309 91201 234211 374194 237022 277061 235575 48463 4611
6521 4611 44083 8771 -44283 -201894 -249601 -217650 -329119 -292227 -149949 -107314 -145359
6510 -145359 -183602 -215475 -217545 -259680 -326057 -107543 -74434 -235396 -164170 -156198 -75106 100619
6498 100619 -39115 -190910 16677 -113500 -115507 -154477 -61602 124250 -22096 -254287
6488 -254287 -269220 -171747 -152707 84285 56775 -81744 -46717 -212723 -134902 97598 -216910
6477 -216910 -291413 58685 167958 -74355 -33337 -73044 -151050 -174570 61509 147370 27653
6466 27653 51996 751 2315 9784 -122314 -59390 38001 -5515 -53639 129747 -200039 -190263
6454 -190263 -66882 47604 -50438 -146978 -220907 -320598 -111424 -323160 -601741 -437019
6444 -437019 -278387 -245618 -175946 -318771 -208266 -146286 13387 16212 93361 97505 91971
6433 91971 23051 15897 117427 45687 123655 76370 119547 314009 -89301 -155860 34143
6422 34143 -37571 33008 150939 -73818 -84307 87143 -139954 -301354 -160634 -175344 -192506
6411 -192506 -129546 -203585 -209893 -119742 -193665 -232920 -196625 -74909 -26441 48868 -35668 -150290
6399 -150290 -163046 -183064 -149450 94929 291263 72667 -26539 87266 43183 146649 108266
6388 108266 -136910 -117933 -246227 -490105 -267137 -6602 -138293 -258542 -115629 -215030
6378 -215030 -194661 -201160 -43555 -48345 -283743 -329475 -168526 -51407 80841 164690 145707
6367 145707 130709 -25777 -246653 -178021 -46647 -83629 -179530 -144367 -36724 92968 -151565
6356 -151565 -10937 151495 43919 -67601 -165843 -120016 91383 -102355 -11972 -23230
6346 -23230 -143497 -87829 -25812 -10031 66718 -36271 -132548 -4282 -54801 52666 58826
6335 58826 -22358 -134644 -109163 -8697 -11668 -159044 -115779 -153484 -179347 -155225 120813
6324 120813 3986 -76216 -125962 -83917 -36508 -111451 57666 224510 113736 189575 321721
6313 321721 164185 -41698 26284 47265 -70882 -67104 77225 34515 155429 100781 -90062
6302 -90062 -116250 149357 137847 207327 107711 141424 -92881 -47223 -95462 -16796 -206919
6291 -206919 -210974 -260187 -58202 96847 79641 16496 41456 -8345 -122811 -192702 41955
6280 41955 139318 8122 150150 152567 -55745 -67785 37374 115150 -8089 -123790 -69761
6269 -69761 -46162 37910 -27284 -122265 -116324 11468 -231567 -217023 -42784 -83428 -294563
6258 -294563 -336174 -189579 -178259 -219180 -55408 -85669 93232 37108 120041 63758 160833
6247 160833 -20503 -80373 -12528 184985 79459 100455 117573 203986 269902 65492 -15367
6236 -15367 -92695 -229019 -142854 -18015 -39296 -132795 -148739 -208248 -99323 -58664 -62428
6225 -62428 104488 308225 208999 142073 522221 744652 715743 720018 781862 870216 715958
6214 715958 492021 454458 486489 593512 582260 656630 631767 378799 200292 243672 254022
6203 254022 189743 213745 234633 336605 222655 -40515 42518 224974 109978 171791 409405
6192 409405 395717 408968 667278 896232 1194601 1214232 1257048 1243413 1230104 1217006 1003700
6181 1003700 884998 912432 830773 766467 701215 510500 497912 568847 425454 461148 388818
6170 388818 281359 348749 407463 130421 -3799 179586 223912 203549 217940 267771 217991
6159 217991 81717 -33488 37569 150312 483351 671073 930679 918669 785201 799666
6149 799666 683273 721803 590982 553588 312810 346083 243435 120914 41655 129513 89130
6138 89130 44591 26658 91044 164229 210271 100012 -115130 32266 -33674 -93705 -17394
6127 -17394 27918 -59191 -129958 -199069 -52900 -67231 77048 -147405 -133241 -120581 -47372
6116 -47372 -139244 40651 -70702 -182755 -245542 -324481 -305629 -143198 -192039 86097 47686
6105 47686 -106907 -51336 53986 201261 73534 -210792 -44824 27817 -134755 -16700
6095 -16700 61360 -63635 -121663 -304204 -390637 -117214 -29035 -47025 203851 202470 -14480
6084 -14480 -193620 -33771 129098 138880 68608 -45549 29309 -55260 -108901 24298 160866
6073 160866 127642 33673 282954 78295 -1773 46646 167992 95972 20746 -76165 -195781
6062 -195781 -32710 -35384 -178066 -39079 82913 83764 104350 118010 -6044 -103403 -19573
6051 -19573 -235981 -49706 -176076 -309062 -290859 -185305 -265118 -199937 -2033 63168 -88744
6040 -88744 11970 -31143 20408 -110310 -154823 12690 128253 -10121 -84668 129204 217091
6029 217091 80559 3099 -67731 -37 -17107 133802 34907 116923 -32924 -179595 -119962
6018 -119962 30518 -9017 15626 54434 67587 63980 15654 -21838 40757 -58516 -253995
6007 -253995 -257599 110280 97709 -23343 136811 235661 -4634 -206769 -162006 76245 168879
5996 168879 159515 132398 199782 -23620 -234630 -21180 99826 78662 105950 -1385 -92870
5985 -92870 -101176 -51892 155896 410518 445196 210682 80291 33097 18394 -10854 19834
5974 19834 -41395 18477 80911 72351 19328 -47693 -280697 -227808 20341 20909 81238 148032
5962 148032 -100126 -184627 -116765 -131132 -35139 200631 15035 44355 210395 245416 125256
5951 125256 265835 377909 308285 29753 23033 -13691 -12337 -165013 -182636 -214699 -187460
5940 -187460 -325456 -334333 -259660 -297181 -88961 34542 -157283 -337667 -116401 -86333 -152745
5929 -152745 -9113 -859 -35872 -50238 42229 -52897 -59208 -86380 -114563 -54403 -1784 -80470
5917 -80470 -92802 -28553 -15057 82533 -26876 -79555 67497 195762 145178 -49897 -26435
5906 -26435 47162 -44936 64858 148932 -167377 -44311 -164206 -176568 -165844 -192774 -259522
5895 -259522 -104210 -177112 -341842 -429257 -391808 -349850 -146472 -29327 -169494 -289272
5885 -289272 -343013 -219571 -219578 -84499 14143 -7392 316721 342403 155663 174761 158443 166745
5873 166745 197768 300214 111469 31004 -223234 -269836 -246068 -158134 -193272 103839 91040
5862 91040 17099 -276646 -257089 -126270 -36708 -195301 -121092 88170 -100411 -304541 -37529
5851 -37529 115113 90873 28999 18004 71147 144656 -59190 -34330 -39479 -80555 -94217 77470
5839 77470 54769 -16573 75170 63524 -100660 -299584 -140768 90291 23428 -72434 -30121
5828 -30121 -5650 -82987 -1329 -33071 33685 -3334 -47450 -118450 -64553 37936 53245 108451
5816 108451 -18498 11161 -27719 23189 -130300 87981 40117 -4368 227571 336109 269714
5805 269714 116984 29667 296047 289971 409419 228891 256822 238837 54474 30885 38204
5794 38204 27107 56641 158086 199660 214111 -55555 -138989 10231 24357 -81024 -35006
5783 -35006 168570 -56423 -59558 93335 228162 158619 183791 357547 482139 476138 273188
5772 273188 210886 370952 288393 345843 502492 432947 367870 378487 287405 130426 230402
5761 230402 176802 92119 19841 70744 -202642 -117996 92536 160510 143260 116795 191703
5750 191703 180413 239439 269930 321601 318449 101387 100767 289177 305586 294323 427960 464679
5738 464679 531313 444451 478754 586436 698068 502031 554775 663733 706217 734003 801767
5727 801767 871566 942995 977848 967920 1089506 1029474 881185 933948 1181729 1189424 1466180
5716 1466180 1448969 1695159 2053190 2539592 2956657 3840813 5602215 8812143 14215222
5707 14215222 20150812 21340289 19155910 16263913 12169592 9200337 7027206 5370297
5699 5370297 4074241 3161174 2414214 2127954 1906094 1869841 1574714 1458551 1587303 1366815
5689 1366815 1149676 1107487 1010257 975628 800882 608249 543947 493019 330547 297979 407912
5678 407912 313042 414489 470208 404793 394092 329728 231156 253734 256043 130581 123397 295006
5666 295006 271955 60630 134842 232274 290191 395292 332187 308543 340027 172270 43831
5655 43831 388950 388556 245724 282831 333735 213657 210134 407147 289636 327352 353900
5644 353900 234572 400619 349666 249947 209024 252878 132297 225599 237709 225759 122575
5633 122575 144043 -41743 -48910 20740 55042 3720 64126 -49212 -67522 -51914 -1564
5622 -1564 -23681 36866 90425 -57407 15651 65648 -134641 -6225 115445 -66822 -2152
5611 -2152 21615 40299 66495 133943 82095 45807 183492 273770 191172 145581 75031 70439
5599 70439 173680 457723 382743 365093 350910 218996 125813 261617 100036 169521 319315
5588 319315 -4388 -107128 -68075 -305706 -339871 -258930 -206575 -116133 32369 -130980 -131237
5577 -131237 -19545 170427 9791 71334 116888 45601 -38271 53932 92645 355136 243797
5566 243797 48709 175350 274359 158630 81055 4843 -97417 -58003 35401 -14677 221340
5555 221340 197036 -116173 -156815 -12546 -8859 -159696 72080 146853 -58401 -69951 -31834
5544 -31834 -205170 -184132 -238764 -219986 -96055 -115016 -193149 -35813 -82869 -145409 -175746
5533 -175746 -157803 -409183 -182929 -141044 -191089 -198095 -192275 -245426 -130248 -45004 9653
5522 9653 186838 145344 -16961 180153 379719 256308 236825 287938 331289 315245 150082
5511 150082 237881 107172 84600 224596 279876 228582 138589 75638 130487 91285 -120083
5500 -120083 -50918 -25693 86454 126565 99410 104833 74759 -7950 -97380 -170993 -149287 -143241
5488 -143241 38513 -71157 -129133 -135052 -42922 -53531 -139217 13892 -37506 -236128 -183446
5477 -183446 -24901 -26383 80170 112487 -123905 -174017 -91995 -24198 -40559 -132016 -64592
5466 -64592 51935 28452 -204378 -206386 -174741 -199772 -218341 -104496 -123306 -74127 -166449
5455 -166449 20334 60050 -1499 103276 85806 166537 355833 74899 76678 136597 146544
5444 146544 138011 161542 146175 -7028 -55041 -298669 -166573 54372 -73007 -162046 -111982
5433 -111982 -156381 -162126 -201020 -164128 -183024 -149067 -53490 -61459 -95037 -89088 -159357 -43507
5421 -43507 134157 219548 99994 208968 108468 1241 108269 104080 -42895 76639
5411 76639 -32060 -2986 99525 -131442 -181734 -48086 20510 -96421 -58552 -4752 -109204
5400 -109204 -14219 -171267 -191462 -178942 -316696 -239073 -80737 117956 21398 -348197 -164249
5389 -164249 -318434 -321130 -135250 -84761 -5624 86199 -34661 32233 154024 16048 239981
5378 239981 346232 210888 37582 166548 23106 54842 192146 289326 163321 217069
5368 217069 23210 -115102 -72471 -223415 -324951 -218443 -285635 -145331 -224070 -148125
5358 -148125 -253074 -310300 -338420 -461947 -442537 -310977 -238946 -203007 -131314 -193956 -173027
5347 -173027 31285 6529 -166329 -199464 -182245 -187554 -89798 65879 90397 201383 141900
5336 141900 20337 -5794 77426 32433 37580 183938 145870 81440 168669 -27409 32883
5325 32883 79530 59559 -82176 181045 102695 87498 176385 183800 76381 319080 62906
5314 62906 -22204 158798 -19118 -320031 -187160 -337445 -401311 -149684 -207875 -237099 -244086
5303 -244086 -393705 -368016 -229530 -53281 -41649 -91654 -31528 71755 141421 105723 200306
5292 200306 56653 265586 154028 146718 308537 73419 -4994 65204 -52371 -68721 2832
5281 2832 102352 -16314 -36906 -240155 -290136 -288708 -393075 -501877 -299336 -357496 -414546
5270 -414546 -490649 -233691 -214302 -116001 42912 -65270 -112371 -188580 -85835 52644 194896
5259 194896 119488 116575 140786 71956 336074 421155 -112482 -271265 -17729 13733 41936
5248 41936 -5625 -294317 -257723 -65075 -30994 -136875 -96482 -28314 39109 67016 -20930
5237 -20930 -288048 -98245 171518 -11994 115589 110818 131090 205957 -13244 -352021 -164193
5226 -164193 52640 -104619 -196754 -211467 -305265 -368868 -189733 -273485 -148108 -11989 -159515
5215 -159515 -173069 -132690 -82605 -194105 13791 -122725 -263290 -25120 -33782 83939 151409
5204 151409 -101847 -205163 -101158 -136792 -214778 -153722 5481 -123370 -253271 -222694
5194 -222694 -39419 197219 106841 -185104 -245241 -212875 -371867 2117 212872 110932
5184 110932 -28610 37916 115243 -40658 -178508 -150297 -75228 -22012 -122311 -70537 65708
5173 65708 110118 -86235 -245076 -70101 -130316 -222677 -249671 -206673 -247485 -37763 -8773
5162 -8773 -128927 -74310 -18010 -99508 96594 -62475 -40603 132183 130174 349580 267595
5151 267595 215701 227190 299638 130848 123962 101663 -47798 -55942 9990 12373 -8176 -33604
5139 -33604 -199022 -204686 -187527 -156083 -186149 -69853 22502 -123494 -294520 -147276 -195572
5128 -195572 -244651 -251357 -252455 -302628 -263171 -329040 -65668 110656 160146 73635 114168 -41726
5116 -41726 38461 -4158 -22132 -3447 -127295 -6231 -208654 -188423 -34881 -104659 -175093
5105 -175093 -106583 -134584 -37755 -4530 -73937 -249935 -157607 -159221 -54981 -91509 -173293
5094 -173293 -7883 -111525 -217793 -189025 -67912 -36719 92335 12936 -1746 145429
5084 145429 277270 -25818 112118 236879 249298 132621 28798 109941 54850 -129565
5074 -129565 93933 -179124 -512989 -371739 -326746 -133527 -205726 -362792 -525559 -429963
5064 -429963 -444484 -383865 -230625 -8693 -286043 -41850 126342 214870 314601 302384 145788
5053 145788 140082 125051 156403 132485 140795 172152 22638 -63585 36875 160179 102264
5042 102264 -215855 -287960 -66848 -306801 -236126 -64445 -113939 -225507 -171656 -278389
5032 -278389 -204822 12323 -89697 -77285 131430 -135936 -119251 149606 29674 92183
5022 92183 84236 -14815 -50894 -3477 -32220 107110 60457 -104407 -473126 -410010 -292538
5011 -292538 -215667 -246541 -104690 -172706 39873 -85528 -284048 -284028 -172894 -78588 135582
5000 135582 79273 -88262 76231 -19351 -323270 -241651 77820 -46437 25298 164959
4990 164959 86838 145308 41928 -99362 -62413 100450 135166 83889 13930 -80860 -123166
4979 -123166 56912 220722 246057 228656 28699 -68375 197426 154445 -10313 62126 10645
4968 10645 -52820 85303 176179 1160 -38490 89794 240798 294404 316056 64833 163142
4957 163142 358422 232123 419788 702305 887284 1064530 1056442 1129944 846635 757122
4947 757122 618949 584613 464101 396130 112543 299644 277529 -101871 -141238 -128689 -70368
4936 -70368 -3084 50580 76045 27432 188950 229053 275998 181634 217044 332156 536542
4925 536542 574941 566354 647886 885212 967707 1038148 1222164 1341004 1314325 1383336 1245558
4914 1245558 1256487 990568 612858 338518 345289 81674 -33178 104803 300168 159163
4904 159163 49813 -28255 124049 292145 214213 170761 297956 202270 228204 266804 246977
4893 246977 113210 157302 126042 131488 434016 462063 405182 756855 810227 666289 815146
4882 815146 767188 593213 314855 370414 264924 246712 187884 188961 233818 242223 134454
4871 134454 236980 201543 184476 66510 166086 85841 17247 51064 86891 94619 180582
4860 180582 -71209 13609 -82472 -119314 -349562 -159324 -64467 -79753 -191736 -178724 -247954
4849 -247954 -170188 -301275 -16475 108175 164364 -69740 -19488 -14712 -84670 -3391 194742
4838 194742 40237 47929 -20109 167954 215524 102474 115621 -72194 -100406 -3936 -84225
4827 -84225 63820 238303 2899 -57824 -48379 -47865 -76637 159932 67853 -9788 -219123
4816 -219123 27789 126538 186968 78161 105623 -61937 81900 82774 123550 91601 93719
4805 93719 -41830 -36927 -58103 -125293 -74971 -220439 -229023 -190251 -283007 -214621 -43714 -161580
4793 -161580 -183257 -194074 -304260 -291295 -93551 29027 36347 -38705 -93701 -68929 -61437
4782 -61437 -144324 -113151 -128851 -134592 -56730 9543 -52261 -89854 -130895 -62046 -120310 -154391
4770 -154391 39923 -22780 487 27525 -83712 -156974 -225936 -189848 -150720 -91865 -112553
4759 -112553 -66628 -115847 -209411 52406 80708 -221893 -203080 -123647 -145888 22501 24065
4748 24065 68815 10428 23034 -224756 -267771 -15009 19790 -14216 -10238 -83066 -20275 -13772
4736 -13772 32290 74279 203735 -115594 -161109 -128661 -15308 110828 257999 58240 -162728
4725 -162728 -281961 -205797 -13219 46847 2345 -21750 69239 188148 111257 -53056 -46146
4714 -46146 53602 -225 -128939 -60106 -7460 -150886 -171542 -133940 -146220 -156816 -178254
4703 -178254 -174507 -121503 -31909 -101248 -68397 -48079 -222456 -63774 73848 46118 17186
4692 17186 -35152 -52092 196020 141859 92809 192131 142768 179123 -20888 -178301 -47903
4681 -47903 2718 -70587 -83409 -158612 -215851 -303441 -325879 -341666 -161215 -337855 -287607
4670 -287607 -135448 -85301 -150337 -145388 -280525 -344072 -411501 -185768 -203902 -182201 -405259
4659 -405259 -253418 106931 94734 -57775 139901 39430 58372 26394 99605 149438 87594
4648 87594 -77033 -182541 -159101 -38735 -137111 -109514 -18798 -199615 -223563 -140351 -189801
4637 -189801 -247986 -291786 -409954 -282784 -308920 -234305 -73929 -90443 -61851 -151594 -272569
4626 -272569 -110450 -170000 -204618 -214228 -219475 -93896 -90704 38746 74836 38939 -63105
4615 -63105 -39180 43317 -33428 -124358 -236659 -170970 -162371 -145232 -259510 -179334 -171911 -80465
4603 -80465 16050 65537 54091 -34625 -113656 8551 55713 33548 73378 142541 20770
4592 20770 119383 83343 29618 98180 9567 -35637 -130605 -200021 -25935 -11033 -80629 -112529
4580 -112529 -148058 23187 33818 -113888 -81867 -70034 -47620 -175043 -45794 -31908 -93975
4569 -93975 -183739 20366 280689 299657 197344 307513 71476 -127339 54712 271683
4559 271683 324407 41636 -26382 107075 173789 -23312 -135303 -994 -60385 -28470 -91451
4548 -91451 -108467 -309 46093 -172067 -304636 -75472 -209222 -61901 -14864 -165276
4538 -165276 -368457 -170052 -163615 -2420 -88148 -158435 63203 -52143 -202492 -232726 -130016
4527 -130016 -24222 -157458 -135973 114603 120825 -143504 -198479 -86361 24029 5267 -74390
4516 -74390 -21562 49990 31878 -41778 -51529 60292 9370 -220133 -134364 16454 -110607
4505 -110607 -208444 -131541 -229406 -216626 -223473 -315672 -12187 1858 -392764 -321075 -168335
4494 -168335 -203245 52291 336877 187862 -160132 -299498 -83516 -110941 -239720 -130249
4484 -130249 83151 94990 -88951 -155823 -125411 31234 -259284 -328204 -42489 -15537 36235
4473 36235 245795 213681 118668 -62064 -296874 8679 111060 -35507 44027 74657 -1947
4462 -1947 146818 91615 3510 -890 56897 -50777 -75564 -106045 -114457 26835 139305 18803
4450 18803 44107 -63734 -181212 -91386 -177106 -152972 -90656 152697 33687 -81936 -114735
4439 -114735 -124364 -239747 -291886 -206254 4534 46926 40103 -164905 -250143 -111463 -47534
4428 -47534 158336 173133 35059 131248 79056 -121787 101176 -66763 -109089 -11456 64700
4417 64700 -20277 61618 7468 -31455 161557 114049 -187051 10703 16781 -100384 -62419
4406 -62419 157192 -151265 -213649 -84082 32771 -163624 -271061 -207952 -92667 10726
4396 10726 -152398 -69480 135744 -101557 -284114 -44312 57120 -5004 -195665 -221092
4386 -221092 -127381 -98379 -204103 -65955 230928 275038 -60482 217279 248112 100241
4376 100241 -79046 168438 102231 126331 92246 -39463 19099 75820 -163240 -155847 -175282
4365 -175282 -224481 -412574 -115323 -61763 -150447 -185864 -86507 -74926 61247 -63846 199488
4354 199488 269129 221778 -43165 185526 154593 -9591 76781 71141 -72552 -198524 -85533
4343 -85533 -52222 38107 45296 -123874 13643 159889 -25492 -107135 -75283 -234261 -384129
4332 -384129 -192467 -186800 -93184 22638 -50256 -286231 -110747 -137905 -243192 -123009 120673
4321 120673 -198151 36609 -69692 -105862 12038 11437 4859 159537 -67263 -137867 -275662
4310 -275662 -104103 -139520 -85935 -118978 -182367 -372949 -263841 -275364 -303784 -212833 -125221
4299 -125221 -71196 142097 35625 -76320 -176851 -265578 -185001 -211416 -206971 -157446 43695
4288 43695 28533 -327599 -427503 -272099 -331708 -384391 -294845 -376162 -359448 -351388 -288042 -111162
4276 -111162 -125022 -73322 -129213 -17910 15594 -33161 -5819 138742 228200 223694 268425
4265 268425 294574 340868 115025 61628 109452 102670 161861 95424 210517 219174 -128405
4254 -128405 -356407 -383380 -186956 -4511 -71013 -245522 -286744 -397478 -559724 -410091
4244 -410091 -228131 -301348 -443582 -262078 -134292 -130308 -164259 -62962 -84537 -124984 -85370
4233 -85370 276587 272840 111964 -208662 -41930 -91537 -25495 115828 449668 414897 255201
4222 255201 97611 62908 112047 258914 202514 220998 279309 170036 -145319 -92694 175472
4211 175472 137996 66078 131173 294104 68398 45996 36290 78536 -49581 -110585 -26349
4200 -26349 171491 49642 -126805 43213 99754 -157676 -221230 -133271 -33862 13580 -93724
4189 -93724 -179817 -366947 -420967 -352759 -83305 -40444 -95130 -227710 -187140 -53688 10293
4178 10293 -4601 -189574 -205211 -56912 -104370 -388875 -254493 -82904 -91084 -116159 -41916
4167 -41916 153487 52908 -15795 83029 55871 231899 164001 246420 268909 152357 84354
4156 84354 90396 249128 22359 -96767 123373 40460 41635 -879 -59179 -18244 157834
4145 157834 114568 37502 -72099 -141149 -118326 -5611 -20984 -126204 -62606 -52917 3567
4134 3567 19074 -37096 -103771 -184480 -82463 -238344 -128579 -57483 -131728 -218214 -286758
4123 -286758 -285935 -262337 -392635 -396143 -158320 -200470 -237515 -434718 -383188 -159077 -20242
4112 -20242 -85166 -165135 -269192 -257919 -219994 -86649 -78093 -1138 45050 56961 150334 268604
4100 268604 230795 404169 510777 198687 116666 213394 205328 219716 188197 245056 80308
4089 80308 47697 18265 99644 213498 75379 -75732 96132 204161 137333 56521 136136
4078 136136 49182 -330811 -279267 -216533 -86803 -287891 -147404 -60977 -142581 -120377 -191940
4067 -191940 -152024 2894 -228544 -262833 -12884 58631 102530 22240 -64179 -75599 -5179
4056 -5179 134998 149878 207909 114926 -138087 -105356 -262063 -267143 -68997 -80172 17659
4045 17659 -110351 -205942 -35158 130786 143193 11196 -57433 49191 -24213 75921 -51174
4034 -51174 -28164 107564 9798 -268053 -17983 125634 76512 162368 130672 13357 -61434
4023 -61434 -13896 19958 -3778 -104329 -317164 -235723 -37817 -148416 -230915 -82408 -81723
4012 -81723 -152433 -73991 -198760 -88706 89786 -142557 -195443 84629 160141 67628 97794
4001 97794 112829 88657 314483 206511 4966 132538 106633 -157649 -153356 -259437 -157091
3990 -157091 -80510 160969 34080 132233 85467 79506 175492 -133491 -39324 105632 87599
3979 87599 -73719 8940 231187 94114 43963 42382 99830 160885 197544 7307 -16096
3968 -16096 -73597 -171381 -169090 -6850 -51395 -111004 -187431 -247320 -189403 -101022 -42975 225423
3956 225423 265735 -14262 -75167 79288 231057 104630 91166 354228 456019 332643
3946 332643 80265 99411 175493 -7415 60034 16689 92091 -6392 -3568 224017 164368
3935 164368 -104491 -42778 -86891 -129376 -225688 -140940 -12651 -102523 -225892 -224028 20771
3924 20771 66051 36381 28488 3792 -622 -4801 120625 271136 121413 5194 -80894 -97122
3912 -97122 -118622 93529 206868 211127 224629 273566 105030 28394 108032 239665 223476
3901 223476 217116 304567 17072 -29079 71866 33036 -186349 -174986 -91595 -45672 -107192
3890 -107192 -235605 -276739 -267380 -250874 -145283 59823 85227 17803 27816 68198 2749
3879 2749 102229 92088 30561 76150 99274 191813 354325 412843 340754 430866 336577 277401
3867 277401 243444 271624 115596 102373 156441 273110 299169 365860 262948 234038 132842
3856 132842 224481 144388 397243 385256 395176 385976 286980 111951 47893 340570 303753
3845 303753 211978 97802 141143 196800 37269 -23592 198043 388973 217321 107760
3835 107760 285042 316065 183472 211337 347425 262154 343077 352514 306294 339137 284252
3824 284252 456101 535143 561985 680361 666560 554962 640923 548284 482728 508174 489889
3813 489889 467591 527543 726312 771821 465070 444125 618142 634817 648559 692692 702871
3802 702871 836521 694005 597815 842730 892949 818649 907055 1009802 1118391 1187686 1085870
3791 1085870 1192350 1480145 1588026 1500970 1781586 1746972 1810677 1740299 2110848 2350741
3781 2350741 2559270 2643369 3063936 3257639 3647436 4029978 4409489 5135907 6206928 7614665
3771 7614665 9868645 13626701 20544550 30171857 38183237 39575978 36083157 30268307
3763 30268307 23446768 17548581 13210199 10318402 7987236 6068781 5014041 4327544
3755 4327544 3807166 3266873 3003342 2787615 2550768 2190165 2106310 2128062 2008108 1844428
3745 1844428 1743949 1406187 1469368 1463835 1311901 1442304 1302967 1166239 938644 871016
3735 871016 978932 1000088 987592 1000603 854876 761280 686331 764234 716127 469458 388379
3724 388379 479884 484513 461984 453196 495716 497291 416029 360278 422627 429324 547345 302228
3712 302228 445530 300386 458961 642929 884817 801261 625549 500259 626198 553231
3702 553231 491049 599806 643735 518539 392820 345233 389686 255432 203077 173509 -28661
3691 -28661 -258963 353 26931 81282 -58460 -74160 -105516 79227 -45785 -149997 -3179
3680 -3179 49202 -65555 315883 303699 298611 458533 373335 270055 304301 221476 153011
3669 153011 393150 465833 295774 357760 505943 269818 25365 106793 339726 171851
3659 171851 132311 34881 63230 163018 47601 -23271 44627 12584 86083 112430 202049
3648 202049 165668 -105382 -143094 20247 86063 24058 107115 123542 -91747 -138748 -87284
3637 -87284 77235 127893 46755 -77310 -28059 -42308 33642 171308 250810 157352 187613
3626 187613 126144 86472 -17376 -121733 -169465 60057 15818 117736 305270 273698 122970
3615 122970 110574 689 37673 100294 -14886 -139533 89327 46508 -135944 -221204 20900
3604 20900 -80608 -70669 -36731 28588 -90522 -225969 -234234 64955 -19693 -36476 -95652
3593 -95652 77849 -53012 -2082 130999 65053 165362 323621 295632 339451 239827 210741
3582 210741 115660 150812 -28450 -77578 45994 -23759 11665 66628 42700 20114 41982
3571 41982 -141642 -6265 16562 70945 -54578 51431 104984 -14786 44296 22042 -74935
3560 -74935 -71785 -106253 -195231 -277322 -249602 -462260 -378627 -244351 -60822 -57434 -29436 -134595
3548 -134595 -67640 -66713 -83405 -116445 32724 45600 79599 -70548 -111984 -14752 260372
3537 260372 -38609 62719 297492 176958 -9028 120795 53857 76106 -101007 -129968
3527 -129968 -130857 92897 27447 -12107 19566 -25899 -220549 -142874 47288 56139 122833 126307
3515 126307 98430 111748 145249 57900 -5122 171202 225944 293376 307828 263811 354244
3504 354244 355217 283329 292452 192482 10892 58753 118069 -12188 -34797 194814 -18620
3493 -18620 -206042 -140206 141469 19272 117263 -8670 103758 89730 -2596 -80371 185399
3482 185399 209030 288442 155783 425068 386037 350185 422036 270527 188444 303927 195700
3471 195700 233435 124650 -9231 -90012 -118837 -47350 -86009 -20758 -143237 -89620 145086
3460 145086 241636 43593 139360 193679 100245 -54023 -42793 -69644 -121430 -119827 -120799 -350724
3448 -350724 -134276 -135730 -334107 -135960 -117881 -179918 -85467 -72685 -77541 6965 -26969
3437 -26969 -195670 16067 -122000 -133789 39982 199984 100987 206565 189316 218190 42133
3426 42133 193008 278943 233197 84483 -53623 -10686 108337 -153652 -216520 -81051 -87460
3415 -87460 -142304 -83806 36411 -48864 -103316 -76814 -24418 -2003 9277 29504 267045
3404 267045 218384 56216 207757 380252 173001 53904 -5002 -25865 -232213 -60893
3394 -60893 -8664 103301 20928 801 -155946 -70784 -11791 101007 57334 162422 -104719
3383 -104719 -94226 -172179 -1211 -47638 -224403 -138897 -14591 -154159 -127073 26173 118849
3372 118849 15241 -169633 -146011 832 18964 -8603 -81174 -41058 32441 -25791 128995
3361 128995 335009 209071 99840 39066 149148 130164 75848 100670 144275 -12637 -54315
3350 -54315 22503 68695 223876 58619 206705 4045 -30786 -114636 -134717 -108765 -309575
3339 -309575 -312509 -268805 -286901 -311335 -274867 -284393 -281216 -260275 -403763 -337589 -239442 -185208
3327 -185208 -158186 -164680 -80342 122502 29246 102118 81407 43872 -29313 -93199 116764
3316 116764 189902 -35563 38739 -165832 -101964 -11147 105253 52937 143380 48800 19236
3305 19236 23026 89030 -1309 5605 -58065 -116791 -47578 -137649 -215112 -188771 -291950 -166057
3293 -166057 -158039 -147968 5095 -129481 -264065 -229909 -374924 -266470 -229225 -166139 -11932
3282 -11932 1410 -137905 -202646 -104184 -26897 76163 50531 -61288 13529 49903 -9232
3271 -9232 204516 101400 -44880 3253 48105 20301 36377 44545 -41180 -130566 -80729 39454
3259 39454 4705 -136705 -151480 -183780 -82502 -327147 -365439 -329417 -68676 -204707 -395433
3248 -395433 -196325 -229262 -44899 -126644 7392 76108 118567 -18827 -215263 78049
3238 78049 -26930 -156611 62669 215511 343740 167065 207706 212131 156425 216984 133224
3227 133224 124783 16037 -104061 26476 186941 -117233 -102258 -170762 -145590 -53456 84234
3216 84234 42470 195842 31915 -77932 -39303 -18390 -217849 -255068 -166632 -61773 -264871
3205 -264871 -371466 -336890 -279563 -193242 -75889 -77386 -130753 -102268 -82123 -245734 -134652
3194 -134652 -133156 -19814 20374 -141991 -120778 -106092 -265855 -182088 -103375 -190496 -176982
3183 -176982 -103228 -283577 -421186 -236584 -352162 -343806 -270949 -274906 -240956 51546 241447
3172 241447 135173 49600 128820 102655 222350 189110 117012 288902 342470 109810 -13945
3161 -13945 128295 -136363 -27158 31028 -176454 -32770 108455 84661 124112 81266 -98081
3150 -98081 -109527 -145497 -100844 -203338 -79658 -95513 -64752 50142 -55659 -126689 8185
3139 8185 -22932 35771 -16306 43973 -165165 -16757 120064 -154655 -209639 -52166 -232839
3128 -232839 -131866 -58180 -77085 16350 202936 -25880 -188423 -6680 -136278 -79861
3118 -79861 -85695 -176638 -78947 -65921 57220 77399 165105 124062 186290 285806 152100 70251
3106 70251 42749 -13158 -131182 100085 211333 79240 31457 74497 -133294 -58756 62459
3095 62459 60083 163264 310426 6949 34907 54174 -197454 -191838 -85555 -40539 81344
3084 81344 -5866 -108011 -172301 -38718 -38763 -116400 45472 -68710 -232075 -165431 46013
3073 46013 -207450 27271 -154643 -322206 -80271 -182299 -364897 -124365 -136422 -395542
3063 -395542 -106587 49254 -33602 -181533 -259548 -315034 -254109 -251619 -35986 2525 52647
3052 52647 73501 11672 10019 -80053 -72287 224945 321834 55477 11264 66634 -144947 -17407
3040 -17407 -48420 -167860 -65924 3533 -150713 -168123 -103733 -404799 -205829 -178459 -89505
3029 -89505 1565 -66732 -95794 -43447 -2083 -4960 31315 57040 -68131 -150813 -12217 -63095
3017 -63095 -83646 52092 29852 -84677 -51787 -111108 -17572 125815 -111356 -102251 92408
3006 92408 -29856 -191943 93611 229509 176236 -3547 -25484 -8960 108166 16705 9596
2995 9596 220312 209084 -132714 -275169 -109639 91306 42765 43024 17379 7015 83010
2984 83010 11424 38232 49813 -116909 -167981 72371 -78208 -222464 -119084 -60004 -155859
2973 -155859 -111944 -164370 -197319 -106633 -274137 -195914 -39895 -201935 -183967 -229497 -73873
2962 -73873 -267276 -282556 -313346 -164592 -96305 -28827 38371 -37405 -64119 -16394 -96989
2951 -96989 71647 27741 -182492 -109408 39394 -60757 19738 -189684 -211800 -67894 -121620
2940 -121620 -233859 -202738 -255330 -455652 -296367 -221669 -140478 -63492 17661 57086 -66037
2929 -66037 -113475 -158920 -59094 -14787 126182 181315 134415 -16662 -133867 -146565 -116218
2918 -116218 -239569 -173839 -106504 -228874 -321101 -455781 -349094 -373826 -279985 -161314 -226257
2907 -226257 -406250 -348835 -375547 -209772 -153858 -108854 -111136 -41329 86677 -37792 -15401
2896 -15401 133811 112413 414183 399442 200109 180172 33552 -54409 7686 -76667 128770
2885 128770 201199 69491 4050 153064 112382 -8010 108391 69515 -39265 -136455 -30119
2874 -30119 -127859 -209634 5841 -7641 122290 28726 -27619 -128418 -119681 -159979 -193839
2863 -193839 -160498 -88383 -12089 121859 -36117 -190736 -179295 -126971 44350 196615 193100
2852 193100 -9196 -11710 -114618 -20283 103072 41019 107789 124606 -35201 -49422 -2964
2841 -2964 -57075 -27665 84607 157287 21141 56252 185127 -9271 -12887 -23541 -80805
2830 -80805 44326 195245 124352 27402 16643 -54513 -87499 -36582 121690 176162 22422
2819 22422 -22813 -5699 63364 19147 124917 143320 -68939 -20719 -167737 -146192 -237192
2808 -237192 -296452 -246468 -113747 -164468 -177938 -123852 -47275 -25680 11029 137577 158874
2797 158874 123927 54395 -127163 -141274 -189446 88278 311113 298706 236400 233369 353514
2786 353514 362936 169971 201317 182580 312698 310653 78160 191946 292689 253196 776
2775 776 58194 35187 -137327 -110362 -158016 -283579 -114091 1984 106042 74096 -13275
2764 -13275 -38056 -117518 -219995 -26029 39533 254984 85519 83726 -220791 -100363 81040
2753 81040 89754 156576 120216 140345 206853 -148663 -184579 10142 87168 -43256 -46825 71655
2741 71655 119179 -47737 1721 135428 187028 110294 366387 240248 -70825 -116134 -162180
2730 -162180 -178512 63610 179632 2822 -77720 -88998 -52824 26724 -100198 -93005 114854
2719 114854 50664 10572 -24527 151099 85258 171508 314803 387210 185859 163945 30757
2708 30757 -7379 115482 152849 210885 78521 917 37414 84953 -21860 -105882 -67191
2697 -67191 -50136 61046 109762 -61305 35877 81200 -56624 45642 59407 72041 141694
2686 141694 191106 124842 254219 377953 462241 341738 366304 384467 341291 220699 206605
2675 206605 141732 -122543 -73527 -61696 64216 21481 -59896 57384 -184905 -277162 -94402
2664 -94402 59084 -67826 -39589 -78538 6878 87324 148892 50479 63048 294890 378733
2653 378733 347813 417301 355211 312977 394812 555883 519244 451920 382321 309371 357184
2642 357184 353082 287475 326971 118800 1235 33454 8723 86533 171094 325403 269889
2631 269889 278504 178081 32007 6705 6100 76487 193391 236853 -22512 -5222 40825
2620 40825 157900 242486 345396 226400 163384 27151 -4616 170891 180088 313818 301205
2609 301205 533979 1000670 1314312 1661433 1771208 1602033 1269945 1009821 969475 974569
2599 974569 623096 393064 512049 374554 265933 215468 368748 351400 217008 93821
2589 93821 206132 466850 683915 572175 582057 591316 444898 432564 594557 604642 394179
2578 394179 192413 142057 335890 352657 388994 377069 381003 308590 317971 338129 127120
2567 127120 160111 163474 104555 152707 188546 205939 354533 255928 61241 83085 120899
2556 120899 328086 414077 419676 241562 311101 357256 271887 276145 390707 203409 299381
2545 299381 244412 162047 100523 -16672 107217 226545 283830 206385 245774 263941 412359
2534 412359 453641 667661 508122 252727 356609 416204 442174 636568 708634 688674 568502
2523 568502 625973 616815 925705 901627 797757 888011 933752 656261 689730 743327 797180
2512 797180 658681 575428 499178 478105 469977 573235 540713 445952 234164 410344 482772
2501 482772 689494 685856 565708 303627 315847 479597 542505 655047 728361 684245 737997
2490 737997 818743 763275 843788 862501 901588 791269 825375 930102 999035 850165 884060
2479 884060 804470 866223 829875 858251 850599 870578 800913 635687 480470 719329 807489
2468 807489 714542 847410 810656 676463 551312 815329 815139 714344 943300 1085761 943333
2457 943333 1118634 1166776 1266280 1172534 1201198 1217782 1255041 1161422 1203361 1169510 1162309 1131484
2445 1131484 1161968 1293007 1229891 1328061 1259191 1281547 1462532 1464387 1441641 1434799 1601459
2434 1601459 1817584 1607859 1657735 1606517 1528265 1541730 1671146 1577692 1709045 1745744 1804442
2423 1804442 2064577 2293055 2031511 2003801 1870280 1902960 1961927 2179414 2215550 2287722
2413 2287722 2267451 2229541 2131489 2275874 2323860 2520518 2683364 2625483 2583224 2719989 2561283
2402 2561283 2596584 2681132 2806951 2787728 2870783 2977892 3113860 3136491 3199878 3115097 3221817
2391 3221817 3330224 3428129 3392356 3675809 3481390 3599307 3881233 4165684 4086554 4269714
2381 4269714 4362673 4628600 4745602 4796528 4951609 5411306 5362375 5443344 5396137 5627421
2371 5627421 5684957 6067561 6369365 6761542 7232649 7707787 7905279 8480614 8933164 9542427
2361 9542427 10170343 10777167 11301198 12343154 13524675 15805475 18571636 21307420 22222166
2352 22222166 22939867 23111945 23660664 24919608 27116704 30448236 35409911 41892496 51193580
2343 51193580 65999692 99022573 162555279 251763804 310532475 293875394 257861605
2336 257861605 203570669 149735539 111984354 84228524 64561625 48698010 37610053
2329 37610053 30680669 27324907 25555468 25125931 25274175 25381370 23729823 21958298 19559266
2320 19559266 17288810 15263972 13604523 12340102 11394041 10142027 9464988 8889526 8324539
2311 8324539 7890705 7652920 7318367 7046557 6733468 6660667 6278679 6160963 5844102 5685562
2301 5685562 5321191 5219710 5036749 5154376 5195395 5164363 4872987 4735984 4313036 4308629
2291 4308629 4352188 4320078 4022898 3940727 3961956 3950679 3678266 3767865 3460934 3435275 3278057
2280 3278057 3345175 3191194 3353791 3213731 3217027 3128890 3120742 2886569 2929970 2821643 2754757
2269 2754757 2378123 2297022 2273370 2278773 2237818 2311287 2225504 2183008 1971565 2017912 2059513
2258 2059513 2045371 1975554 1902362 1853613 2039592 1966974 1883300 1834875 1963670 1868331 1917197
2247 1917197 2033689 1958820 1794167 1504358 1475442 1462570 1341571 1256159 1270196 1160332
2237 1160332 1066829 953302 815403 870356 796690 1003756 1006709 1019185 1139194 1109095 1246531
2226 1246531 1303988 1365023 1426053 1432108 1322210 1065235 1024926 1077726 1099631 753476 678795
2215 678795 645398 762386 749238 479652 259663 405990 375750 353716 327364 338412 238114
2204 238114 264564 329498 282259 295254 380979 648268 622307 506506 651036 682735 635987
2193 635987 602418 485977 714423 676170 642232 640924 731002 520686 635357 574138 646104
2182 646104 509945 495768 337603 432727 434723 404481 313441 445639 451923 497911 335147
2171 335147 383384 155338 272979 461352 511365 346746 272236 189894 334053 139603
2161 139603 178266 319173 304307 218972 265113 242307 297242 215309 166527 270190 216671
2150 216671 357495 495291 289720 198567 51728 -127411 -31248 111022 132854 -3166
2140 -3166 175057 223844 181790 71642 -61205 39553 130763 137704 62620 218894 288129
2129 288129 222158 119642 318227 169785 168014 192992 271584 293408 285139 188892 228451
2118 228451 63245 -138801 -20230 210265 323767 311925 419513 315803 359163 338478
2108 338478 451705 518156 438806 341505 244748 254859 174853 172078 55014 -26637 -63676
2097 -63676 -184919 -74748 -118764 48817 -130479 -169617 -152335 173051 44483 -61972
2087 -61972 52604 72566 130166 204149 68257 296821 219570 60946 56578 159878 138113
2076 138113 244638 241344 352844 530691 638275 1049579 1401760 1201536 1160026 1099321
2066 1099321 884218 436744 116687 102762 239990 83859 108874 140395 218113 112584
2056 112584 150340 269964 108638 82262 98753 176116 231293 233781 146054 -115453 -82872
2045 -82872 -46905 -2768 137677 49223 -72679 -49297 -21506 -65133 -24293 114087 228719
2034 228719 147931 -16236 2061 159204 81999 127276 137645 222517 359135 450863 193324
2023 193324 19999 113638 248243 161230 200192 258887 247477 70859 214590 144856 42168
2012 42168 53822 -95418 -135094 -198088 -147915 -145171 -156812 -218861 -312011 -84719 -69315 -244365
2000 -244365 -261290 -100727 -3444 80039 43182 83892 56126 -17751 -53867 -144133 74851
1989 74851 129418 98357 127974 182659 150819 213832 166395 144386 -27955 -80785 50428
1978 50428 96827 86023 -23293 99091 54597 -73031 -4007 -49117 163638 200965 126853
1967 126853 94409 85697 36809 4447 12680 30592 -90283 -33218 -142417 -367787 -326285
1956 -326285 -306438 -164925 -102270 -197159 -141556 -51364 -287279 -107386 -127274 -204521 -48450
1945 -48450 119554 122435 174926 248433 145181 -90266 57587 88673 -55025 48753 -48986
1934 -48986 -276576 32702 48925 -39402 -13519 -93676 -103844 -98348 -106690 -88421 -235876 -273041
1922 -273041 -186229 -22380 -16348 -106696 -150075 -180923 -211285 -267393 -159793 -175645 -296372
1911 -296372 -193526 -293249 -443913 -215527 -183313 -119976 -118351 -228440 -96058 -80926 -51585
1900 -51585 -79989 106337 112047 107045 200156 266325 318310 96006 -3505 52306 23800 44964
1888 44964 3111 -96859 35157 -17172 -105154 -290937 -231490 -4685 83340 -25888 -172698
1877 -172698 -289184 -269062 -306139 -101740 -87045 -14603 75495 -59022 -95013 9514 -49125
1866 -49125 26015 -20379 -10020 -112094 -176578 -150055 -229508 -30395 -234632 -218561 -166927
1855 -166927 -132762 118723 -25175 -119422 -84237 -79624 46789 190496 134125 60211 324867
1844 324867 342276 310541 189119 131767 376468 317494 251148 294142 211749 171900 173336
1833 173336 205905 155385 116616 -382 49658 14747 52371 4300 120069 141052 99448
1822 99448 57565 -27497 -33539 -114184 -168587 -17904 -69327 -213656 -87780 -40996 -87222
1811 -87222 -112277 44688 -102035 -63834 -76475 -84656 -134579 -179917 -252874 -185723 -106043 -178318
1799 -178318 -192499 -115802 -153623 -218128 -228933 -97421 -47471 13165 -17888 -101470 144804
1788 144804 -114186 -55068 18763 30613 72456 8525 20861 -35722 104447 131552 151470
1777 151470 222619 165038 9103 209079 213853 63479 -24474 24473 -134284 -83577 -19906
1766 -19906 -147129 -136976 -199456 -453352 -220963 -79679 -138951 -269428 -111158 -172830 -252624
1755 -252624 -225175 -44798 69723 -49734 -28524 221346 278661 255486 162512 93222 178362
1744 178362 8994 67775 19627 50503 171890 39000 -113269 -19541 -58352 -97571 4187
1733 4187 -24669 -125574 -68800 22769 -7125 86179 176163 246727 305257 195036 119323 148302
1721 148302 322643 106721 -40664 -8894 67665 -56404 -45772 -58710 36985 -12920 -279002
1710 -279002 -180898 101631 37252 -109179 20574 62676 -49259 -127499 14232 259275
1700 259275 166901 -35302 -31026 104423 236681 126309 77929 282119 400609 270266
1690 270266 58761 -104351 -313661 -234947 -97177 30418 22351 -73434 -156978 -14490 -96303
1679 -96303 -225127 -243407 105565 70165 72905 14967 -92061 -59862 -170884 -197307 84763
1668 84763 -31132 -91085 -175313 -220627 -234965 -186181 -132220 1743 -56159 -55599 -165969 -91943
1656 -91943 -106502 -183711 -204988 -3623 -11761 -144231 43874 38133 180890 133859 308574
1645 308574 389197 194859 -49518 -64568 -8184 12322 -135778 -65990 -24202 33836 -76524
1634 -76524 -16141 -65800 -48223 -148416 -173860 -60568 9420 -14813 -129253 4105 176404
1623 176404 66071 -7386 95736 302350 162636 124573 203688 424799 282394 24041
1613 24041 184075 133485 -61035 -147065 -229760 -126701 -296723 -236700 -104168 -246209 -439531
1602 -439531 -284460 -489498 -400159 -296425 -257861 101900 91717 -102898 -78749 -2421 127407
1591 127407 188952 233141 274847 254803 87729 37657 36381 93825 -21778 -55139 -23537
1580 -23537 -98452 -202679 -113064 -29204 -146679 -153014 -45927 9650 164617 150411 -15312
1569 -15312 18534 21496 -49136 14950 144548 -72199 107629 373407 243848 215829 300115
1558 300115 148554 91223 113231 39619 9881 -120525 -126449 -251701 -296067 -259911 -299507
1547 -299507 -118641 -95816 -172975 -152227 -174326 -60372 -164825 -299222 -338076 -100557 63641
1536 63641 -221737 -282850 -204613 -127083 -132409 -64711 -192478 -164594 -192040 -246006 -226168 -139506
1524 -139506 -107571 9916 -61807 -151038 -241964 -212691 -224141 -243186 -27564 116809 22831
1513 22831 348532 88743 -65232 88232 213961 -37877 -158925 -17568 -64996 -102406
1503 -102406 -120050 -207118 -60184 -202614 -262811 41922 125832 -93525 -42677 -123707 -264566
1492 -264566 -239703 -160494 -125746 22845 100440 106273 78146 -62860 -188927 -164833 14716
1481 14716 136780 -6727 -71397 2434 17819 -26231 -10143 197597 244079 -71832 33263
1470 33263 263910 219030 82208 39820 93161 171451 342261 49693 -2222 147559 155696
1459 155696 54266 143776 -15976 -211679 -338667 -342252 -457169 -309065 -310152 -254213 -232331
1448 -232331 -173671 -366160 -226531 23291 -108687 -82076 91070 227958 280773 341467
1438 341467 201989 205502 263207 306363 226990 119209 138515 29553 22315 -5602 -19076
1427 -19076 3420 147167 178254 71345 -13736 13204 20869 54094 -26300 107549 346667
1416 346667 342023 168899 60624 57682 152018 129398 147130 141406 238344 -66438 -327448
1405 -327448 -315654 -457791 -526089 -364270 -291529 -347702 -258104 -283614 -385109 -118383 -67191
1394 -67191 -224178 46428 124846 -68749 56187 109327 142656 125576 7931 55050 3492
1383 3492 -73532 -208685 -157831 -96086 -172885 -197749 -127392 -67967 -31653 -223761 -238277 -179889
1371 -179889 70077 -52271 -137358 58811 -4231 -33131 -73371 91771 123011 76767 97051
1360 97051 159173 125638 -138739 -172589 21154 201072 -13336 39800 197876 157864 46095
1349 46095 -44450 -96075 26639 -32571 -193784 5030 26565 -62326 36113 69311 197184
1338 197184 288353 217399 259577 310043 268464 169316 144853 231069 64017 183642 64411
1327 64411 -100708 32948 21498 -48487 -78749 -6609 -123618 -63114 118649 -179540 -207037
1316 -207037 -11943 26555 -131312 -322681 -282068 -121120 -145295 -66640 -70550 -115334 -212262
1305 -212262 -187725 2266 -36685 -58004 -111283 -172366 -282492 -130330 -67866 161997 128994
1294 128994 39578 30665 225545 30876 -36512 -54285 116534 117481 163971 78685 38836 75105
1282 75105 -59819 -62621 -5129 -40637 -67331 3617 -26164 -49824 -71077 -212689 -258898 -82305
1270 -82305 -62608 -160852 -302383 -333148 -229921 -125782 -177819 32742 -74886 38932 -43916
1259 -43916 -15378 -144375 -171534 -166253 -281042 -225121 -226712 -169900 -65137 -6569 -4355 -16476
1247 -16476 -61567 -164747 -111917 -225 94189 -69544 -142355 -92119 -39860 70555 219722
1236 219722 75730 19272 60641 26082 -177872 -68217 -47306 -14873 113809 157149 51023
1225 51023 290770 240406 186823 201421 147191 154657 242383 377637 189147 158596 284147
1214 284147 -23274 -51656 -18680 -211658 -129830 -119728 -419076 -450372 -317979 -170781 -208784
1203 -208784 -223033 -277983 -315688 -112097 -252186 20008 21019 60647 32722 287350 285636
1192 285636 282020 314497 290592 254307 416957 252304 148532 138016 155116 -177511 -227469
1181 -227469 -102288 -173184 -398637 -268495 -341431 -384545 -395640 -241763 -334008 -235215 -114940
1170 -114940 -22550 142438 14671 -74083 104726 151222 146591 -106478 -72812 166075 233739
1159 233739 159801 3545 85000 111946 -17249 -43757 -50584 -28324 -99757 -94223 -81741 -169698
1147 -169698 114988 -16545 -20901 262566 72843 -61135 98628 31759 261720 345461
1137 345461 -6641 651 191574 176897 267570 98410 80801 28341 -40929 -76373 -167336
1126 -167336 -184296 -77748 63229 -154241 -233437 -171299 55458 186704 78210 107010
1116 107010 195695 67095 176162 42181 -218852 -94613 -16494 61449 -18446 33302 -78949
1105 -78949 144398 105544 -315731 -454920 -109560 -123757 -56882 -228062 -55520 -105629 -51866
1094 -51866 -158374 -80062 -161273 46998 164621 257628 209493 167351 -21529 -3971 -27405
1083 -27405 -90615 -98931 -99527 -84443 -124698 -127727 -194495 -139451 -120215 -78302 -92720 -145084 -73942
1070 -73942 33151 -77343 -22554 -137917 -157484 108047 80953 -12181 54883 56846 43733
1059 43733 77829 306339 215054 102774 34449 67736 -87956 159799 110793 -69491 -95211
1048 -95211 -34722 -243178 -266138 -274375 -168382 -177597 11376 -133756 -86266 -59256 97023
1037 97023 173805 160099 64957 77058 218626 133838 185682 343891 154399 270174 427958
1026 427958 273381 48917 -29573 -57 -218100 -267807 -230296 -139574 -205768 -52624 -115370
1015 -115370 -147048 -169759 -166499 -36932 6061 -287282 25257 62543 -20626 -6536 73585
1004 73585 112756 20688 85763 -5624 -386257 -379051 -284565 -280749 -209883 -12583 -258886 -279139
992 -279139 -49326 -276722 -250748 138340 309161 248497 275583 -2194 30937 30048 -13051
981 -13051 128638 256139 168076 171209 -53745 -16807 -55754 -62221 61686 -43241 -20753
970 -20753 67607 1252 36133 50370 -176484 -326423 56727 76215 71020 172215 57626
959 57626 -11000 21107 85084 99257 202365 190701 269647 266936 57149 223912 174354 75238
947 75238 168597 62655 -45344 -53219 -152927 -156173 -207197 -69979 51318 -130353 -306292
936 -306292 11489 -8761 -1139 124670 -82075 -46990 558 -106266 -120462 151914 127465
925 127465 -25511 -35264 -34818 -246584 -109782 -197091 -249165 -291969 -252599 -175372 -72491 -125140
913 -125140 -179325 -281362 -133014 -197723 -106891 46200 -62467 44184 31206 55359 47884
902 47884 202756 160211 -14016 157402 -15372 -183163 -56952 19184 -17652 -137119 -115991
891 -115991 -302646 -304399 -378866 -306111 -133760 -286144 -258481 -41689 20610 38614 84455
880 84455 119329 28489 -2649 1509 56406 143631 126922 119900 50057 13136 13803 -5671 -104157
867 -104157 -87380 -166158 -280367 -265729 -79397 -187346 -271513 -341776 -148192 -160976 -278153
856 -278153 8191 110494 186311 62243 -47426 200406 159179 -42976 175522 459255
846 459255 362607 265561 218019 109069 195821 304514 164617 187050 203673 178370 -75983
835 -75983 35557 67337 -86356 -37038 -126080 -242295 -216638 -84367 -258314 -269953 1293
824 1293 -46434 -31472 -234522 -304164 -79975 225363 3938 47668 234905 17076 46164
813 46164 -33352 -22724 59154 158712 135018 -106567 -114374 180411 -94549 114994 177210
802 177210 -107892 -57999 -130312 -61023 3101 -174497 -135272 3114 25817 -120642 -150530
791 -150530 -194021 -447680 -378044 70446 -22608 -33618 -128171 -184913 8818 -72025 -284760
780 -284760 19493 18496 -8887 158805 223640 178398 52543 74515 -43418 30605 99108
769 99108 180389 213852 341361 153831 26256 204941 212550 75132 151976 123890 -78993
758 -78993 20944 105751 97106 91159 -40055 -164994 -189454 -121198 -36866 -57695 -170626 -260985
746 -260985 7355 165589 119231 81656 18837 -83396 -247258 -400715 -215436 -173331 -210795
735 -210795 -157178 -218975 -254775 -119435 -97587 69303 62933 88707 270351 311527 -9619
724 -9619 220096 113657 188459 201284 120783 84642 205521 233983 157365 218700 282266 55116
712 55116 4972 77065 108150 -23521 -60421 -70399 -87562 -98905 -292442 -376313 -323201 -391697
700 -391697 -441845 -393412 -374435 -197533 -148008 -155727 -356518 -117210 16061 22057 -4202
689 -4202 40163 -109452 -42477 -47410 -12852 -213662 -52326 21482 193462 139154 99431 140687
677 140687 72662 -25472 232097 146242 213322 197561 246646 216952 233582 160277 66158 64074
665 64074 203459 3433 1249 -1004 -22694 -81863 35407 18311 16466 -66515 -169371 -117465
653 -117465 83131 12436 -176763 110435 -96278 -193908 -48127 -159722 -309806 -241763
643 -241763 -22635 196355 -49769 14866 -80456 -226591 -215832 -17261 144303 -59142
633 -59142 -63638 -119995 -87724 -140509 -117530 14577 -81951 -112024 70992 -206264 -295219 24677
621 24677 -1887 54067 -17479 -134758 -241395 110734 129888 127982 245016 264477 275718
610 275718 182770 107418 150217 166842 94403 -76693 -83187 -42731 -118816 -305955 -168683
599 -168683 -81991 19850 -78249 69616 89590 140670 199908 195801 152442 83498 11140 171683
587 171683 149972 191278 126740 56598 216369 253515 166959 106223 43012 -169108 -167515 -140241
575 -140241 -107516 -100026 -160076 -203191 -136436 -58861 -269688 -239526 -202637 -291579 -396480 -310704
563 -310704 -24579 -191028 -169738 -106232 33526 122479 134243 -160365 -76867 84312 -15609
552 -15609 67118 -14297 -90574 -299891 -248262 -88349 19733 -105837 131420 171634 196070
541 196070 252040 286485 281611 375202 414509 405404 232785 133068 140892 207139 68740 -78895
529 -78895 -208687 -464220 -377602 -282311 -353649 -259511 -188097 -254804 -186618 -80549 -53657
518 -53657 -242646 -135977 -158085 83258 272954 266173 278192 465246 429498 310231 224947
507 224947 427155 400667 355364 222337 200867 309477 315255 80083 117546 39317 -280429
496 -280429 -217978 -5067 -60897 -248607 -148522 -245206 -218343 -211082 -184734 -159502 11939
485 11939 -118350 -418989 -118448 -100663 -66503 -41541 53509 -28737 190971 -62781 -76917
474 -76917 20094 109824 -184083 -7333 110751 92403 154512 168218 125860 97196 124954
463 124954 -5153 -13007 43043 -11136 -72683 163605 -82461 -130872 -99148 -24502 -69068
452 -69068 -120471 -127690 160473 176922 -112783 -135013 246032 191742 54870 57893 218244
441 218244 256084 161006 -53026 -27240 -43185 52580 -63647 93312 159406 166838 22621
430 22621 4548 -143219 -260941 -135538 35164 191564 1931 -75942 118441 18927 -50565
419 -50565 -47348 60215 -107174 -130188 -73622 -67866 2202 -36757 -63265 -14073 76854 72050
407 72050 77556 -15255 -31098 8926 72102 149804 51014 -11160 65839 7453 161818 109267
395 109267 131830 278688 242624 105008 424901 194444 229653 198935 271784 136708 145539
384 145539 112170 86067 225617 124032 -180782 -6475 122330 19114 -24160 595 -49930
373 -49930 -61581 100535 247959 3682 -62051 184774 145004 151675 -56852 -161013 -27599
362 -27599 94007 40190 429469 404013 171988 291825 254159 51387 240200 187634 37558
351 37558 85605 -116584 -685 236376 160999 110532 218767 119894 36601 3432 243115
340 243115 88926 -147243 74875 -116239 -262751 -34181 -3827 -249999 -30451 141854
330 141854 -70147 785 55411 -86719 14039 54259 103250 295394 290493 277499 340030
319 340030 246103 188543 326473 249937 188386 162271 161711 252000 153235 236169 -47565 -78019
307 -78019 -89700 -244488 -238267 -303 13018 98609 22408 -45021 -152252 -15529 -43147
296 -43147 -203250 12216 85276 221146 396602 389971 348045 296927 327558 288023 362414
285 362414 236045 274674 424251 263817 152480 243051 84068 265471 226535 248548 173510
274 173510 174298 352870 208993 -12974 -107265 -189910 -169971 29572 45350 -1423 -86141
263 -86141 -163313 -247591 80588 47406 -24427 -103385 -132858 -150983 -214743 -255213 12811 -56308
251 -56308 -81721 17334 242376 158252 120490 276577 202815 123802 128423 405419 387414 258976
239 258976 154334 105267 266531 252602 181868 350917 299625 -54551 -52818 20501 -24029
228 -24029 162249 126112 -111676 22913 -63389 -98587 59536 147092 -14880 24842 -59853
217 -59853 -75546 -96982 44866 83582 92848 161107 97988 61182 263987 368675 346098 195719
205 195719 287706 112444 98284 137098 83536 -9571 -85724 -1149 157197 382593 334924
194 334924 291524 255769 34819 -39757 -32178 65171 -81518 -162468 17390 50423 -66866
183 -66866 -27453 77281 4266 -17626 7838 40403 -41132 -73742 30901 101347 103893 -36934
171 -36934 -58184 159883 300858 174025 313239 371130 247673 324618 178693 283441 293412
160 293412 121639 101419 213052 197864 294561 305331 248141 80732 56146 -125527 -35484
149 -35484 11487 91208 124448 157874 17888 -65105 17587 288752 248991 121550 67841
138 67841 25533 11035 207855 246514 100866 -88900 -16601 43854 92953 74993 -5162
127 -5162 75026 73886 90853 101623 100904 78811 72211 83258 194251 114351 140750 152751 72184
114 72184 245598 72057 -19422 -90314 37628 37813 191155 182570 146935 -93309 -168958 -156321
102 -156321 -134174 -61272 72289 153503 -9837 -182699 -28655 114422 29842 -3325 49026
91 49026 264029 294917 145392 20434 110999 152110 160123 123284 177795 78954 173166 146490
79 146490 172717 149285 31408 -5027 126726 75958 124832 189305 362805 315028 292902
68 292902 180897 58623 29875 -29501 -151635 -54332 -6786 41402 -93936 10141 35921
57 35921 84090 53211 132812 99050 -16573 -163862 -23981 -4514 -56621 123926 232277
46 232277 313193 179089 151236 258798 166363 156664 241941 174250 113941 203576 242744 128832
34 128832 213713 252361 113541 80283 137490 84559 -21929 -71817 25343 61593 90910 177851
22 177851 144238 11434 33080 4826 69222 145780 187629 50209 133135 111564 140133 129406
10 129406 89721 -7122 -66079 60579 103116 47939 -2586 2497 85449 216078
0 216078
$$ Imaginary data points
##PAGE= N=2
##DATA TABLE= (X++(I..I)), XYDATA
16383 -306152 -332033 -246235 -277957 -259359 -276275 -305354 -252871 -267123 -303416 -263347 -256037 -404867
16371 -404867 -338028 -234894 -231291 -238137 -408864 -259455 -254695 -182177 -51739 -191906 -126332
16360 -126332 -168784 -158635 -103505 -6584 -30705 25002 4826 -142525 -41451 -7598 -79876
16349 -79876 -44691 102697 24632 14512 69045 -18281 55110 41515 88845 -30399 68806
16338 68806 160781 40989 -32075 59860 31201 24864 165896 55711 26842 61769 30034
16327 30034 -65930 88728 164667 167936 148609 146123 77364 189994 120990 19517 35526
16316 35526 12292 83394 289261 171990 227281 177676 27238 -98265 27084 177485
16306 177485 157686 201474 311469 173872 127843 95812 122433 13841 26701 127687 78730
16295 78730 332488 190386 229933 252631 236677 181192 340027 266187 324942 334500 170492
16284 170492 245701 554219 437851 246715 348914 223796 140406 297080 336045 228313
16274 228313 226269 132793 -10782 -77799 -12597 28304 256090 377785 471693 507516 420155
16263 420155 348473 296837 396505 378156 491784 552859 412688 457661 552966 440766 418265
16252 418265 577447 526116 403917 369983 489276 524408 551480 442105 373619 531203
16242 531203 417183 224172 267966 377576 325501 261340 290069 280235 318110 286773 112119
16231 112119 297400 455259 315021 478182 653091 537392 584781 606658 610472 524754
16221 524754 673349 614453 762189 628410 507980 392649 588001 499538 310744 366558
16211 366558 556697 362261 328209 322370 326861 358913 352150 475018 262999 225995 128965
16200 128965 265546 317689 347965 383571 621943 497425 468901 610507 755362 624616
16190 624616 654342 484005 578425 682358 765934 603907 727305 693643 466064 498230
16180 498230 637300 686216 730459 732282 748682 774824 870238 1001437 894351 809821 823893
16169 823893 722138 809000 902518 887076 890575 777433 663572 497940 557885 653286 754358
16158 754358 403061 354309 524739 461169 470060 571699 630286 562712 498026 468156 686763
16147 686763 618992 489749 519456 249141 140815 341648 418921 571836 426178 399564
16137 399564 356760 327062 209636 363514 351279 312285 445249 412170 528558 814168
16127 814168 807184 814894 820985 681464 740268 688974 668250 805014 641574 658288 761004
16116 761004 638520 728063 788368 762650 757330 724978 530648 524001 533899 563020 659807 530475
16104 530475 427293 610955 624787 590462 679122 697010 492650 655169 522467 580632
16094 580632 588615 696776 581589 556505 476310 541600 341580 463590 603373 438128
16084 438128 389371 563444 671491 769717 901302 878848 964235 905854 930199 983549 991525
16073 991525 888178 848351 799290 697526 683575 609233 680519 551702 484758 470556 391289
16062 391289 485211 481156 436675 355073 330156 439484 373656 500742 512578 527423 712063
16051 712063 534432 550006 780635 779662 799394 752278 729908 714107 756649 698035 697668 632235
16039 632235 575846 701704 714835 653837 645270 648661 722979 588183 335096 536615 633974
16028 633974 590690 525891 365598 446194 711381 620423 681887 663504 713293 592901 665425
16017 665425 682405 817818 791597 772298 702009 700256 668954 785352 764499 955553 975402
16006 975402 763571 625752 745032 699921 720268 819814 719350 749572 602283 589395
15996 589395 818691 702447 781944 793604 561894 434543 478251 436667 499489 780956
15986 780956 480712 480770 609507 731677 843657 894705 674200 754666 873667 556434 565319
15975 565319 855819 807052 919344 879931 963247 981488 828309 666493 701572 626375 628451
15964 628451 498153 559698 544260 449342 603702 585664 384738 403252 566649 460309
15954 460309 390152 357876 370974 467004 524817 468611 565997 493959 452607 629741 805944
15943 805944 636166 745640 639839 668678 556708 537593 589338 473787 559985 381581
15933 381581 441351 577884 600457 813299 529083 576542 578782 491466 429685 558011 691854
15922 691854 706619 582910 839781 744699 585752 723871 1046265 936722 976067 1173689
15912 1173689 1186641 1009522 886758 925762 1032780 1014563 715601 650782 677279 647190
15902 647190 680591 777500 755200 782352 736163 816021 543092 582961 601147 568641 647859
15891 647859 772429 727380 597093 492569 472972 551699 614764 576618 737495 683754 686486
15880 686486 543931 643744 750567 796621 733380 865317 624956 727791 674921 688615
15870 688615 592713 781842 606185 522261 727218 856532 964299 990458 769594 592412
15860 592412 686936 677571 618735 718650 597838 492413 342404 353080 366990 435249 491384
15849 491384 515883 460661 481959 598131 577465 660900 584380 738662 808795 679309 413185
15838 413185 655117 806806 732300 632575 632894 478853 501590 450434 555745 521592 459703
15827 459703 643009 752675 689565 425256 61996 268582 337329 147904 298499 411631
15817 411631 446019 520966 592079 626986 827374 729267 792277 843691 745244 830069 887252
15806 887252 992510 1093508 1121303 878535 947185 932448 798079 567072 696002 664110
15796 664110 700288 585620 467222 658749 621502 405289 484673 624827 701757 610843
15786 610843 787086 693786 621249 631802 734541 837887 743854 744225 771065 669720 722238
15775 722238 754395 513561 755424 818437 547729 353253 380959 389575 626071 794439
15765 794439 841086 776227 600389 489019 617393 774786 794226 760436 677428 706485 622762
15754 622762 603810 621353 727317 876383 911134 696500 763580 631684 725658 821136 758773
15743 758773 712726 679403 611933 672658 508067 604247 368536 446216 440273 410767 608372
15732 608372 813162 612785 556534 659339 586053 728171 781711 748512 583207 806832
15722 806832 681455 681592 820445 838353 706014 828232 751744 922448 826320 751466 706423
15711 706423 826229 869770 756406 748336 798347 518792 738923 714841 707402 713245 725468
15700 725468 665605 777394 700860 394104 343456 555584 516463 791701 871377 776638 479808
15689 479808 614753 629203 732066 875504 919816 729020 644598 657395 771219 818117
15679 818117 866695 608231 549500 617365 458066 696841 617982 526876 726113 757316 483737
15668 483737 583734 454367 576479 457752 526641 431887 436894 479792 544910 336674 574193
15657 574193 410243 297240 502382 642091 560066 715231 686823 632514 702259 738347
15647 738347 855886 1053365 902948 842860 931470 858686 840998 1000854 880899 791236
15637 791236 743015 693010 810080 721472 653000 693605 580030 881744 863840 497101 609037
15626 609037 642607 616204 729142 662491 438332 351293 307371 232348 489806 620940 625761
15615 625761 854817 746489 525039 676986 719433 580219 741961 754135 841258 772889
15605 772889 827319 699187 792699 988435 964884 798537 851335 662263 544924 582223
15595 582223 779042 897605 1111776 1004060 751200 770769 877154 631272 552037 588934
15585 588934 602200 563907 609941 599909 588445 508617 580283 695820 533972 522056 577459
15574 577459 539527 383619 448010 642298 785956 529660 694981 815364 810060 880877
15564 880877 913431 946752 1063673 981471 812052 730695 833067 653295 749837 802562 673014
15553 673014 696710 685789 608084 516404 611257 618253 599145 721622 745848 763228 765241 528992
15541 528992 422863 516205 742673 694316 657875 693675 703919 676405 732961 793583 688565
15530 688565 724156 825328 758448 722135 687696 813105 848086 743086 682015 587430 514106
15519 514106 690335 737795 806494 611486 521498 542985 463550 537669 553409 753066 776698
15508 776698 690492 391430 450475 455287 404734 383761 625291 733707 571179 548731 649769
15497 649769 550661 673971 760322 639173 720780 708948 585060 723302 642744 680654 735203
15486 735203 981283 908412 940296 777410 662666 531638 564300 622214 666419 838607
15476 838607 714661 677832 674423 680948 660348 621386 708192 763182 632876 450440 564307
15465 564307 716207 449127 588434 736678 786967 576683 561172 334924 570154 721061
15455 721061 519380 441409 447514 626305 776693 622624 766134 806886 769894 694135 871124
15444 871124 868488 868249 840057 965327 1052228 1050919 1108522 1075061 1124726 1013868 997697 997350
15432 997350 1041658 1084288 800183 604868 645149 488748 401872 647384 682329 615337 352552
15421 352552 487136 616603 638622 535884 515146 438995 404732 291858 393936 615840
15411 615840 657765 612704 564294 622650 601866 665479 549569 640776 686415 917630 729731
15400 729731 674531 687944 721069 846492 978682 625231 679664 643619 649123 656666 682749
15389 682749 662683 626377 626206 435328 614505 740968 799582 806977 953020 1091211 933073
15378 933073 744209 764764 627057 653730 614036 747580 962816 952971 790536 673629
15368 673629 657357 671757 701080 830202 795293 591847 548333 486301 577114 666261 532027
15357 532027 463505 522149 409239 405237 662058 773793 735025 640779 469694 493566 659572
15346 659572 719050 763993 911258 950092 828888 758430 675583 733243 793226 691319 773385
15335 773385 804331 857074 850891 859126 766760 724808 581174 773044 736366 579467 662544
15324 662544 690670 661147 674671 666519 709681 752596 780261 684812 691717 702165 554767 671824
15312 671824 741310 811869 786847 653714 626949 892237 1054572 872869 581756 634502
15302 634502 703030 811539 845938 739084 812047 769273 765839 647614 479127 514937 641658
15291 641658 720200 693361 666037 773157 948550 926715 870036 842326 649720 576334 583623
15280 583623 512486 462596 472593 575279 519936 575011 633433 720989 778627 480116 472765
15269 472765 643106 589022 578458 735213 743218 507750 529044 582646 636200 567489 474315
15258 474315 676745 709659 736134 895963 772508 793289 489240 674342 880913 833393
15248 833393 789485 746070 778913 773676 703563 781432 814081 933756 846749 644043 717678
15237 717678 666100 582250 544790 481271 531692 626876 528248 626356 660685 802992 784541
15226 784541 626030 710260 514270 477630 584531 521681 512500 501552 528860 692194 690715
15215 690715 401021 556738 553855 324437 312391 590855 520931 532923 560995 657490 832751
15204 832751 808298 658853 659801 639260 672510 672787 646997 825184 719527 658659 789570
15193 789570 881815 834923 663829 645839 677987 649511 606174 728922 896775 877620 1009006
15182 1009006 878473 807654 921040 843113 1016483 1102540 1014603 965352 964421 1169239 1131551
15171 1131551 952380 938498 1056577 926413 928016 927077 880898 779540 761950 668456 705788
15160 705788 697625 467392 703649 615692 528346 460148 593440 637938 631608 418982 475508
15149 475508 441656 449331 639332 693395 807111 834243 828036 838575 789300 597745 736095
15138 736095 984380 833574 881753 927985 725540 864587 864784 573390 540063 725607 583913
15127 583913 501043 480569 787249 774967 597469 606633 612058 619941 587781 591143 869621 740387
15115 740387 667371 790883 642753 479645 730437 768142 780715 846437 857825 675430
15105 675430 648136 657624 644509 717040 600843 552795 725712 659782 646433 612515 568635
15094 568635 549885 543521 688478 657949 622310 657479 643621 712186 831855 899851 952768
15083 952768 811795 706087 697842 730540 666859 729104 802360 914690 928901 1036004 1019839
15072 1019839 848364 851614 931701 1012593 1110567 1015668 965435 1052740 931191 948784 965705
15061 965705 837455 770992 806137 733359 634574 757735 667690 569155 719908 809896 784381
15050 784381 841403 633878 799046 749143 660105 604942 751444 913566 968676 922477 816191
15039 816191 780018 800056 688052 911158 994855 942296 755578 810552 806572 855302 723693
15028 723693 731680 797990 884072 721637 621523 867254 815593 691255 811913 831204 695793
15017 695793 605345 505471 717566 603438 406031 495915 613940 553161 525523 478329 400732
15006 400732 391255 424030 499255 408996 326628 651284 870701 777574 684404 693198 559336
14995 559336 702196 731610 648287 668945 824245 1035816 997236 934030 943174 833288 843977
14984 843977 899631 1132818 1024175 1132225 1113751 1125738 1207270 1106702 840585 828720
14974 828720 814680 962249 883831 774314 652834 660313 515102 609166 638669 597361 506895
14963 506895 376271 487160 542052 548882 553005 522092 662412 597093 401204 495488 623162
14952 623162 610128 555144 600107 472273 493586 567025 625885 782740 625941 656969 884820
14941 884820 1012100 959524 923597 933713 881905 815410 883186 935883 993916 926075 863086
14930 863086 946948 961168 754677 806732 901536 788671 750991 652667 807862 981823 958486
14919 958486 863904 855054 772319 642032 464176 561523 448576 378289 354451 479421 422893
14908 422893 446375 477577 425542 746181 694932 846487 1024997 917159 699157 809521
14898 809521 858542 745016 913887 894698 1009845 919871 998911 1000930 1092292 988893 927624
14887 927624 929306 987007 666447 667335 750350 800845 594106 590717 554009 580102 394003 460843
14875 460843 390839 650906 699001 755180 651596 429025 654814 725981 489558 484597 651550
14864 651550 700069 762296 631346 790220 898821 890023 971687 951480 837772 1053146 977474
14853 977474 976157 1063092 992420 814346 907356 1038790 890029 842537 728455 746814 793649
14842 793649 745103 749750 811301 691786 515258 412887 384638 411782 417749 541459 652970
14831 652970 665379 622588 494404 373200 522941 771892 997914 1113709 987869 987039
14821 987039 1040781 1038534 1145573 1019812 1128248 1020182 1109855 1015300 976154 906937 928125
14810 928125 680763 827994 934673 858101 721785 672266 598558 444172 300893 316836
14800 316836 409517 477095 504623 634334 653910 602848 446506 701673 641129 673235 791747
14789 791747 888700 970230 1049401 927081 961796 978122 918877 660937 615505 691970 795917
14778 795917 675005 847968 1002614 873935 772180 763437 761841 736383 658484 793531 902260
14767 902260 819435 611368 567606 763204 833823 748553 666708 844598 844392 845445 637866
14756 637866 704551 630800 583770 468453 711524 671966 622696 670533 882175 748654 799579
14745 799579 981704 884988 650015 962152 942936 1110775 1038517 766569 858028 1018618
14735 1018618 918475 880924 788077 842233 821772 859888 750709 887222 898792 673469
14725 673469 609579 534544 582904 559888 714446 852487 780001 552514 633162 723445 814977
14714 814977 837591 811917 720845 716476 875767 885401 952478 920626 878391 613620 600860
14703 600860 603257 616127 663201 686169 376413 529138 503478 459480 683585 694497 576460
14692 576460 565861 698124 891824 859006 945622 1032210 1012669 950947 821813 938962 853580
14681 853580 893170 795737 723450 927349 972314 695890 712971 789575 763979 711515 681221
14670 681221 615158 671434 644770 591603 546967 597379 563433 610583 550476 725516 716155
14659 716155 765827 930995 826515 942021 1136369 1019684 1084521 1107123 1023196 1069750
14649 1069750 1044868 878279 961931 939601 934208 909434 625533 464786 673118 651914 563760
14638 563760 455732 360837 498051 628223 393025 527329 450951 587242 783829 910121
14628 910121 911911 820163 844949 955994 956407 1021879 1157211 1230634 1126852 1138383 1086428
14617 1086428 939634 974325 1085906 906122 980901 898273 626184 840743 866096 721388
14607 721388 695249 844729 733914 641463 626492 567328 617111 623943 597586 563245 681678
14596 681678 769828 684743 751850 881695 742848 608532 765360 755888 992132 959536 728768
14585 728768 822170 1029682 900681 873991 838825 884616 679967 768683 806068 934132 861975
14574 861975 677744 640157 685035 644067 641588 650594 763891 743929 521818 660673 601045
14563 601045 558100 563206 627643 843865 791357 723007 723105 875829 719676 634728 901480
14552 901480 821378 1066321 1177776 997848 1024517 957506 996218 979623 1130811 1036575 765997
14541 765997 555408 711520 503016 587474 725956 563591 643845 571284 336618 330040
14531 330040 479318 280919 361510 564714 571785 548509 798225 735033 685235 704155 841143
14520 841143 991793 963782 936667 1066139 1166272 1045285 908129 1101657 1277681 1159570
14510 1159570 1037091 1085656 802702 571400 641859 572568 705097 796394 466581 621602
14500 621602 655000 498915 606987 802936 790367 715571 860220 749771 774720 903159
14490 903159 1008779 998079 964157 952119 869387 804489 976150 1102679 978033 905397 850124
14479 850124 921466 856246 669791 631609 791915 695437 827048 912089 756006 750068 793184
14468 793184 706058 682145 773299 793498 949883 797283 589005 693964 718852 540668
14458 540668 844650 813062 911857 837302 616327 695032 755412 915883 983212 919959 939389
14447 939389 1027320 892137 737512 832189 900774 968915 1070252 971269 1006692 855356 802938
14436 802938 904331 844815 857355 768326 769207 692669 510212 535974 597455 721137 658957
14425 658957 518974 621899 587285 578332 677666 800758 704953 675592 735608 819046 751164
14414 751164 863495 965703 798632 875838 664112 559445 861285 913222 987684 785711
14404 785711 828496 966419 904285 1064204 978848 751053 799487 881336 798121 901995 787043
14393 787043 798379 890895 841666 895247 984783 918330 935221 784175 737542 650634 985727
14382 985727 976621 966231 995200 979183 853314 936401 884540 834850 840980 911050 502650
14371 502650 441601 571150 548290 495614 476013 442599 480184 618949 563617 538641 631473
14360 631473 680110 735444 619600 695250 656276 644916 635341 491276 664344 627464 632919
14349 632919 887716 1040116 933567 950400 1101171 1094796 1096348 1037608 1085040 1155320 980484
14338 980484 878178 664622 828747 777472 787164 789489 803419 696332 911889 832483 724876
14327 724876 655053 777434 828055 766380 583557 616248 632517 579631 526497 674468 880401
14316 880401 990597 848184 981205 1013120 966803 831577 886351 908266 940135 861491 850368
14305 850368 901986 836793 807445 1000306 1139241 942765 658923 735099 804703 893602 893272
14294 893272 947747 954416 966996 700520 675509 871181 897023 697861 633927 663836 580714
14283 580714 541100 567574 745754 732666 485896 561144 958006 913461 815616 862239 889910
14272 889910 698237 763182 855281 1091777 990298 1130069 1148134 991620 952409 999664
14262 999664 1004859 1108699 920354 870733 915445 892525 958533 816646 767414 752000 768257
14251 768257 909993 691640 567227 741695 852635 903218 994779 1059567 949910 882134
14241 882134 853218 855516 960661 983875 1097625 972122 994782 977771 779611 682780 730565
14230 730565 848624 959183 917767 929691 776104 737527 676008 697443 853408 817290 763141
14219 763141 965118 842480 873848 902432 1031837 997919 821190 822546 945662 917707 883836
14208 883836 662630 644501 542855 570768 741122 728477 657631 710841 631494 572969 744053
14197 744053 754291 772693 890113 901781 868774 920485 889366 1017999 970138 1050989 1034908
14186 1034908 997789 1024968 936232 1022793 788865 769224 907158 732713 868054 899542
14176 899542 851983 878331 761625 727089 810241 919616 920014 896703 880431 844738 889216
14165 889216 969063 966999 950737 922792 858502 872436 892073 874762 803542 709672 725769 830341
14153 830341 766851 954587 914532 764416 683034 899272 807909 861058 938823 874073 712269
14142 712269 722515 789835 857888 907382 818868 667331 903885 790262 678008 850811
14132 850811 913781 875915 1001617 852774 905707 770585 757685 887064 997414 787429
14122 787429 709306 691019 862441 849641 933469 677656 776345 915789 753980 783772 769317
14111 769317 872330 794396 770030 947083 932902 920280 1001574 812424 697256 575761
14101 575761 697889 762251 935921 844320 669069 796242 830119 719566 743051 713324
14091 713324 746535 896837 844369 875699 935604 781064 741947 850216 1018814 904511
14081 904511 905724 975792 912045 872427 1019431 1036429 1047496 1000078 1030410 858170 894276
14070 894276 755923 689582 871441 767659 650295 967630 758741 772868 735264 570952
14060 570952 661374 867029 720010 894436 909501 861263 761023 958603 1019463 1022354 1036155
14049 1036155 1052462 924629 928882 709046 643710 740731 976895 937764 858473 985225 831371
14038 831371 814603 988797 883072 914223 990825 747853 920845 1042693 1018224 853855
14028 853855 1058457 1050008 918169 992542 1027660 794751 768954 737418 780106 848914 846336
14017 846336 737579 935914 709054 521333 607081 870091 940233 974422 1079377 927307
14007 927307 922609 1027725 891885 906576 1000492 1017118 1025310 1175011 962016 983162 968714
13996 968714 855570 704658 799710 898302 798851 856905 710365 770767 716824 730488 849098
13985 849098 1021549 905934 643937 571343 502622 640384 689624 744733 672838 624699 861391
13974 861391 773648 741354 757308 602709 726524 699381 690125 929559 891156 836209 735003
13963 735003 627467 712657 870107 954902 994269 1062427 899961 904257 843222 901438 988033
13952 988033 1062747 1162908 1042039 969773 1041127 980730 905831 964425 1006149 840815 823045
13941 823045 892401 713575 722607 738252 507227 550620 562490 488679 598586 620561 611304
13930 611304 642641 720355 793783 814308 687958 880301 997296 1046628 1059251 1031765 951185
13919 951185 1001406 1044077 1004783 1137309 1080157 1035235 946449 974790 1048363 1042308 955169
13908 955169 866597 773594 787376 879455 775655 734618 690870 699648 796656 871597 804686
13897 804686 825470 761735 628608 578218 734236 895434 1008214 883244 972694 960318
13887 960318 998400 1150814 1019541 941341 1082910 1099532 1031091 888932 931688 893679 925285
13876 925285 959906 765557 849341 897626 863742 825451 601778 642261 758324 731908 783897
13865 783897 951806 919402 950472 910578 733666 916682 914556 881168 821690 866397 750674
13854 750674 948990 897071 794575 834493 505481 738552 959524 718517 702440 773809
13844 773809 937494 929440 1037198 972663 983296 967394 1061773 864647 872315 888135 802521
13833 802521 808087 986400 927347 771503 974298 969023 881213 908711 919680 905791 992630
13822 992630 942360 911649 1042245 1038785 874724 1065536 1083407 1112866 963503 899632 727982
13811 727982 862440 813472 775561 943895 789135 756066 884826 821648 843736 854585 1004372
13800 1004372 960221 916001 888200 924499 847052 838516 843384 1033619 1176127 1035932 952805
13789 952805 857286 925228 997209 866172 780761 878950 953414 881614 731690 748432 672312
13778 672312 776882 775626 758198 779554 732939 641402 706637 740624 886209 892872 890390 916494
13766 916494 869551 725152 686802 762657 825405 840003 646530 907809 942457 865434 1045161
13755 1045161 997704 1013046 910329 844005 813917 913476 807845 815244 959986 994003 1025304
13744 1025304 843434 901354 1147622 1075667 972210 999753 1031783 990071 933162 1060340
13734 1060340 947685 760893 750140 861074 840598 729672 887964 1002065 997435 926187
13724 926187 826147 893685 818902 625709 630946 639375 922566 772074 677282 777577 851650
13713 851650 730007 649478 790595 1110713 1069436 663465 807788 786314 612036 691824
13703 691824 911968 802439 792393 1003867 1068915 977547 972478 870535 898505 1090871 933537
13692 933537 918813 1018663 1096115 1077477 943729 1159475 1176792 1151595 1164561 1092921 1144530
13681 1144530 813697 819410 812136 772437 654964 709194 858183 699008 622792 518703 674768
13670 674768 778238 650690 595800 736052 786009 670712 652070 827690 894845 881826
13660 881826 942044 1216371 1101476 1010762 1186650 1246436 1226656 1180924 1152655 1285963 1213726
13649 1213726 1074249 1057536 1132745 1006036 947996 811255 837692 849913 704364 606066
13639 606066 848040 811748 776575 638871 581053 587150 612887 932574 932708 878732 997500
13628 997500 1058818 995777 1022198 984648 1014140 1214805 1149785 1112754 1056133 1019070 999566
13617 999566 977077 1037950 1095666 896700 797992 885999 1019153 910721 639554 712261 733732
13606 733732 894100 992557 1019949 831696 783261 758233 661762 890824 949249 922496 1192898
13595 1192898 1003635 871552 959027 846160 968002 1129766 1088439 1150442 942988 906534
13585 906534 745094 898486 1058443 1019618 710830 721091 790406 1019051 1001229 1019219
13575 1019219 953994 1018130 1068035 1050046 1048818 1099408 1015812 936425 984841 1077876 1038220
13564 1038220 1099801 1074159 1051492 1038964 987375 1014143 1011924 943051 1050871 1098212 1118842
13553 1118842 1156868 1079932 1062127 1043919 971013 791223 973757 977931 1074223 1027814 965193
13542 965193 866770 810150 853032 972207 1144626 1099849 983583 1012765 933022 882522 835545
13531 835545 998651 1016076 1118577 1037574 1131051 1176730 1144431 979843 885445 802614 914322
13520 914322 743567 859994 894242 944367 796344 772744 558474 583918 784639 785056 719044
13509 719044 688532 684589 771457 963202 1058674 1100942 816916 804752 883428 902479 985567
13498 985567 1148400 1192247 991061 922916 1072847 1135526 1065784 922142 1029368 1062895
13488 1062895 1032002 1023437 1101568 1024750 852922 731411 630266 759137 757058 849374 950968
13477 950968 969372 778034 741014 1041481 833339 759114 1042902 1096484 1041442 1075710 1188907
13466 1188907 1280174 1194919 1299869 1232041 1149770 1169523 1297157 1525575 1557671 1253134
13456 1253134 1431571 1512561 1409938 1260807 1220909 1165554 1132954 993874 893267 789253
13446 789253 701607 578944 534976 557257 471565 372337 301257 515120 439938 543625 817717
13435 817717 844263 1020737 1027077 877523 1070209 1208058 908882 1114955 1325246 1516072
13425 1516072 1405059 1334716 1364417 1460541 1029817 1027428 1026783 829642 882224 760577 659309
13414 659309 751829 879637 861237 898174 869022 672219 625282 713215 656720 948238 847040
13403 847040 800149 913197 919261 919208 1000451 968950 1018219 956790 1151586 1046216 880576
13392 880576 690160 764316 831768 992273 711987 679713 789016 794498 677257 831044
13382 831044 1024956 1074735 1121706 1022786 1076695 1038035 879774 837725 955215 959538 1046083
13371 1046083 1112633 1036399 1046126 1177225 1092196 1211154 1059536 853398 884468 821239 1054069
13360 1054069 1125483 940116 874052 942988 797346 886039 923326 769929 978144 900956
13350 900956 934509 1056704 1038883 970305 898543 891215 1156867 953787 1062978 1136285 1193578
13339 1193578 1255269 1305414 1260448 1182235 1264214 1201381 1082242 1144577 1051810 928570 1095619
13328 1095619 1111187 1024431 916012 1092792 1131717 960697 774170 770857 761869 620964 585874
13317 585874 689169 1012401 877864 695121 933460 914459 757222 796591 839667 1044113
13307 1044113 1137936 991787 1063430 1174446 1200834 1129358 1169533 1137597 1009819 1082366 1031376
13296 1031376 1031608 1077254 917351 1076755 1161304 883853 839317 927907 1071463 979590 715168
13285 715168 893533 968871 949658 763164 877120 847532 848932 839109 821365 880252 903304
13274 903304 877816 1042034 944510 852747 853516 1076460 1140850 1011013 864810 956827 1039663
13263 1039663 1000825 1047678 1128073 1258328 953542 808252 909329 1125117 953382 913691
13253 913691 965821 1177726 1013841 909780 944171 1184645 964187 607729 863777 1145796
13243 1145796 819545 719537 697422 781293 959081 997439 920485 1037205 996096 868440
13233 868440 979768 1041982 1122794 1091573 1107890 1095323 914192 717087 1082379 1188250
13223 1188250 1247281 1227391 1147384 1191832 1049798 1068689 1010269 890381 904717 920954 915832
13212 915832 895859 1032954 928637 989171 1086807 1105060 994106 1014252 939723 1035049 1065116
13201 1065116 817451 1001884 1015214 1033065 873958 931677 1122357 1079486 953118 920542
13191 920542 1049528 796188 899901 907141 819148 664487 866392 1025667 1089799 1030983
13181 1030983 1072373 1208713 1146127 1007232 1018490 1112944 1050249 1023891 916363 1092752
13171 1092752 1086875 951712 986933 1142378 1067199 879444 843736 934662 996474 1076053 1010723
13160 1010723 1212027 1161359 1041862 873787 1040911 1239957 1122332 1141581 1147199 935383
13150 935383 867049 949771 1087077 1239212 1200406 823192 826465 1017819 856804 807941 981410
13139 981410 990308 899786 780624 902201 924418 827400 760255 673945 626365 720979 736404
13128 736404 726008 907509 825961 836322 957851 1089838 965741 1134149 1070834 1017233
13118 1017233 1069134 995918 967619 1283987 1159418 1143417 1212954 1211479 1003475 1058467 1141540
13107 1141540 1104954 1017597 878168 980489 1113231 987160 824240 859317 805477 870143
13097 870143 985441 970326 925211 822550 714044 852331 938772 1032394 805043 953364
13087 953364 1067411 966654 1089851 1380360 1204372 1022660 1126951 1216055 1074222 1174057
13077 1174057 1086302 1193138 1076652 944237 1113096 1045805 1061955 1064467 1136274 1205752 1037277
13066 1037277 1026879 1168605 1255743 1126179 963457 991919 931925 939991 865050 1042508 1065107
$$ [...]
##END NTUPLES=NMR SPECTRUM
##END=
