##TITLE=1H_CA-9415-1
 200.13MHz,CDCl3.
 8 sc
 
 22.1.2026
##JCAMPDX= 6.0         $$ Bruker NMR JCAMP-DX V2.0
##DATA TYPE= NMR SPECTRUM
##DATA CLASS= NTUPLES
##ORIGIN= UXNMR, Bruker Analytische Messtechnik GmbH
##OWNER= pz
$$ XWIN-NMR		Version 3.5
$$ Thu Jan 22 14:15:39 2026 Russian Standard Time (UT+4h)  she@DPX200
##.OBSERVE FREQUENCY= 200.1313
##.OBSERVE NUCLEUS= ^1H
##.ACQUISITION MODE= SIMULTANEOUS
##.ACQUISITION SCHEME= undefined
##.AVERAGES= 8
##.DIGITISER RES= 18
##SPECTROMETER/DATA SYSTEM= spect
##.PULSE SEQUENCE= zg30
##.SOLVENT NAME= CDCl3
##.SHIFT REFERENCE= (INTERNAL, CDCl3, 0, 15.5122)
##AUDIT TRAIL= $$ (NUMBER, WHEN, WHO, WHERE, WHAT)
$$ ##TITLE= Audit trail, XWIN-NMR		Version 3.5
$$ ##JCAMPDX= 5.01
$$ ##ORIGIN= Bruker BioSpin GmbH
$$ ##OWNER= she
$$ F:/spectra/data/she/nmr/H-C/1/pdata/1/auditp.txt
$$ ##AUDIT TRAIL=  $$ (NUMBER, WHEN, WHO, WHERE, WHAT)
(   1,<2026-01-22 14:14:13.70 +0400>,<she>,<DPX200>,
      <created by zg, POWCHK disabled, PULCHK disabled
       configuration hash MD5:
       00 E9 B6 7A A2 85 ED C7 34 08 36 98 17 FE 4E 26
       data hash MD5: 16K
       03 AA B6 76 05 93 CC 09 2B 57 75 C1 68 F9 C9 E9>)
(   2,<2026-01-22 14:14:16.07 +0400>,<she>,<DPX200>,
      <Start of raw data processing
       efp BC_mod = 2 LB = 0.25 FT_mod = 6 PKNL = 1 PHC0 = -3862.19 PHC1 = 14.19231 SI = 16K 
       data hash MD5: 16K
       B4 5B 2C 8D D8 BD B5 F3 70 5B D4 D0 A1 39 F9 32>)
(   3,<2026-01-22 14:14:35.18 +0400>,<she>,<DPX200>,
      <pk PHC0 = -0.7757449 PHC1 = 0 
       data hash MD5: 16K
       69 2A C9 63 8B AD 92 01 7E 62 9D D9 01 48 94 A9>)
(   4,<2026-01-22 14:14:39.75 +0400>,<she>,<DPX200>,
      <abs ABSG = 5 
       data hash MD5: 16K
       C4 11 7A 9C 8F 54 E4 C8 10 C1 A2 02 39 22 32 2B>)
$$ ##END=
$$ 
$$ hash MD5
$$ DC C5 91 72 31 0A C1 A0 5E 2C 85 1D AB A8 67 80
##$RELAX= 
##$RELAX= 
##$RELAX= 
##$RELAX= 
##$RELAX= 
##$RELAX= 
$$ Bruker specific parameters
$$ --------------------------
##$DU= <F:/spectra>
##$EXPNO= 1
##$NAME= <H-C>
##$PROCNO= 1
##$TYPE= <nmr>
##$USER= <she>
##$AMP= (0..31)
100 100 100 100 100 100 100 100 100 100 100 100 100 100 100 100 100 100 
100 100 100 100 100 100 100 100 100 100 100 100 100 100 
##$AQSEQ= 0
##$AQ_mod= 1
##$AUNM= <au_zg>
##$AUTOPOS= <>
##$BF1= 200.13
##$BF2= 200.13
##$BF3= 200.13
##$BF4= 200.13
##$BF5= 200.13
##$BF6= 200.13
##$BF7= 200.13
##$BF8= 200.13
##$BYTORDA= 1
##$CFDGTYP= 0
##$CFRGTYP= 5
##$CHEMSTR= <none>
##$CNST= (0..31)
1 1 145 1 1 1 1 1 1 1 1 1 1 1 1 1 1 1 1 1 1 1 1 1 1 1 1 1 1 1 1 1 
##$CPDPRG= <>
##$CPDPRG1= <>
##$CPDPRG2= <>
##$CPDPRG3= <>
##$CPDPRG4= <mlev>
##$CPDPRG5= <mlev>
##$CPDPRG6= <mlev>
##$CPDPRG7= <mlev>
##$CPDPRG8= <mlev>
##$CPDPRGB= <>
##$CPDPRGT= <>
##$D= (0..31)
0 0.7 0 0 0 0 0 0 0 0 0 0.03 0 0 0 0 0 0 0 0 0 0 0 0 0 0 0 0 0 0 0 0 
##$DATE= 1769076853
##$DBL= (0..7)
120 120 120 120 120 120 120 120 
##$DBP= (0..7)
150 150 150 150 150 150 150 150 
##$DBP07= 0
##$DBPNAM0= <>
##$DBPNAM1= <>
##$DBPNAM2= <>
##$DBPNAM3= <>
##$DBPNAM4= <>
##$DBPNAM5= <>
$$ [...]
##$SUBNAM3= <"">
##$SUBNAM4= <"">
##$SUBNAM5= <"">
##$SUBNAM6= <"">
##$SUBNAM7= <"">
##$SUBNAM8= <"">
##$SUBNAM9= <"">
##$SW= 18.0517328524113
##$SWIBOX= (0..15)
0 0 2 0 0 0 0 0 0 0 0 0 0 0 0 0 
##$SW_h= 3612.71676300578
##$TD= 16384
##$TD0= 1
##$TE= 0
##$TE2= 300
##$TE3= 300
##$TEG= 300
##$TL= (0..7)
0 120 120 120 120 120 120 120 
##$TP= (0..7)
150 150 150 150 150 150 150 150 
##$TP07= 0
##$TPNAME0= <>
##$TPNAME1= <>
##$TPNAME2= <>
##$TPNAME3= <>
##$TPNAME4= <>
##$TPNAME5= <>
##$TPNAME6= <>
##$TPNAME7= <>
##$TPOAL= (0..7)
0.5 0.5 0.5 0.5 0.5 0.5 0.5 0.5 
##$TPOFFS= (0..7)
0 0 0 0 0 0 0 0 
##$TUNHIN= 0
##$TUNHOUT= 0
##$TUNXOUT= 0
##$USERA1= <user>
##$USERA2= <user>
##$USERA3= <user>
##$USERA4= <user>
##$USERA5= <user>
##$V9= 5
##$VALIST= <valist>
##$VCLIST= <CCCCCCCCCCCCCCC>
##$VD= 0
##$VDLIST= <DDDDDDDDDDDDDDD>
##$VPLIST= <PPPPPPPPPPPPPPP>
##$VTLIST= <TTTTTTTTTTTTTTT>
##$WBST= 1024
##$WBSW= 4
##$XGAIN= (0..3)
0 0 0 0 
##$XL= 0
##$YL= 0
##$YMAX_a= 407216
##$YMIN_a= -353175
##$ZGOPTNS= <>
##$ZL1= 120
##$ZL2= 120
##$ZL3= 120
##$ZL4= 120
##$ABSF1= 15.48686
##$ABSF2= -2.564989
##$ABSG= 5
##$ABSL= 3
##$ALPHA= 0
##$AQORDER= 0
##$ASSFAC= 0
##$ASSFACI= 0
##$ASSFACX= 0
##$ASSWID= 0
##$AUNMP= <proc_1d>
##$AZFE= 0.1
##$AZFW= 0.1
##$BCFW= 0
##$BC_mod= 2
##$BYTORDP= 0
##$COROFFS= 0
##$CY= -3
##$DATMOD= 1
##$DC= 0
##$DFILT= <>
##$DTYPP= 0
##$F1P= 0
##$F2P= 0
##$FCOR= 1
##$FTSIZE= 16384
##$FT_mod= 6
##$GAMMA= 0
##$GB= 0
##$INTBC= 1
##$INTSCL= 3.241238e-09
##$ISEN= 128
##$LB= 0.25
##$LEV0= 0
##$LPBIN= 0
##$MAXI= 10000
##$MC2= 0
##$MEAN= 0
##$ME_mod= 0
##$MI= 1.114404
##$NCOEF= 0
##$NC_proc= -7
##$NLEV= 6
##$NOISF1= 3.799351
##$NOISF2= 2.8
##$NSP= 0
##$NTH_PI= 0
##$NZP= 0
##$OFFSET= 15.51221
##$PC= 1
##$PHC0= -3862.966
##$PHC1= 14.19231
##$PH_mod= 1
##$PKNL= yes
##$PPARMOD= 0
##$PSCAL= 0
##$PSIGN= 0
##$REVERSE= no
##$SF= 200.130001900425
##$SI= 16384
##$SIGF1= 3
##$SIGF2= 2
##$SINO= 0.751879
##$SIOLD= 32768
##$SREGLST= <19F.Aceton>
##$SSB= 0
##$STSI= 16384
##$STSR= 0
##$SW_p= 3612.71676300578
##$SYMM= 0
##$S_DEV= 0
##$TDeff= 16384
##$TDoff= 0
##$TI= <>
##$TILT= no
##$TM1= 0
##$TM2= 0
##$TOPLEV= 0
##$USERP1= <user>
##$USERP2= <user>
##$USERP3= <user>
##$USERP4= <user>
##$USERP5= <user>
##$WDW= 1
##$XDIM= 16384
##$YMAX_p= 344301561
##$YMIN_p= -1028837
$$ End of Bruker specific parameters
$$ ---------------------------------
##NTUPLES= NMR SPECTRUM
##VAR_NAME=  FREQUENCY,     SPECTRUM/REAL,   SPECTRUM/IMAG
##SYMBOL=    X,             R,               I
##VAR_TYPE=  INDEPENDENT,   DEPENDENT,       DEPENDENT
##VAR_FORM=  AFFN,          ASDF,            ASDF
##VAR_DIM=   16384,         16384,           16384
##UNITS=     HZ,            ARBITRARY UNITS, ARBITRARY UNITS
##FACTOR=    0.220516191357247, 1,           1
##FIRST=     3104.45859522038, 0,            0
##LAST=      -508.258167785404, 0,           0
##MIN=       -508.258167785404, -1028837,    0
##MAX=       3104.45859522038, 344301561,    0
$$ Real data points
##PAGE= N=1
##DATA TABLE= (X++(R..R)), XYDATA
$$ [...]
11932B58054k827l28341n5856J93481O3695o5824j48142k20443r7882J52170m5855
11921b97770q5293L23460J53324J92186j46389Q0788j27976K27277q0997J35879
11911C74489j53055j50835j18815m5008k05550k43285K7527K44216n6741o1928
11901c88985M91373L51507K23200R2665n00406J95964k58978m90330K15077P9299
11891A0386m6052O7619r7549k99417L34581N2149k61619J68619P5821j81728J08962
11880f8228J5051K21961K42637R8687l97182j01947l44052j14888Q7418K11515
11870a49028L48596K92243k68855j26333j15198j90117j47935l2716J4726J24607
11860b50010J311M7569r5102R0762L28774J1908k87201L31538j51197j96421K75142
$$ plain form
11932 258054 255227 -73114 -128970 64511 128206 62382 -85760 -306203 -404085 -251915 -297770
11921 -297770 -383063 -59603 93721 285907 139518 220306 92330 319607 238610 374489
11911 374489 221434 70599 -48216 -93224 -298774 -542059 -514532 -270316 -327057 -388985
11901 -388985 102388 453895 677095 769760 269354 465318 206340 -283990 -68913 10386
11891 10386 -35666 31953 -65596 -365013 -30432 21717 -239902 -71283 4538 -177190 -68228
11880 -68228 -53177 168784 411421 510108 112926 10979 -333073 -447961 -360543 -149028
11870 -149028 199568 491811 222956 96623 -18575 -208692 -356627 -389343 -374617 -250010
11860 -250010 -248699 -201130 -296232 -205470 123304 135212 -151989 179549 28352 -168069 107073
11849A07073l51644L7393L62820n52119k03017K465p1962M27055K91136Q4208
11839A33408J07927k90555J51963p7048j63842K3240K34152j8488j2390j83727
11829i5360l19639q5011L11369J34624m9785J41581Q1388j91121L67036J67981
11819D63063l19975k44594L4588O9840k35804J87891k26379l30019J63476J5906
11809d22007r2193O44969j9632l4444O2895P809q9446m3632o9955l56006N991
11798d05651L59986M0515N9507k5019k78651l1948J68911l16835N8697L06284
11788f4204N8353q5199j73880P6857L98336j18876j96827J26889O2795k36246
11778a52002J24174l40121J03665J42150j61215J16754N07964l49510j35510J63123
$$ plain form
11849 107073 -244571 -207178 155642 -396477 -599494 -597029 -668991 -241936 49200 133408
11839 133408 241335 -49220 102743 25695 -138147 -114907 119245 100757 88367 -95360
11829 -95360 -414999 -500010 -188641 -54017 -103802 37779 119167 -71954 295082 463063
11819 463063 143088 -101506 -66918 2922 -232882 -44991 -271370 -601389 -437913 -422007
11809 -422007 -514200 130769 111137 76693 139588 147397 57951 14319 -55636 -411642 -405651
11798 -405651 -45665 -5150 54357 29338 -249313 -281261 -112350 -429185 -370488 -64204
11788 -64204 -5851 -91050 -264930 -188073 210263 91387 -105440 21449 84244 -152002
11778 -152002 -27828 -367949 -264284 -122134 -283349 -166595 341369 -8141 -143651 19472
11768A9472p2479j7938r2690l2337j27854M04688j54104K77974K11684k03651
11758B12765n16207j7666J3959K4401K16291k45131L18276k26042N5257J01471
11748f2626j01348M7935p993N2048J6901J77052k74898J13700j60759j27571K1936
11737c05623n370L08859o8830r9580j85021k3011j0054J350k10803K04218K27975
11726a65890K6388P0485J91314k4890j96359j78752l05717K24369M9353J51370
11716a58329J73681j28182L54992m34029j56361K42316k42048K78799K9842l69289
11706d08608L53839L1018j28494j21384L5967J2533J03114l8334J14291J41660
11696I5602R6848k39525j54409M7316J09207k48765k95155J37541J45877O53753
$$ plain form
11768 19472 -53007 -70945 -163635 -195972 -323826 80862 -73242 204732 416416 212765
11758 212765 -303442 -321108 -307149 -282748 -66457 -311588 6688 -219354 -164097 -62626
11748 -62626 -163974 -116039 -124032 -71984 -55083 121969 -152929 -39229 -199988 -327559 -305623
11737 -305623 -310993 -2134 -70964 -170544 -355565 -378576 -388630 -387280 -598083 -393865 -165890
11726 -165890 -139502 -69017 122297 97407 -98952 -277704 -583421 -359052 -309699 -158329
11716 -158329 15352 -112830 242162 -191867 -348228 -105912 -347960 -69161 -39319 -408608
11706 -408608 -54769 -23751 -152245 -273629 -237662 -225129 -122015 -160349 -46058 95602
11696 95602 192450 -47075 -201484 -154168 -44961 -293726 -588881 -451340 -305463 348290
11686C48290o473Q7564l3773j79641N744J2373j61962k4226o349M3595k34784
11675a49642J40937J76927q5433Q7522m04728P2374K64291j02352j6885P7548
11665F0559k47335L4258j76246K1555K48515n9628o7237M6469Q959N0827Q4156
11654D852k6375K5308k22253J35606j33461L09710n7986M2496l2528j54313J39829
11643C0885j25178k12152n7491P1737k67337N3150K80211n1818M05463J06712
11633B34182L5666j97284L89879j54305n1513J78848n0714l73988J54312k66523
11623a01440n84768J16059m3277j39867O17161j34347J65155K04255M6588k70233
11613a24714J37777K60981k66413p6939j74643J10220j32058k17458j05214O78405
$$ plain form
11686 348290 341817 429381 395608 215967 221711 234084 72122 47896 41547 85142 -149642
11675 -149642 -8705 168222 82789 170311 -234417 -162043 102248 -104 -16989 60559
11665 60559 -186776 -152518 -328764 -307209 -58694 -118322 -185559 -139090 -130131 -79304 4852
11654 4852 -21523 3785 -218468 -82862 -216323 93387 35401 77897 45369 -108944 30885
11643 30885 -94293 -306445 -363936 -292199 -559536 -506386 -226175 -277993 127470 234182
11633 234182 269848 72564 462443 308138 256625 435473 384759 10771 165083 -101440
11623 -101440 -686208 -570149 -613426 -753293 -136132 -270479 -105324 98931 145519 -124714
11613 -124714 13063 274044 7631 -69308 -243951 -133731 -265789 -483247 -588461 89944
11603H9944l11548m1591M34875n16329J90461K45240l18298M6265K77891n2253
11593D4657Q2765J33519k55180j61382M9684M8297m31834J34007J72180o0102
11583b43389J11393M0061J30514Q6916o9770o3597k70080K66525K99495m36949
11573a48881R2995K5586j80390L08625k53405k90530j844J2462j43508L43318
11563b35572J10246J78618K3800j57035N5579Q9976J4372K2873J83037J4592l95166
11552i4680j86214l38701K69612L3537J38417k533J98438l4859P1912r0064L9927
11541D792n7698j42817O807j59503J59850K33810j38328o378J56680R1681j76254
11530b7358J58683l26332J25429J87254k57626K91925O9658J60778P2549Q7374
$$ plain form
11603 89944 -221604 -263195 171680 -344649 -154188 91052 -227246 -180981 96910 44657
11593 44657 127422 260941 5761 -155621 -105937 -57640 -489474 -355467 -183287 -243389
11583 -243389 -131996 -91935 38579 125495 55725 -7872 -277952 -11427 288068 -148881
11573 -148881 -55886 -30300 -210690 97935 -155470 -446000 -447844 -435382 -578890 -235572
11563 -235572 -125326 53292 77092 -79943 -24364 65612 79984 102857 285894 300486 -94680
11552 -94680 -280894 -619595 -349983 -316446 -178029 -180562 17876 -16983 54929 -35135 4792
11541 4792 -52906 -195723 -188916 -348419 -188569 45241 -93087 -99465 57215 148896 -27358
11530 -27358 131325 -195007 -69578 117676 -139950 151975 221633 382411 454960 542334
11520E42334n0249j43922j60559J00479r5396O744N1240m81432J51267R0828Q6037
11509I7371M65001j97253k28835K48190k7242k96365k7166L8317l43433P2349
11499a99066J70812j36387K11232J23983m05870O65036J95709n90808K93252l17258
11489A0635K11866L70710J14932m9637P591l33750n4158J74845N5874N6028j9704
11478E45232j35477k58065M125K98104k83066k6920K71891m92901K13577R9283
11468B35783k64535J09268K73176o4561k73121N1948k46701J71544M7286K11719
11458B51806M7148J41751m02946L24305m27131J71063L26618l08176L75626j7728
11448D82336j92402k0440J09207j78294k9279N4168P4903N059j40616K38614j6153
$$ plain form
11520 542334 492085 348163 187604 288083 192687 199431 250671 -230761 -79494 11334 97371
11509 97371 562372 365119 136284 384474 357232 60867 33701 72018 -271415 -199066
11499 -199066 -28254 -164641 46591 170574 -235296 429740 625449 34641 327893 10635
11489 10635 222501 593211 708143 658506 666097 332347 278189 453034 508908 564936 545232
11478 545232 409755 151690 155815 453919 170853 143933 415824 -77077 136500 235783
11468 235783 -28752 80516 353692 289131 16010 67958 -178743 -7199 40087 251806
11458 251806 298954 440705 37759 362064 -65067 105996 432614 124438 500064 482336
11448 482336 289934 269494 378701 200407 171128 225296 300199 305258 164642 403256 387103
11437C87103L4602r258l86772p7591k4434k87239q9821J30664r9177K15716M06565
11426B00358L37908l13473j53849j97624r0301N99305m53171l8926p1145j66477
11416c47395K48991j24274q3977J71409K06600J35724M77114o51192j03329K24763
11406A54434m92834J76232J0870K5223N0142L10589M5481J21163J31072n24013
11396H359j38806J83686p946n7374N2817j36070J1787L21627k4205k14465q9881
11385i0471J28154l1164J14901K40081j76009O0317j49903l2075K61075j74232
11375A50674j97368K21525n4260J44590j31948l02647L4260l01471j14745R5274
11365d56116R4267J80294O1722K16390p0381O9087q0205N3954j46579N5564l03655
$$ plain form
11437 387103 421705 412447 25675 -51916 -76350 -363589 -453410 -322746 -421923 -206207 200358
11426 200358 538266 224793 70944 -126680 -216981 382324 -70847 -109773 -180918 -347395
11416 -347395 -98404 -222678 -306655 -135246 71354 207078 684192 33000 -70329 154434
11406 154434 -338400 -162168 -151298 -126075 -75933 234656 280137 401300 532372 8359
11396 8359 -130447 53239 45293 -12081 40736 -95334 -83547 238080 213875 -590 -90471
11385 -90471 37683 6519 121420 361501 185492 245809 95906 63831 324906 150674
11375 150674 -46694 174831 120571 265161 133213 -169434 -135174 -436645 -551390 -456116
11365 -456116 -361849 -181555 -119833 96557 26176 95263 15058 69012 -77567 -22003 -325658
11354c25658k41448p4607j84160M09606K06139n04p3795j05833J78682p850j21935
11343c41363O8340P0534k03115M3310j38949J951N13613k834J85967L11629j56424
11332C52659l73807k96905j28777L3544l0995R1095Q6818K88296J81759l23021
11322a19334J43681L8871k19308k71341j14421j49353J60125J22738J76549k02943
11312d34736L41805l7680k16868K8765k80549L39360O578J02527j443j50891j11392
11301d14524o423L9720J12360K4488L6686Q155l9270Q2124J23919j98572j04962
11290c36299M2331K67817K2155L9613l26074r7544J11131J04473J1327l1946R5146
11279i7870n1477L13836l48144J04777j72544L5974l6006o9817J2733K5781J13899
$$ plain form
11354 -325658 -567106 -641713 -825873 -416267 -210128 -210632 -284427 -390260 -211578 -219428 -341363
11343 -341363 -273023 -202489 -405604 -362294 -501243 -499292 14321 11487 197454 509083 352659
11332 352659 -21148 -318053 -446830 -413286 -444281 -353186 -266368 21928 203687 -119334
11322 -119334 24347 63218 -156090 -427431 -541852 -691205 -531080 -408342 -231793 -434736
11312 -434736 -92931 -130611 -347479 -318714 -599263 -259903 -253325 -150798 -152241 -303132 -414524
11301 -414524 -420947 -381227 -268867 -244379 -207693 -199538 -238808 -156684 -32765 -231337 -336299
11290 -336299 -293968 -26151 -3996 35617 -290457 -388001 -276870 -172397 -161070 -193016 -97870
11279 -97870 -149347 164489 -183655 -78878 -251422 -215448 -251454 -321271 -308538 -282757 -168858
11268a68858k06642K58282K93811n2846m4745m54062j27240L45481P706k25664
11258c74777J88904J02448J44595M2650j45021N46899k52571j73365j82686j41688
11248b44612k11287P7919P3915j96989K83328M10983J56453K15968j86406k64377
11238A14895O5755l06950m38028J88098L49161n0351k15673K10968r31K19355
11228A36299j3066k86298K45223j82671k1945M58742n71533k04688j04950p0738
11218f15625J55343L66329K86836j42965K6375J6433o8884l01858j7158n5956
11208c51130K50134r5107j57168K44370K50708l49791J37661k52540k05568K41230
11198b87201j96835Q9833k47044K81898k14247K51630J81275L11507L97589j9128
$$ plain form
11268 -168858 -375500 -117218 176593 123747 79002 -375060 -502300 -156819 -149113 -374777
11258 -374777 -185873 -83425 61170 103820 -41201 505698 253127 79762 -102924 -244612
11248 -244612 -455899 -377980 -304065 -501054 -217726 193257 349710 565678 379272 114895
11238 114895 180650 -126300 -564328 -376230 -27069 -77420 -293093 -82125 -83056 136299
11228 136299 123233 -163065 82158 -100513 -122458 336284 -235249 -439937 -544887 -615625
11218 -615625 -460282 -93953 192883 49918 76293 92726 23842 -278016 -295174 -351130
11208 -351130 -100996 -196103 -353271 -108901 141807 -207984 -70323 -322863 -528431 -287201
11198 -287201 -484036 -394203 -641247 -359349 -573596 -321966 -140691 170816 568405 549277
11188E49277J3162p4673q8586n7292L1582j89718k06608l2385j3839q1970k14024
11177c65074J46738k46122L55357J22272q2138N12903l72080j3775L52893Q0376
11167D91350l88243J08567l59026j60212K29169j63279M7041K22697L7552m26048
11157c60432J31163K8794j79659N68513j38602k51605L80142k550k47464J99649
11147A27949j35021l18752P3236K55810J65081l22399P4086n2649n4708M14718
11137B27351k82257m5057K19996o3003o7633O41518k37504j10272j61665l53909
11127b32435N2220j592q207l9856L44296j03911k71994K24028l50088J7899K17270
11116a52370k6659m4289L48847R9233p3571J211j28127l26939k32929L78192J25065
$$ plain form
11188 549277 562439 487766 399180 341888 373470 183752 -22856 -55241 -69080 -151050 -365074
11177 -365074 -218336 -464458 -109101 13171 -68967 443936 71856 58081 410974 491350
11167 491350 103107 211674 -147352 -307564 -78395 -241674 -194633 28064 65616 -360432
11157 -360432 -229269 -200475 -380134 188379 49777 -201828 178314 175764 -71700 127949
11147 127949 -7072 -325824 -252588 3222 168303 -154096 -80010 -132659 -187367 227351
11137 227351 -54906 -99963 120033 57030 -10603 630915 393411 283139 121474 -232435
11127 -232435 -180215 -181807 -190014 -229870 114426 10515 -261479 -37451 -387539 -369640 -152370
11116 -152370 -179029 -223318 125529 224762 151191 152402 24275 -302664 -535593 -157401 -32336
11105c2336K72130P5049j42966K12337J77885l63648j96926j19607K0163j04354
11095b02273M024O2239J43290j00443J1799P2776J82277j19320j23997q347O1439
11084a6536r6613m0359L44339k06300J4316j7852k1355j73876K47514j06410P0319
11073b813j0975k59594J41295q3775J07024j18521K71568L8809J53795J21947
11063C58760J38091p9475m27006o5488j33176L4089l06071L77731j89321J20797
11053a71069J92014j91245L21743L843k9368J86901j55551j13774K67446j48303
11043A62637j22030j49702P3660l1252j7697k399J3010J719J14588j77310K96762
11032A61986N6067j84736j40001J45495p5434j4017M84812l46984o5329L89455
$$ plain form
11105 -32336 239794 314843 171877 384214 562099 198451 1525 -118082 -97919 -202273
11095 -202273 -198249 -136010 7280 -93163 -81364 -8588 173689 54369 -69628 -77975 -16536
11084 -16536 -113149 -153508 190831 -15469 -1153 -19005 -40360 -214236 33278 -73132 -2813
11073 -2813 -13788 -273382 -132087 -215862 -108838 -227359 44209 83018 236813 358760
11063 358760 496851 417376 -9630 -75118 -208294 -174205 -480276 -102545 -291866 -171069
11053 -171069 20945 -170300 151443 155286 125918 312819 157268 43494 310940 162637
11043 162637 40607 -109095 -35435 -66687 -84384 -86783 -73773 -72054 42534 -134776 161986
11032 161986 218053 33317 -106684 38811 -36623 -50640 434172 87188 21859 411314
11022D11314J62135m43364J88640k69672k56912J14307p5611j69791K54802j28661
11012b12813o5328L37962k92920j15801K43459J14291M9460m1402N8397P5963
11002A51268m25848o7370L42962p6615k47670K33855K1298J47458K9439m3535
10992F5242k19890K84687Q1974q037p2516K1604N8773L2897o3146j40887L6112
10981G6813J6759L527R9650Q4336k20449l04538J79919J8744R1463J17545K4138
10970A87907N9835p3207R4638M8505r4075J66434r2745J54704j06540n28289k43007
10959d25840K0799r2929J94700M70979j04589J96415r3142l32461L08619m3363
10949I9188m76264J34972N6797J6795K86516k12730L6074N7956j20971O7020r8443
$$ plain form
11022 411314 573449 130085 318725 49053 -207859 -93552 -169163 -338954 -84152 -212813
11012 -212813 -278141 59821 -233099 -348900 -105441 8850 58310 16908 75305 151268
11002 151268 -274580 -341950 1012 -75603 -323273 -89418 -68120 79338 108777 65242
10992 65242 -154648 130039 212013 203976 131460 153064 211837 244734 181588 40701 76813
10981 76813 93572 97099 196749 281085 60636 -243902 -63983 -45239 46224 163769 187907
10970 187907 247742 174535 269173 317678 223603 390037 297292 451996 345456 -182833 -425840
10959 -425840 -405041 -497970 -303270 167709 63120 259535 166393 -166068 142551 99188
10949 99188 -377076 -242104 -185307 -168512 118004 -94726 -58652 -696 -121667 -54647 -153090
10938a53090k460K57930j13924r8488M29372j91016J40938k74574m35572J16512
10928c24372j92807n2324L78386J74627J74172j46802j95970J62855k4780K05454
10918A58439R1456J42561q1960j91456N247l8501j69245k46054J5110p0698L69081
10907a6020J65005j47750l7001J80289k50780K9347k61548n2239J9435J37506
10897b33756J56161R2356L8809K76897k46659r3921L27449k98892n6412Q0583
10887D2615k29759P9626l901J37828J6415p3379K32388j4062k51311r2210j46331
10876c02081j05030J48500K30290K89782J881J69926l0218j62012M9030k39234
10866E0834m68152j09423O1829k53834M31659M03340m17830M9336L70363j4855
$$ plain form
10938 -153090 -155550 102380 -11544 -110032 319340 128324 269262 -5312 -440884 -324372
10928 -324372 -517179 -569503 -191117 -16490 157682 10880 -185090 -22235 -47015 158439
10918 158439 249895 392456 310496 119040 124287 85786 -83459 -329513 -314403 -385101 -16020
10907 -16020 148985 1235 -35766 144523 -106257 -76910 -338458 -390697 -371262 -233756
10897 -233756 -77595 14761 53570 330467 83808 -10113 317336 18444 -37968 42615
10887 42615 -187144 -107518 -111419 26409 42824 -30555 201833 187771 -63540 -155750 -302081
10876 -302081 -407111 -258611 -28321 261461 263342 433268 403050 241038 290068 50834
10866 50834 -417318 -526741 -464912 -718746 -287087 116253 -301577 -252241 118122 103267
10856A03267m2203J52672j97565l2127k5068p2212l72323L6854L8599K89017R5247
10845b5842J57470j77281M4573l3467p1449J07052J13841L5718J73400k33022
10835I0993K02170r5537j51934j41659P8369k46498k0009M85694K47079j70690
10825B77978M5358J18273n27258K33060j62764j32056K50866j17808j97116L52150
10815A40683j19648M2380n5556p0931J44120K9901j16352J4553j15930L04018
10805A97238l50876P5402L91347k64499K58159j49129k26877j05889K21661j71563
10795a25026J67422j99855j55520N98698J03102j53887K28816M44746l59093m4368
10785E05035p6312j12985n9970j61745j57074J27357N1465j61001J50483K19161
$$ plain form
10856 103267 61064 213736 16171 -15956 -41024 -113236 -485559 -448705 -410106 -121089 -25842
10845 -25842 131628 -45653 -1080 -34547 -105996 1056 114897 150615 324015 90993
10835 90993 293163 197626 45692 -95967 -17598 -264096 -284105 201589 448668 277978
10825 277978 323336 441609 -85649 147411 -15353 -147409 103457 -14351 -211467 140683
10815 140683 21035 63415 7859 -63072 81048 110949 -5403 9150 -106780 197238
10805 197238 -153638 -78236 313111 48612 306771 157642 -69235 -175124 46537 -125026
10795 -125026 42396 -157459 -312979 285719 388821 234934 463750 908496 549403 505035
10785 505035 428723 315738 255768 94023 -63051 64306 115771 -45230 105253 324414
10775C24414L5348p3888Q8378k09354k25056J88348j9078L0222J24515R2646Q7932
10764D44427J33878m81075j59038J12174j18531l2895K31724k63741K49137k8043
10754H8017j24490k5095J4544R3887J81852l66560r3598K76652J60283L73930
10744E79422k60143l56325k48551J9988r7094J81256J98613j61574K83231K32073
10734C70896o4031j01683l6409k72059k2311j38129j04395N40617k15461j9102
10724f2067J6251L59745l73444L41933j70839k49277N90236l32795o7962J45053
10714A96834k03213L7037j10180K1620J63775k11575N72137k3150k19900N40025
10704G63410m43586j52082K21092j56808m76064K35008L6003J15049K49859j19437
$$ plain form
10775 324414 359762 285874 374252 164898 -60158 128190 109112 139334 263849 356495 444427
10764 444427 578305 97230 -61808 50366 -68165 -101060 130664 -133077 116060 88017
10754 88017 -36473 -61568 -47024 46863 228715 -137845 -231443 45209 205492 579422
10744 579422 319279 -37046 -285597 -265609 -362703 -181447 17166 -144408 138823 370896
10734 370896 306865 205182 168773 -103286 -125597 -263726 -368121 172496 -42965 -62067
10724 -62067 -45816 313929 -59515 282418 111579 -137698 452538 119743 51781 196834
10714 196834 -6379 30658 -79522 -57902 105873 -105702 466435 443285 223385 763410
10704 763410 319824 167742 388834 232026 -244038 -9030 26973 142022 391881 272444
10694B72444K1930P233l54115k74951L27169K58731j66456J06282p1289q1138
10684D5840J48145Q6149J52685L7118P5476k77526j19983k56296J29361J0225
10674C1194N1449o6925O0813Q0053j32863K5373P2031K06083j39910M52028m6719
10663E92607r2039l26700r3925K41934j57921k56082n2932L06229J61604j05747
10653B17028L56452l15565N2317J4933n53174J47730M28376k39464J08386O1400
10643B78419k40685J50173M8879m30848k20410K40844n9924M14701J70903L6075
10633C88127j32925j05437k00763K38047r030J20738j6636k50756j23500L87865
10623B95730l2367k26991l25540P1373J15292L07926o1735l35749L23987j59905
$$ plain form
10694 272444 294374 301607 -52508 -327459 -290 258441 91985 198267 126978 45840
10684 45840 193985 280134 432819 469937 545413 267887 147904 -108392 20969 31194
10674 31194 82643 15718 76531 156584 23721 49094 121125 327208 187298 639326 592607
10663 592607 500568 173868 79943 321877 163956 -92126 -145058 161171 322775 217028
10653 217028 573480 257915 310232 325165 -228009 -80279 348097 108633 217019 278419
10643 278419 37734 187907 236786 -194062 -414472 -173628 -233552 181149 352052 388127
10633 388127 255202 149765 -50998 187049 178019 298757 282121 31365 -92135 295730
10623 295730 263363 36372 -289168 -217795 -102503 205423 143688 -192061 131926 -27979
10613b7979k21213K56197J98994j30760Q6497K01665m20256L06394j73532k23471
10603a47464J16148K84694j08152j50812N0692l16976N3692P8921L5696L242L69469
10592B69150q0759K67555L5338m94212K39135Q8368j85498m7644n7389l83599
10582c49555J8927k36855J68466L47668Q1266M1033J7483K31427l16642k5230
10572b2012P6180L5102J33224l7520r9210o1589q1851L3258L71639l25188J48861
10561A70894j09223q6835O0849k48888l9602Q7951J83681K4563j74433M92669
10551C61626l03103K83179L8845p30O6465l07182l55231L52789k59977k08842
10541c32161L93058m97000J94608J90490p7148j00138K98055n48505M73259l9849
$$ plain form
10613 -27979 -249192 7005 205999 75239 161736 363401 -56855 249539 76007 -147464
10603 -147464 -31316 253378 145226 -5586 45106 -271870 -218178 -139257 -103561 -100319 269150
10592 269150 188391 455946 491284 -2928 236207 324575 139077 91433 34044 -349555
10582 -349555 -330628 -567483 -399017 -51349 29917 70950 88433 319860 3218 -22012
10572 -22012 54168 89270 222494 184974 85764 24175 -57676 -24418 347221 22033 170894
10561 170894 61671 -25164 35685 -213203 -252805 -164854 18827 43390 -131043 361626
10551 361626 58523 341702 380547 379817 446282 139100 -216131 136658 -123319 -332161
10541 -332161 60897 -436103 -241495 -51005 -128153 -228291 69764 -478741 -5482 -45331
10531d5331L06793j8969K93720j93420n28407R8129K61915j50831R7913l3858
10521H7654k12596J08237Q2366l53004J91497l12889K00217J42551K83961j3826
10511B04168j10298M2497K15312O8150j78027p6523r3347k24583J26075n7044
10501h3620o2241j96191K34153k87331J47421Q7179m6434K29486p6633J03556
10491D9345r5619j52273l39911M26369Q0463K69796Q6541J16230j55467J08282
10481C93756n58618l75605K25599L963L4224K06250J91608Q3327j03871J8334
10471A18967O6374K41732R5108j20922l1217l6406j86969j28308J92138p8559
10461A31938k28675K92894l17299K18774N1284q6249N2925j46897k77888J77676
$$ plain form
10531 -45331 261462 242493 536213 342793 -185614 -87485 174430 23599 121512 87654
10521 87654 -124942 -16705 65661 -287343 -95846 -408735 -208518 -65967 217994 204168
10511 204168 93870 136367 351679 419829 241802 165279 71932 -152651 -26576 -83620
10501 -83620 -145861 -342052 -107899 -395230 -247809 -160630 -207064 22422 -54211 49345
10491 49345 -46274 -198547 -538458 -112089 -31626 238170 324711 440941 285474 393756
10481 393756 -164862 -540467 -314868 -310905 -276681 -70431 121177 204504 100633 118967
10471 118967 185341 427073 522181 401259 370042 333636 146667 18359 210497 131938
10461 131938 -96737 196157 -121142 97632 148916 62667 115592 -31305 -309193 -131517
10451a31517J59190j7678K94562J85407j40113p31j75503k59377J11440R3818
10441A19498j06329K06207j82487l09297R8132m1612m40268L24282J65976J05647
10431f0251Q7663j73268j32580M27527l81974p4206N59798k93963k59619K79685
10421b1188j54465o3041K48597k25062k52588J33987L2418K03400k20963l7913
10411c56818M7457k39702L21436j92860K72190J47749J03834J21286K57603l07013
10401A75162j00723j60338q6148j51370N8736J62054k19696j52222J75796n4070
10391c52819K85227J22115p426o8418k02846j76317P1367K0016L50244m9351k4518
10380c2726P9685n7989P5942j73691L2322K5925J0819k6754m2568J72409j7026
$$ plain form
10451 -131517 27673 9995 304557 489964 349851 349120 173617 -85760 25680 119498
10441 119498 13169 219376 36889 -272408 -174276 -215888 -656156 -331874 -165898 -60251
10431 -60251 27412 -145856 -278436 149091 -232883 -307089 252709 -41254 -300873 -21188
10421 -21188 -175653 -238694 9903 -215159 -467747 -333760 -301342 -97942 -318905 -356818
10411 -356818 -309361 -549063 -227627 -420487 -148297 -548 103286 224572 482175 175162
10401 175162 74439 -85899 -172047 -323417 -264681 -102627 -322323 -474545 -298749 -352819
10391 -352819 -67592 54523 47097 -21321 -224167 -400484 -329117 -309101 41143 -8208 -32726
10380 -32726 46959 -11030 64912 -108779 -76457 -50532 -39713 -66467 -109035 63374 46348
10369D6348m69036L51473o0445Q7767K26270K09381j84042l989m77279N4062K331
10358b17159r6757K4810j44994J00119L77560k84717M69782j7961j95721L95504
10348D10466l95796L395J42033l36971j16328K91913j27624R0432P4561j05228
10338f9147K12787J00233k66684J70691o9108k42024J95455m31166k50228N43902
10328a05289J42585K57264J00383j55781l01077L7650k79538n9646J97894J21767
10318d3788l5609J7533N0275K854o3797M10331o59688K85945R2977J74061j29483
10307A01611j95172q8364l0691L51593l01619J00027o8584q5731k28304M49291
10297D057o9177r2575M45449j66810o3852K02151p1143Q1345M15403l09801k3193
$$ plain form
10369 46348 -422688 -71215 -131660 -43893 182377 391758 207716 203727 -273552 -219490 -217159
10358 -217159 -313916 -289106 -434100 -333981 43579 -241138 228644 210683 14962 410466
10348 410466 14670 18065 160098 -176873 -293201 -1288 -128912 -38480 36081 -69147
10338 -69147 143640 243873 -22811 147880 78772 -163252 32203 -398963 -649191 -105289
10328 -105289 37296 294560 394943 239162 -61915 -24265 -303803 -363449 -165555 -43788
10318 -43788 -79397 -61864 -11589 -8735 -72532 337799 -321889 -35944 57033 231094 101611
10307 101611 -93561 -181925 -212616 138977 -162642 -62615 -131199 -216930 -445234 4057
10297 4057 -65120 -157695 287754 120944 57092 259243 188100 269445 684848 375047 351854
10286C51854J16480n3240k52979m9573N43396m27119J97021J4293m35495L24359
10276C28997k20796P1578J1824L31978k28691J03287K6534J75892J3183J30616
10266G44402J74425k59642K91729r7351j09480L67763r0543Q8498K71180j11876
10256A269105N34196L68546r9228M48967K51706j54539P2372l45313l58427j19198
10246A868187P2044p78351K92217p7682k18343O7053p4183o4467K69831m16200
10236I40106J87187j29255m46101J03453p7049r1190j13433j58411k1297L55128
10226E49138k53839Q7R0170j48257J97766l74977K83000r3280k0204M9660p7419
10215B01845p4363m5052J61415j99512L44289M7136P0130j85845R0308j14312
$$ plain form
10286 351854 468334 415094 162115 112542 655938 228819 425840 440133 4638 328997
10276 328997 108201 179779 191603 523581 294890 398177 424711 600603 613786 744402
10266 744402 918827 659185 950914 853563 744083 1111846 1021303 1109801 1380981 1269105
10256 1269105 1803301 2171847 2072619 2521586 2773292 2618753 2691125 2345812 1987385 1868187
10246 1868187 1940231 1161880 1454097 1376415 1158072 1225125 1150942 1086475 1356306 940106
10236 940106 1127293 998038 551937 655390 578341 487151 373718 215307 194010 549138
10226 549138 295299 295386 385556 237299 435065 60088 343088 249808 229604 279264 201845
10215 201845 127482 82430 243845 44333 388622 435758 505888 320043 410351 296039
10205B96039j67549J48553k20842M15397j12755J23250J62656L3368k56780k5617
10195C95720J66631m98267M88394j55701K36069J39619k92210j57487M08629P4130
10185H05527k16466K79435r3711q7150L10720k51322l67662L55609k45516l15775
10175A73689K24793q4835J39500j32735j57938Q4937K127K67805l14019M60849
10165F64173k20365j19432N7827j4586M6703J94045m2273j41345L0224k16483
10155B38488J78619j29000p8154L0092J42686r7634l40140J80813K61094m3549
10145C43315L81275N1282l47934K82603k80369k36698K36720m77329L88316L33635
10135F74816k49703j01675J16830j9336j57470j9079R2627j26784Q6660j58490
$$ plain form
10205 296039 128490 277043 56201 471598 358843 482093 644749 678117 421337 395720
10195 395720 562351 64084 552478 396777 632846 772465 480255 322768 731397 805527
10185 805527 589061 868496 774785 687635 998355 747033 379371 734980 489464 173689
10175 173689 398482 313647 453147 320412 162474 247411 249538 517343 203324 664173
10165 664173 443808 324376 382203 367617 414320 608365 566092 424747 454971 238488
10155 238488 417107 288107 209953 240045 382731 285097 -55043 125770 386864 343315
10145 343315 724590 775872 427938 710541 430172 193474 430194 -47135 341181 674816
10135 674816 425113 323438 440268 420932 263462 244383 337010 210226 296886 138396
10125A38396k11498J65427L64619k31293L5023M1247m03590j65946Q2285J4799
10115a70531L12103K50390M5784l31515j5648J45010j83591L77056l05391q9324
10105C4343K11459M83j56844K76367l929n8705L15190J21058P5373k51035k82196
10094B81564K27623k52513o32840K08429J41752j74542M98914O8337L0118J8170
10084D15012k3207o4538N351k4029j20590n7933n1536N5391J35227M48018k64968
10073D52198k85128j08253Q2236p2100j51100J14439O2807j86394J93677k0707
10063H1675j84343K55237O072k00107L10276k4942K2998j14406J69352l13575
10053H237L35470K46553M0757k32646j97057j19435N8651J53606k35696K57914
$$ plain form
10125 138396 -73102 92325 456944 225651 260674 301921 -101669 -267615 -185330 -170531
10115 -170531 141572 391962 437746 106231 90583 235593 52002 429058 123667 34343
10105 34343 245802 246285 89441 365808 361879 303174 618364 739422 814795 563760 281564
10094 281564 509187 256674 -376166 -167737 -25985 -200527 298387 366724 396842 415012
10084 415012 391805 327267 332618 308589 187999 130066 78530 133921 269148 717166 452198
10073 452198 167070 58817 141053 68953 -82147 32292 95099 -91295 102382 81675
10063 81675 -102668 152569 158641 -41466 268810 243868 266866 152460 321812 8237
10053 8237 343707 590260 631017 398371 201314 81879 140530 294136 58440 316354
10043C16354r6025l7062o6799M7292j61527L90222N4173O6213L69296l99572k41619
10032B40946J4075l22320K29584J60254j00990L7305j33549l84939K59522J73688
10022A73576J22679p7059N7219j07243L7533j41131l40915j5106N8358J57537
10012g4552J77853K98647j63871j5250J90125k86502l38125L77934K12662l72610
10002F311J57092L3203r1334K34498Q5542O407L8552l01812P4109J38849k31294
9991A50123J98180J16060o474n4381P266k22446k0384k69776J89245J78790q4321
9980A81882K14457m6388O5836k19838m6388p5766N4196J63093p4268K44712j26363
9969C35165J11149k03279J23987j95967l50352p5418j71743J94980K14152R7101
$$ plain form
10043 316354 220329 183267 116468 163760 2233 392455 446628 512841 882137 482565 240946
10032 240946 255021 -67299 162285 322539 221549 258854 125305 -259634 -112 173576
10022 173576 296255 219196 276415 169172 206705 65574 -275341 -290447 -232089 -74552
10012 -74552 103301 401948 238077 222827 412952 126450 -211675 166259 378921 6311
10002 6311 163403 196606 105272 339770 425312 431719 470271 168459 242568 381417 150123
9991 150123 348303 464363 457889 403508 410774 188328 167944 -101832 87413 266203 181882
9980 181882 396339 349951 415787 195949 149561 73795 127991 291084 216816 461528 335165
9969 335165 446314 243035 367022 171055 -179297 -254715 -426458 -231478 -17326 79775
9959G9775l41338J60341j98510M04665K51960K28717l81623K4741K34060j34268
9949C28520j11476J9052L88812J40579k44427k92927j286R7036l29057O7565R4158
9938A56549k317j1387j7754J87699p8999o1385K8782J2370L275J95726k9003J41022
9926E24578k63512J30774M102j41247q7443l5973J47427j42206p1581j01876L16620
9915B79663j27867K8678O7956j13732j23298K97063K160Q0228K15000k34034K54743
9904F26560R7333n27843k92506K56108j78901J47718L6904P5236L89102j10575
9894E19136j8949K25963P1755n0060M9590M0108m07463k03464K05029j16517J22540
9883D37668L71782l04690L36819m15579K28984R6892m03560j87203M3206K49460
$$ plain form
9959 79775 -261563 -101222 -299732 104933 356893 585610 203987 228728 462788 328520
9949 328520 217044 236096 624908 765487 521060 228133 226847 323883 -5174 62391 156549
9938 156549 154232 142845 125091 312790 233791 172406 201188 213558 216833 412559 383556 524578
9926 524578 261066 391840 395942 254695 167252 131279 278706 136500 64919 -36957 279663
9915 279663 151796 180474 248430 134698 11400 308463 310623 390851 605851 371817 626560
9904 626560 723893 196050 -96456 159652 -19249 128469 165373 240609 629711 519136
9894 519136 500187 726150 797905 747845 797435 837543 430080 226616 431645 315128 437668
9883 437668 809450 504760 841579 426000 654984 751876 348316 161113 204319 453779
9873D53779O4338l39021P25287n7157k32912L75257k59357m22101K31037m34451
9863A04699J93606K95074n09721J60204J13958K0058n34860M26907K60341j26407
9853D03859m9841J78916j84915M58891j97290k18731N34233j94890j22145J28043
9843G36130n67297J77369J23912k18369O69300j75325m6092K11301m47053n74565
9833a10689l8044K5784K93999n9559R74L63109l31675J90274j11881j56781M95251
9822E60762N0526k06373M9561k41773L27413K37565j86635J66654j05651l02588
9812C49461J972J03807k8160j65507K16293q7712R6991j2176q4133K63654Q1250
9801G35740j93307K83318J39223n05037O6611o7409j37282r2871K97499k9300
$$ plain form
9873 453779 518117 179096 904383 847226 614314 989571 730214 308113 539150 104699
9863 104699 298305 593379 83658 243862 357820 377878 -156982 269925 530266 403859
9853 403859 354018 532934 348019 806910 609620 390889 925122 730232 608087 736130
9843 736130 168833 346202 470114 251745 921045 745720 699628 910929 463876 -110689
9833 -110689 -148733 -122949 171050 111491 112465 475574 143899 334173 222292 65511 560762
9822 560762 611288 404915 454476 212703 540116 777681 591046 757700 652049 349461
9812 349461 351433 455240 427080 261573 477866 390154 487145 474969 390836 654490 735740
9801 735740 542433 825751 964974 459937 526548 459139 321857 228986 526485 497185
9791D97185j65951Q7357J09305k2828R1167l80103k29261K71586m5119J80507
9781C93845K27896j93336J15963K53470l36724O8104l08470L73015K65019l83835
9771D74947J7010J09518o2299k8986l002o8614k0329j43102J75684J8518K55520
9760G24865J84245r5168q0161J46052j86994m46676K19519k0008l12605M00020
9750E33089J19170l67945L97969Q7500q0971K14656k43792J60835k628k1237J39671
9739I36317j26145K02093k04622j12124K96512o8578K555P0857l53121K06145
9729H49889j02126j93011N78415k74002j52985N69213o5065j97284J71688J8643
9719A203375O0019K07709j19859J63796l9057K80396J30668J14236K01672k1784
$$ plain form
9791 497185 331234 418591 527896 505068 596235 216132 -13129 258457 213338 393845
9781 393845 621741 428405 544368 797838 461114 529218 220748 593763 858782 474947
9771 474947 491957 601475 539176 510190 507188 438574 418245 275143 450827 469345 724865
9760 724865 909110 813942 733781 879833 692839 246163 465682 445674 133069 533089
9750 533089 652259 284314 682283 769783 688812 903468 659676 820511 817883 796646 936317
9739 936317 810172 1012265 807643 695519 992031 923453 926008 996865 643744 849889
9729 849889 747763 554752 1133167 859165 706180 1275393 1210328 1013044 1184732 1203375
9719 1203375 1263394 1471103 1351244 1515040 1475983 1756379 1887047 2001283 2202955 2181171
9709B181171O0587J87818R8681L8696n8301q9532L95999M699K74673K97106j20775
9698C270822J46252m17332k2703N858l69687j97135j93031p0655J35775k06480
9688B081684j80768J28135m61290L59474M1751k22200j4475K76421J1316K56686
9678B276734K55394R3456k07984K879J38579L65008J57505J63714k90201k6632
9668B928452L25370j23756N14961j26503J07182o412O6369j24236l45021k24077
9658B992329l46361m38373j46247J85421o488q5403k25167R464q2661j81305r5709
9647A579500l30887j33386J27896o3585j1751K00816J04870M9686J39536m51062
9637A211633k67113Q777N5904j6341r7112L93128K31878K86515l44794j80448
$$ plain form
9709 2181171 2241758 2429576 2528257 2566953 2508652 2419120 2815119 2819818 3094491 3391597 3270822
9698 3270822 3417074 2999742 2977039 2982897 2613210 2416075 2223044 2152389 2288164 2081684
9688 2081684 1900916 2029051 1567761 1927235 1968986 1746786 1732311 2008732 2020048 2276734
9678 2276734 2532128 2625584 2417600 2420479 2559058 2924066 3081571 3245285 2955084 2928452
9668 2928452 3253822 3130066 3645027 3518524 3625706 3619294 3685663 3561427 3216406 2992329
9658 2992329 2645968 2207595 2061348 2246769 2240281 2154878 1929711 1939175 1856514 1675209 1579500
9647 1579500 1248613 1115227 1243123 1179538 1167787 1368603 1473473 1523159 1662695 1211633
9637 1211633 944520 953297 1009201 992860 895748 1288876 1520754 1807269 1462475 1282027
9627A282027J54008l16536k31368N44274n4560p1065J7204J7511K19659J15782
9617A676936l31620Q7493K22235l12031J11717J22566m62609J09679J82404L6826
9607A443596K0028m3963j33932k25864P3806l71807O2861M06808K23104K85982
9597A740619K19449j79163J60602j15578k73306m02981K1205j44704J83535L86492
9587A596170k85014K57542j14488j59574n7608J49793K9021j48733L86828l77146
9577A276791K13227K72325P3716j23438K58806l70800p9359J82676l4354r2544
9567A577046L38901m0864l30220L34452k25167K2730K42331k35883J79335p9396
9557A783265R7586j9376Q9982j03372l64970N24584j19113k4266K43828k44376
$$ plain form
9627 1282027 1436035 1119499 888131 1432405 1377845 1306780 1323984 1341495 1561154 1676936
9617 1676936 1345316 1432809 1655044 1343013 1454730 1577296 1114687 1224366 1406770 1443596
9607 1443596 1463624 1419661 1285729 1059865 1133671 761864 824725 1231533 1454637 1740619
9597 1740619 1960068 1780905 1941507 1825929 1552623 1149642 1170847 1026143 1209678 1596170
9587 1596170 1311156 1568698 1454210 1294636 1237028 1386821 1415842 1267109 1653937 1276791
9577 1276791 1490018 1762343 1836059 1712621 1971427 1600627 1521268 1703944 1669590 1577046
9567 1577046 1915947 1875083 1544863 1879315 1654148 1676878 1919209 1683326 1862661 1783265
9557 1783265 1880851 1861475 1951457 1848085 1483115 2007699 1888586 1864320 2108148 1863772
9547A863772J98871N02795j66674J93597K28935k49612K30509J38653j1439K36522
9537C165929J78880k07294l17890K77673J61353L3415L12916L7312r1156Q8124
9527C639262j91979k70180R6657n1417l89241K13537k67822j07907k09408K14846
9517B676348l49460M73524N6850j70257j84850l3106k94347J15432M57776j16021
9507B631889M81966J32112j16108L94205j3704k11000K43402j43733j72767K55283
9497C481545j61525M13322k1411j38795j63657P6590L59505k94530j72767m46237
9487B932040k61819j34265l22875l3762o7318j75316m5958K18721k24181r8637
9477A786630K96036J2153J47944j45305k15475j71564J14464j71163l2136J6017
$$ plain form
9547 1863772 2062643 2565438 2398764 2592361 2821296 2571684 2802193 2940846 2929407 3165929
9537 3165929 3344809 3137515 2819625 3097298 3258651 3292066 3604982 3642294 3551138 3639262
9527 3639262 3447283 3177103 3273760 3222343 2833102 3046639 2778817 2670910 2461502 2676348
9517 2676348 2326888 2800412 2857262 2687005 2502155 2469049 2174702 2290134 2747910 2631889
9507 2631889 3113855 3245967 3129859 3524064 3510360 3299360 3542762 3399029 3226262 3481545
9497 3481545 3320020 3733342 3711931 3573136 3409479 3486069 3845574 3551044 3378277 2932040
9487 2932040 2670221 2535956 2213081 2179319 2112001 1936685 1890727 2109448 1885267 1786630
9477 1786630 2082666 2094819 2242763 2097458 1881983 1710419 1824883 1653720 1621584 1637601
9467A637601M7759m06872m339j13810k8301K69856J07303Q2910L95279l36753
9457A650633k85605K06995k72951Q1444l2075l33615N47795k98582k18996M00920
9447A445963O6153p7727p6451o77140L66311J85309J81284K50957k23290K5107
9437A466476O8802q336l69302K48837l09893Q9725K10492l09439L11909j7897
9427A381374k82439R3951L5795J36519L36975n620j99327j98560l8458k28077
9417A032133p4911L78860J43978r9495k511j91657j51898K51473K9886r4462K54641
9406A476037j09304j21030K00149j0984K943J5957L52246j65465K50954j34412
9396A757091j01262j89801R0823j37754n4968O4036j73842q6520J10634p7792
$$ plain form
9467 1637601 1685360 1278488 1274149 1160339 1132038 1401894 1509197 1592107 1987386 1650633
9457 1650633 1365028 1572023 1299072 1380516 1348441 1014826 1562621 1264039 1045043 1445963
9447 1445963 1512116 1434389 1357938 680798 1047109 1232418 1413702 1664659 1441369 1466476
9437 1466476 1535278 1526942 1157640 1406477 1096584 1186309 1396801 1087362 1399271 1381374
9427 1381374 1098935 1192886 1228681 1365200 1702175 1696555 1497228 1298668 1260210 1032133
9417 1032133 957222 1336082 1480060 1380565 1378054 1186397 1034499 1285972 1315858 1221396 1476037
9406 1476037 1366733 1245703 1445852 1434868 1437811 1453768 1806014 1640549 1891503 1757091
9396 1757091 1655829 1466028 1556851 1419097 1364129 1428165 1254323 1167803 1278437 1200645
9386A200645L07698M4933L1465K98402m40507Q4139L196j25246n6152K29828J97810
9375A776211K44692K90616j72556j48416j55919j03722O2508R9631J71873p6376
9365A988542K60293J00909p6085L64886m426p02645j65550M3467l1430O086r934
9354A774113k03147K10639m4306j8573P6553p890J89103L51738l35795O2691J7383
9343B072509J05759J16203j48128p3509J40126J33333K06972k6045M21895j86318
9333B762797j49301K82354L8274k1478J6940N9542j07769J93117j68710r0122
9323B815644n3587l47347r3015J42628k19224M34459k5965j7453J63750j40195
9313B659695j44302Q1096P0405N6976j56330J18201m16209R5895k18081j35760
$$ plain form
9386 1200645 1508343 1553276 1584741 1883143 1442636 1526775 1529971 1404725 1348573 1578401 1776211
9375 1776211 2020903 2311519 2138963 1990547 1834628 1730906 1793414 1893045 2064918 1988542
9365 1988542 2248835 2349744 2273659 2638545 2634119 1931474 1765924 1809391 1777961 1784047 1774113
9354 1774113 1570966 1781605 1737299 1718726 1795279 1787389 1976492 2328230 1992435 2055126 2072509
9343 2072509 2178268 2294471 2146343 2072834 2212960 2346293 2553265 2527220 2949115 2762797
9333 2762797 2613496 2895850 2934124 2912646 2929586 2989128 2881359 3074476 2905766 2815644
9323 2815644 2762057 2414710 2321695 2464323 2245099 2679558 2653593 2636140 2799890 2659695
9313 2659695 2515393 2596489 2666894 2723870 2567540 2685741 2269532 2365427 2147346 2011586
9303B011586R6457J14565K00811L46697K36579p9060j29141N3812J70069j88613
9293B833762J51980l40543k31229K09882J22838o1109M79308k71621l42231K60658
9283B811695m70878K28135j6701j30130L7640K31162K1962q3221O4379L03k39066
9272B455280R7563R8007k11489N13388K2130m78558n5558k46360p965Q8614K16049
9261B491101j43080K59546J48419j35364K0549Q6466k95813q6723K95973j22908
9251B518166q2157L15005k2341L9230L3693l0723j46728q6901o9113J51198R2037
9240B711366N7862L07j93426J57813j43566R5142r3625P8826j74343J30286N7506
9229B684148P1762R5618m0817k68407L4782m7149M4713L2361N4731L68320J97576
$$ plain form
9303 2011586 2108043 2222608 2423419 2770116 3006695 2927635 2798494 2852306 3022375 2833762
9293 2833762 2985742 2645199 2413970 2623852 2746690 2685581 3164889 2893268 2551037 2811695
9283 2811695 2340817 2568952 2552251 2422121 2459761 2690923 2712885 2629664 2694043 2694346 2455280
9272 2455280 2552843 2650850 2439361 2952749 2974879 2496321 2440763 2194403 2186438 2275052 2491101
9261 2491101 2348021 2607567 2755986 2620622 2641171 2727637 2431824 2345101 2641074 2518166
9251 2518166 2436009 2751014 2728673 2767903 2801596 2770873 2624145 2537244 2468131 2619329 2711366
9240 2711366 2769228 2769535 2576109 2733922 2590356 2685498 2591873 2670699 2496356 2626642 2684148
9229 2684148 2755910 2851528 2810711 2542304 2577086 2529937 2574650 2607011 2661742 3030062 3227638
9218C227638j66695n3731m04201L021K8915l12445M0735J35423j58293Q7136Q4559
9207B512062K73158r7937L3654J49414o2931q9010K641M4868J33541Q8697j3265
9196B974892l62725J51505j02463K46946k96389K39663K42648m080J53649l15652
9186B927994O6970m2980K23873j98660J07392J66159J58699j12329J5247j22266
9176C190099j78060P6916k70317j84911K16204J39688K81966j4272J16129k14806
9166C158636j6816j84754N60937j81855m4005J75616l91406J05195o7412o4256
9156C049880M18991M1135n3046K23144j69178l85954L31119O79m7851L13688k41986
9145C480621L21207O6632P8879L29150K21489l82171j5010M6237j64668J29862
$$ plain form
9218 3227638 3060943 3007212 2603011 2606032 2634947 2322502 2363237 2498660 2340367 2427503 2512062
9207 2512062 2785220 2687283 2720937 2870351 2807420 2718410 2721051 2765919 2899460 2988157 2974892
9196 2974892 2612167 2763672 2661209 2908155 2611766 2851429 3094077 3089997 3243646 2927994
9186 2927994 2994964 2951984 3175857 2977197 3084589 3250748 3409447 3297118 3312365 3190099
9176 3190099 3012039 3088955 2818638 2633727 2849931 2989619 3271585 3257313 3373442 3158636
9166 3158636 3141820 2957066 3518003 3336148 3292143 3467759 3076353 3181548 3114136 3049880
9156 3049880 3468871 3510006 3456960 3680104 3510926 3124972 3456091 3456770 3408919 3722607 3480621
9145 3480621 3801828 3868460 3947339 4276489 4497978 4115807 4100797 4147034 3982366 4112228
9135D112228K12907k02095R130Q1205m4769L54124K3456l01931O9013J80699L70474
9124D864441j39326N2022L05619l77259J26456L31992j86085l32547L23568k79185
9114D689696O2665M12946j00330j34252J13730K67772q488J71614k72035K01150
9104E404468J42607J69393j00660J33553J02658J96594n6866n0456M97749K5227
9094F464267K75531j85209n8410L02859j5975L16500R354j31970O2924K23056
9084G262927j30443K37134K3070L6121l5307J71801K00296L35482M39630j61375
9074H379336L21940J47616r5745K316K13006l65728L82977L35489k39110L34509
9064I416606K43305l75766O40171J51923L26465O13995J30672J04735O63132K7492
$$ plain form
9135 4112228 4325135 4123040 4132170 4213375 4168606 4522730 4546186 4244255 4313268 4493967 4864441
9124 4864441 4725115 4777137 5082756 4705497 4831953 5163945 4977860 4645313 4968881 4689696
9114 4689696 4752361 5165307 5064977 4930725 5044455 5312227 5303739 5475353 5203318 5404468
9104 5404468 5547075 5716468 5615808 5749361 5852019 6048613 5991747 5941291 6439040 6464267
9094 6464267 6739798 6554589 6496179 6799038 6783063 7099563 7108917 6976947 7039871 7262927
9084 7262927 7132484 7369618 7392688 7428809 7393502 7565303 7765599 8101081 8540711 8379336
9074 8379336 8701276 8848892 8753147 8755463 8968469 8602741 8985718 9321207 9082097 9416606
9064 9416606 9659911 9284145 9924316 10076239 10402704 11016699 11147371 11252106 11915238 11942730
9054A1942730K36584P5584j7200L74303Q6999j42426N58705J87669K58332l0543
9044A3530737Q7050J20424K40902O1874J16846n4476J68407K52801J34890N33704
9034A5193159L04317J78377M34293L96391r7491M05752N48276J37549P04929M17713
9024A8623265l78246J85846N02642J02723M51130M57650p6450Q98356L93479J25083
9014B1285478N60956M94480K81517L71414P21819Q11655L17532N49626K40950
9005B5635427N53972N87359Q90219N26031J161534O07830Q38058J112121Q91820
8996C2804371J327643J428919Q12070J451454J386269J317583J618942J932765
8988D4080016J918891K315280K562562K301047K668763K900307K603670L197126
$$ plain form
9054 11942730 12179314 12254898 12237698 12612001 12699000 12556574 13115279 13302948 13561280 13530737
9044 13530737 13617787 13738211 13979113 14040987 14157833 14103357 14271764 14524565 14659455 15193159
9034 15193159 15497476 15675853 16110146 16506537 16409046 16814798 17363074 17500623 18205552 18623265
9024 18623265 18245019 18430865 18933507 19036230 19487360 19945010 19868560 20766916 21160395 21285478
9014 21285478 21846434 22340914 22622431 22993845 23715664 24527319 24844851 25394477 25635427
9005 25635427 26189399 26776758 27666977 28193008 29354542 29962372 30800430 31912551 32804371
8996 32804371 34132014 35560933 36373003 37824457 39210726 40528309 42147251 44080016
8988 44080016 45998907 48314187 50876749 53177796 55846559 58746866 61350536 64547662
8980F4547662L713618L265928L979128M030017M490220M798200N691459O823569
8972A01339801Q100824J0786514J3040374J5520844J8052317J8670030J7070731
8965B02581435J4304253J0747609O381553J371158k788427o328495q784849r189323
8957B08294914q808514o701716l275287j63188M193042R085096J2843640J7193905
8949B32661892K1339989K2924237K2563969J9132817J5142795R324667J211195
8942C44301561o310910j2797483j7285624k0627370k1741781k0593240j8815526
8935B26129627j5630292j3019172j0462751p886490n956462l855425j918795q3912
8927A67316328J30114N86431K60316N12193J479386L094221M768858P404934Q751207
$$ plain form
8980 64547662 68261280 71527208 75506336 79536353 84026573 88824773 94516232 101339801
8972 101339801 109440625 120227139 133267513 148788357 166840674 185510704 202581435
8965 202581435 216885688 227633297 234014850 235386008 232597581 226269086 217484237 208294914
8957 208294914 199486400 192784684 189509397 189346209 193539251 202624347 215467987 232661892
8949 232661892 254001881 276926118 299490087 318622904 333765699 343090366 344301561
8942 344301561 337990651 325193168 307907544 287280174 265538393 244945153 226129627
8935 226129627 210499335 197480163 187017412 179130922 173174460 169319035 167400240 167316328
8927 167316328 167446442 168032873 168293189 168805382 170284768 173378989 178147847 185552781 194303988
8918A94303988R417298R569054R403000Q622380P850875N813619L687818K117446
8910B50785478q14628l598385o113855r164561j1256025j2267598j2362032j1361443
8902A83846951r851458q092702o645191n388936m813234m203721m073607l538544
8894A37239558m005701l495250l129543k931140k949254k068644j779799j046745
8886A15833482l7189q87643p70144n66161j704126k356739k713597l970721m150233
8877I8676929m047456m013478l381664k760934k710403k171860j809602j527089
8869G6254443j254088q64704o03371j18828L26256P93232Q26762O83726l73310
8860G5670118j089605k209064k374845k872755l513730l425784k611249k238600
$$ plain form
8918 194303988 203721286 213290340 222693340 231315720 239166595 244980214 248668032 250785478
8910 250785478 249970850 246372465 240258610 231094049 219838024 207570426 195208394 183846951
8902 183846951 173995493 165902791 159257600 153868664 149055430 144851709 140778102 137239558
8894 137239558 133233857 129738607 126609064 123677924 120728670 118660026 116880227 115833482
8886 115833482 115796293 114908650 114138506 113572345 111868219 109511480 106797883 102827162 98676929
8877 98676929 94629473 90615995 87234331 84473397 81762994 79591134 77781532 76254443
8869 76254443 75000355 74135651 73532280 73413452 73739708 74532940 75359702 76043428 75670118
8860 75670118 74580513 72371449 69996604 67123849 63610119 60184335 57573086 55334486
8852E5334486j655692j461959j237785q53629r16549q53155p51303r38171p32900
8843D5933343r17220p39070j022056j152022j158195j234898r30153j553297j010522
8834C6215910j674030j500769j319560j172695j075669j410485q84895j031764
8826B6146043p62176k34954k84078o44539j16675n24711o67837p99968j304754
8817B0806351j202933q53040n98222q72357n83545o14760p75560o95163K6070
8808A4636841q67775l51660j00096n24435k49057k35849o47784j24547j14010
8799A1421628m10305l95214p3520j76339k11579k85370m74500l34082j0618K97293
8789I347394k57343K1002R1698m38314j95951K71580j00536K23074M6129m99393
$$ plain form
8852 55334486 53678794 52216835 50979050 50125421 49208872 48355717 47604414 46666243 45933343
8843 45933343 45016123 44277053 43254997 42102975 40944780 39709882 38779729 37226432 36215910
8834 36215910 34541880 33041111 31721551 30548856 29473187 28062702 27177807 26146043
8826 26146043 25383867 25148913 24864835 24220296 24103621 23578910 22911073 22111105 20806351
8817 20806351 19603418 18750378 18152156 17279799 16696254 16081494 15305934 14610771 14636841
8808 14636841 13769066 13417406 13317310 12792875 12543818 12307969 11660185 11535638 11421628
8799 11421628 11011323 10616109 10542589 10366250 10154671 9869301 9394801 9060719 9050101 9347394
8789 9347394 9090051 9111053 9202751 8764437 8568486 8840066 8739530 8962604 9008733 8509340
8779H509340o6331j34935j69474j5734M17873l59537L46644L39935k99830L75906
8769H943857J69644M2130L06728j5254K48247M82445L24375L31388M74183L4108
8759A1341851R59077N62454M24317J078317J80338Q64627P97883M19245K21283
8750A6849392J74988N16702l49506k3153k21907p47520m69339k35051r75536p37188
8740A3781882m79516o09139m77048j95258k95838l66104J95445o65701j80001
8731A0708722j3503o2580R4542J32849J82595J13198k56930K88937M45694O06315
8721A2239839R31402Q08540N3312O56400K83718P01355O79396M48459j1908K25714
8711A7016227k55846n92695o78345r05998p89579j120925l21198r50155q44477
$$ plain form
8779 8509340 8443009 8308074 8138600 8122866 8540739 8181202 8527846 8867781 8567951 8943857
8769 8943857 9113501 9155631 9462359 9447105 9695352 10177797 10502172 10833560 11307743 11341851
8759 11341851 12300928 12863382 13287699 14366016 14546354 15410981 16208864 16628109 16849392
8750 16849392 17024380 17541082 17191576 17168423 16946516 16198996 15729657 15494606 14519070 13781882
8740 13781882 13302366 12693227 12216179 12020921 11725083 11358979 11554424 10888723 10708722
8731 10708722 10695219 10632639 10727181 10860030 11042625 11155823 10898893 11187830 11633524 12239839
8721 12239839 13171241 13979781 14033093 14689493 14973211 15674566 16353962 16802421 16790513 17016227
8711 17016227 16760381 16167686 15489341 14583343 13793764 12672839 12351641 11401486 10557009
8702A0557009n01426p21851n14328k01341p01471k44372j9493p94241j12667j78509
8692F567310m34019O948m92168l09423k62477k51049l20947k25863j70712k83975
8682C823625J0178m3423n5094K42389q7779j03563j24149n203j57998J41971r3443
8671C547511r6624k39713N5150p9013R9508K25809l33216K6441k28499k39887
8661B737467j66767O0847k71598J06864J71727l3804L19372k5992k11520j36111
8651B550485m7194j28194R9783o0629M0697j21801l36133R8276j00448J27328
8641B122170o2476L63336n4747O05776k3905K1748n7458j50974K47889k86705
8631B724654M0541J69502l21311J390J72001m18507m402K26681j74056J25886
$$ plain form
8702 10557009 10055583 9333732 8819404 8618063 7916592 7672220 7652727 6858486 6745819 6567310
8692 6567310 6133291 6140239 5648071 5338648 5076171 4825122 4504175 4278312 4107600 3823625
8682 3823625 3833803 3790380 3735286 3977675 3889896 3786333 3662184 3656981 3498983 3640954 3547511
8671 3547511 3450887 3211174 3266324 3187311 3286819 3512628 3179412 3205853 2977354 2737467
8661 2737467 2570700 2631547 2359949 2466813 2638540 2604736 2924108 2898116 2686596 2550485
8651 2550485 2503291 2375097 2474880 2414251 2454948 2333147 1997014 2095290 1994842 2122170
8641 2122170 2059694 2423030 2368283 2974059 2950154 2971902 2914444 2763470 3011359 2724654
8631 2724654 2765195 2934697 2613386 2614776 2786777 2368270 2363868 2590549 2416493 2542379
8621B542379K88253J60612j80483K976j74877k33555L14041K1433n694k12956
8611B522129K71320q7714j97109j28012k39752L32069k21457J28623k01726J83447
8601B361818J18489l03474k17274K9422L48878N2273q8816L2790K80762k75857
8591B339011M10687k83767R9034L78161j74402j30653K17845J43892j50434K66730
8581C116104k29832n33295j4659p973J09853K20490L92465J73723j52439k21589
8571B852848k60962J3877Q0075k19159J07351L21170k27880q7757j67203j77160
8561B235200J56229K23803J44451p1277L92536j94270J99380n20625K73926j55981
8551B683372K551j73896L7386j726l6931L29212m35228K03261k59775j78094M29607
$$ plain form
8621 2542379 2830632 2991244 2810761 2813737 2638860 2405305 2719346 2740779 2735085 2522129
8611 2522129 2793449 2705735 2508626 2380614 2140862 2472931 2251474 2380097 2178371 2361818
8601 2361818 2480307 2176833 1959559 1988981 2337859 2390132 2301316 2334106 2614868 2339011
8591 2339011 2749698 2465931 2564965 2943126 2768724 2638071 2855916 2999808 2849374 3116104
8581 3116104 2886272 2352977 2338318 2330345 2440198 2660688 3053153 3226876 3074437 2852848
8571 2852848 2591886 2605763 2685838 2466679 2574030 2895200 2667320 2579563 2412360 2235200
8561 2235200 2391429 2615232 2759683 2688406 3080942 2886672 3086052 2565427 2839353 2683372
8551 2683372 2685923 2512027 2549413 2547687 2510756 2839968 2404740 2608001 2348226 2170132 2599739
8540B599739J43804j12617J05023m14775q1867p8546o02989M95993Q0544M0946
8530B175255K93284J3393J49876j77381J7849j58407K19310k55p7610l07665L24203
8519B471852k48909k00396K16915N26K31706o974l14510l1444J8079j81955K9907
8508A984797M04147L54397K71558K31590n9715j88716k28012k06055j14738N9838
8498B509091m7461n1496j54801l0175p377k46002K25947Q3191j50842J11988R9285
8487B341348m61754J14783O8051r7353K30704R5390k19677k64713j24743o0926
8477A621110m15533K66517J25467l02322M35498k34194m98800K87454P4672K7140
8467A387009K53093k81032j52974N5857j24645P8044K2014P7680O5175l9457K87253
$$ plain form
8540 2599739 2743543 2630926 2735949 2321174 2239307 2160761 1557772 2053765 2134309 2175255
8530 2175255 2468539 2481932 2631808 2454427 2472276 2313869 2533179 2532924 2455314 2147649 2471852
8519 2471852 2222943 2022547 2239462 2239988 2471694 2464720 2150210 2118766 2136845 1954890 1984797
8508 1984797 2388944 2743341 3014899 3246489 3186774 2998058 2770046 2563991 2449253 2509091
8498 2509091 2461630 2410134 2255333 2225158 2217781 1971779 2197726 2280917 2130075 2242063 2341348
8487 2341348 1879594 1994377 2062428 1965075 2195779 2291169 2071492 1806779 1682036 1621110
8477 1621110 1205577 1472094 1597561 1295239 1730737 1496543 997743 1285197 1359869 1387009
8467 1387009 1640102 1359070 1206096 1261953 1137308 1215352 1237366 1315046 1380221 1340764 1628017
8456A628017o0032j11624m7030N697P0392J50667J58180M3485J69535m36576R5873
8445A666584j85116k5228M14535r8242m42201K00014j20430j83511K44202j25371
8435A345236j10799j37361K36890n320J83418P7691m6975k43900J81536L0816
8425A511232k00683J57867j59732j04983M57874J06729j53614n2900q1460K4803
8415A505133r7271k73613r8362M55811j65680J76370L88009k70862M18548l2804
8405B005279l48028N7800j0736K6696K27761l77947P6082j46461L3285J41624
8395A685355j33222J53988k17363J32429k17705k02396K39096j85254k27522J91590
8385A218996p8638M3179L31711J76465o5134p5029j71230j64132n1908K91322
$$ plain form
8456 1628017 1567985 1456361 1409331 1415028 1485420 1636087 1794267 1837752 2007287 1570711 1666584
8445 1666584 1481468 1456240 1870775 1772533 1330332 1530346 1409916 1226405 1470607 1345236
8435 1345236 1234437 1097076 1333966 1328646 1512064 1589755 1542780 1298880 1480416 1511232
8425 1511232 1310549 1468416 1308684 1203701 1661575 1768304 1614690 1561790 1480330 1505133
8415 1505133 1407862 1134249 1035887 1491698 1326018 1502388 1890397 1619535 2038083 2005279
8405 2005279 1657251 1715051 1704315 1731011 1958772 1580825 1656907 1510446 1543731 1685355
8395 1685355 1552133 1706121 1488758 1621187 1403482 1201086 1440182 1254928 1027406 1218996
8385 1218996 1140358 1183537 1515248 1691713 1626579 1551550 1380320 1216188 1164280 1455602
8375A455602L29453k72772K86414J4503j85324K87448l51851k2097J59286j5674
8365A684988M36970K78773k65435k2886P209k78810L08927r1333k74394J88072
8355A972081J01839k61949R6817Q6179n12871k31174L13589k97340M30966R8676
8345A796813k98937R050j88864j87577J89335K44201L0502r9377n6188j22140
8335A316818n4540M93125l27145l1599K35890l93293R815K06371q8302J52620
8325A519760J273l59237J97002M34831J18964m2551K2988j19059k11926l5141
8315A526904J8389o5613j22046k33918j56442J6628J08137K65129l78043r0015
8305H89110K42738k647Q8277J14870P7094p1763O1854L8272k08419N31160r7389
$$ plain form
8375 1455602 1785055 1512283 1798697 1813200 1627876 1915324 1563473 1541376 1700662 1684988
8365 1684988 2121958 2400731 2135296 2112410 2119619 1840809 2149736 2058403 1784009 1972081
8355 1972081 2073920 1811971 1908788 1994967 1482096 1250922 1564511 1267171 1698137 1796813
8345 1796813 1497876 1506926 1318062 1130485 1319820 1564021 1594523 1495146 1438958 1316818
8335 1316818 1262278 1755403 1428258 1396659 1632549 1239256 1249071 1455442 1367140 1519760
8325 1519760 1521033 1161796 1358798 1793629 1912593 1870042 1893030 1773971 1562045 1526904
8315 1526904 1545293 1479680 1357634 1123716 967274 983902 1092039 1357168 979125 889110
8305 889110 1131848 1129201 1217478 1332348 1409442 1337679 1399533 1437805 1229386 1760546 1663157
8294A663157j64235R6360p8404m21874j2731j23259J71905K16832j22414L53419
8284A578756R8986q5192k67851m4542j39116J00855j19164k34649n6921l45324
8274D85838K1939J11018L73982K3592o9451Q2392Q9880l0919O9010M77429j45693
8263A489017l07982K59297m50643k4426K12113k77435j17939L24232M9115J79223
8253A334572n8600j59755k8323k93386L90035p0630K25568K84031k4150j99091
8243A400271K20183j56049J10822j50817m55803k6774m0898J40850K63282m2586
8233A262481j68697j08471K00975M9321q3146J10122l77659k5197L2110K95313
8223A187152j94196J98523K92423k12186M35063J48759j45027J26262K95757n92188
$$ plain form
8294 1663157 1498922 1595282 1516878 1095004 1082273 959014 1130919 1347751 1225337 1578756
8284 1578756 1677742 1592550 1324699 1280157 1141041 1241896 1122732 888083 831162 485838
8274 485838 507777 618795 992777 1016369 946918 1029310 1119190 1088271 1157281 1634710 1489017
8263 1489017 1181035 1440332 989689 965263 1177376 899941 782002 1106234 1155349 1334572
8253 1334572 1275972 1116217 1087894 794508 1184543 1113913 1339481 1623512 1599362 1400271
8243 1400271 1620454 1464405 1575227 1424410 968607 941833 900935 1041785 1305067 1262481
8233 1262481 1093784 985313 1186288 1235609 1152463 1262585 884926 859729 891839 1187152
8223 1187152 992956 1191479 1483902 1271716 1706779 1855538 1710511 1836773 2132530 1540342
8213A540342j59487P6672R1145j48363j5477k33683p1967J51742L53326J32702
8203A716952k5362m6059L9860n35205J47651n07607O4937L20126M99373k6080
8193A648586J756775J678310l258076m33370r3746K85765k50574k77093L45893
8184A402470n4413j13508k17558k70593K88108K33889L470K30192M18152l28583
8174A591626N31682k41926m46187K26618k06123l1040l2015J61633o8398L14866
8164A800736k80633q3372L81871j51077l62838L16343q2485l53091L06000k91617
8154A199837J85861N28000n37777o3248J87321L703j5310L61651k47995l10218
8144A291825L02924J28994q1627L37772j09864K3902N9132L1194j35425j55390
$$ plain form
8213 1540342 1380855 1457527 1548672 1400309 1384832 1151149 1079182 1230924 1584250 1716952
8203 1716952 1691590 1645531 1685391 1150186 1297837 790230 855167 1175293 1674666 1648586
8193 1648586 3405361 5083671 1825595 1392225 1298479 1584244 1333670 1056577 1402470
8184 1402470 1348057 1234549 1016991 746398 1034506 1268395 1271865 1502057 1920209 1591626
8174 1591626 2123308 1881382 1435195 1661813 1455690 1424650 1392635 1554268 1485870 1800736
8164 1800736 1520103 1436731 1818602 1667525 1304687 1621030 1538545 1185454 1491454 1199837
8154 1199837 1385698 1913698 1375921 1312673 1499994 1503697 1488387 1850038 1602043 1291825
8144 1291825 1594749 1723743 1642116 1979888 1870024 1893926 1953058 1984252 1848827 1693437
8134A693437L7625N3256j44735k22430j43124M18227j18632n4999j6938l13899
8124A187788J49023n668k70804k9427M20912l50336J41173K14667l63397j64577
8114I29354L83091o2260K11965K04091j23851J26854K39899j10694m73068K22935
8104A548316m20030J2451K54118J85819p3750J52842K08906p6600R5680l33525
8094A554227p0506k5791O7285K7181j28068j70664J01378J3043o8361j25311J23784
8083A298197J63080J11318L14642k24450J41913j12685m38833J71752m616L74704
8073A795022P2417j25638q5683l43158j37396j7606j91750Q1805M72449k0984
8063A499478r0162k0262P3249r5208k7857L15521J45337K71723K50355j87538
$$ plain form
8134 1693437 1731062 1784318 1639583 1417153 1274029 1692256 1573624 1518625 1501687 1187788
8124 1187788 1336811 1331143 1060339 1030912 1451824 1101488 1242661 1457328 1093931 929354
8114 929354 1312445 1250185 1462150 1666241 1542390 1669244 1909143 1798449 1325381 1548316
8104 1548316 1128286 1140737 1394855 1580674 1506924 1659766 1868672 1792072 1887752 1554227
8094 1554227 1483721 1457930 1525215 1552396 1424328 1253664 1355042 1368085 1299724 1174413 1298197
8083 1298197 1461277 1572595 1887237 1662787 1804700 1692015 1253182 1424934 1420318 1795022
8073 1795022 1867439 1741801 1656118 1312960 1175564 1157958 966208 1048013 1520462 1499478
8063 1499478 1409316 1389054 1462303 1367095 1339238 1654759 1800096 2071819 2322174 2134636
8053B134636N4775O5001k24760j53184Q3621l53360j80306K76688N1517J70801
8043A925429M55510j76060j47317J48372m24490j30967J47856N1799k45618J67087
8033A771601N7914K9653R7734K1427j08234P0259o0594n07270L08672J75870j30716
8022A726316N1797J1894J9440J30384M9465j48744L14241j65521k16872L3008
8012A805408Q0054K24484k37745K61846j5587p9848Q6941r719j6780j3549K31953
8001B317458p0533j57913j91384J47747j82513Q2659K03068N5649P4775M8972
7991B327985n27294M04198K5724m22737K58063J54770n2310L38810J01284o0834
7981B547659o9836j02174J50830L5827R1532J25733M1619q6317j32551L47896
$$ plain form
8053 2134636 2189411 2254412 2029652 1876468 1960089 1606729 1426423 1703111 1754628 1925429
8043 1925429 2380939 2204879 2057562 2205934 1781444 1650477 1798333 1850132 1604514 1771601
8033 1771601 1829515 1859168 1956902 1978329 1870095 1940354 1879760 1372490 1681162 1857032 1726316
8022 1726316 1778113 1790007 1809447 1939831 1989296 1840552 2154793 1989272 1772400 1805408
8012 1805408 1885462 2109946 1872201 2134047 2118460 2038612 2125553 2115834 2099054 2085505 2317458
8001 2317458 2246925 2089012 1897628 2045375 1862862 1945521 2148589 2204238 2279013 2327985
7991 2327985 1800691 2204889 2230613 1807876 2065939 2220709 2168399 2507209 2608493 2547659
7981 2547659 2477823 2375649 2526479 2562306 2653838 2779571 2821190 2734873 2602322 2950218
7971B950218j08227Q9959j0150l95572L54254r5193r7036M03932J53566j59398
7961C086353L94849k0616K4916M383m2796J09120k89228n934r0307J32597J66158
7950C469495k31108O21480J90294R278K62301P4853l36232M01460k16927k54417
7940C990477M58071k99767k55873M04438J86671J44307L42686N3172M0853L85671
7930E450706l23876K9656J32154L28779J11908J09195k47270L9153J31859J26370
7920E888634J26281M9852L05929J94917K16845P3686J47320j40055N74431J29535
7910G567375O06940M14932O6223N89258l1502J09441j964R2253M49382M95168
7900A0357506N55895N78873K95125L59142M27270M10732O89852M07759N97897
$$ plain form
7971 2950218 2841991 2931950 2921800 2526228 2880482 2785289 2688253 3092185 3245751 3086353
7961 3086353 3481202 3460586 3485502 3489885 3447089 3556209 3266981 3261047 3170740 3303337 3469495
7950 3469495 3238387 3859867 4050161 4059439 4321740 4396593 4060361 4461821 4244894 3990477
7940 3990477 4448548 4148781 3892908 4297346 4484017 4628324 4971010 5024182 5065035 5450706
7930 5450706 5126830 5156486 5288640 5617419 5729327 5838522 5591252 5630405 5762264 5888634
7920 5888634 6014915 6064767 6370696 6565613 6782458 6856144 7003464 6863409 7437840 7567375
7910 7567375 8174315 8589247 8655470 9244728 9213226 9322667 9320703 9412956 9862338 10357506
7900 10357506 10913401 11492274 11787399 12146541 12573811 12984543 13674395 14082154 14680051
7891A4680051Q92790P32858P65343O35359Q42593Q06298R96943J222776J227313
7882B2802324J346957J947444J415380J573302K020683J476175K297255J996931
7874C6876451K411769L482440L629093L411296L687663M024513M842841M924968
7866F7291034N057018O132200N905525O297329O380738N471451M952811L665236
7858A11153342K048248M78423n86088k788560l832553m861433n231764n874597
7850I0505018o006418n940928o192302n598585m984519m689033m338744l470757
7842D9283732l389167l259550k749842k925764k506726k009397j882214j653995
7834B8907077j397547j256149r14015j488843j394359m28313q71290n66613m78998
$$ plain form
7891 14680051 15572841 16305699 17071042 17706401 18548994 19355292 20352235 21575011 22802324
7882 22802324 24149281 26096725 27512105 29085407 31106090 32582265 34879520 36876451
7874 36876451 39288220 42770660 46399753 49811049 53498712 57523225 62366066 67291034
7866 67291034 72348052 78480252 84385777 90683106 97063844 102535295 107488106 111153342
7858 111153342 113201590 113680013 113093925 110305365 106472812 101611379 96379615 90505018
7850 90505018 84498600 78557672 72365370 66766785 61782266 57093233 52754489 49283732
7842 49283732 45894565 42635015 39885173 36959409 34452683 32443286 30561072 28907077
7834 28907077 27509530 26253381 25339366 23850523 22456164 22027851 21156561 20589948 20110950
7825B0110950j005449q03514o82784p25098q17543o18585l83937j51802m69858
7816A4452380j59842m62957q57341j87467m23393o25984M20590m03378n49164
7807A1203444R6452o15510M9675J94876q6088j66089n86204j74911o9270j98029
7797I648346Q8444L50784j17059P0496K71171m2043K9215k9985K71458J10137
7787A0650964K35270L31844J56628K64112J80930p9960P12789L45962O06816M37987
7777A3843342R07368R28956N44634R03913J281251R50902J570690J707179J586593
7768B4224828J730005J741070J985548J764377J827213J829530J184203R08903
7760C7195677L67544j84661o87108r86387j487636j344207j325167j795830j411724
$$ plain form
7825 20110950 19105501 18301987 17619203 16894105 16076562 15457977 15074040 14922238 14452380
7816 14452380 14292538 13829581 12972240 12784773 12361380 11735396 12155986 11752608 11203444
7807 11203444 11299896 10684386 10734061 10928937 10842849 10676760 10090556 9915645 9846375 9648346
7797 9648346 9736790 10087574 9970515 10041011 10312182 10270139 10299354 10269369 10540827 10650964
7787 10650964 10886234 11218078 11374706 11638818 11819748 11739788 12452577 12798539 13405355 13843342
7777 13843342 14750710 15679666 16224300 17128213 18409464 19360366 20931056 22638235 24224828
7768 24224828 25954833 27695903 29681451 31445828 33273041 35102571 36286774 37195677
7760 37195677 37563221 37378560 36691452 35705065 34217429 32873222 31548055 29752225 28340501
7751B8340501j226660j416809j145131p92152p90324p10681M499m72804L17380
7742B2107819O73257m0509N62838Q51829M57366Q73004J583222J231521J763267
7733C0063614J856097J585955J594288J794406J265211O94590N61611j17570q97829
7724C8400373j222416j701357k476191j788262k317118k474343j906269j989376
7716B2525041j804858j946565j439599j392889r10159r61249j081297q56231l46865
7707A1785329q31496m89891o17608m29459n29868n44921p26936N3165l00808m99446
7697F868061r3728l40934k05868q8579k34414k28523n96137l26599j99356l44583
7687D209340J25015j92360m18300j7398m4491k48317L96116j19310l83908J91813
$$ plain form
7751 28340501 27113841 25697032 24551901 23759749 22969425 22258744 22263243 21790439 22107819
7742 22107819 22781076 22740567 23303405 24155234 24612600 25485604 27068826 28300347 30063614
7733 30063614 31919711 33505666 35099954 36894360 38159571 38854161 39415772 39298202 38400373
7724 38400373 37177957 35476600 33000409 31212147 28895029 26420686 24514417 22525041
7716 22525041 20720183 18773618 17334019 15941130 15030971 14069722 12988425 12132194 11785329
7707 11785329 10953833 10463942 9846334 9416875 8887007 8342086 7615150 7668315 7367507 6868061
7697 6868061 6774333 6433399 6227531 6138952 5904538 5676015 5079878 4753279 4553923 4209340
7687 4209340 4334355 4141995 3723695 3706297 3661806 3413489 3809605 3690295 3306387 3498200
7677C498200k68363j83996j380o7435q4425j20572j6630k65111j6267N74154j9892
7666C028283L1158K2889m01782k31385M3015J39637k78357J2718k06746k31572
7656A927858J88224J91813k30014K95050k63568j58239k16565k02201l43596j45596
7646A043166J78048k27801K47351L85931J09447j79473m1897K19971m25182P7494
7636A387055l26808j93745J62632Q3037j19739K00741j69564p5753J78004j19614
7626A006246r9746M6807J15209R6539k82443K43032n8690k43709l7641Q1390J38166
7615A005160j75403j69397j09812J96321n70455m8708L89060j30897m8835K98661
7605F35695Q68J58902l28006r6220J30797K09913N7817N7868j80123l7955K73012
$$ plain form
7677 3498200 3229837 3045841 3044461 2977026 2892601 2772029 2755399 2490288 2474021 3048175 3028283
7666 3028283 3059441 3082330 2680548 2449163 2492178 2631815 2353458 2366176 2159430 1927858
7656 1927858 2116082 2307895 2077881 2372931 2109363 1951124 1734559 1532358 1188762 1043166
7646 1043166 1221214 993413 1240764 1626695 1736142 1556669 1514772 1734743 1309561 1387055
7636 1387055 1060247 866502 1029134 1112171 992432 1193173 1023609 947856 1125860 1006246
7626 1006246 906500 953307 1068516 1165055 882612 1125644 1066954 823245 785604 866994 1005160
7615 1005160 829757 660360 550548 746869 176414 127706 516766 385869 337034 635695
7605 635695 636563 795465 467459 371239 502036 711949 769766 827634 647511 609556 882568
7594H82568l13445k2695r9900n99361J80518r5640J54545J99716K03870k4435
7584D65741K32183J33641j9051j36512l59925J97056j52837k71822J61213j46511
7574A03176j672K963l68708J5515N83223j56836n6877J22748J35686L0631K96955
7563G06804l38675k51858K71120J573k08740K33256M9478q1850K48794Q0748j75397
7552E35253j12677J17744k18525o0243k34522K07692r6141K28524K67394p04017
7542f9518J95103J81176k8892N88443j8917j35802j05088Q4442l08338q2457j30522
7531A69630j01112K39902J0113K26007J16479k41756K13708n1925l4830N8456
7521F04672J59106K2707j68611J10924J41340l23661K0870l02239J17508J9632
$$ plain form
7594 882568 569123 546428 446528 -152833 27685 -67955 86590 286306 490176 465741
7584 465741 697924 831565 812514 676002 316077 513133 360296 88474 249687 103176
7574 103176 101504 104467 -264241 -248726 334497 177661 120784 243532 379218 409849 706804
7563 706804 368129 116271 387391 388964 180224 413480 462958 381108 629902 710650 535253
7552 535253 422576 540320 321795 261552 27030 234722 138581 367105 634499 -69518
7542 -69518 125585 306761 277869 866312 847395 711593 606505 690947 382609 300152 169630
7531 169630 68518 308420 318533 544540 661019 419263 632971 581046 546216 604672
7521 604672 763778 786485 617874 728798 870138 546477 567347 265108 382616 402248
7511D02248j71088k4550K03345p1179K8703M68250k58946l24200l1371m82042
7501b60830L97462R8914q231Q3403j96771K3500L98753k02699L92857j07947l9639
7490E78772O8674l42542O2210j01731k81115J8215J88057j97086K31204O0803
7480B85461J18859K98165K03990N66J37552J88872j80188j60689K12571l62802
7470G42357l35001o7427K5487j89730J13762l50419P2195p6807L8980J34620J47836
7459B55853J3643j04010l7311K05755m8103m5961j37215J87198k65512K4740L02189
7448C51266Q5674k48577J4648O0821L3229l53896K79940R3028j15923J28717l24175
7437D752K57514L3583k13100q4336N3866l11254K90930j43609k90067J10977N06755
$$ plain form
7511 402248 231160 206610 409955 338776 367479 835729 576783 252583 221212 -260830
7501 -260830 136632 235546 227315 310718 113947 137447 536200 333501 726358 618411 578772
7490 578772 647446 304904 367114 265383 -15732 2483 190540 -6546 224658 285461
7480 285461 404320 702485 906475 907041 1044593 1233465 1053277 892588 1105159 742357
7470 742357 407356 339929 365416 175686 289448 -60971 11224 -65583 -26603 108017 255853
7459 255853 269496 165486 128175 333930 285827 239866 102651 289849 24337 49077 351266
7448 351266 436940 188363 203011 263832 297061 -56835 223105 316133 200210 328927 4752
7437 4752 262266 295849 82749 -1587 52279 -258975 31955 -111654 -401721 -290744 216011
7426B16011L8332n4785L21882j42641j36625l89343l61974O8381N08895k62938
7416a94805N6120L62155j40038Q1551q2740N3293K04133k31944K72578k7518j68520
7405A84265j10678P4741k20863k29322M67503J79056J73548k09676K92944j51124
7395D50394J05801J63440m09043j67610J56812l10918o2873L26556k2640K02155
7385D32074P6218l3186l11354Q1641L97326l16270j41016K51407L6961k32586
7375B41215m3002l11276q0094k65027N9261K91561N42591Q3685j19430J07932
7365E07416r1176j22946M9335J60362n6086n5630j21772n6195O798j8518J59768
7354C61356J74418j22540J83127J66333j17480l03172j86367K5773K32557O886
$$ plain form
7426 216011 254343 199558 521440 378799 242174 -147169 -509143 -440762 68133 -194805
7416 -194805 -138685 223470 83432 164983 82243 135536 339669 107725 380303 352785 184265
7405 184265 73587 148328 -72535 -301857 165646 344702 518250 308574 601518 450394
7395 450394 556195 719635 310592 142982 299794 -11124 -73997 252559 229919 432074
7385 432074 508292 475106 163752 245393 642719 326449 185433 436840 473801 241215
7375 241215 198213 -113063 -193157 -458184 -398923 -107362 435229 518914 399484 507416
7365 507416 416240 293294 342629 502991 446905 391275 269503 213308 220106 201588 361356
7354 361356 535774 413234 596361 762694 645214 342042 155675 181448 414005 420891
7344D20891J8687J88890M6697L35929k55870j67168k5082l71036N687k41098j58867
7333b02340M15558j349J86362L8693n30047J63967K0749L04749O2078o4608j28112
7322B65700j14004J86248Q7031j34707J45941l25627N3314J34801k6244J4352
7312B86805K28856O907l60136L12390J08886r944q2307M9935K2571J68464q6144
7301F46283m79363l29492J07670r8307M95181L0413K04036P6742L18433l16522
7291F55074j24633K9270k35106j913N7085j98047o1441N32986j94227m2320o208
7280D10520j44855J9171o0502J71119Q1063k7623k68531K44895L6433j06628K47423
7269F02485q7558K87603J15436O3913k02758N699l7942k73370J02700j31726l75054
$$ plain form
7344 420891 439578 628468 675165 1011094 755224 588056 562974 191938 197625 -43473 -202340
7333 -202340 213218 211869 398231 436924 -93123 70844 91593 396342 458420 393812 265700
7322 265700 151696 337944 424975 290268 436209 110582 163896 298697 272453 286805
7312 286805 515661 522568 162432 474822 583708 573764 491457 541392 563963 732427 646283
7301 646283 166920 -162572 -54902 -153209 341972 372385 576421 653163 971596 655074
7291 655074 530441 559711 324605 322692 379777 181730 120289 653275 459048 416728 410520
7280 410520 265665 284836 224334 395453 476516 448893 180362 425257 461690 355062 602485
7269 602485 514927 802530 917966 981879 779121 784820 746878 473508 576208 444482 69428
7258F9428M24827q4841j8039K96036L16786l5164o5499J34685k83676N2788L92331
7247A199662q9046J28146N3549j53081l04287K16221m79844J60131K08553n46175
7237C93829K47080J13901P0093N22873J66919l02033k715j67435k3500P2651K6528
7226A118191J45526k6834J16081q4394l0264j26708r0512K0307J41457j23020
7216A059830K48025J49459J40511J23853p1691J72698L9297k13918l04848j09215
7206A234001q1561J04607J31429L74460j25719j1361k2088k90425P6948J65221
7196A555512J68230J93586J56547K78019Q1269k49246o3413r453L01438k18584
7186B193905P6022N8349j70766m7369k46067M9550k5003J87087P4823j14675j27025
$$ plain form
7258 69428 494255 409414 391375 687411 1004197 969033 903534 1038219 754543 807331 1199662
7247 1199662 1110616 1238762 1292311 1139230 834943 1051164 571320 731451 940004 393829
7237 393829 640909 754810 824903 1347776 1514695 1212662 1209947 1042512 1019012 1091663 1118191
7226 1118191 1263717 1236883 1352964 1268570 1238306 1111598 1021086 1041393 1182850 1059830
7216 1059830 1307855 1457314 1597825 1721678 1649987 1822685 1861982 1648064 1343216 1234001
7206 1234001 1152440 1257047 1388476 1762936 1637217 1625856 1603768 1313343 1390291 1555512
7196 1555512 1723742 1917328 2073875 2351894 2433163 2183917 2120504 2111051 2412489 2193905
7186 2193905 2269927 2328276 2157510 2110141 1864074 1913624 1888621 2075708 2150531 2035856 1908831
7175A908831J71505J0941R1730J29394l54014L13533M02261m37896J16331J66155
7165B518771Q9688j4222L10240k81779L8227J22988J15113q8418N3901J84821
7155C049330j97149N11570o0119k84262M83445j20985r5086p6615K77520j3575
7145C474074l56138J41708M14652K11110K02231K32359K3710K14492q3897L7429
7135D511730Q1433k63720L92585J54471Q0739J16978k88226K44783K39759j50315
7125E120217K15549M24780j93955K48266K62419j38896M4809K92050j64271j9912
7115F091056P21453m2042N58832Q82381J78651M01297M11498J98280L81929R01162
7105A0684497J111513R19335R80460R67105N34729N81848P86621P24647P98871
$$ plain form
7175 1908831 2080336 2091277 2183007 2312401 1958387 2271920 2674181 2236285 2352616 2518771
7165 2518771 2608459 2594237 2904477 2622698 2660925 2783913 2899026 2810608 2864509 3049330
7155 3049330 2852181 3363751 3303632 3019370 3502815 3381830 3286744 3210129 3487649 3474074
7145 3474074 3117936 3259644 3674296 3885406 4087637 4319996 4343706 4558198 4474301 4511730
7135 4511730 4593163 4329443 4722028 4876499 4957238 5074216 4785990 5030773 5270532 5120217
7125 5120217 5335766 5760546 5566591 5814857 6077276 5938380 5983189 6275239 6110968 6091056
7115 6091056 6812509 6770467 7329299 8211680 8390331 8791628 9203126 9401406 9783335 10684497
7105 10684497 11796010 12715345 13695805 14662910 15197639 15779487 16566108 17290755 18089626
7096A8089626J106734L86338P39166Q95566O18954J087590J095775J026495Q25008
7087B5871252J844959K274187L263517M570554O103214Q674084J1791924J5846912
7079H0240603J8990343K1468094J9891445Q814141l879752p565001j2956928j7470228
7071A07532717j6720815j3214865q281768o115437n006273m316313l730020l362467
7063D6784759l681714l852657l626947k896473k977990k111093j340601j292277
7055B5005007j158432p51088j031805n23288k50882k33163M19053J86913L62439
7046B2024754O63955O31673P95843J341894J607587K476357K332900K567174L166571
7037C7608708K803015K683670J670321J140106J20732j576374k360748l025913
$$ plain form
7096 18089626 19196360 19582698 20321864 21217430 21836384 22923974 24019749 25046244 25871252
7087 25871252 27716211 29990398 33253915 37824469 43927683 52601767 64393691 80240603
7079 80240603 99230946 120699040 140590485 149404626 145524874 137959873 125002945 107532717
7071 107532717 90811902 77597037 69315269 63199832 58193559 53877246 50147226 46784759
7063 46784759 43103045 39250388 35623441 32726968 29748978 27637885 26297284 25005007
7055 25005007 23846575 23095487 22063682 21540394 21289512 21056349 21475402 21662315 22024754
7046 22024754 22688709 23320382 24116225 25458119 27065706 29542063 31874963 34442137 37608708
7037 37608708 40411723 43095393 44765714 45905820 46026552 44450178 42089430 39063517
7029C9063517l467175l465238k935233k913039k079727j702450j811100j185757
7021A9503798q19209q46818n91443J64402k13953L12629O83808O34169P99780
7012A9627163P17892M45009J199651J278360J320561J875862J761335J539215
7004B9765048J760433J086001J524j91328j227251k294299k245789k770102k494585
6995B1389652j972383j631215j544879q69471p24961j232768m04061o77767o2739
6986A2269408o08981n6059j67680M26605J45301m9296L23575O1311M80367L51294
6976A3175845M06486K52689K07711L8798m36843j8551l45813l07552m89668m98487
6966A1984615j317368l68347l65845r26046j07770j48127j87234q3305J74437
$$ plain form
7029 39063517 35596342 32131104 29195871 26282832 24203105 22500655 20689555 19503798
7021 19503798 18684589 17837771 17246328 17410730 17196777 17509406 18193214 18827383 19627163
7012 19627163 20345055 20790064 21989715 23268075 24588636 26464498 28225833 29765048
7004 29765048 31525481 32611482 32613006 32421678 31194427 28900128 26654339 23884237 21389652
6995 21389652 19417269 17786054 16241175 15371704 14646743 13413975 13009914 12332147 12269408
6986 12269408 11660427 11604368 11436688 11863293 12008594 11959298 12282873 12344184 12824551 13175845
6976 13175845 13582331 13835020 14042731 14081529 13644686 13626135 13280322 12972770 12483102 11984615
6966 11984615 10667247 10298900 9933055 9007009 8899239 8751112 8563878 8480573 8655010
6957H655010k33680k46655j7912r374J89744P26947O25225L56492M18052k86004
6947A0177845J01871M20029k95403k63125l77008j22634j58688k45154l35985
6938H901748J50913l30914P9575j54235l85061R5163J07777J35082M91356L52963
6928I444367L33274J117516k08112j37006N31175J29100O779L59310M10419J61938
6918A2148760L42201o0700m4357K41324l7251o1552J85465l44659Q5087r9547
6908A2354771k48178l17104j58078j39662J34273L88051L42964N83186J141324
6899A4081547R56959Q98444J452339K94193L60272K37919l49730J13049J01812
6890A8146804o18092m72198m95882n78450k97915l57836m04203k29973j51679
$$ plain form
6957 8655010 8421330 8174675 8156763 8147389 8337133 9064080 9689305 10045797 10463849 10177845
6947 10177845 10279716 10699745 10404342 10141217 9764209 9641575 9482887 9237733 8901748
6938 8901748 9052661 8721747 8801322 8647087 8262026 8357189 8464966 8600048 9091404 9444367
6928 9444367 9777641 10895157 10687045 10550039 11081214 11210314 11217093 11576403 11986822 12148760
6918 12148760 12490961 12430261 12385904 12627228 12589977 12528425 12713890 12369231 12454318 12354771
6908 12354771 12106593 11789489 11631411 11491749 11626022 12014073 12357037 12940223 14081547
6899 14081547 15038506 15936950 17389289 17683482 18043754 18281673 17931943 18044992 18146804
6890 18146804 17528712 17056514 16560632 15982182 15684267 15326431 14922228 14692255 14540576
6881A4540576l08832l95617o9854k33740m52018m64637o73458O0865J72850M96403
6871A2672538O68960M77751R17150J051246Q23062J347159J121382J146080J019354
6862B1244682M65740r9470K82866k07045p96170r13345j115801j420767j445520
6853A5995170j290162j199321j088497n11154l92282m16507m24920p33546n9769
6844I879012o42931O6708k9692m495J77043j03921K80458L41903Q917L87314O72574
6833A1032890O91846R97720R62802L66138N94812M5037j51502j59144o11653q51285
6823A2917661r84784r57921j114337r84868p74825p73128n00546k90604l93115
6814F143533k61991k40631l57578l21194J73288n59298j06436J09091j38325j90889
$$ plain form
6881 14540576 14231744 13836127 13766273 13532533 13080515 12615878 11942420 12003285 12176135 12672538
6871 12672538 13341498 13819249 14736399 15787645 16610707 17957866 19079248 20225328 21244682
6862 21244682 21710422 21610952 21893818 21686773 20890603 19977258 18861457 17440690 15995170
6853 15995170 14705008 13505687 12417190 11906036 11513754 11097247 10672327 9938781 9879012
6844 9879012 9236081 9302789 9273097 9268602 9445645 9341724 9622182 9964085 9973002 10360316 11032890
6833 11032890 11724736 12722456 13685258 14051396 14646208 14691245 14539743 14380599 13768946 12917661
6823 12917661 11932877 10974956 9860619 8875751 8100926 7327798 6827252 6536648 6143533
6814 6143533 5881542 5640911 5283333 4962139 5135427 4576129 4469693 4578784 4440459 4249570
6804D249570K85292j52356J85223N91520k23574p7129M68353j12474j4546L13879
6794E513758m49207k02565j25741l50773l81698j41671l07377k00020N2017o7921
6784C338802k11819j27188l79602M9112o8436n20136l1101M60024k42473P9118
6774B346301K19984l25633k53170J3784J65343l27697J70100k90299m02092M52499
6764A769120o5921k84737O57574k27745k53550L24357j34842j84399M31356j19253
6754A911960j97028J40125K13088J87932j57892o8693N4202M8452j4374l08o5107
6743B052357L74577l29596N1274L51219l1585k5405M11663J44386O49259L56207
6733D004356k41384M29025j99874l81825K9460O5500k4964k20917j27435l88525
$$ plain form
6804 4249570 4534862 4382506 4567729 5159249 4935675 4858546 5326899 5214425 5199879 5513758
6794 5513758 5064551 4861986 4736245 4385472 4003774 3862103 3554726 3354706 3406723 3338802
6784 3338802 3126983 2999795 2620193 2669305 2600869 2080733 2049632 2509656 2267183 2346301
6774 2346301 2566285 2240652 1987482 2001266 2166609 1838912 2009012 1718713 1316621 1769120
6764 1769120 1703199 1418462 2076036 1848291 1594741 1919098 1784256 1599857 2031213 1911960
6754 1911960 1714932 1855057 2068145 2256077 2098185 2029492 2083694 2132146 2117772 2117464 2052357
6743 2052357 2426934 2097338 2148612 2499831 2468246 2442841 2854504 2998890 3648149 4004356
6733 4004356 3762972 4191997 3992123 3610298 3639758 3705258 3680294 3459377 3331942 2943417
6723B943417j11574J48508m55932J51221J02054P4781L85103J75075M39395j08795
6713C743253K50678K75475L42443M88371P72875M16896N27980L88428q7925K7098
6703G145572j06131o06807k56000o98070o63870j08778k99873m99375j02885m61487
6693C342296l04917k93283j38431K6251M5050M16038K49010K92841K08842j33202
6683C710495J64406L31334N6940K65306N5806p8546n3803j63497k19333j3384
6673D055724k92507k04489j77344l97062m05540j73991o73472K67468k77553J58379
6663A879613k08305j68277n19754j3761M02327k18980j4339J135j57789J68261
6653A150131K12996n4665k5223l13970m41519K45127L89889j80385j47260k15301
$$ plain form
6723 2943417 2831843 2980351 2524419 2675640 2777694 2852475 3237578 3412653 3852048 3743253
6713 3743253 3993931 4269406 4611849 5100220 5873095 6289991 6817971 7206399 7118474 7145572
6703 7145572 7039441 6432634 6176634 5478564 4814694 4705916 4406043 3906668 3803783 3342296
6693 3342296 3037379 2744096 2605665 2631916 2676966 3093004 3342014 3634855 3843697 3710495
6683 3710495 3874901 4206235 4263175 4528481 4584287 4505741 4451938 4288441 4069108 4055724
6673 4055724 3763217 3558728 3381384 2984322 2578782 2404791 1731319 1998787 1721234 1879613
6663 1879613 1671308 1503031 983277 969516 1371843 1152863 1138524 1139659 981870 1150131
6653 1150131 1363127 1308462 1283239 969269 527750 772877 1162766 982381 835121 619820
6643F19820k35258m6283M84443j12323o9672L88525K3688J86103l02286k66404
6633F70353j27712q9939k27837K52900M03575l7114o8828J11286o3219k14628
6623F08837k14890q6830m2734L42855o8165R3001O8671O0641j1812m6594J02355
6612H05335k82237K3663m2754J20218k12037o3642J50124J18953P8376Q8126J45040
6601I29165k1025J04738j31881O9607K4845j92556j5429q0066j2379l68782J56275
6590D62512p9359O7642R3101j26895r3489J21257N2665K30460o6173l3934N47528
6579A175315O0726j09556k26913j39356L11706J5594m10232J66439P7498l38102
6569E83119j8378O703j41250q2684O67965j59230q3601N1591q1631j96993K17162
$$ plain form
6643 619820 384562 338279 822722 710399 640727 1029252 1052940 1239043 936757 670353
6633 670353 542641 452702 224865 477765 881340 844226 775398 886684 823465 608837
6623 608837 393947 307117 264383 607238 539073 632074 700745 761386 749574 702980 805335
6612 805335 523098 546761 504007 624225 412188 348546 498670 617623 695999 784125 929165
6601 929165 908140 1012878 880997 950604 975449 782893 767464 687398 675019 306237 462512
6590 462512 383153 450795 543896 417001 323512 444769 497434 727894 661721 627787 1175315
6579 1175315 1236041 1126485 899572 760216 1071922 1087516 677284 843723 921221 583119
6569 583119 564741 571444 430194 347510 1015475 856245 772644 824235 742604 545611 762773
6558G62773J79438j94995l29189K67806k11239r2766K99385m55698K76774M42698
6548I44987l52664Q9234O8701k15915j41693L53755p5718j6406m0268K5687J1318
6537F51018o7944J833R6500J43657k02149K60109Q0364J5369j88374J24165j30286
6526G84262j65781J0804m0976J18472J32657k97673o5619O3551j56458K70460
6516F53699J55417r9041n8671P136R7461j44866j93181L25239J49270j26080N4602
6505H20985k34305p7147L25455l55127J81372M02060j931N4619L23151k38327
6495A200805j73771L77315l65384K2726k64753j85027K5274J13592J77589K71699
6485A200065k85496l4514J58122J16832j42549J47764J64065J27254P385k0449
$$ plain form
6558 762773 942211 747216 418027 685833 474594 381828 681213 225515 502289 944987
6548 944987 592323 681557 750258 534343 392650 746405 670687 654281 614013 639700 651018
6537 651018 583074 584907 681407 825064 622915 883024 963388 978757 790383 914548 784262
6526 784262 618481 629285 588309 706781 839438 541765 476146 539697 383239 653699
6516 653699 809116 710075 651404 658540 756001 611135 417954 743193 892463 766383 820985
6505 820985 586680 509533 834988 479861 661233 1063293 1061362 1115981 1439132 1200805
6495 1200805 1027034 1404349 1038965 1061691 796938 611911 637185 750777 928366 1200065
6485 1200065 914569 880055 1038177 1155009 1012460 1160224 1324289 1451543 1458928 1438479
6475A438479m46930j82980K3304k20666Q0202L38741K00989J10131P9895j96073
6465A225092l8881P563j89989K5286J71174L88129J71471j11121J38220m16078
6455A370866o0755K5577m05851K7711K10372N2915j10107l76153L0159L58444
6445A123178j71747L76108o671J02634K97755q1390j83135j74843m0149j67609
6435A074131J14494j24830J93443J11038O6227m97245j85004L37412m53721L47384
6425I83329M75981j24882K58235J59130j90834K14386k13926l12576K60248l0355
6415A478736Q9918M18700k24297j03507K63549m12509K37483N95444n65232J76174
6405A954459J16009o72966M63820K8828m3630K20402L34121K14440L60568R1620
$$ plain form
6475 1438479 991549 808569 831873 611207 691409 1030150 1231139 1341270 1421165 1225092
6465 1225092 1186211 1193774 1003785 1029071 1200245 1588374 1759845 1648724 1786944 1370866
6455 1370866 1310111 1335688 929837 957548 1167920 1220835 1110728 734575 764734 1123178
6445 1123178 951431 1327539 1320868 1423502 1721257 1639867 1456732 1281889 1241740 1074131
6435 1074131 1188625 1063795 1257238 1368276 1434503 937258 752254 1089666 635945 983329
6425 983329 1459310 1334428 1592663 1751793 1560959 1775345 1561419 1248843 1509091 1478736
6415 1478736 1568654 1987354 1763057 1659550 1923099 1510590 1748073 2343517 1778285 1954459
6405 1954459 2070468 1397502 1861322 1890150 1846520 2066922 2401043 2615483 2976051 3067671
6395C067671j63865k6261J61472L73948J37329M58607L95323K56886L95597J84653
6385E241360K68829J6191m57339K01494l33829l97921K99695J8365l91328J6341
6375D481858J80702k33094J99922l5181j59868O13907O4233k38201O06544M35961
6365E916783L48267P82443Q46178N34702P42628J076704J06757K73071L18332
6356A0945865l18008J26533j97627j20947L6778q626n37094j42301k19108m49934
6346I115531L6537l43640k4564P76046j8834R1973O91675M1928J62786N89163
6336A1118601j40757J67189L68911k52612r149M8024j76627j4955J97052j22013
6326A1183664k73994l9994l71891l32297l21293k36572o29349N4171l38653n6664
$$ plain form
6395 3067671 2903806 2877545 3039017 3412965 3550294 4008901 4404224 4661110 5056707 5241360
6385 5241360 5510189 5526380 5069041 5270535 4936706 4538785 4838480 4856845 4465517 4481858
6375 4481858 4662560 4429466 4629388 4594207 4434339 5048246 5112479 4874278 5480822 5916783
6365 5916783 6265050 7047493 7893671 8428373 9171001 10247705 10354462 10627533 10945865
6356 10945865 10627857 10754390 10556763 10435816 10472594 10463968 9926874 9784573 9565465 9115531
6346 9115531 9152068 8808428 8783864 9559910 9541076 9633049 10324724 10366652 10529438 11118601
6336 11118601 10977844 11145033 11513944 11261332 11252183 11300207 11123580 11108625 11305677 11183664
6326 11183664 10909670 10869676 10497785 10165488 9844195 9607623 8978274 9032445 8693792 8637128
6316H637128M2132j79941K43919K35400R2006J37994K15193k56849j99505j35265
6306H832212m49333l49023j14604m14372k65395j10692R9557J23444O20560J95165
6296H167519O08438N23614L05165N70090L41853O0604K71977J89465l13680n9569
6286A0665476j85843k36743Q387j89302K86649N05731M98397L11882M45927K05476
6276A2316037j9089J27394L10511k63477k29065j6026J26089m2411j73534Q9034
6266A2225463l0859J6521m4208m17845k92787j27778l76408l26775k77905j84929
6256A0162490J73743N2585r3176J93862Q6775j46151Q6835k49530l40894n55136
6246I371403o69022p53100o40770p45506n53981k90379l47749k3314p24363j52192
$$ plain form
6316 8637128 8679260 8499319 8743238 8978638 9070644 9208638 9423831 9166982 8967477 8832212
6306 8832212 8382879 8033856 7919252 7504880 7239485 7128793 7228350 7351794 7972354 8167519
6296 8167519 8775957 9299571 9604736 10174826 10516679 10577283 10849260 11038725 10725045 10665476
6286 10665476 10479633 10242890 10251277 10061975 10348624 10854355 11352752 11664634 12110561 12316037
6276 12316037 12296948 12424342 12734853 12471376 12242311 12226285 12352374 12309963 12136429 12225463
6266 12225463 12194604 12211125 12166917 11749072 11456285 11328507 10952099 10625324 10347419 10162490
6256 10162490 10336233 10388818 10295642 10489504 10576279 10430128 10516963 10267433 9926539 9371403
6246 9371403 8702381 7949281 7308511 6563005 6009024 5718645 5370896 5347582 4623219 4471027
6236D471027m15440m87908j98359l7988j07920J81752M6739n21950L98492Q5554
6226C413999k81381j51368j55815j05181k31525J70424J80690m14051J02978L2402
6216B561172j30156J47943K01444j09855K74553k06788L9299o2153m29674K19000
6206B504785L3224k06558J78731N9784l75092L63783k44488n3774N28102p8157
6196B710340j65607N2708K7p1777J13695J5578q6844J20086k56183M5532j25176
6185B352379P5662J02710k14854j44122p7897J77973K16360q359n3152J51477
6175B578177K7189K92837l00117j10922p0699p2218m9336l94182L49494k5272
6165B224951R4713k25352j62013j79908J74857K38253j85741N32815o2560j71914
$$ plain form
6236 4471027 4055587 3567679 3369320 3331332 3223412 3405164 3451903 2929953 3328445 3413999
6226 3413999 3132618 2981250 2825435 2720254 2488729 2659153 2839843 2425792 2528770 2561172
6216 2561172 2431016 2578959 2780403 2670548 2945101 2738313 2777612 2715459 2285785 2504785
6206 2504785 2538009 2331451 2510182 2569966 2194874 2558657 2314169 2260395 2788497 2710340
6196 2710340 2544733 2597441 2597468 2525691 2639386 2654964 2568120 2688206 2432023 2477555 2352379
6185 2352379 2428041 2530751 2315897 2171775 2093878 2271851 2488211 2479852 2426700 2578177
6175 2578177 2605366 2898203 2598086 2487164 2416465 2344247 2294911 1900729 2250223 2224951
6165 2224951 2319664 2094312 1932299 1752391 1927248 2165501 1979760 2512575 2450015 2278101
6155B278101M8380k79847J02326J83557n3531R4827Q3293l6959K64233K547j63416
6144B523511o0161k49649J02975J90214j2051J28509J27341k7172k24642J27437
6134B626312j66940J40230J23969K70515m8314j64422q8581l23563L9242l29205
6124B079243N10254N04040L836K24850o6685k24072o9281K0786k39663L1777J92943
6113B968028j26649L42812K21827k7620p0K02282k17539N0635J51593j22649L82012
6102C824662L73196j9571j30780K89427K77702j04496L4654J85084J8511Q0990
6092D829379O2297k50454J92631m265k6028J19626J75898K51258M10439K73984
6082F034765Q3215K57277L99529K26736Q09886L14406N20284P85373M15516M95115
$$ plain form
6155 2278101 2326481 2046634 2148960 2332517 2278986 2373813 2457106 2420147 2684380 2686927 2523511
6144 2523511 2463350 2213701 2316676 2506890 2494839 2623348 2750689 2723517 2498875 2626312
6134 2626312 2459372 2599602 2723571 2994086 2945772 2781350 2692769 2369206 2408448 2079243
6124 2079243 2589497 3093537 3097373 3322223 3255538 3031466 2962185 2982971 2743308 2775085 2968028
6113 2968028 2841379 3184191 3406018 3378398 3378328 3580610 3363071 3413706 3565299 3442650 3824662
6102 3824662 4197858 4178287 4047507 4336934 4614636 4510140 4544794 4729878 4748389 4829379
6092 4829379 4891676 4641222 4833853 4829588 4803560 4923186 5099084 5350342 5760781 6034765
6082 6034765 6117980 6375257 6774786 7001522 7811408 8125814 8646098 9431471 9846987 10342102
6072A0342102P63071K54601P24563J124126J20164P42324M49702m05143m82547
6063A3632963K42162k31678J31290M64327L40768L45543P79117O90200O98261
6054A7092953M46957M84310k77951N723k69749o30838j78449m8942o2505N5745
$$ plain form
6072 10342102 11105173 11359774 12084337 13208463 13328627 14070951 14520653 14115510 13632963
6063 13632963 13875125 13643447 13774737 14239064 14579832 14925375 15704492 16394692 17092953
6054 17092953 17539910 18024220 17746269 17751992 17482243 16851405 16672956 16624014 16561509 16617254
$$ [...]
##END NTUPLES=NMR SPECTRUM
##END=
