##TITLE=1H_CA-9414
 200.13MHz,DMSO-d6.
 8 sc
 
 12.1.2026
##JCAMPDX= 6.0         $$ Bruker NMR JCAMP-DX V2.0
##DATA TYPE= NMR SPECTRUM
##DATA CLASS= NTUPLES
##ORIGIN= UXNMR, Bruker Analytische Messtechnik GmbH
##OWNER= pz
$$ XWIN-NMR		Version 3.5
$$ Mon Jan 12 14:38:43 2026 Russian Standard Time (UT+4h)  she@DPX200
##.OBSERVE FREQUENCY= 200.1313
##.OBSERVE NUCLEUS= ^1H
##.ACQUISITION MODE= SIMULTANEOUS
##.ACQUISITION SCHEME= undefined
##.AVERAGES= 8
##.DIGITISER RES= 18
##SPECTROMETER/DATA SYSTEM= spect
##.PULSE SEQUENCE= zg30
##.SOLVENT NAME= DMSO
##.SHIFT REFERENCE= (INTERNAL, DMSO, 0, 15.4968)
##AUDIT TRAIL= $$ (NUMBER, WHEN, WHO, WHERE, WHAT)
$$ ##TITLE= Audit trail, XWIN-NMR		Version 3.5
$$ ##JCAMPDX= 5.01
$$ ##ORIGIN= Bruker BioSpin GmbH
$$ ##OWNER= she
$$ F:/spectra/data/she/nmr/H-C/1/pdata/1/auditp.txt
$$ ##AUDIT TRAIL=  $$ (NUMBER, WHEN, WHO, WHERE, WHAT)
(   1,<2026-01-12 14:37:22.42 +0400>,<she>,<DPX200>,
      <created by zg, POWCHK disabled, PULCHK disabled
       configuration hash MD5:
       00 E9 B6 7A A2 85 ED C7 34 08 36 98 17 FE 4E 26
       data hash MD5: 16K
       3C 39 A7 C8 60 4D 72 36 7B FC E6 02 F6 AE FC 23>)
(   2,<2026-01-12 14:37:25.31 +0400>,<she>,<DPX200>,
      <Start of raw data processing
       efp BC_mod = 2 LB = 0.25 FT_mod = 6 PKNL = 1 PHC0 = -3703.167 PHC1 = 12.19231 SI = 16K 
       data hash MD5: 16K
       3D 35 52 80 FE 26 CA 73 71 87 D4 6D F6 D8 F2 A4>)
(   3,<2026-01-12 14:37:47.85 +0400>,<she>,<DPX200>,
      <pk PHC0 = -2.312218 PHC1 = -0.2 
       data hash MD5: 16K
       C6 ED FB 29 A6 1A 16 38 DE E7 34 F9 AF C4 F0 4D>)
(   4,<2026-01-12 14:37:52.21 +0400>,<she>,<DPX200>,
      <abs ABSG = 5 
       data hash MD5: 16K
       62 5B 02 A8 EB D5 B7 E5 89 B1 84 F9 5E 21 29 B3>)
$$ ##END=
$$ 
$$ hash MD5
$$ 3B 55 7E 71 D5 70 64 BA 75 2C 1A F7 AC 55 A3 E4
##$RELAX= 
##$RELAX= 
##$RELAX= 
##$RELAX= 
##$RELAX= 
##$RELAX= 
$$ Bruker specific parameters
$$ --------------------------
##$DU= <F:/spectra>
##$EXPNO= 1
##$NAME= <H-C>
##$PROCNO= 1
##$TYPE= <nmr>
##$USER= <she>
##$AMP= (0..31)
100 100 100 100 100 100 100 100 100 100 100 100 100 100 100 100 100 100 
100 100 100 100 100 100 100 100 100 100 100 100 100 100 
##$AQSEQ= 0
##$AQ_mod= 1
##$AUNM= <au_zg>
##$AUTOPOS= <>
##$BF1= 200.13
##$BF2= 200.13
##$BF3= 200.13
##$BF4= 200.13
##$BF5= 200.13
##$BF6= 200.13
##$BF7= 200.13
##$BF8= 200.13
##$BYTORDA= 1
##$CFDGTYP= 0
##$CFRGTYP= 5
##$CHEMSTR= <none>
##$CNST= (0..31)
1 1 145 1 1 1 1 1 1 1 1 1 1 1 1 1 1 1 1 1 1 1 1 1 1 1 1 1 1 1 1 1 
##$CPDPRG= <>
##$CPDPRG1= <>
##$CPDPRG2= <>
##$CPDPRG3= <>
##$CPDPRG4= <mlev>
##$CPDPRG5= <mlev>
##$CPDPRG6= <mlev>
##$CPDPRG7= <mlev>
##$CPDPRG8= <mlev>
##$CPDPRGB= <>
##$CPDPRGT= <>
##$D= (0..31)
0 0.7 0 0 0 0 0 0 0 0 0 0.03 0 0 0 0 0 0 0 0 0 0 0 0 0 0 0 0 0 0 0 0 
##$DATE= 1768214241
##$DBL= (0..7)
120 120 120 120 120 120 120 120 
##$DBP= (0..7)
150 150 150 150 150 150 150 150 
##$DBP07= 0
##$DBPNAM0= <>
##$DBPNAM1= <>
##$DBPNAM2= <>
##$DBPNAM3= <>
##$DBPNAM4= <>
$$ [...]
##$SUBNAM3= <"">
##$SUBNAM4= <"">
##$SUBNAM5= <"">
##$SUBNAM6= <"">
##$SUBNAM7= <"">
##$SUBNAM8= <"">
##$SUBNAM9= <"">
##$SW= 18.0517328524113
##$SWIBOX= (0..15)
0 0 2 0 0 0 0 0 0 0 0 0 0 0 0 0 
##$SW_h= 3612.71676300578
##$TD= 16384
##$TD0= 1
##$TE= 0
##$TE2= 300
##$TE3= 300
##$TEG= 300
##$TL= (0..7)
0 120 120 120 120 120 120 120 
##$TP= (0..7)
150 150 150 150 150 150 150 150 
##$TP07= 0
##$TPNAME0= <>
##$TPNAME1= <>
##$TPNAME2= <>
##$TPNAME3= <>
##$TPNAME4= <>
##$TPNAME5= <>
##$TPNAME6= <>
##$TPNAME7= <>
##$TPOAL= (0..7)
0.5 0.5 0.5 0.5 0.5 0.5 0.5 0.5 
##$TPOFFS= (0..7)
0 0 0 0 0 0 0 0 
##$TUNHIN= 0
##$TUNHOUT= 0
##$TUNXOUT= 0
##$USERA1= <user>
##$USERA2= <user>
##$USERA3= <user>
##$USERA4= <user>
##$USERA5= <user>
##$V9= 5
##$VALIST= <valist>
##$VCLIST= <CCCCCCCCCCCCCCC>
##$VD= 0
##$VDLIST= <DDDDDDDDDDDDDDD>
##$VPLIST= <PPPPPPPPPPPPPPP>
##$VTLIST= <TTTTTTTTTTTTTTT>
##$WBST= 1024
##$WBSW= 4
##$XGAIN= (0..3)
0 0 0 0 
##$XL= 0
##$YL= 0
##$YMAX_a= 427986
##$YMIN_a= -599090
##$ZGOPTNS= <>
##$ZL1= 120
##$ZL2= 120
##$ZL3= 120
##$ZL4= 120
##$ABSF1= 15.49127
##$ABSF2= -2.560579
##$ABSG= 5
##$ABSL= 3
##$ALPHA= 0
##$AQORDER= 0
##$ASSFAC= 0
##$ASSFACI= 0
##$ASSFACX= 0
##$ASSWID= 0
##$AUNMP= <proc_1d>
##$AZFE= 0.1
##$AZFW= 0.1
##$BCFW= 0
##$BC_mod= 2
##$BYTORDP= 0
##$COROFFS= 0
##$CY= -3
##$DATMOD= 1
##$DC= 0
##$DFILT= <>
##$DTYPP= 0
##$F1P= 0
##$F2P= 0
##$FCOR= 1
##$FTSIZE= 16384
##$FT_mod= 6
##$GAMMA= 0
##$GB= 0
##$INTBC= 1
##$INTSCL= 3.241238e-09
##$ISEN= 128
##$LB= 0.25
##$LEV0= 0
##$LPBIN= 0
##$MAXI= 10000
##$MC2= 0
##$MEAN= 0
##$ME_mod= 0
##$MI= 1.114404
##$NCOEF= 0
##$NC_proc= -5
##$NLEV= 6
##$NOISF1= 3.799351
##$NOISF2= 2.8
##$NSP= 0
##$NTH_PI= 0
##$NZP= 0
##$OFFSET= 15.49678
##$PC= 1
##$PHC0= -3705.479
##$PHC1= 11.99231
##$PH_mod= 1
##$PKNL= yes
##$PPARMOD= 0
##$PSCAL= 0
##$PSIGN= 0
##$REVERSE= no
##$SF= 200.130004987302
##$SI= 16384
##$SIGF1= 3
##$SIGF2= 2
##$SINO= 0.751879
##$SIOLD= 32768
##$SREGLST= <19F.Aceton>
##$SSB= 0
##$STSI= 16384
##$STSR= 0
##$SW_p= 3612.71676300578
##$SYMM= 0
##$S_DEV= 0
##$TDeff= 16384
##$TDoff= 0
##$TI= <>
##$TILT= no
##$TM1= 0
##$TM2= 0
##$TOPLEV= 0
##$USERP1= <user>
##$USERP2= <user>
##$USERP3= <user>
##$USERP4= <user>
##$USERP5= <user>
##$WDW= 1
##$XDIM= 16384
##$YMAX_p= 294563670
##$YMIN_p= -341271
$$ End of Bruker specific parameters
$$ ---------------------------------
##NTUPLES= NMR SPECTRUM
##VAR_NAME=  FREQUENCY,     SPECTRUM/REAL,   SPECTRUM/IMAG
##SYMBOL=    X,             R,               I
##VAR_TYPE=  INDEPENDENT,   DEPENDENT,       DEPENDENT
##VAR_FORM=  AFFN,          ASDF,            ASDF
##VAR_DIM=   16384,         16384,           16384
##UNITS=     HZ,            ARBITRARY UNITS, ARBITRARY UNITS
##FACTOR=    0.220516191357247, 1,           1
##FIRST=     3101.3707378401, 0,             0
##LAST=      -511.346025165678, 0,           0
##MIN=       -511.346025165678, -341271,     0
##MAX=       3101.3707378401, 294563670,     0
$$ Real data points
##PAGE= N=1
##DATA TABLE= (X++(R..R)), XYDATA
$$ [...]
8732B490915p7753n4251n5656R811o6963J1941N530O660o889j12528j21k3244
8720B127452l2152k414k4996k6832n2162k3949L0683q5387p4346M0957l6731m6882
8708A793241l8697j9050j36989o9459k6532n6377n7760m1336j28867k296n2820
8697A163058j6205j2132m97n0179q928O6436P7601k0202m4074m2343J1504J22233
8685A246272n903q652o0900p8700L5143K0454J0468J45542m4741j16949m4761
8674A097273q8541l8417l5818n0402l2196r4228j21944n3484k0978J11716K259
8663F75240O8974L618o8295M828j4318l3101r686Q8158n1383J7437k5066j04254
8651E52152R6630k7454j4021O4928j2649L4824M4189r1k9082o6127k2321m177
$$ plain form
8732 2490915 2413162 2358911 2303255 2313066 2246103 2258044 2263574 2270234 2263345 2150817 2150696 2127452
8720 2127452 2095300 2092886 2067890 2041058 1988896 1964947 1995630 1910243 1835897 1876854 1840123 1793241
8708 1793241 1754544 1735494 1598505 1529046 1502514 1446137 1388377 1347041 1218174 1215878 1163058
8697 1163058 1146853 1134721 1134224 1084045 1075117 1141553 1219154 1198952 1154878 1112535 1124039 1246272
8685 1246272 1240369 1231717 1170817 1092117 1127260 1147714 1158182 1303724 1258983 1142034 1097273
8674 1097273 1008732 970315 934497 884095 851899 757671 635727 582243 561265 672981 675240
8663 675240 744214 747832 679537 684365 670047 636946 627260 715418 664035 681472 656406 552152
8651 552152 648782 621328 607307 672235 659586 694410 738599 738508 709426 643299 620978 616801
8639F16801r7634n6795K4389q152j11150o2080n8591L0048J18644k7035K9059
8628C97504o3162k0667n6107p1785N2120n879j3030j9914N519L8850K049l0653
8616B14845O1781N4891J7807K4641m8323m6231J8219K157o7163l104r8840n4211
8604G6469o086K1673J29481j2801N6599n2930r2976J8521k8919k1062O8628k3138
8592A33459l196m5863q046R9220M2750O4549j15370k2661o0177o887Q7112K8705
8580A93595J14220j37484p6076j02801L6855O9618J10284J30162j28003j61550
8570D8820o7174L6618O9978J21344K7724M8355k620j03816o9753l8318M1738m984
8558A07912J9732n5837l4124P3735J59894m0063k6981p579j5606p324O380K6196
$$ plain form
8639 616801 519167 462372 486761 478609 367459 305379 246788 276836 395480 368445 397504
8628 397504 334342 313675 257568 185783 237903 232024 218994 199080 204599 243449 245498 214845
8616 214845 276626 331517 349324 373965 325642 279411 297630 299787 232624 229520 130680 76469
8604 76469 70383 92056 221537 208736 265335 212405 119429 137950 109031 87969 156597 133459
8592 133459 130263 84400 76354 175574 218324 282873 167503 144842 84665 77778 164890 193595
8580 193595 307815 170331 94255 -8546 28309 97927 208211 338373 210370 48820
8570 48820 -18354 18264 88242 209586 237310 285665 283045 179229 109476 71158 112896 107912
8558 107912 127644 71807 37683 111418 271312 231249 204268 196689 181083 173759 180139 206335
8546B06335n8119j1864r6520j2882j2102R9756J61706l0809o3083Q631L0457k9924
8534A91582l2295L6384L7728M1319l0667j06490M1185Q9320j8905n0960O6018
8523B64219J22290N4645l1452o8147k3363N4426j3477K0350n6117K5653n1189
8512B97838p6956k5059o3072J05276K856J70l1470R4838N6258n0858k0001R5618
8500C85438l5294l9533j7636p0468J5306J07486Q5035j01510Q5148R9140L8617
8489E51729P5742n0877j0969J31238l8481L941q2304k7145n7290n2173K0916o894
8477D57433J67828J8758l5658j15457r9678q1028J663n6062P3682N8445m8320
8466C41606j61476k8933P0519L6570P1957m3185r0197j1847L2678L2079l4668
$$ plain form
8546 206335 148216 136352 39832 26950 14848 114604 276310 245501 182418 191049 221506 191582
8534 191582 159287 195671 233399 274718 244051 137561 178746 268066 249161 198201 264219
8523 264219 386509 441154 409702 341555 318192 372618 359141 379491 323374 349027 297838
8512 297838 220882 195823 132751 238027 240883 241053 209583 304421 360679 309821 289820 385438
8500 385438 350144 310611 292975 222507 237813 345299 430334 328824 413972 513112 551729
8489 551729 627471 576594 565625 696863 658382 662323 580019 552874 495584 443411 464327 457433
8477 457433 625261 644019 608361 492904 393226 312198 313861 257799 331481 389926 341606
8466 341606 180130 151197 221716 258286 330243 287058 196861 185014 217692 249771 215103
8455B15103N6964J06713m3874j07799n1543J3704Q8130M8519k9364L1454J0165
8444C38172k3096J14404o6748m4983O7350r382j00944l9009N7325k7318o8603
8433A97168o7884N3447o6838j18865P7474K7673j23293N0103j00930O401l3803
8422i9347j1114J24851k7952j01499J7720L6610J9571M0546p338Q4552O951J1901
8410I5452J26528R3237L9710r6525Q397k2244j46060q68n3076k3237k1278L6411
8398C6447j3868L1194M8945L3608l7513q9841j76437n8376M4112j8796R6377k0239
8386a24387J10676j3120l7701J8407M7319J21705P6676j27844l6486J45038j22991
8375E7292K090l4113O1035J07263l0837m717J588m8845j9193J9164j21173k2977
$$ plain form
8455 215103 272067 378780 334906 227107 175564 189268 277398 325917 296553 328007 338172
8444 338172 315076 429480 362732 317749 385099 375717 274773 235764 293089 265771 197168
8433 197168 129284 182731 115893 -2972 74502 102175 -21118 28985 -71945 -65544 -99347
8422 -99347 -110461 14390 -13562 -115061 -97341 -60731 -41160 -614 -7952 76600 83551 95452
8410 95452 221980 315217 354927 258402 266799 244555 98495 97627 44551 21314 36 36447
8398 36447 22579 53773 102718 136326 98813 8972 -167465 -225841 -181729 -200525 -104148 -124387
8386 -124387 -13711 -26831 -64532 -46125 1194 122899 199575 71731 35245 180283 57292
8375 57292 59382 25269 86304 193567 162730 158013 159601 110756 91563 110727 -10446 -33423
8363c3423J03056M2694l0932K7796L0722l5903L5388R729j3780M8922k5237l0686
8351A28346M619N4957N2707j9364r6180J0808J3507M6507n8601k2985j762M2821
8339A55380j1960J3268R0579n8315O597o0918q3440O7952N9475q5155L0569k8144
8327I5888j0315M9392J7769k0299m7334P3447j3747m5643j49305L7827N0807M423
8315D2910K471K2792K7853J9724m5338j97256J07296M681N9513O1704j07552K4884
8303B3682L4609m7051L4741R9658L241k0693j8592o5132Q629L7007l7930l1669
8291B0500j7624P7010J0200N2443j40208j5443N0019n4824j3805o7945O4983M6738
8279A2044M9762j02448k6948P5876M6121m2351L5305m138P0819o2349r1949J29126
$$ plain form
8363 -33423 69633 112327 81395 109191 139913 104010 139398 149127 135347 184269 159032 128346
8351 128346 132965 187922 240629 221265 125085 135893 149400 195907 137306 114321 112559 155380
8339 155380 143420 156688 247267 188952 195549 134631 51191 119143 178618 93463 124032 95888
8327 95888 85573 134965 152734 132435 85101 158548 144801 99158 -50147 -12320 38487 42910
8315 42910 45381 68173 96026 115750 70412 -126844 -19548 -14867 44646 106350 -1202 23682
8303 23682 58291 11240 45981 145639 148880 128187 109595 44463 53092 90099 52169 20500
8291 20500 2876 79886 90086 142529 2321 -13122 36897 -17927 -31732 -99677 -34694 12044
8279 12044 61806 -40642 -67590 8286 54407 12056 47361 43223 114042 51693 -40256 88870
8267H8870J0179M1925l9315j7129N4366J0447j9435n2748j55798m2101Q6662j35023
8255a69100K2511j5326L2050J67126K0900j40204O620K102o1823N9075m0168L5235
8243h1002K0060M3067k9084Q6406N8944K2411o785j10906J07694p3968P4079j14842
8231c926o6885N8138m8492O300q3558L2286n239N5796O81N6474l721R3324n1092
8218D0086p7670N551L1550M0856j24647o2398n2188J43037q1535R8449J13091
8207G4182J3991K1272p0045m1625K5131J09051j32987j1956r8406J4761N6946
8196c9685J9675q9053O4324k2934j51266O2147m2796J21110N1333N309Q475r3350
8184a06711M3666J13472p3211j05169P4387m050q4841q315L7658K0579J29316
$$ plain form
8267 88870 99049 140974 101659 84530 138896 149343 129908 77160 -78638 -120739 -34077 -169100
8255 -169100 -146589 -161915 -129865 37261 58161 -82043 -75423 -73321 -135144 -76069 -116237 -81002
8243 -81002 -60942 -17875 -46959 39447 98391 120802 114017 3111 110805 36837 110916 -3926
8231 -3926 -70811 -12673 -61165 -54865 -138423 -106137 -111376 -55580 -54899 1575 -2146 91178 40086
8218 40086 -37584 -32033 -483 40373 -84274 -146672 -198860 -55823 -137358 -38909 74182
8207 74182 88173 109445 39400 -2225 22906 131957 -1030 -12986 -111392 -96631 -39685
8196 -39685 -20010 -109063 -44739 -67673 -218939 -156792 -199588 -78478 -27145 -21836 -13361 -106711
8184 -106711 -63045 50427 -22784 -127953 -53566 -57616 -142457 -150772 -113114 -92535 36781
8173C6781J6163q9733N3336n0993K3974J7380r749q6852M1072n8552o4404L4418
8161a37159l0712J05904K1968N3725J1463L4400l0775p1592J3552j5283m4069
8150h8578k6282j07732m6770M6781M6519J21560N5117p8754n2595O7967J03984
8139D1217j7803M3780Q2210q6842p9213K4629K2254o917J9312q510K4922l3256
8127B5783l3439j02071O7996L6559q963N53j08121J0017n2878m5054J54P396o6768
8114b68836K4137N4169L0721J00393K2368K1296J5452q2742p1224L8989N2011
8103f3266k2010K6244Q697n3219m940Q7607L5885L2909n7390j6801m8413m2631
8091a17328J06240o048J8399K7480q6683o3476p3560q0463J07955P7058O5591
$$ plain form
8173 36781 52944 -36789 16547 -34446 -10472 6908 -2841 -89693 -48621 -107173 -171577 -137159
8161 -137159 -167871 -61967 -39999 13726 25189 59589 28814 -42778 -29226 -44509 -88578
8150 -88578 -114860 -222592 -269362 -222581 -176062 -54502 615 -78139 -130734 -62767 41217
8139 41217 23414 67194 149404 62562 -16651 7978 30232 23315 42627 34117 59039 25783
8127 25783 -7656 -109727 -41731 -5172 -14135 -13582 -121703 -111686 -164564 -209618 -209464 -202068 -268836
8114 -268836 -244699 -190530 -159809 -59416 -37048 -15752 -300 -83042 -154266 -115277 -63266
8103 -63266 -85276 -59032 -50335 -103554 -108494 -20887 14998 47907 -9483 -26284 -74697 -117328
8091 -117328 -11088 -17136 1263 28743 -57940 -121416 -194976 -275439 -167484 -90426 -24835
8080b4835Q6630p8181M994r293o450m287K4584L6917o4891j0766p4687j1046P4656
8067e6655l5363J26666j9593j19735J01348J3030l271k0356k5514q6696n4977
8056a81116M3140L182P8825P793j09822J389m3129J4380O3518M3377l8617R878
8044a07202k6155q5442J10893k415K2602N1961K003r8264m2809P0010K4221M0431
8032d0166Q999p3764o5486O9041o2947k1310o260n2432n2147Q9555J00701p5350
8020a81566Q3967l1905J0620j0959n7826L409O4719L2153j15808P5454p551J06361
8008b8932l5900j0205k9692P0147N1627j39625Q5158j07394M7872j3815N4273
7997e6486l1j18577j671L1472m251j8624J26368Q160J02930m5584j2047j46636
$$ plain form
8080 -24835 61795 -16386 -11392 -20685 -27135 -31422 -6838 30079 -34812 -45578 -120265 -131311 -56655
8067 -56655 -92018 34648 15055 -104680 -3332 9698 6427 -13929 -39443 -126139 -181116
8056 -181116 -137976 -134794 -55969 -48176 -157998 -156609 -199738 -185358 -121840 -78463 -117080 -107202
8044 -107202 -133357 -218799 -107906 -110321 -87719 -35758 -33755 -132019 -174828 -104818 -80597 -40166
8032 -40166 -31167 -104931 -170417 -101376 -164323 -185633 -191893 -244325 -296472 -206917 -106216 -181566
8020 -181566 -97599 -129504 -118884 -129843 -187669 -184260 -119541 -87388 -203196 -127742 -135293 -28932
8008 -28932 -64832 -75037 -104729 -34582 17045 -122580 -37422 -144816 -96944 -110759 -56486
7997 -56486 -56517 -175094 -176765 -145293 -149544 -168168 -41800 -33640 69290 23706 11659 -134977
7985a34977j5423q950M8148J22413j6713M8331j65283j32465L1498J62169q76
7974f2128N2959l1589l9227l9171m8995J3600P4556M5726l6900J2045n301L2740
7962c1685J6330L2855Q8524k6774o031m3838j6090P2850j3696l9007M686q9067
7950e0943j39799J5005O6686N5111n7413n9443n2851J45116n931M3389J15579
7939G4506r1545r1084l4076M8209l0573P3939Q656K6915N0666N203J5826L7282
7927I3924M3857N8454p2070j05146r8705L5470N0485K5690M61r7181k4113q1124
7915a69998r455M8108J12546m46L026q6152p6488R8369k7771Q6216P8787j36563
7903g9821l5896L6670k8268M2393k1183j7798M6696J0466J485Q7512p8742l3797
$$ plain form
7985 -134977 -150400 -159350 -111202 11211 -5502 42829 -122454 -254919 -223421 -61252 -62128
7974 -62128 -9169 -40758 -79985 -119156 -168151 -154551 -79995 -34269 -71169 -59124 -64425 -31685
7962 -31685 -15355 17500 106024 79250 73219 29381 13291 86141 72445 33438 38124 -50943
7950 -50943 -190742 -175737 -109051 -53940 -111353 -170796 -223647 -78531 -84462 -41073 74506
7939 74506 -17039 -108123 -142199 -93990 -124563 -50624 -41968 -15053 35613 40816 56642 93924
7927 93924 137781 196235 124165 19019 -79686 -44216 6269 31959 32420 -64761 -88874 -169998
7915 -169998 -179453 -131345 -18799 -19245 -16219 -102371 -178859 -80490 -108261 -22045 56742 -79821
7903 -79821 -115717 -79047 -107315 -64922 -86105 -103903 -57207 -46741 -45256 42256 -36486 -70283
7891g0283N967j43054L9933p9214n2097N2143O3970M0951j6113o700L7822N7964
7879f8711o7190k7530P1388n4020n0826R0195l4524n1486j4734l367R4160O0864
7867e5781l5161m9276R0577o0157P0490N9537p9327L3244p3058N4648r6773j3058
7855a54095P6670P0425o1746r1365k109l2406Q1784K6725P5588M6583k3389m4374
7843c1709j00781o4164J1683J03341m8863j3635M8347p2276N3781O224k5983L9488
7831i4547P3333j8708k962k8357j2629M7099j090j30657R6334M4180p4889J5469
7819h7424l1380M4164K9590K6732j04946j2400j8462k7086Q106n614P5246m1139
7807a44613m952L545o6920L750o8066j1017o614J3205N0359n2254K4707R5106
$$ plain form
7891 -70283 -64316 -207370 -167437 -246651 -298748 -246605 -182635 -141684 -157797 -164497 -126675 -68711
7879 -68711 -135901 -163431 -92043 -146063 -196889 -106694 -141218 -192704 -207438 -210805 -116645 -55781
7867 -55781 -90942 -140218 -49641 -109798 -39308 20229 -59098 -25854 -98912 -44264 -141037 -154095
7855 -154095 -77425 -7000 -68746 -160111 -162220 -194626 -112842 -86117 -10529 36054 12665 -31709
7843 -31709 -132490 -196654 -184971 -81630 -130493 -144128 -95781 -168057 -114276 -108052 -134035 -94547
7831 -94547 -21214 -39922 -42884 -71241 -83870 -36771 -37861 -168518 -72184 -28004 -102893 -87424
7819 -87424 -118804 -74640 -45050 -18318 -123264 -135664 -154126 -181212 -173106 -178720 -103474 -144613
7807 -144613 -149565 -146020 -212940 -209190 -277256 -288273 -294887 -281682 -231323 -283577 -258870 -163764
7795a63764J7540J22536j35445p704J8824M539M7271q0511l1832L7714K205l0966
7783a99593R1251L883p5539n6427L9181L0549P2649O899l6751p4495o5554R427
7771b54520N7596l7371j4701R1885L5730m5211k9036O8666O7868J4919r0520k6
7759a34721N2668p3076J02658o3580J3710L4547j38403q6602O6395K4154Q1020
7748a21230n915l225J4623l483K9352j8696K0798O5641N0784q6231j4067j7601
7736h9250M796k8346n1808N5842Q691k5024Q372l6552q605K4707K9333k9237k3135
7723a60216J10168l3095J5600o6020l9936J2459n5054j2364k4431J26864N6836
7712f9189n5304K5396o61j05538L0429l459O3788L5782o5812n6577j21693K6356
$$ plain form
7795 -163764 -146224 -23688 -159133 -166837 -148013 -143474 -96203 -176714 -208546 -170832 -168627 -199593
7783 -199593 -108342 -104459 -179998 -236425 -197244 -166695 -94046 -87147 -123898 -198393 -263947 -254520
7771 -254520 -196924 -234295 -248996 -157111 -121381 -166592 -195628 -126962 -59094 -44175 -134695 -134721
7759 -134721 -82053 -155129 -52471 -116051 -102341 -67794 -206197 -292799 -226404 -202250 -121230
7748 -121230 -127145 -130370 -115747 -119230 -89878 -108574 -87776 -22135 28649 -57582 -71649 -89250
7736 -89250 -84454 -112800 -164608 -108766 -100075 -125099 -116727 -153279 -161884 -137177 -107844 -137081 -160216
7723 -160216 -50048 -83143 -67543 -133563 -173499 -161040 -216094 -228458 -252889 -126025 -69189
7712 -69189 -124493 -99097 -99758 -205296 -174867 -178326 -114538 -78756 -144568 -201145 -322838 -296482
7700b96482Q8787o334M4757m7924Q490J11456P185k1967P5244K9597r2451o6304
7688a65946J066q4937J40822Q023O819p8516m5360P5124q199N9188P0208R2421
7676G0713p1761l4482j55453O4307L8901K9339l4858m3248Q0199n5360L450l9446
7664a47699K8300k152J46466l1770J8164P307n832n5043j00039Q3994m1035k0370
7652a19709k2542L465J6640N6641q87l1005P1437K5881j4491k7314O525K8406
7640f953m6096J233j29733j24406N3620J53901K4961j7925K7228N0221j1463K6870
7628A458n7803P6090O4130j7341j21733j49983J42929j19939M0830j05044M7915
7617a98491J06422K4490L3509m6924M5707J9855j8697k7357J20091r4615m6116
$$ plain form
7700 -296482 -207695 -214029 -169272 -217196 -208706 -97250 -90065 -112032 -36788 -7191 -99642 -165946
7688 -165946 -164880 -249817 -108995 -100972 -94153 -172669 -218029 -142905 -151104 -91916 -21708 70713
7676 70713 -1048 -35530 -190983 -126676 -87775 -58436 -93294 -136542 -56343 -111703 -108253 -147699
7664 -147699 -119399 -121551 24915 -6855 11309 18616 12784 -42259 -142298 -58304 -99339 -119709
7652 -119709 -142251 -138786 -122146 -65505 -66392 -97397 -25960 -79 -14570 -41884 -35359 -6953
7640 -6953 -53049 -51816 -181549 -305955 -252335 -98434 -73473 -91398 -64170 -13949 -25412 1458
7628 1458 -56345 19745 83875 66534 -55199 -205182 -62253 -182192 -141362 -246406 -198491
7617 -198491 -92069 -67579 -34070 -80994 -35287 -15432 -34129 -61486 58605 -36010 -82126
7606h2126j09413o3581N0896O6914P5797o9593M8151M683n001m0891R6394J880
7594b5890K129M6584j61538k8202J8389l9042M0769M658n8136J30398m441j3847
7582h8169J8275J634Q5622J6372n7351l6820l8702k9126K186K8177L0540M6562
7570b0800o177J0706K6762K329P3608J5790k3387J30750m8961K2819L1332L6267
7558B51038J32933J98346K74462O5782l9083m4558l8593j43085j17289j79169
7548C60784j10325m577j14006j882J7183K648n4953p5743m8230M3601o0288J0843
7536c4945K5187M7754N6765n6808l1089j9141l4450k1217k979N639m9166l1274
7524a45724J2119L77o214l5328J34817J13072L8070l9017j9209o3956M2333O6783
$$ plain form
7606 -82126 -191539 -255120 -204224 -137310 -61513 -131106 -82955 -78272 -83273 -124164 -27770 -25890
7594 -25890 -23761 22823 -138715 -166917 -148528 -187570 -146801 -142143 -200279 -69881 -74322 -88169
7582 -88169 -69894 -68260 17362 33734 -23617 -60437 -99139 -128265 -126079 -97902 -67362 -20800
7570 -20800 -26977 -16271 10491 12820 86428 102218 78831 209581 160620 183439 214771 251038
7558 251038 383971 582317 856779 922561 883478 838920 800327 657242 539953 360784
7548 360784 250459 245882 131876 129994 147177 149825 94872 19129 -29101 14500 -45788 -34945
7536 -34945 -9758 37996 94761 37953 6864 -12277 -46727 -67944 -70923 -65284 -114450 -145724
7524 -145724 -133605 -133228 -139442 -174770 -39953 73119 111189 72172 52963 -10993 31340 98123
7512I8123p4004n555l4342m7355k4742k0916N6911M9554n4998j15268l4840O1575
7500a45857J26234O7835n3223k7662l6842q5658O9950Q3108J6916M2802n7745
7489a42j19363O5760R4854M1960N0518r5200j34425Q9156m7316L2082N9771P860
7477D5515p6655p8977L5235J9192J04770p5579m5063J4969m9959K0278J18199
7466C1925K489n5249R26K6139q011j1475o657K1793N9796q7016N2417Q2539K2074
7453A31690J0830j21761m5876J5806n8520O3434Q2464j24439R0949J2128q7659
7442c0954J39357k3016Q0333o2566n6253j2715m1844j9839J9979m9040L96J2419
7430d3743l0016K7609m9313M5704P5338o526j1930j5347m1796P8089l1042M7348
$$ plain form
7512 98123 24119 18564 -15778 -63133 -87875 -108791 -51880 -2326 -57324 -172592 -207432 -145857
7500 -145857 -19623 48212 -5011 -32673 -69515 -155173 -85223 -2115 14801 57603 -142
7489 -142 -119505 -53745 41109 83069 133587 38387 -96038 -6882 -54198 -22116 37655 45515
7477 45515 -31140 -110117 -74882 -55690 49080 -26499 -71562 -56593 -106552 -86274 31925
7466 31925 34414 -20835 -19909 6230 -1781 -13256 -19913 1880 61676 -25340 27077 109616 131690
7453 131690 142520 20759 -25117 -9311 -67831 -4397 78067 -46372 44577 56705 -30954
7442 -30954 108403 85387 165720 103154 46901 34186 -7658 -27497 -7518 -56558 -56162 -43743
7430 -43743 -73759 -46150 -95463 -49759 25579 19053 7123 -8224 -50020 28069 -2973 44375
7418D4375Q7260m1654k9619n5942r566M4586R5169k6765j2506J52501p2926N2335
7406B27248R061o6584r628r1553L8125j3675j1388N6164o1634j2314J11499l9255
7394A36066K5414k5042K6046p6423n257L5440j11432M3156N1883M6841Q762N1996
7382B07450k9257j540j7486K3712m3431P3120p249L7160J5456L127M8514J7234
7370C26810m1592K7970r8400k0557J6935p575n430o1407P8116L5507M6854K3198
7358C20429N3754n9821o277o4634r1641M3375J9191P6389K7548l2044M2171K4595
7346C53035L5896k5067n947Q7037r3017P4579N0515l2815n499M2770j9165o5595
7334C96727l878j4396J01390k1063o737P8829J485j0893M3550l3590K2488L7681
$$ plain form
7418 44375 131635 89981 60362 4420 -5146 39440 134609 107844 95338 247839 174913 227248
7406 227248 236309 169725 160097 68544 106669 92994 81606 137770 76136 63822 175321 136066
7394 136066 161480 136438 162484 86061 80804 116244 4812 47968 99851 146692 155454 207450
7382 207450 178193 176653 159167 182879 139448 212568 205319 242479 257935 261062 309576 326810
7370 326810 285218 313188 214788 194231 211166 203591 198161 136754 214870 250377 297231 320429
7358 320429 374183 314362 308085 243451 151810 195185 214376 290765 318313 286269 328440 353035
7346 353035 388931 363864 357917 444954 351937 426516 477031 444216 438717 481487 462322 396727
7334 396727 392849 378453 479843 458780 452043 530872 532357 521464 565014 531424 553912 591593
7322E91593L910o8979M4106l0593N4549l5062m93K8546m7379J00921Q6336l0921
7310F96534O9647K8227l5470L5724Q095N5733j44803M2807q2953Q5116Q6791n0849
7298G94599M6094m3421P8202L4611P9115N2520K710p521q3359K2989N4704l5040
7286I96203M0918o3929L4008N6863M3822J18096L3509L4649J06328N1016r502
7275A441981Q679l8698M5445P1060L3274K4870K2151J3754P9266R2173L9386J35858
7263A969199J56861O3901J216K0800N592K7881J50770O4153M0986K40816O638
7252B748813Q9231J03199J95697J68035K64368J28528N0718K25346K34527K27457
7242D435919L80983K92643L00338K70165K73841M74651L51461N54342L90927N51557
$$ plain form
7322 591593 595503 526524 570630 540037 594586 559524 559031 587577 540198 641119 727455 696534
7310 696534 766181 794408 758938 794662 802757 858490 713687 756494 673541 758657 845448 794599
7298 794599 840693 797272 875474 910085 989200 1041720 1044430 1036909 953550 976539 1031243 996203
7286 996203 1037121 973192 1007200 1064063 1107885 1225981 1259490 1294139 1400467 1451483 1441981
7275 1441981 1450660 1411962 1457407 1528467 1561741 1586611 1608762 1622516 1701782 1793955 1833341 1969199
7263 1969199 2126060 2189961 2191177 2211977 2217569 2245450 2396220 2460373 2501359 2742175 2748813
7252 2748813 2838044 2941243 3136940 3304975 3569343 3697871 3748589 3973935 4208462 4435919
7242 4435919 4816902 5109545 5409883 5680048 5953889 6428540 6780001 7334343 7725270 8276827
7232H276827N46788N03061P18591P76629P23451P07743O55245P81938P73875P31217
7222A5195365N90608M81555N16681K67135K47163K92205K55371Q2014Q000k07559
7212A7728538j30538M9453j39779O7234M7615r571j18576L0589J11829J86461
7202A7823255J81958N1323j3273k4136j82014j57507k17723l82386m35281n32736
7192A6111480o67424p09067p74814p13736o51298p91391p57083o62052o18716
7183I765899n63739m51398n76760m95925m82388l66478m07573l69012l44112j83484
7173E525030k30953l46767k30538k37061j36853j93122k85186j50752k30200j36870
7163C346728m0513j55492j5647j55465j70802j23501k5438p8492j13634l5641
$$ plain form
7232 8276827 8823615 9326676 10045267 10821896 11545347 12253090 12908335 13690273 14464148 15195365
7222 15195365 15785973 16267528 16784209 17051344 17298507 17590712 17846083 17928097 17936097 17728538
7212 17728538 17598000 17647453 17507674 17574908 17622523 17612952 17494376 17524965 17636794 17823255
7202 17823255 18005213 18056536 18043263 18019127 17837113 17679606 17461883 17079497 16644216 16111480
7192 16111480 15444056 14734989 13960175 13246439 12595141 11803750 11046667 10384615 9765899
7183 9765899 9202160 8750762 8174002 7678077 7195689 6829211 6421638 6052626 5708514 5525030
7173 5525030 5294077 4947310 4716772 4479711 4342858 4149736 3864550 3713798 3483598 3346728
7163 3346728 3306215 3150723 3135076 2979611 2808809 2685308 2659870 2581378 2467744 2432103
7153B432103j88492l4883o7227j06973O579N3687r8379l1055J6612j01750o4393
7142A815829r0918m3684m3147p6261r9213n9905R4516k2450m5587J3103r3533
7131A348750l567q7883j1496K8456k9542m5471j13127K038L7275o554l8171o2604
7119A018104M2421r6165L0502m1859m1970n1531j0798O7148K1611O7846l0329
7108I74980l2506p9146j9611l5243j05787r981N942j9712P9416j167o5688J4635
7096G06132O0470j10528J9049M1558j28962k4963J5122n3413j1429M5582j0192
7085E48426r689L230k6467J1749j9622p7834P996k1164N7993P7970j39763m7642
7073C65183m591M0393o1463K9679K6230j493j9721k7516M2611Q551Q7625n5611
$$ plain form
7153 2432103 2243611 2208728 2141501 2034528 2041107 2094794 1996415 1965360 1981972 1880222 1815829
7142 1815829 1724911 1681227 1638080 1561819 1462606 1402701 1497217 1474767 1429180 1442283 1348750
7131 1348750 1345183 1257300 1245804 1274260 1244718 1199247 1086120 1088158 1125433 1118879 1080708 1018104
7119 1018104 1060525 964360 994862 953003 911033 859502 848704 915852 937463 1005309 974980
7108 974980 942474 863328 843717 808474 702687 692706 698648 678936 758352 757185 691497 706132
7096 706132 766602 656074 675123 716681 587719 562756 577878 524465 513036 558618 548426
7085 548426 538737 541967 515500 527249 507627 429793 437789 416625 474618 552588 412825 365183
7073 365183 360592 400985 339522 369201 395431 393938 374217 346701 389312 397863 485488 429877
7061D29877m8913j1166j0259j2524J8182k939p9060J816N4565m1131n2060R1788
7049C38176m79L512j9526j39470k4642J11485O6680p1625p6850Q5981J10987j5844
7037C68385k8295M536o26l1251k8589k9243K9854J08499j44113l2091Q2045N8650
7025C57761k0470n7581n5602m0346L2276L3427j4176p2468M077J9606Q8085j4726
7013B59863N8273P488m0688q2098q2839K5685L2364K7501n1547r019O9280L7903
7001B52166k8617j79578R2704J06782l9298l0990o666R1210L7812j11696p0375
6990A13454m3865n3928O1568N8215k1087L8107n840r5849K9733R9600m532K7175
6978B02751k5583k3593j1345l9211N077P3480K6007J3298l2434P1643L3533q5156
$$ plain form
7061 429877 380964 369798 359539 347015 365197 362258 283198 285014 339579 298448 246388 338176
7049 338176 337697 341209 321683 182213 157571 269056 335736 264111 187261 273242 384229 368385
7037 368385 340090 344626 344000 312749 284160 254917 284771 393270 249157 217066 299111 357761
7025 357761 337291 279710 224108 183762 216038 249465 235289 162821 166898 186504 274589 259863
7013 259863 318136 325624 284936 202838 119999 145684 178048 205549 154002 144983 214263 252166
7001 252166 223549 43971 136675 243457 204159 173169 166503 257713 295525 183829 113454
6990 113454 69589 15661 77229 135444 114357 152464 146624 50775 80508 180108 175576 202751
6978 202751 177168 153575 142230 103019 108096 181576 207583 220881 188447 260090 293623 208467
6966B08467P0192j5217k6768p1777l1503K2310l2840J7131K781l6277m4440K9410
6954I1469j6224N001P8423n9801L3153j0803O0623P7860k4597m2976k173o0434
6942A29521l8122M414n1278N1651N4633j3997O100P7975l0369K0290L454j2523
6930B01749J8164r8248j5836l0717P2253m7540R053K5948l0914m7202N7130l4975
6918G8865J981N8718o1334M5025K2571n5189j0941N180n5099Q409M9452k946Q2982
6905A67674l9111r7499J8112J9052N8973j9948n7813j4838N2831k0374q792l0571
6893B7696P0793Q2317j05427j8519N2035j5506k4587k592o4559k9048J16571M5447
6881A34621K1934M0763n3951l6089P7229L8297k577m0339m7948j41504N556M5797
$$ plain form
6966 208467 278659 263442 236674 164897 133394 155704 122864 139995 142776 106499 62059 91469
6954 91469 75245 80246 158669 98868 132021 121218 181841 259701 235104 192128 189955 129521
6942 129521 91399 95813 44535 96186 150819 136822 142922 220897 190528 210818 214272 201749
6930 201749 219913 121665 105829 75112 147365 99825 108878 134826 103912 56710 113840 78865
6918 78865 80846 139564 78230 123255 145826 90637 79696 84876 29777 38186 87638 84692 167674
6905 167674 128563 31064 49176 68228 127201 107253 49440 34602 87433 67059 58267 27696
6893 27696 98489 180806 75379 56860 108895 93389 68802 66210 1651 -27397 89174 134621
6881 134621 156555 197318 143367 107278 184507 222804 220227 179888 131940 -9564 -4008 41789
6869D1789J7018N0307o3073l2929j7237N8904Q0612l1359J2372L3817l1667o4152
6857E4402o154O1014o374N6250o0833o663J0756p3852M0927r507K8528J97277
6845B85771n8505j35729M8305k9653O835m0630N1671o3551J5684p9671J5635J05740
6833A21902J6382r6576l3369J3503L077N2282L5921P5443m1110o7191m2870R189
6821D6583L5111M8322M4256O0763M8355l5423j4783P2282o2895p1967M6425m0914
6809A76115P02j07718j04760R0366J9853J2209m0450N9584K0698M4745m0199K120
6797A33265P6458m7736k0800L2442k2403k2592M8280r1988j3321K4514J298R5174
6785A92591P3007M0693k575j8811n8554O1619j4169K9493j16270K6511M9808O2392
$$ plain form
6869 41789 58807 109114 46041 13112 -4125 54779 135391 104032 116404 150221 118554 54402
6857 54402 48248 109262 102888 159138 98305 91642 102398 28546 69473 59966 88494 285771
6845 285771 227266 91537 139842 110189 117024 76394 128065 64514 80198 527 16162 121902
6833 121902 138284 41708 8339 21842 24919 77201 113122 188565 147455 80264 37394 46583
6821 46583 81694 130016 174272 235035 283390 247967 233184 305466 242571 170604 217029 176115
6809 176115 176817 69099 -35661 54705 74558 86767 46317 105901 126599 171344 131145 133265
6797 133265 209723 161987 141187 173629 151226 128634 176914 84926 71605 96119 97417 192591
6785 192591 265598 306291 303716 284905 226351 287970 273801 303294 187024 213535 263343 325735
6773C25735N0995J8281Q7882l0890M4923K0481m3523M201O8151k3050M9713m4374
6761E28525m9999p269J6149Q1739N2878J0758j0169L8578n3313k0712L0410j4793
6749F02782k1455L6102k5919j5386M2107l6574M2236p7931l2645K9972l5366L9672
6737E47595m879r667K1973l4999k3029M9570j5840n7774L3134J3074k8455N8316
6725E49019k196j50566k2060K8457L6041K8543p505p2884J8562M1697r5847J26140
6713D77401M0148k7978q610o3118o2147l9781O1869J1932o2004N9583K7540n4297
6701C60538P8199J7782j3646N2902p178p7792J5258K5437K7466Q3223o2972p964
6689D91253Q2386k4035L2153L2268K3325k4773l8733m7216K6358M8181N9431j65951
$$ plain form
6773 325735 376730 395011 482893 452003 496926 517407 473884 478085 546236 523186 572899 528525
6761 528525 478526 471257 487406 569145 622023 632781 622612 661190 607877 587165 617575 602782
6749 602782 581327 617429 591510 576124 618231 581657 623893 545962 513317 543289 507923 547595
6737 547595 542716 533049 555022 520023 496994 546564 530724 472950 506084 519158 490703 549019
6725 549019 546823 396257 374197 402654 438695 467238 459733 386849 405411 447108 351261 477401
6713 477401 517549 489571 480961 417843 355696 315915 377784 389716 327712 387295 414835 360538
6701 360538 438737 456519 442873 495775 488597 410805 426063 451500 478966 562189 499217 491253
6689 491253 573639 549604 581757 614025 637350 612577 573844 526628 552986 601167 660598 494647
6677D94647K4145O799n9180J50087J9667J5214L4391j8760j09997k7672J25041
6666F54382M8333k5531m5991l366m0068m4556L8985K4561N4842k5578m9378O4646
6654F51281k7471K925J0230L693L7862j574Q4337J0113n0772j42609K5909R2999
6642F96923N5902K6858O6186J54177Q2557O5921K7041Q087q2209p1164j13664
6631I16615j02549L1812p8298J3401J5429K0928P618o357N359P4939n1509k1054
6619H26334L0334k6864O3700K7821J01254L0878m4511o1292j8326Q8266N6928
6608A074522K5150j3855L1921j526n3728j6141O6275Q9882K4709j43160l8658
6597A045391K4093L3828P3708J11727J62412k3036o7179o6308O9740J27590J44894
$$ plain form
6677 494647 518792 525591 466411 616498 636165 651379 685770 667010 557013 529341 654382
6666 654382 702715 677184 631193 627827 587759 543203 582188 606749 661591 636013 586635 651281
6654 651281 623810 626735 636965 640658 678520 676946 761283 771396 720624 578015 603924 696923
6642 696923 752825 779683 845869 1000046 1082603 1148524 1175565 1183652 1101443 1030279 916615
6631 916615 814066 845878 767580 780981 796410 817338 824956 818599 823958 898897 847388 826334
6619 826334 856668 829804 893504 921325 1022579 1053457 1008946 947654 929328 1017594 1074522
6608 1074522 1099672 1085817 1117738 1116212 1062484 1046343 1112618 1202500 1227209 1084049 1045391
6597 1045391 1069484 1103312 1177020 1288747 1451159 1428123 1360944 1294636 1364376 1491966 1636860
6586A636860M5720J11568N2985r730J1064o7305P4100J9851n9684n5968k0027
6575A739434q1003q913P7886N3589L8957j24155J7334j7246L6855P8235K8066
6564A839039k2816m3824j1459O8267Q1644Q4616M0953M2337j6173j18256P2428
6553B016756N4001J59359Q0374M7653q8357r646J01580J08011J60336L6893J3283
6542B680243K8267K8186K9753J38658M8592R5393L9832O0597R8029J25845J25807
6531C499202J02763K10728K7729K1419Q4033J11982J53771L5732O0888O2595m2621
6520D328221o2339J7626R479N6494K24571O2972l762J84812J84184j0261J15744
6509E107741Q7448K3732J06957J43857J78160K28237J68414J84978K11463J42119
$$ plain form
6586 1636860 1682580 1794148 1847133 1837403 1848467 1781162 1855262 1875113 1815429 1759461 1739434
6575 1739434 1658431 1649518 1727404 1780993 1819950 1695795 1713129 1695883 1732738 1810973 1839039
6564 1839039 1816223 1772399 1760940 1829207 1910851 1995467 2036420 2078757 2062584 1944328 2016756
6553 2016756 2070757 2230116 2310490 2358143 2269786 2260140 2361720 2469731 2630067 2666960 2680243
6542 2680243 2708510 2736696 2766449 2905107 2953699 3049092 3088924 3149521 3247550 3373395 3499202
6531 3499202 3601965 3812693 3840422 3861841 3945874 4057856 4211627 4247359 4308247 4370842 4328221
6520 4328221 4265882 4283508 4292987 4349481 4574052 4637024 4633262 4818074 5002258 4991997 5107741
6509 5107741 5195189 5218921 5325878 5469735 5647895 5876132 6044546 6229524 6440987 6583106
6499F583106J75706K59112K58112L23507J95548K07279L02660J93097K61953J46537
6489H906617L01145L68630L88069L24511M30589N46391N05334O44521N55784P00871
6479A3672462P05615O53464P78245R69875J033439J034575R77972R72964J177331
6470B1975942J173931J281345J349275J416621J500604J510236J491758J575361
6462C3275073J683780J811546J756249J817598J940627J895268K095203K149018
6454D8424362K150828K150093J999693J972068J844192J736104J651325J543862
6446F3472527J343865J350926J353909J483229J769917K114315K552345K959231
6438G8400264L354478L784617M211916M351655M266854L837451L194263K256798
$$ plain form
6499 6583106 6758812 7017924 7276036 7599543 7795091 8002370 8305030 8498127 8760080 8906617
6489 8906617 9207762 9576392 9964461 10288972 10719561 11265952 11771286 12415807 12971591 13672462
6479 13672462 14378077 15031541 15809786 16779661 17813100 18847675 19825647 20798611 21975942
6470 21975942 23149873 24431218 25780493 27197114 28697718 30207954 31699712 33275073
6462 33275073 34958853 36770399 38526648 40344246 42284873 44180141 46275344 48424362
6454 48424362 50575190 52725283 54724976 56697044 58541236 60277340 61928665 63472527
6446 63472527 64816392 66167318 67521227 69004456 70774373 72888688 75441033 78400264
6438 78400264 81754742 85539359 89751275 94102930 98369784 102207235 105401498 107658296
6430A07658296J020538l15790j611269k913658l892136m569062n102158n219456
6422H5055305n300930n203394m953178m624142m165295l778451l329287k920054
6414E0780574k671557k385509k136137j961218j507632j307541j163253r93994
6406C6653733r83370q57335p17907o65237n02558n40680o59233o00582o71396
6397C0455435o23167m83095m46332o63649o10274n11972n65997m72553m45382
6388B5633014l96812m26714m62958m89182o11456m88895k87610l74937m21880
6379B1672570m32168m87629m25102l68206l02671l31121m27745k52966l48155
6370A8296807l61031l14423k64655j04688k20600m00034j66597j16739j73410
$$ plain form
6430 107658296 108678834 108363044 106751775 103838117 99945981 95376919 90274761 85055305
6422 85055305 79754375 74550981 69597803 64973661 60808366 57029915 53700628 50780574
6414 50780574 48109017 45723508 43587371 41626153 40118521 38810980 37647727 36653733
6406 36653733 35670363 34813028 34095121 33429884 32927326 32386646 31727413 31126831 30455435
6397 30455435 29832268 29349173 28902841 28239192 27628918 27116946 26550949 26078396 25633014
6388 25633014 25236202 24809488 24346530 23857348 23245892 22756997 22469387 22094450 21672570
6379 21672570 21240402 20752773 20327671 19959465 19656794 19325673 18897928 18644962 18296807
6370 18296807 17935776 17621353 17356698 17252010 17031410 16631376 16464779 16348040 16174630
6361A6174630j34537k06863j25686j84493k29190j64256j84271k55353j57007
6352A4532974k99516l47754j35895k00579k21397k33179k16223j26908j54236
6343A2597287l13162k74574j89597k58307j40877j73883j78148j8482j29595j18690
6333A0801972r1105k66595k26825k70240l70328l35081l20448k85194l14891k53280
6323H067985k78042l22113l41136l64835k07421m5243k65272k99420j79723l25083
6313E439697j44818j10622j16448j49030j47217k34011k15340j40211j23079r2198
6303C966723j15368r1452r8581k03039j28185j9005j605j2217j06853j88569r6244
6292B905605q3955l8555j1688j85700j00742j41816j39281n0733j514p2289K2069
$$ plain form
6361 16174630 16040093 15833230 15707544 15523051 15293861 15129605 14945334 14689981 14532974
6352 14532974 14233458 13885704 13749809 13549230 13327833 13094654 12878431 12751523 12597287
6343 12597287 12284125 12009551 11819954 11561647 11420770 11246887 11068739 11050257 10920662 10801972
6333 10801972 10710867 10444272 10217447 9947207 9576879 9241798 8921350 8636156 8321265 8067985
6323 8067985 7789943 7467830 7126694 6761859 6554438 6509195 6243923 5944503 5764780 5439697
6313 5439697 5294879 5184257 5067809 4918779 4771562 4537551 4322211 4182000 4058921 3966723
6303 3966723 3851355 3759903 3661322 3458283 3330098 3311093 3309488 3297271 3190418 3001849 2905605
6292 2905605 2821650 2783095 2771407 2585707 2484965 2343149 2203868 2153135 2151621 2079332 2101401
6281B101401p2552j11664o2615m1732o4425k5979L9271j01805l1066n2934l3454
6270A542446n727J9721j29458L7428k9916r5692j477O195l5142K1819M7551k8339
6258A349409P516j20303l315n551k7282n1773K7159p9513M112J9253k664M5046
6246A162094l1519r1362M450m0860n1888N5610q9183M2627J2499J8507K8501k8242
6234I91234J7868l018q9221o5409Q0188n3387l2356R2993j12320k7914p5358m3294
6222F80006k6099N0028J21810k0613K2162j72728j2004o855o811J02626M557k4853
6210G11226k4461j7532J6729N7094R398P065K7889l4774j08217Q2117p6519j6475
6198F33540K6801r2318P0891J0520m3505o2546l1233j3957L8107R5610m192n1499
$$ plain form
6281 2101401 2028849 1917185 1854570 1812838 1748413 1722434 1761705 1659900 1628834 1575900 1542446
6270 1542446 1536719 1556440 1426982 1464410 1434494 1338802 1337325 1343520 1308378 1330197 1377748 1349409
6258 1349409 1356925 1236622 1233307 1227756 1200474 1148701 1175860 1096347 1100459 1119712 1117048 1162094
6246 1162094 1130575 1039213 1043663 1002803 950915 1006525 917342 959969 972468 990975 1019476 991234
6234 991234 1009102 1006084 916863 851454 931642 878255 845899 938892 826572 798658 723300 680006
6222 680006 653907 703935 825745 805132 827294 654566 642562 635707 628896 731522 736079 711226
6210 711226 686765 669233 685962 743056 752454 759519 787408 752634 644417 726534 650015 633540
6198 633540 660341 568023 638914 649434 605929 543383 512150 498193 536300 631910 627718 576219
6186E76219o2275n9618Q0801q054P8844O2919k047n5533q7274k7657L3876J26937
6174F57138L1676o4967n1536k1035l4905M5352l9071M7114j00613n5403P5822
6163D89572P7541J336k0956m6518j6808O3924n0553j999P6943J11776o1726O2767
6151F85299j05286m6923j0233Q621J00813J3318n1724L6109N1302K6988Q3486
6140G91770n2549j1801J6619n7569m3982J0990p0587R5629N7258n8278m8713j0797
6128F17990L6007O5544K8182p9713K4184j775k1112J6835n6704M244k8040j8992
6116E86650M4891k4828j0789K3287K1173k4889j19788L3188o5561J6670J1998
6105D92002K6025o948j62387K8906j7270P9049J60123k2334k4595n1452m8449
$$ plain form
6186 576219 513944 454326 535127 527073 605917 668836 666789 611256 523982 496325 530201 657138
6174 657138 688814 623847 572311 551276 516371 561723 522652 569766 469153 413750 489572
6163 489572 567113 568449 547493 500975 484167 548091 497538 495539 572482 684258 622532 685299
6151 685299 580013 533090 522857 531478 632291 645609 593885 629994 681296 708284 791770
6140 791770 739221 727420 744039 686470 642488 653478 582891 678520 735778 677500 628787 617990
6128 617990 653997 719541 747723 668010 692194 690419 669307 686142 629438 633682 605642 586650
6116 586650 631541 606713 595924 619211 640384 615495 495707 528895 463334 480004 492002
6105 492002 518027 511079 348692 377598 360328 439377 599500 577166 552571 501119 452670
6094D52670r3029P8615M704M454M5899q5972l0542O0845L2951lM3815j21287J356
6081C94476o3227q9074O959N1864L5126P3734K7109J3380J3526Q097q4142K6054
6069D13882J2981p1861L7024M3916M8558J416q141n6045n356L2804O7812P9638
6057E96628j293M5843j12406m4657N28N3671j5598J9358o2980j2324k2442N6718
6045E01046J01859l0764Q2607P9132M4194j4627J01992o5510P551O8363J26812
6034A002655N2100J88749P4676m4876K789P579r1380p6703j9054J4818n2636j46893
6022I11824q5286l1065M3914j02191N184j14459J6838j1892p1047k212m2224k4045
6010D93339P091J6516Q3076l8224l8956l1768j42911m3711j7882J00951j1759
$$ plain form
6094 452670 359641 438256 442960 447414 493313 407341 376799 437644 470595 470592 514407 393120 394476
6081 394476 331249 242175 249134 300998 336124 409858 436967 450347 463873 471970 387828 413882
6069 413882 426863 355002 392026 435942 484500 485916 477775 421730 416374 449178 516990 596628
6057 596628 595335 641178 528772 484115 484643 538314 522716 542074 479094 466770 444328 501046
6045 501046 602905 572141 654748 733880 778074 763447 865439 799929 807480 875843 1002655
6034 1002655 1054755 1243504 1318180 1273304 1276093 1283672 1192292 1115589 1096535 1111353 1058717 911824
6022 911824 826538 795473 839387 737196 742380 627921 644759 632867 561820 559608 517384 493339
6010 493339 500430 516946 600022 561798 522842 491074 348163 304452 286570 387521 375762
5999C75762M2954l5682j00941K091N1268L9576L015K9539J1935n3077n0288L316
5987C19468Q2621k3153n3031l1996L681P4512M732j7034N1521n234r513o6048
5975C30526N2862N386m0566j8777O220K3130l9238p2544k0718K2424N9979K1754
5963C30438p6920L8340L8541p8617M0046P613n6727J56950K7380j8541j00388
5952C08115n3609l6865J00382L1257m8692J13918n8612r0890k5278l1172R5689
5941C04243k0639n2236q4624r9215m4483P9727R8164J9393Q4944l976q4751m1430
5929A55117p612R3979M4587N3648l5150q9289M449R2658N5168j5495p9207l0314
5917B42539q7192k2754N2475K6896N595o2415M3822p779L4287m4426O1793l1452
$$ plain form
5999 375762 418716 383034 282093 284184 335452 375028 378043 407582 419517 366440 316152 319468
5987 319468 402089 378936 325905 293909 297590 372102 376834 359800 411321 406087 396574 330526
5975 330526 383388 388774 348208 329431 335651 358781 319543 246999 226281 248705 308684 330438
5963 330438 253518 291858 330399 251782 291828 299441 242714 399664 427044 408503 308115
5952 308115 254506 217641 318023 349280 300588 414506 355894 265004 239726 208554 304243
5941 304243 283604 231368 146744 47529 3046 82773 180937 200330 285274 281298 196547 155117
5929 155117 147505 241484 286071 339719 304569 215280 219729 312387 367555 352060 272853 242539
5917 242539 155347 132593 185068 211964 217559 155144 198966 191187 225474 181048 242841 211389
5905B11389k3050L2190R749m8875N923p537m6335P2417J25400Q0791P290n5442
5893C63910j20886R817J9434L4189R8006J44868q0402j09813k4797l4955N5514
5882C54885M845N2005n4360p9276J9682K983j2159M9148L1697p1135l9366N7158
5870C16107m6099m667j2460J6051p113p4117K1547j3922J38019o5235k8443J9132
5858B58800m9423Q864K4801M5051M8360K0895l1593j02242j8310M3068M6928p4598
5846B20601j5953N8501Q3956O8525o3751K651m5557j02647J445j3094p9356Q8761
5834B04082M5835K8680l7442K6084j02084P2795o0392J41J14603o4511R9051k6126
5822C00716J2075m5542N2931k1279j2518O0446m8935R0101j05053m9547J8065
$$ plain form
5905 211389 188339 220529 230278 181403 187326 179789 133454 205871 331271 412062 419352 363910
5893 363910 243024 252841 272275 306464 404470 549338 468936 359123 334326 299371 354885
5882 354885 359730 411735 357375 278099 297781 300764 288605 337753 369450 298315 258949 316107
5870 316107 270008 265341 252881 268932 261819 187702 209249 195327 333346 268111 239668 258800
5858 258800 209377 218241 243042 288093 336453 357348 325755 223513 205203 248271 295199 220601
5846 220601 204648 263149 347105 415630 351879 354530 308973 206326 207771 194677 115321 204082
5834 204082 249917 278597 241155 267239 165155 237950 177558 177699 292302 227791 326842 300716
5822 300716 312791 267249 320180 298901 286383 346829 297894 387995 282942 233395 251460
5811B51460J39998k1477m8296l9999O3028K334j8439m0633n0533M1378n4640J41574
5799C65755k5428L6696n2352k6390n0932k3868O8455L5293J5640k468K844p3086
5787B70159k4282P1348N3836K2129Q8047j3628j34069P5514j2960Q2484K6802
5776E05380n7790r8920m5052J2862L0999O4524K8037J0462j43989n6042K8443
5765B78914R1978P3166P998j15749J0754K3160J0064P4566j4094J37465r6793
5754D81429P895m7161L0775N1571k60N9485J4122K8338K0698k1222r6446J17008
5742F46232r8j7416n1379n7613o0008Q7390M9428n760R0071n478m2589k6604p2629
5729E33547n7328P9168L0150L2007r045Q2016M3118m9206R3328m895j2790M0767
$$ plain form
5811 251460 391458 369981 321685 281686 344714 347048 328609 287976 237443 278821 224181 365755
5799 365755 340327 377023 324671 298281 247349 223481 291936 327229 342869 340401 343245 270159
5787 270159 245877 317225 371061 393190 481237 467609 333540 409054 396094 478578 505380
5776 505380 447590 348670 303618 316480 347479 412003 440040 450502 306513 250471 278914
5765 278914 370892 444058 452056 336307 347061 370221 380285 454851 440757 578222 481429
5754 481429 489324 442163 472938 524509 524249 583734 597856 626194 646892 625670 529224 646232
5742 646232 646134 628718 577339 519726 459718 547108 596536 590776 680847 675369 632780 606176 533547
5729 533547 476219 555387 585537 617544 608499 690515 733633 684427 777755 772860 760070 800837
5717H00837j0252p0047L2243K3730K1776m4358k7855o2681J23037N5024L4831
5706H76285k4673j15820O6719l8047k7615K2143Q3181p0960o5909L0152P90J23765
5694H60011L7284M1199j2710N629J576J30053J05519J8875P928j03147m1481L2405
5682A083141K7460R185J52986j6854n7155n3472m1324J30302J18449m3510k6151
5671A283057M2528l9875j5454j7684J7854j1578o385m4470L3785J5015J12670
5660A369463L6394n5359J07585N3009J5176q32M4326M7079J20846p08j9459k9117
5648A688403Q3692J27729K0076P75K1466J32257L0025L5944p3286l8197Q904o8535
5636A969253N3162p395Q8800R34K5203q261J8301N0803J37690k1684M4921J22637
$$ plain form
5717 800837 790585 720538 752781 776511 798287 753929 726074 663393 786430 841454 876285
5706 876285 851612 735792 802511 764464 736849 758992 842173 771213 705304 735456 736246 860011
5694 860011 897295 938494 925784 931413 932989 1063042 1168561 1187436 1195364 1092217 1050736 1083141
5682 1083141 1110601 1119786 1272772 1255918 1198763 1145291 1103967 1234269 1352718 1309208 1283057
5671 1283057 1325585 1285710 1270256 1252572 1270426 1258848 1252463 1207993 1241778 1256793 1369463
5660 1369463 1405857 1350498 1458083 1511092 1526268 1525436 1569762 1616841 1737687 1736979 1717520 1688403
5648 1688403 1772095 1899824 1919900 1920675 1942141 2074398 2104423 2140367 2067081 2028884 2037788 1969253
5636 1969253 2022415 2015020 2103820 2104754 2129957 2121696 2139997 2190800 2328490 2306806 2351727 2474364
5624B474364o626N199o3459o2965R9412J15413j02760M3195O479J41012R0127
5613B739391o1745M3384J01882J02121l9049j7138n961J24827K363J1685L0432
5602C032192J08361J25143M7997L6346Q9866R2741j8103Q471p6145J33566J43514
5591C723949q938K6775J15592n917O494J81604J8947K8187O798O1914k3668L4008
5579D165745J91619O3742J07390J7030J07535J88038J40630J78349J53791J48795
5569E462664L0863L7348J04291J62330K42168J63043J24043R5623J04398J83723
5559F710494Q5459P4064K49787J66825J03135M3452J94477J89331K62208K13757
5549H292989K44534J29233K70927K65288J98987K75174K33920K78097K72516M49298
$$ plain form
5624 2474364 2467738 2472937 2409478 2346513 2445925 2561338 2458578 2501773 2508252 2649264 2739391
5613 2739391 2677646 2721030 2822912 2925033 2885984 2868846 2862885 2987712 2990075 3001760 3032192
5602 3032192 3140553 3265696 3313693 3350039 3439905 3532646 3514543 3523014 3446869 3580435 3723949
5591 3723949 3715011 3741786 3857378 3851461 3857955 4039559 4058506 4086693 4093491 4155405 4131737 4165745
5579 4165745 4357364 4421106 4528496 4545526 4653061 4841099 4981729 5160078 5313869 5462664
5569 5462664 5493527 5530875 5635166 5797496 6039664 6202707 6326750 6422373 6526771 6710494
5559 6710494 6795953 6870017 7119804 7286629 7389764 7433216 7627693 7817024 8079232 8292989
5549 8292989 8537523 8666756 8937683 9202971 9401958 9677132 9911052 10189149 10461665 10910963
5539A0910963L58203M07806M23162M21161L48075L37595N55139N96188N49826
5530A4908118N61890N51138N90352P15364O62864P18839Q00329Q04053Q33487
5521B1146434Q94605J027941R92372J169330J315690J250508J490719J555448
5513C0843047J768722J880106K226987K432869K656326K827015L134102L605073
5505E1374247L842829M295083M758292N363009N979027O642517P524241Q661280
5497I8440525R651054J1018507J2453238J4241673J6079990J7866014J9560681
5490A99311682K0671041K0717101J9381367J6506116J1821977O154386j01304
5483B94462366o278437j1599510j5636471j8305371j9661565j9639560j9147566
$$ plain form
5539 10910963 11269166 11676972 12100134 12521295 12869370 13206965 13762104 14358292 14908118
5530 14908118 15470008 16021146 16611498 17326862 17989726 18708565 19508894 20312947 21146434
5521 21146434 22041039 23068980 24061352 25230682 26546372 27796880 29287599 30843047
5513 30843047 32611769 34491875 36718862 39151731 41808057 44635072 47769174 51374247
5505 51374247 55217076 59512159 64270451 69633460 75612487 82255004 89779245 98440525
5497 98440525 108091579 119110086 131563324 145804997 161884987 179751001 199311682
5490 199311682 219982723 240699824 260081191 276587307 288409284 294563670 294462366
5483 294462366 288183929 276584419 260947948 242642577 222981012 203341452 184193886
5476A84193886j7878127j6408573j4728614j3110538j1585833j0228694r035054
5469I1218453p671242o826675o009563n350079m715033m154531l826189l324894
5461D9340247k978418k729428k433226k145517k056266j844808j711941j617170
5453C1823473j489049j296729j193227j227942j093958j023451q22175q47360
5445B2829582p93679q48563p17507o74185p85732o45858n68448n53122n76517
5436A6665971m74078n68628m80799m22613m50230n12608m15857m24539l34799
5427A2581820l63651m23390k96196m38149l26393k59123k56553k51629k00632
5418I766104k08028k10692l02844k71716k81330k81927j97360k16889k53409p8614
$$ plain form
5476 184193886 166315759 149907186 135178572 122068034 110482201 100253507 91218453
5469 91218453 83547211 76720536 70710973 65360894 60645861 56491330 52665141 49340247
5461 49340247 46361829 43632401 41199175 39053658 36997392 35152584 33440643 31823473
5453 31823473 30334424 29037695 27844468 26616526 25522568 24499117 23676942 22829582
5445 22829582 22035903 21187340 20469833 19795648 19009916 18364058 17795610 17242488 16665971
5436 16665971 16191893 15623265 15142466 14719853 14269623 13757015 13341158 12916619 12581820
5427 12581820 12218169 11794779 11498583 11060434 10734041 10474918 10218365 9966736 9766104
5418 9766104 9558076 9347384 9044540 8772824 8491494 8209567 8012207 7795318 7541909 7463295
5408G463295j71180j10545k03681l01788k42355j96929r5291k2271n2555j97846
5398E868854k00711j44514j36907j27478m2361J1756j4926j80968q0215j15942
5388D836588j31024N6335k2873n6238j29937j76157r6554j14104j07588r3208
5378C965240r4900j07536q6557r6551p7957l2536j35283j5915p8722j54944k2309
5367C062030j62870o0367k4547q9473N3200m6151O873L0210o6560l843r0605l3285
5355B574612o3229J2750j49770n8506n7752j6715l1169j20682l0468r2462j38502
5344A828107K8409j1790J6592o551j71312P258L2202n8768K753k9919O950J6772
5332A660703o9140n9593O146Q9511J7646K0855k40799j13825K9615J0196K172
$$ plain form
5408 7463295 7292115 7181570 6977889 6676101 6433746 6236817 6141526 6119255 6066700 5868854
5398 5868854 5668143 5523629 5386722 5259244 5216883 5228639 5213713 5032745 4952530 4836588
5388 4836588 4705564 4761899 4739026 4682788 4552851 4376694 4280140 4166036 4058448 3965240
5378 3965240 3870340 3762804 3676247 3579696 3501739 3469203 3333920 3318005 3239283 3084339 3062030
5367 3062030 2899160 2838793 2814246 2724773 2777973 2731822 2738695 2768905 2702345 2698502 2607897 2574612
5355 2574612 2511383 2524133 2374363 2315857 2258105 2241390 2210221 2089539 2059071 1966609 1828107
5344 1828107 1856516 1844726 1861318 1854767 1683455 1690713 1722915 1664147 1666900 1636981 1643931 1660703
5332 1660703 1591563 1531970 1538116 1627627 1645273 1666128 1425329 1311504 1341119 1351315 1353487
5321A353487n5181o095r5275q4922M0411J51739j6123L0239q4052m1498J7607
5310A210337n6213O5310k5813j9412p3913l9587K5730J03979p114Q4074m3348
5299A224030j31843j01992j1854j2075O9124j7486L5575l5152o0352o8181j6346
5288H73448Q1895p490k8553o8459j2311j5760K5671N3049q2367p3684m4005n9200
5276F42234J38552k703N6312j0665p1179L7453O5278p0787P6248M683o2996J45707
5264I48137l5269L2798n6774r0377K2083m305k9699k3282n7986p0020l8831p9619
5252E16856J40129k0136n2343o5106l6543L1065L8785M5625m436J0380n4962l8503
5240E10811j2142O2695J10756l824p3038K6815p9211Q6402j5917M8158P2418j19372
$$ plain form
5321 1353487 1298306 1292211 1196936 1112014 1152425 1304164 1288041 1318280 1234228 1192730 1210337
5310 1210337 1154124 1219434 1193621 1174209 1100296 1060709 1086439 1190418 1183304 1267378 1224030
5299 1224030 1092187 990195 978341 966266 1035390 1017904 1053479 1018327 957975 889794 873448
5288 873448 955343 947853 919300 850841 838530 822770 848441 901490 819123 745439 701434 642234
5276 642234 780786 778083 834395 823730 752551 790004 855282 784495 860743 865426 802430 948137
5264 948137 912868 945666 888892 798515 820598 816293 786594 763312 705326 635306 596475 516856
5252 516856 656985 636849 584506 519400 482857 513922 552707 598332 593896 604276 549314 510811
5240 510811 498669 561364 672120 668296 595258 622073 542862 629264 613347 661505 733923 614551
5228F14551j8080l7838l3381N2075O7572l1172o6964j02514o9682j2015M7943
5217D10495L3669m7143p2183L8886R517N9199N9843j0016j1086N9154j25175l8829
5205C66331P5073K3743l1110K6504n7215M8519R2791j22906P5687q165M2587k4496
5193E07343k5459l0734J063j2542J0983j45307K3772N0194K5196J12224m1210
5182D75523M7229l8353M1167k9833J14483R2583M5455l189O3782K7423P7703n9174
5170H54799n6873J5227m2577q76m5288L1416l1038J9836j3662K0229O8845R6455
5158I16493l2809J8633P3924l984R0488L4327N2955J79251Q9281J02389J37854
5147A658802N2502j5719M4056K19569J27398J29508L3060R738o4409q4229j35544
$$ plain form
5228 614551 596471 558633 525252 577327 644899 613727 546763 444249 374567 362552 410495
5217 410495 444164 397021 324838 363724 373241 432440 492283 482267 471181 530335 405160 366331
5205 366331 441404 465147 434037 460541 403326 451845 544636 421730 497417 489252 531839 507343
5193 507343 481884 451150 452213 439671 450654 305347 329119 379313 404509 516733 475523
5182 475523 522752 484399 525566 495733 610216 702799 748254 745065 808847 836270 913973 854799
5170 854799 797926 813153 770576 769700 724412 755828 724790 744626 730964 751193 820038 916493
5158 916493 883684 902317 976241 972257 1062745 1097072 1150027 1329278 1418559 1520948 1658802
5147 1658802 1711304 1695585 1739641 1959210 2086608 2216116 2249176 2258914 2194505 2110276 1974732
5136A974732j03630J7030m4815o7175m3288l2508j30849n4248k6900K3471n256
5125A506564J6379M7691K25088J15289R2701R2202J04541J58159J16383N3788
5115B528785J4546M1201P1508L2212J7737Q9330P7107P8255n4585j31687p4107
5104B690302k5424n7581n6608l091n4292j7690P3272Q245p4130m479r1600j45711
5092B241213j94387m5644L6287J12286J14128J47512O6537P1761P858n5206m8688
5081B453657j56277j2233m4487m6663n6549M2961j205o7193j38207p4905J9689
5070A918588j7301K1560j6840O9030P8478L6386q1424n4208M686n8465q0633o0340
5058A759517o3349r3366j09245j17415l5692J9126l0957j44646N358L771p7973
$$ plain form
5136 1974732 1871102 1888132 1843317 1776142 1732854 1700346 1569497 1515249 1488349 1511820 1506564
5125 1506564 1522943 1570634 1795722 1911011 2003712 2095914 2200455 2358614 2474997 2528785
5115 2528785 2543331 2584532 2656040 2688252 2705989 2795319 2872426 2950681 2896096 2764409 2690302
5104 2690302 2664878 2607297 2550689 2547598 2493306 2475616 2548888 2557133 2483003 2478524 2386924 2241213
5092 2241213 2046826 2001182 2037469 2149755 2263883 2411395 2477932 2549693 2557551 2502345 2453657
5081 2453657 2297380 2285147 2240660 2193997 2137448 2180409 2179204 2112011 1973804 1898899 1918588
5070 1918588 1901287 1922847 1906007 1975037 2053515 2089901 2008477 1954269 1958955 1900490 1819857 1759517
5058 1759517 1696168 1602802 1493557 1376142 1340450 1359576 1328619 1183973 1189331 1193102 1115129
5047A115129n8209j35654j2964N9202n1811p1555j08581j5773l4398p5863j470
5036F08053L601L6665P4155N0163O5657o5164k0086o3290J162M8604J46631J8087
5024I04238j14528j16681o4211n6221k4883n6054r332O3239j853k7525N158k2410
5012D78937k3526j0410o3311n5535M8603n129p2460L5834k1234l0080K6365L2653
5000C40707n6858K1023J41328k3205j2202O3607j44134O6030N5386j19577K3451
4989C55556J6028m7055K7893O269q7682J8778l6519M171O9541J7004j9617j1526
4977C12841O0480q2019m8685o4685k7895N1749j2623o1310K5152r882N8291M96
4965B01910O63K755Q9060J6808m3562q3070Q4393J2411p792K7099n9901J4844
$$ plain form
5047 1115129 1056920 921266 908302 967504 915693 844138 735557 719784 685386 609523 608053
5036 608053 611654 648319 722474 772637 838294 773130 753044 689754 690916 739520 886151 904238
5024 904238 789710 673029 608818 552597 527714 471660 462328 525567 523714 496189 501347 478937
5012 478937 455411 445001 381690 326155 374758 369629 297169 333003 311769 281689 308054 340707
5000 340707 283849 304872 446200 422995 410793 474400 330266 396296 451682 332105 355556
4989 355556 371584 324529 352422 358691 271009 289787 253268 257439 326980 343984 324367 312841
4977 312841 373321 291302 242617 177932 150037 201786 189163 127853 153005 143123 201414 201910
4965 201910 202573 205328 294388 311196 267634 184564 268957 281368 273576 300675 240774 255618
4953B55618O4097P1318j15511M7969K6390j52567K8672K7458L323J51084m5987
4942C61864j04914j9031k7611L0097P3458M4698J12552M0720k6474L326P3901
4931E62586O5193R401k7666m8194J07264Q1477N2694K85131M81956M43877L17071
4920B330790J96730J6624n1316j75480l61321m15687k41027j77831k28560j74608
4910G18314K5086J945n6725j10866o247r5851K3864M9363j06411J6022J2297L3902
4898E04693M6394p3400k0292J9826j05135k1371o4131M6907J02460K217j01165
4887C37003k5353j1283p851k0736L96J7878K686M7732q5604l0633J48023L413
4875C75671j37257m0824J09480N5103k2805n9765p7638j5199j4252q3831J0961
$$ plain form
4953 255618 319715 391033 275522 323491 349881 197314 225986 253444 256767 407851 361864
4942 361864 256950 237919 210308 240405 313863 358561 471113 511833 485359 488685 562586
4931 562586 627779 637180 609514 561320 668584 750061 802755 1087886 1569842 2013719 2330790
4920 2330790 2527520 2544144 2492828 2317348 1956027 1540340 1299313 1121482 892922 718314
4910 718314 743400 745345 688620 577754 571507 475656 499520 548883 442472 458494 470791 504693
4898 504693 551087 477687 457395 477221 372086 350715 286584 333491 435951 438168 337003
4887 337003 311650 300367 292516 271780 272176 290054 292740 340472 254868 224235 372258 375671
4875 375671 238414 197590 307070 362173 339368 279603 201965 186766 172514 88683 99644
4864I9644P4579O9828n2757J1596j2816M5387O6406j06165j02755P4611K47m1741
4852A26064P8619k8232Q5567J6548j18994rL7992M128P4099j28138l7391L8445
4840A48698P2677P670O8527l908J9038m0716k8597n5352o0339L7373l7190k5161
4828A02720m4870R0417J5757K0340n304j4378j4698K7699l2371n411J06581O6828
4816C13310p4331j0194m3119Q2000J09829p7335M4807P4070M7370L0588O142l6012
4804D67125J11100o02M6103J03721R351J07810K98173K43183K85512L40250L15225
4793B326951J47236o1736j81573j73486k43339l14099l11822k21599r5866j97287
4783F73380o6105p3622M0452p3198J2194o6967P75R3209q5919n4542j15928J235
$$ plain form
4864 99644 174223 244051 191294 202890 190074 235461 301867 195702 92947 167558 167805 126064
4852 126064 204683 176451 262018 278566 159572 159563 197555 201683 275782 147644 110253 148698
4840 148698 221375 229045 297572 293664 312702 271986 243389 188037 127698 165071 127881 102720
4828 102720 57850 148267 164024 184364 179060 164682 149984 177683 145312 139901 246482 313310
4816 313310 238979 228785 185666 267666 377495 300160 344967 419037 466407 496995 503137 467125
4804 467125 578225 577623 623726 727447 736798 844608 1142781 1385964 1671476 2011726 2326951
4793 2326951 2474187 2412451 2230878 2057392 1814053 1499954 1188132 966533 870667 673380
4783 673380 607275 533653 574105 500907 513101 446134 446909 540118 454199 399657 283729 284964
4771B84964o5927j281O3576J8307J5280n0869j26587J1489O2132j4814P7975n4781
4759B19464j5293K7040K9346O115J19211J8173J02390k3310o7592J12967J343
4748E29854L4248k0608o8907k360J03291N0333m2205M703q4934q5497j18493k9064
4736B70361N7955q135K186r4556N4182N274P6292R7593N0639n5733J07104r1763
4724D71399j37899P5363J8074q119m6366L9033l9228J10768n8321N147m404O7088
4712D92535Q1693j92493J02627R895l033j6307k0825n6803J42358k1335j68927
4701C49385R6577j5258l6701J18109P7017n3159J14153j5522k5159m8689j4938
4690E45815J52454Q998O1068L2930M6037K08044M7027R229L9258P201K4954j19779
$$ plain form
4771 284964 219037 217756 281332 299639 314919 264050 137463 148952 211084 196270 274245 219464
4759 219464 204171 231211 260557 266672 385883 404056 506446 483136 415544 528511 529854
4748 529854 564102 543494 474587 472227 575518 625851 583646 588349 503415 417918 299425 270361
4736 270361 328316 320181 322367 227811 281993 287267 363559 461152 511791 456058 563162 471399
4724 471399 333500 408863 426937 418818 372452 411485 372257 483025 424704 429851 425447 492535
4712 492535 574228 381735 484362 494257 491224 474917 454092 397289 539647 518312 349385
4701 349385 445962 430704 394003 512112 589129 535970 650123 634601 609442 560753 545815
4690 545815 698269 707267 768335 801265 847302 1055346 1102373 1111602 1150860 1158061 1183015 1063236
4678A063236j46175N2744q1108j7070l2738j06113J00381J21195j39000l285M6532
4667H58599L8142P613q0990R5380J44779L0620J7945l3238m5320J31533q3542
4656A081521j04119R3308J9383K498J37683j2408J28934J34140L0308K9301J13257
4645A653806J03529J09406J5371P337J10203J40644J79096J38206K33108K90290
4635B980996K21324K59915K53676L53835N03339O81686J102712J877004K960058
4626A1194545L545207K771881P17735o38743j370477j803588j900062j689356
4618A0827142j227752q79243o52466k04059n648K27565N72384P52881J058791
4609A0469595J537502J736601J561645J461123J099820J122616J260636J587351
$$ plain form
4678 1063236 917061 969805 888697 871627 838889 732776 833157 954352 815352 812067 858599
4667 858599 896741 904354 823364 918744 1063523 1094143 1112088 1078850 1033530 1165063 1081521
4656 1081521 977402 1070710 1090093 1092591 1230274 1217866 1346800 1480940 1511248 1540549 1653806
4645 1653806 1757335 1866741 1882112 1889449 1999652 2140296 2319392 2457598 2690706 2980996
4635 2980996 3202320 3462235 3715911 4069746 4573085 5254771 6357483 8234487 11194545
4626 11194545 14739752 17511633 18229368 17590625 16220148 14416560 12516498 10827142
4618 10827142 9599390 8720147 8067681 7863622 7857974 8085539 8657923 9410804 10469595
4609 10469595 12007097 13743698 15305343 16766466 17866286 18988902 20249538 21836889
4601B1836889K095503K550237K448384J783205J241069O26862M84285N94520J255582
4592C4916536J981039K236081J522950K87910o40069j320772j516731j434575
4584C6032369q63828n62634m76302r93204j653035k060580k175867k174820j980133
4575B3091966j526126j400151j304644j426351j583369j709523j567993j656877
4567A0916932j432719j182818j083021p22189n87625n26827m63607m07482k85187
4558D225457j67481k12517j97920k03877k04626j62784j47445l6534j05495j34008
4548B652770j43592j59425n4810p3772M7108K2134L9327l5529q8730j50384o8406
4537A986691q5963j7527p6957r6487m8949n6691N394m8126M7425n529K1958p9380
$$ plain form
4601 21836889 23932392 26482629 28931013 30714218 31955287 32582149 33066434 33660954 34916536
4592 34916536 36897575 39133656 40656606 40944516 40304447 38983675 37466944 36032369
4584 36032369 35168541 34605907 34129605 33136401 31483366 29422786 27246919 25072099 23091966
4575 23091966 21565840 20165689 18861045 17434694 15851325 14141802 12573809 10916932
4567 10916932 9484213 8301395 7218374 6496185 5908560 5381733 4918126 4510644 4225457
4558 4225457 4057976 3845459 3647539 3443662 3239036 3076252 2928807 2892273 2786778 2652770
4548 2652770 2509178 2349753 2294943 2221171 2268279 2290413 2329740 2294211 2205481 2055097 1986691
4537 1986691 1900728 1883201 1806244 1709757 1660808 1604117 1609511 1561385 1608810 1603281 1625239 1545859
4525A545859l9906l1423k7959m0739q4073p3865n1270N6991j12466j6961J3587
4514A137775M8329l921j19160R3713K3217j37846n7766j1771p5088N0427R1289
4503A039198K7978n6220K8969m9026j9961J03345J0161k3765K4970p6111n9789
4492I49749O0087O0315l2698Q923m2953m5803N1628O2129j3995M3057Q4194o4957
4480A119676l8131P2818J7376P5033L4106j13820M4042L3968j0352p9928L6374
4469A191162k4159n2686L0775L1813K3773K5781p978p9207P7483J6305k5508M7713
4457A255267j218K996N9535o692j9589J25606L1494J12638M5479q1185k8869J4942
4445A510404K7948P2710J50215J35316M0497O5503Q2986M2222J24213Q4701L2319
$$ plain form
4525 1545859 1505953 1474530 1446571 1405832 1321759 1247894 1196624 1253615 1141149 1124188 1137775
4514 1137775 1186104 1182183 1063023 1156736 1179953 1042107 984341 972570 897482 947909 1039198
4503 1039198 1067176 1010956 1039925 990899 970938 1074283 1084444 1060679 1085649 1009538 949749
4492 949749 1009836 1070151 1037453 1046376 1003423 957620 1009248 1071377 1057382 1100439 1184633 1119676
4480 1119676 1081545 1154363 1171739 1246772 1280878 1167058 1211100 1245068 1234716 1154788 1191162
4469 1191162 1167003 1114317 1145092 1176905 1200678 1226459 1218481 1139274 1216757 1233062 1207554 1255267
4457 1255267 1254049 1257045 1316580 1309888 1290299 1415905 1447399 1560037 1605516 1524331 1495462 1510404
4445 1510404 1538352 1611062 1761277 1896593 1937090 2002593 2085579 2127801 2252014 2336715 2369034
4434B369034O9824M3001K9160J05692K6270Q4020J67357J95174J31302K17947
4424C438781L34211K31999L66657M05614L76537N38419N31976O58961Q95307Q93729
4414H672191J027372J177363J182651J360239J615315J939013K530245L639627
4406B3144016N604099Q026153J0910875J3299969J4553915J4230861J1543576
4399A01313464P303220K327327l058195p752408j0739820j2277462j2579733j1690692
4391E2845701r935206q134304o504466m999730l778244k917839k246769j834581
4383A2494562j445565j186701r29752q26624o15145m84665m43604m07452n24863
4374E630191l59594k39482k82193l10914j91214k33029j71914k44841j52204j33186
$$ plain form
4434 2369034 2438858 2481859 2511019 2616711 2642981 2727001 2894358 3089532 3220834 3438781
4424 3438781 3772992 4004991 4371648 4777262 5153799 5692218 6224194 6883155 7778462 8672191
4414 8672191 9699563 10876926 12059577 13419816 15035131 16974144 19504389 23144016
4406 23144016 28748115 36774268 47685143 60985112 75539027 89769888 101313464
4399 101313464 108616684 110944011 107885816 100133408 89393588 77116126 64536393 52845701
4391 52845701 42910495 34776191 28271725 23271995 19493751 16575912 14329143 12494562
4383 12494562 11048997 9862296 8932544 8105920 7490775 7006110 6562506 6155054 5630191
4374 5630191 5270597 5031115 4748922 4438008 4246794 4013765 3841851 3597010 3444806 3311620
4364C311620K4680M4605j99460l6488r2400m3182j16768J922o7132p6989q5549
4353B664859j47514j24514J2895j4930k44977k1313J12531k7478q0279J2339j53223
4342A988396k0928j08875j40476k24981k8994L9970p5652j9246n1445k7953r262
4331A320554J5109p1179j1680Q5832o8600k1366m7089j02481p0935k1118q9510
4320I17537j54412k6592J56944N7155p1087m3629N4970K1153j07584J3364Q1970
4309H99789J8799j0519r4902j01197O0709M7891m541j8125M3211l7884R558N3057
4297H65846m2316l6192L1701j02924k7300r767q479K234R3735j26320j9735Q3823
4285G04306K4239j03305k7882J3722N9680P5454j26466K0809L1836O955k4036
$$ plain form
4364 3311620 3336300 3380905 3181445 3144957 3052557 3009375 2892607 2894529 2827397 2750408 2664859
4353 2664859 2517345 2392831 2405726 2390796 2145819 2124506 2237037 2209559 2129280 2141619 1988396
4342 1988396 1967468 1858593 1718117 1493136 1464142 1504112 1428460 1409214 1357769 1329816 1320554
4331 1320554 1335663 1264484 1252804 1338636 1270036 1248670 1201581 1099100 1028165 1007047 917537
4320 917537 763125 736533 893477 950632 879545 835916 890886 912039 804455 817819 899789
4309 899789 918588 908069 813167 711970 772679 820570 816029 797904 841115 803231 812789 865846
4297 865846 823530 787338 819039 716115 688815 679048 670569 672803 766538 640218 620483 704306
4285 704306 728545 625240 597358 611080 670760 746214 619748 640557 672393 679348 655312
4274F55312r1393N5794O8071n9063r7214r5045j427J0797q5559K6055J598J7510
4262D05436j3535N887N5561K7622J17330j60593j05036R999j528M6461o0559k8018
4250B99027k9406q622K2576p5847R6520L8152j0364n5492o047j02470o158J01029
4238B62898O9494q6564j14086q8823k0813K4444k7743Q1896J20539J7723n2286
4227A86679K7619j4698r245P3832k6571o2185L0638j03351O6494N1260k2271M6717
4215B44918o9534n5863N4600J95039J37281L7540R546r4129j14571j5653l2062
4204B97112o4999J37518K7307j24074p5173j07078l7056R4233L6529j31854K9236
4193H1701J7378Q755M5269L4400j1096l712P540n4881q012J23616N6718l5338
$$ plain form
4274 655312 563919 619713 687784 628721 531507 436462 435035 445832 360273 386328 387926 405436
4262 405436 391901 397788 453349 480971 598301 437708 332672 342671 341143 387604 327045 299027
4250 299027 269621 260999 283575 207728 304248 342400 332036 276544 270497 168027 161869 262898
4238 262898 332392 245828 131742 42919 22106 46550 18807 100703 221242 238965 186679
4227 186679 214298 199600 190355 264187 237616 175431 206069 102718 169212 220472 198201 244918
4215 244918 175384 119521 174121 369160 506441 543981 553527 459398 344827 329174 297112
4204 297112 232113 369631 396938 272864 197691 90613 53557 147790 184319 52465 81701
4193 81701 99079 107834 153103 187503 176407 172695 180235 125354 117342 240958 297676 262338
4181B62338K7887M3970k4309N3408n1556m4453k3483l3589j2067K0414l5476J6885
4169A99969L0180p5373q7372L9052K7574l7044l1086o9820M6857l1624Q1156K1427
4157A13896N0500j9239k1650L335J2577j02115r022Q4972m7791l790k730p563
4145E1380O0886J8820K4790O1041m5164K759L8040p3247n6866p1622L2362r1602
4133d8423K2328M3312l5419M7230P8426J0365k8307P6387M0390k5162K9690k765
4121B08052P0397M6570k4953o1903P0674J19014N2675K5906K03374J30845N2486
4110H93137K8103o6460j0016k2845m1539j08022J9212q1149k3237j38009j947
4099D47228J6258J65872P6861K149J41459J03045M5044J7521J05936Q8771J15848
$$ plain form
4181 262338 290225 334195 309886 363294 311738 267285 243802 210213 198146 218560 183084 199969
4169 199969 230149 154776 67404 106456 134030 96986 65900 -3920 42937 11313 92469 113896
4157 113896 164396 145157 123507 126842 139419 37304 28282 113254 65463 61673 58943 51380
4145 51380 112266 131086 155876 216917 171753 174512 212552 139305 82439 10817 43179 -48423
4133 -48423 -26095 17217 -18202 29028 107454 117819 89512 165899 206289 181127 210817 208052
4121 208052 278449 325019 300066 238163 308837 427851 480526 506432 709806 840651 893137
4110 893137 921240 854780 844764 821919 780380 672358 691570 610421 587184 449175 447228
4099 447228 463486 629358 706219 708368 849827 952872 997916 1015437 1121373 1210144 1325992
4088A325992K01988J42254K57259N01960P30987J356536J913354K117340J469283
4079A0016953K16666m87541r71820j252907j291115j191211j003087q65652m36594
4070B733692k40555l02946j59282q8948j08781k21503j24782p1265J0228J8025
4060A443883p6181M4802j5477j05993p9172j39238q4221n4420j17594k16403p9977
4049E20009J03831L3290L5436p1548m0702m7955l9459J5654m4797p4753o7710
4038C21296J6225K9459q0985q6305Q8915j7559l6542p5137K821J02983J3500O4808
4026C43479p8448r440Q6710r4069j27533M4410j90N7422p6586M7143n0311J7784
4014A60371k2693k6408P8375k008j8799o6022O5328p4272M879J2847L0782q9763
$$ plain form
4088 1325992 1527980 1670234 1927493 2429453 3160440 4516976 6430330 8547670 10016953
4079 10016953 10233619 9746078 8774258 7521351 6230236 5039025 4035938 3170286 2733692
4070 2733692 2493137 2190191 2030909 1941961 1833180 1611677 1486895 1415630 1425858 1443883
4060 1443883 1367702 1412504 1397027 1291034 1211862 1072624 988403 933983 816389 599986 520009
4049 520009 623840 657130 692566 621018 580316 532361 492902 508556 463759 389006 321296
4038 321296 337521 366980 285995 199690 288605 271046 234504 159367 162188 265171 278671 343479
4026 343479 265031 255591 342301 248232 120699 165109 164919 222341 145755 192898 142587 160371
4014 160371 137678 111270 189645 187637 168838 102816 168144 93872 98751 111598 142380 52617
4002E2617L8824N4794L9806O2310l5965M2235J1847p4382n4756n9946j445N8902
3990A34841P9352q4302m1705P1831K9082J160l0171p1102j01674k9099P713R7001
3978F2927J77735j698j04964j613j39240J3109J35987M1040n7122j2687j955q2831
3966B8688N4833J11110O1252p5634L1572k2830m3261N224P960j5942l9416o8924
3954C4632m7697Q4072q5094O5691J1413R355l9487j9510K8803M8350K5222n5032
3942F0718l4607J05125J09290m7013j0774o9033J00693M9925p4341K673J2494
3931B05150j08966l4910M8121L0302P3710r1714m8139q2875l8210J5907M3384
3920A1760j1899R1003l3537m8103M9711l7549k5814l8302O8938P7892K3187j9003
$$ plain form
4002 52617 91441 146235 186041 248351 212386 254621 266468 192086 137330 77384 75939 134841
3990 134841 214193 129891 88186 160017 189099 190259 160088 88986 -12688 -41787 -34074 62927
3978 62927 240662 238964 134000 132387 -6853 6256 142243 183283 126161 113474 111519 28688
3966 28688 83521 194631 255883 180249 211821 188991 145730 150954 158914 142972 103556 34632
3954 34632 -13065 71007 -14087 51604 63017 72372 32885 13375 42178 90528 115750 60718
3942 60718 26111 131236 240526 193513 182739 113706 214399 264324 189983 192656 205150
3931 205150 96184 61274 109395 139697 213407 121693 73554 -9321 -47531 -31624 11760
3920 11760 -139 90864 57327 9224 58935 21386 -4428 -42730 26208 104100 127287 108284
3908A08284R8361J13478o5787j07567l3542M7447j182p7430j2257K480P541p3688
3896F138j3311P9449M0956j160k67o9433k198l4755k9961N5628k5457q5926r664
3883h9961l1385N5356P0375Q0029J52899k8035j20675k4209k2616k7717K0441
3872C4502n3062M3004P6224o8994j5845M4244j2576r986L145j11949L1435R1741
3860E1883J0137r238L9859J11779o0454q7059j1518L9182m7551m749o3492j314
3848c2535J1405o4621N8939J10363O0533L66m6025J9028O3380q7979n692p4800
3836A2362k515j5437M6918O4230J01213m2961j2281l7649k7356l9845r69J1516
3824E7226j5950q3956n4617N8271M992j6321O8452k6008q332J09192o1894J2537
$$ plain form
3908 108284 206645 320123 254336 146769 113227 160674 159492 82062 69805 72285 79826 6138
3896 6138 -7173 72276 113232 112072 111805 42372 40174 5419 -24542 31086 5629 -80297 -89961
3883 -89961 -121346 -65990 4385 84414 237313 209278 88603 64394 41778 14061 34502
3872 34502 -18560 24444 100668 31674 15829 60073 47497 37511 40656 -71293 -39858 51883
3860 51883 62020 52782 92641 204420 143966 56907 45389 84571 37020 32271 -31221 -32535
3848 -32535 -21130 -85751 -26812 83551 144084 144450 98425 117453 180833 92854 87162 12362
3836 12362 9847 -5590 41328 105558 206771 163810 151529 113880 86524 46679 45710 57226
3824 57226 41276 -42680 -97297 -39026 -34034 -50355 18097 -7911 -16243 92949 31055 43592
3812D3592J07738J60043j51597p1109r8058o4328m9896O2375J27334K626m5130
3801B3590m7334M4231J25938J522j19219J2512O6729m6226m8519K4393K9857p5632
3789h158j5808M1769J04746j5134K3797l0013k7544L7249n560M911m8299M7438
3777A09394N5894o6485o3281k7441O2712R4869p8349j13682n495J2250N1857R5239
3765A27482N944K3115n6156M9798j15496n9888O2499N7843p227p4446m9178O5504
3753B9794J38248p808m4380l4050J00662J6488k8923j26323K5034Q5879k0379
3742A34242l2464O3646P7382j01979J3733p8266Q8421L5042J0029k6509p5982
3731A07295l2531m5264Q5501K3892J7374L8914K3365j83590L5251K7034m063O782
$$ plain form
3812 43592 151330 311373 159776 88667 -9391 -73719 -123615 -61240 66094 68720 23590
3801 23590 -23744 20487 146425 147947 28728 41240 107969 61743 13224 37617 67474 -8158
3789 -8158 -23966 17803 122549 107415 131212 101199 73655 110904 105344 110255 61956 109394
3777 109394 165288 98803 35522 8081 70793 165662 87313 -26369 -31864 -19614 32243 127482
3765 127482 133426 156541 100385 150183 34687 -25201 37298 95141 87914 13468 -35710 29794
3753 29794 168042 160234 115854 81804 182466 198954 170031 43708 68742 154621 134242
3742 134242 101778 165424 242806 140827 154560 76294 164715 199757 209786 183277 107295
3731 107295 74764 29500 115001 138893 156267 195181 218546 34956 70207 97241 93178 99960
3719I9960m5380n075K4805J12637k1226k728r981n772m5023m9857j4849R4Q2950
3706A20555O617k3830n7206P5289Q54k3892L832O126J4550o0093J7107Q1424m408
3693A56925p2290l926k4633J05737o7424J1152l9571P0459o7041j36505R7819
3682C0702q014M6132K3734Q609l6828P4650j0964o0676k2689j14944k1379L9095
3670e2572M7940M3514N5262M8734m0056k3520j8274j4021j5174p9263J04967j2164
3658D5373k524O2819o2436K2154P6592r9319o1134L3573O2466P4120q0057k1251
3646E0376O234K5535N3055o2272M7506m29o8369j06872n9682J00475L3048K1258
3634C9863O0076Q640q792K8505j7077L1464j799l1477k1597K7479j2279J0509
$$ plain form
3719 99960 54580 49505 74310 186947 165721 162993 153012 147240 102217 52360 37511 37605 120555
3706 120555 127172 103342 46136 121425 122279 98387 102219 108345 122895 62802 79909 161333 156925
3693 156925 84635 80709 56076 161813 94389 105541 65970 136429 69388 -67117 30702
3682 30702 22688 68820 92554 101163 64335 138985 128021 67345 44656 -70288 -91667 -52572
3670 -52572 -4632 38882 94144 142878 102822 79302 61028 47007 31833 -47430 57537 45373
3658 45373 42849 105668 43232 65386 141978 42659 -18475 15098 77564 151684 71627 50376
3646 50376 56610 82145 135200 72928 120434 120005 51636 -55236 -114918 -14443 18605 39863
3634 39863 99939 108579 99787 128292 111215 142679 140880 109403 87806 115285 103006 113515
3622A13515l8043O411o3425k2111J6441k3823K0982N5376N2485r723M6735J3887
3610A68707j22772K7924O8316j06749l7434k4961n0390P4817K7242P0207p478
3599H7429M1434n1191K6276Q1359K188O7671p8163j45231j458J9704r6513O5803
3587A9308n2210Q7735L0018r0826J0765R4350m696J0571k3239P708m001p0962
3575A4521O1590r529K3023K577p5978J7834N1878O3458M5556L5845P1706l9482
3563B62999p3934p0411p6190K5925N7570L2451j03595r3934K8303K5100J04279
3552A18563J6312P1746r497k5860L8446M1664O9343j26293q3958j68781O886j1268
3540f2697J37086Q5513J4528M8004n3723k059p5381L6594O2341L3991j13775K7547
$$ plain form
3622 113515 75472 81883 18458 -3653 12788 -11035 9947 65323 117808 108085 154820 168707
3610 168707 45935 73859 142175 35426 -2008 -26969 -77359 -2542 24700 94907 87429
3599 87429 128863 77672 103948 185307 187495 255166 177003 31772 30314 50018 -46495 19308
3587 19308 -32902 54833 84851 -5975 4790 99140 94444 105015 81776 89484 85483 14521
3575 14521 76111 66582 89605 92182 16204 34038 85916 149374 194930 230775 302481 262999
3563 262999 189065 118654 42464 68389 125959 158410 54815 -39119 -10816 14284 118563
3552 118563 134875 206621 197124 171264 209710 251374 320717 194424 110466 -58315 -51429 -62697
3540 -62697 74389 159902 174430 222434 168711 166652 91271 127865 190206 224197 110422 137969
3528A37969j29957M1414L4452j2013P4629M5477Q9924l8791j22517M9148K6524
3517A96259k4236J03436l251L5218j9353N0583J609O536L8171o5276m8060m2410
3505B29226N1263J00480J4702R5969M8942N7517M6894N3112J27617R2739J49021
3494A067482M0695J22320R5172K02509J23516N2124Q9231k8224j10429r6682j39840
3483A417874j07168m9728j46159p6057m5776j7920P086M1768l4863J11540N9468
3472A160065p3108j6016M8784o205N8068J00672K36465J85135J28558K25667J45766
3461B193851K34403K08420K62673K33786J35420n9110m8311j61571k41369k80869
3451B477323j64646j30895j34914k05194k18430p0428j11347j09881j45599l5770
$$ plain form
3528 137969 8012 49426 83878 71865 146494 191971 281895 243104 120587 169735 196259
3517 196259 172023 275459 272208 307426 288073 338656 340265 346801 384972 319696 271636 229226
3505 229226 280489 380969 395671 491640 540582 598099 644993 698105 825722 918461 1067482
3494 1067482 1108177 1230497 1325669 1528178 1651694 1703818 1793049 1764825 1654396 1557714 1417874
3483 1417874 1310706 1260978 1114819 1038762 992986 975066 982152 1023920 989057 1100597 1160065
3472 1160065 1086957 1070941 1119725 1113520 1171588 1272260 1508725 1693860 1822418 2048085 2193851
3461 2193851 2428254 2636674 2899347 3133133 3268553 3209443 3161132 2999561 2758192 2477323
3451 2477323 2312677 2181782 2046868 1841674 1623244 1552816 1441469 1331588 1185989 1150219
3441A150219k7532L0622q0250j7995k5096j826k4605M2010P4557K14709J20702
3430A455515r976n9317K1696J64644K4458L3987k863M6593m2711k2249l3220j3012
3418A563545r2495k2847m7122j79181J0671r2817o775J4362R3248J6897j1711
3407A245775R727L4860J97958J69604N724J41490K86223K70329M19922N30623
3397C312235M89059L92808R0794j23614l33756m40113m15701m76826l06053k81242
3387A907591j84154j30568p7233j20926p0963p1462O45J3130L6325P7033L7050
3376A416468m5971L5207K4854O3833J89220J22456K15801L56747N00323O59676
3366C538614J129492J223223J089520O55887j6954l08785o30692q43517p63711
$$ plain form
3441 1150219 1122687 1153309 1073059 1055064 1029968 1028142 1003537 1045547 1120104 1334813 1455515
3430 1455515 1445539 1386222 1407918 1572562 1597020 1631007 1628144 1674737 1632026 1609777 1576557 1563545
3418 1563545 1471050 1448203 1401081 1221900 1232571 1139754 1132979 1147341 1240589 1257486 1245775
3407 1245775 1255502 1290362 1488320 1657924 1663648 1805138 2091361 2361690 2781612 3312235
3397 3312235 3801294 4194102 4284896 4161282 3827526 3387413 2971712 2494886 2188833 1907591
3387 1907591 1723437 1592869 1515636 1394710 1323747 1252285 1252930 1266060 1302385 1379418 1416468
3376 1416468 1370497 1405704 1430558 1494391 1683611 1806067 2021868 2378615 2878938 3538614
3366 3538614 4668106 5891329 6980849 7636736 7619782 7310997 6680305 5836788 5073077
3357E073077p84142p36285m79994n40980k98798k82702j36801r3908j46217j47568
3347A425682n1761q6227q5803l6973L0787O3164j9707k9011m7509R7167P5881
3336A335690K47206J81483L09961M43082N24808M95960K07741m743j74366k86313
3326C280509m22140m18919m43293l48439k73027k46304j28108j14433j07295j7012
3316G61539p4157m1724K3960k0864q716m3408j05985o8783j21166n3177J6896
3305B64415j5806R5063L3261M0970j9169K8059J1847p102m7146k2332j4577n2127
3293B95356j01746J6799k4643n3139j2651M2917R2402P2642R1634m3428j22187
3282B53956j54972j0636J3431m0844K8417M7118r7484m7148Q8607O9804L5250
$$ plain form
3357 5073077 4288935 3552650 3072656 2531676 2232878 1950176 1813375 1719467 1573250 1425682
3347 1425682 1373921 1287694 1201891 1164918 1195705 1258869 1239162 1210151 1162642 1259809 1335690
3336 1335690 1582896 1764379 2074340 2517422 3042230 3538190 3745931 3741188 3566822 3280509
3326 3280509 2858369 2439450 1996157 1647718 1374691 1128387 1000279 885846 778551 761539
3316 761539 687382 645658 669618 648754 640038 596630 490645 421862 300696 247519 264415
3305 264415 248609 343672 376933 417903 398734 426793 438640 431538 384392 362060 347483 295356
3293 295356 193610 210409 185766 132627 119976 162893 255295 327937 419571 376143 253956
3282 253956 98984 88348 101779 60935 89352 136470 38986 -8162 80445 150249 185499
3271A85499R487k7659m9168l4785m1472O731l967N0499Q719o3451L7139L404p8024
3258B952l1679R2647k789n824r913r548l8266O275N1195J267j4934l131L814J4736
3244E6802N2915j27367k2073r275N5798j0590k1771N2656k7812L6929K4147n3833
3232F526m2049R826n2697K3432O7566N0222j9928K9947o1276o8772Q7545L786
3220C4128j0915j24235J17614L6519q0577M7520K7879L0149p7055r3695j30453
3209b23121J6492J00632L6791K9441N3546j4112P3388k0336l1720m8590L523L6283
3197A2217K618M0815r7906j806j8245M7444L180j00584N9248J43337j489R207
3185I8036j00194l1051J0027J2409R4986O4873l5817r1721n0639p1094q78P5630
$$ plain form
3271 185499 194986 167327 118159 83374 41902 48633 44666 95165 103884 40433 77572 80976 2952
3258 2952 -28727 63920 61131 55307 45394 35846 -2420 3855 55050 56317 41383 38252 42066 56802
3244 56802 109717 -17650 -39723 -48998 6800 -3790 -25561 27095 -717 36212 60359 6526
3232 6526 -35523 -25697 -78394 -54962 12604 62826 42898 72845 11569 -57203 30342 34128
3220 34128 23213 -101022 16592 53111 -27466 20054 47933 78082 1027 -92668 -223121
3209 -223121 -206629 -105997 -69206 -39765 13781 -331 73057 52721 21001 -27589 -24066 12217
3197 12217 14835 55650 -42256 -44062 -62307 -14863 -11683 -112267 -53019 90318 88829 98036
3185 98036 -2158 -33209 -23182 -10773 84213 149086 113269 21548 -29091 -100185 -101063 -25433
3173b5433n6123P2764K3429j30502J01941k444M466N8296Q8693r5325L1507q6534
3161a5265m8041k9554k2855P296l2270L0849k523N4007J23005R6327o2324p8399
3149B0253k5243M2364m3918l6500Q311J6762M4492J2797l5481Q5600L5636J0531
3137A35604K4059m8845k328m8537q2833P5588k7687q3691J09269m7161P3530P6657
3125A53625l404p0014J0745l6181m9046P6349k1705M0098j8095L3702o7707J13002
3113A61369J4536R840j3824O3620P5196J989p65P873p9632j47412P3808q9720
3101G6878M6810M7715M0480j878N6946j13571K0381k7672k7663K7507o8679N7811
3089A35065K4861J6585k5711O6759L5935m8994O9208o9758o2955R6534q5056O3376
$$ plain form
3173 -25433 -81556 -8792 14637 -115865 -13924 -16368 -11902 46394 135087 39762 71269 -15265
3161 -15265 -63306 -92860 -115715 -108419 -140689 -109840 -112363 -58356 64649 160976 98652 20253
3149 20253 -4990 37374 -6544 -43044 -34733 -17971 26521 39318 3837 89437 125073 135604
3137 135604 159663 110818 108490 59953 -22880 52708 25021 -58670 50599 3438 76968 153625
3125 153625 150221 80207 90952 54771 5725 82074 60369 100467 82372 116074 48367 161369
3113 161369 175905 185745 171921 235541 310737 312726 311961 319834 240202 92790 166598 76878
3101 76878 123688 171403 211883 210005 266951 153380 173761 146089 118426 145933 77254 135065
3089 135065 159926 176511 150800 217559 253494 204500 273708 203950 140995 237529 152473 215849
3077B15849N7341L5150j61500L588M1724N5043N2984m1980j0879L0150J8315j14801
3065A80984k7548j1860J864j6022L9949P5428j0047j10482N0942o8470m9259j4597
3053D0882j6394Q5129P1330l9824l2391J0600J3804k2971r826R4077J8492p5552
3041A37356q1497L0651m0304N3644L4793l2144J4087O7376j13189l7049p4319
3030d0595L7229L3871p6732O3860L8464r383r122K7459j4754R470m2000m359L9912
3017E3320N0425j1699r8517m1555l1260O3447K7684N8257k3360P3026l0306j12287
3005b2825n086J0265o303O659M9235o6016K1081p3419J1837O1522N4444o2011
2993b0617J6486j6561J6616K7419O8359o2569j02603K0529n7305Q3460K0173j7931
$$ plain form
3077 215849 273190 308340 146840 150428 192152 247195 300179 258199 247320 277470 295785 180984
3065 180984 153436 141576 143440 127418 167367 242795 232748 122266 173208 104738 55479 40882
3053 40882 24488 109617 180947 141123 108732 119332 133136 110165 100339 194416 212908 137356
3041 137356 55859 86510 46206 99850 134643 102499 116586 183962 70773 33724 -40595
3030 -40595 -3366 30505 -46227 17633 56097 46714 37592 65051 50297 59767 17767 13408 53320
3017 53320 103745 92046 -6471 -48026 -79286 -15839 11845 70102 46742 119768 89462 -22825
3005 -22825 -27911 -17646 -23949 -17290 31945 -34071 -12990 -86409 -74572 -13050 41394 -20617
2993 -20617 -4131 -20692 -4076 23343 91702 29133 -73470 -52941 -110246 -26786 -6613 -24544
2981b4544M1821J4651k3727l9565P909P7009l82o4694m7472o2390L8804K3494
2969e9086l4940J19683j1888j22570K8457J10605J288J32573r37j55325n6900
2958d9040l4613j24135K4379J35615L0687O5500p2153m0348j8628K9958L2647
2947b0131n845j9768K5436q1316o5935k7247l8469J6480N6091J13033J02619N2914
2935A07862k6476j10638p6001K4372N5462N4276J8826l2517l5413r2992r432K5156
2923i7515R4893O322j8065o0967J2211R5237p5573j324o0734j41164P9098Q2834
2911h4747j8657P8699j0673o1879l990k1223K170J04073N2977l0543p5833j2340
2899h1966J21466p5859j0209k3924k6835l4223J7453O397L837J31911k4026m3158
$$ plain form
2981 -24544 17277 31928 8201 -31364 -23455 53554 53172 -11522 -58994 -121384 -82580 -59086
2969 -59086 -94026 25657 13769 -108801 -80344 30261 31549 164122 163185 7860 -49040
2958 -49040 -83653 -207788 -183409 -47794 -17107 48393 -23760 -64108 -82736 -52778 -20131
2947 -20131 -25976 -45744 -20308 -101624 -167559 -194806 -233275 -216795 -160704 -47671 54948 107862
2935 107862 81386 -29252 -105253 -80881 -25419 28857 47683 15166 -20247 -113239 -122671 -97515
2923 -97515 -2622 3700 -14365 -75332 -63121 32116 -43457 -44781 -105515 -246679 -167581 -84747
2911 -84747 -103404 -24705 -35378 -97257 -101247 -122470 -120300 -16227 36750 6207 -69626 -81966
2899 -81966 39500 -36359 -46568 -70492 -97327 -131550 -114097 -107700 -103863 28048 4022 -39136
2887c9136k8441m6296J2581K6442o2648J8218k8824L8010M9141K8223k7646P6894
2875A6518J25342o8992K8260m5399l0290M478n0874n2806q7367o1637L0912J51212
2863d0643L366R5389k5628p8490l5146K757L0743Q30m1193j5325Q5141K769n3707
2850f9137P8742J3784N922K7453J2393m5522j8203q1077p3901J44468J40390n0293
2838H5019n0936K6740k1075q2121o2450j1305Q1682m0587o3274J33085k3072J34338
2826A06044j3785j45739L8007j05798n254J5157L9404L7127k4072n7771M2030
2815g4650J0404P7757K8141o5415o7346l1231k4014m1376J31812p6684o5738M1874
2803a56466l0082O3025J70425N8463L2880j30133m8956p3504P7624J02744J3727
$$ plain form
2887 -39136 -67577 -113873 -101292 -74850 -137498 -119280 -148104 -110094 -60953 -32730 -60376 16518
2875 16518 141860 72868 101128 55729 25439 29917 -20957 -73763 -161130 -222767 -191855 -40643
2863 -40643 -37277 58112 32484 -46006 -81152 -78395 -47652 -46822 -88015 -103340 -18199 -15430 -69137
2850 -69137 9605 23389 29311 56764 69157 23635 5432 -75645 -149546 -5078 135312 85019
2838 85019 34083 60823 39748 -42373 -104823 -116128 -34446 -75033 -138307 -5222 -28294 106044
2826 106044 92259 -53480 -15473 -121271 -126525 -111368 -71964 -34837 -58909 -116680 -74650
2815 -74650 -64246 13511 41652 -23763 -91109 -122340 -146354 -187730 -55918 -132602 -198340 -156466
2803 -156466 -186548 -123523 46902 105365 138245 8112 -40844 -114348 -36724 66020 79747
2792G9747K8672m7547J0210k1762L506n9398M1544m3021m7505M5029O079Q0885
2780G6439q0287q5113n1380l917M080J8725r67Q6277J8255M86k0449K9263N4480
2767D5892J01108l2746j06772o081j04855P345J13463M2709q1795K7520m3170
2756c7382J6768O040N770R297r7971j7390o2597Q8978J13086k6757l163p348o0419
2743g3088q8031R7679J9079J2958p3187l0854N6348q598J48167n9659j05386L0930
2731g3642M7251K5883k0764n5424J55454l8079o9366j22347k4309N0236M8696
2720g6411J20245q2343O1891j68110j1638k6940O2322J43382p8714J7802k2468
2709f0982J6188o35J2862n1312q181M6419q492K9662k7276m5809J13346j782k3049
$$ plain form
2792 79747 108419 60872 71082 49320 52826 -6572 34972 -8049 -55554 -10525 -4446 76439
2780 76439 -3848 -88961 -140341 -144258 -140178 -121453 -122420 -36143 -17888 -17402 -37851 -8588 45892
2767 45892 147000 114254 7482 1401 -103454 -96109 17354 60063 -21732 5788 -37382
2756 -37382 -20614 -14574 -8804 493 -97478 -114868 -177465 -88487 24599 -2158 -5321 -12669 -73088
2743 -73088 -161119 -63440 -44361 -31403 -104590 -135444 -79096 -87694 60473 814 -104572 -73642
2731 -73642 -26391 -508 -21272 -76696 78758 40679 -28687 -151034 -175343 -125107 -76411
2720 -76411 43834 -38509 23382 -144728 -156366 -183306 -120984 22398 -56316 -38514 -60982
2709 -60982 -44794 -45429 -32567 -83879 -92060 -45641 -54133 -24471 -51747 -97556 15790 14008 -9041
2696i041l5721m0691J08601n929Q803m5061j7778K7602m5849k4305J05276M6112
2684G2019j33960K4618J8165m4735K4248L7622J8136m9143M7936j6908P819r3459
2672h7642L8455m6059k1072M3051l4122N5644q23P9989p0083j4058Q1538r5576
2660g0758R674M1837q9501l8613K8180K7173l6932J35922L3155k7713L391l5548
2648a9733p5573L4404n927j883J3685m325p022o5645R9056p861J4518J9605j8483
2635b5184o4958n5024p1588K154K6141O4369M3468n461J04827L7332k4943l4270
2623c137L2220L2020o0776m9480j4682j4782j03197J1513K5171P7553Q2642j2133
2611B932P494j0208q5236j04185J7977m9252Q3581N6578n9630l3349j2092P6800
$$ plain form
2696 -9041 -44762 -85453 23148 17219 26022 -19039 -36817 -9215 -55064 -79369 25907 72019
2684 72019 -61941 -37323 -19158 -63893 -39645 -2023 16113 -33030 14906 -2002 5817 -87642
2672 -87642 -49187 -95246 -116318 -73267 -107389 -51745 -52568 27421 -42662 -56720 24818 -70758
2660 -70758 -61084 -19247 -108748 -147361 -119181 -92008 -128940 6982 40137 12424 15815 -19733
2648 -19733 -95306 -60902 -66829 -68712 -55027 -59352 -66374 -132019 -32963 -40824 -26306 -6701 -25184
2635 -25184 -90142 -145166 -216754 -214600 -188459 -124090 -80622 -86083 18744 56076 31133 -3137
2623 -3137 29083 61103 327 -49153 -63835 -78617 -181814 -170301 -145130 -67577 15065 2932
2611 2932 10426 218 -85018 -189203 -171226 -220478 -136897 -80319 -139949 -173298 -185390 -108590
2599a08590M4984l355J04011K8877r9117R0831r1271J796K4763l4905J44628m2348
2587F0304q3676L4082l1624p1175j1335j12743J03641L5718q4012j96L5110M3753
2575h2153o7922L9194Q129J8935k3475N6954p9448M2501Q2425O204P5410n1623
2563B5131M157m3372L5297q7350l3816J01327l3077o0857l8385j7547j694k9199
2551a79385j3402J5511O634M7041J00608N485J8216m1867k4028o8786M3843J827
2539h8303j4592k0423M9156m2965m806j1862n2955J59261P244M9356J6991n7251
2527a1149k4251J2765n275j25528J11343M0299k8322l8105m0543N3385j0531o9131
2515a35043O5671k945j5996M5590k377m9945l4651M6594O2327O8089J9002q4492
$$ plain form
2599 -108590 -63606 -66961 37050 65927 -33190 57641 -33630 -31834 -7071 -41976 102652 60304
2587 60304 -23372 10710 -20914 -92089 -103424 -216167 -112526 -76808 -160820 -161016 -125906 -82153
2575 -82153 -150075 -110881 -102752 -83817 -107292 -50338 -129786 -87285 -4860 1344 76754 25131
2563 25131 29288 -14084 21213 -66137 -99953 1374 -31703 -92560 -130945 -148492 -150186 -179385
2551 -179385 -192787 -177276 -170642 -123601 -22993 -17508 708 -41159 -65187 -133973 -90130 -88303
2539 -88303 -102895 -123318 -74162 -117127 -121933 -133795 -186750 -27489 -20245 29111 46102 -11149
2527 -11149 -35400 -22635 -27910 -153438 -42095 -1796 -30118 -68223 -108766 -55381 -65912 -135043
2515 -135043 -69372 -72317 -88313 -42723 -45100 -95045 -129696 -83102 -20775 47314 66316 -18176
2503a8176m3008M4676m5873J5237P382R0565N9283q4196k9698k7550n8941J13983
2491B3684q7068k8463J6093r229m1594N9048M1887J6913Q1291o6516p8357K1284
2479e1027J9132K817J01156o2266j2704k7882l8652O1515J6143M1854j18086O9024
2467A024k6648K1644o009P2254m390j15293j4812l270Q6357l6760L8433p2524
2455e9994q38m9895K6425J29566L020l6695q6094n0571k6661P8232J4557l0536
2443h9484L3939n2955L5014J5914j4763N7194N8342p0460j2791j19493k2907n320
2431a87770P4180J3015J2978J85900j37709N345l8344P7018o5679L7553K3859
2420C46q9869K0354n7419M4879L7541O2140K3334J1266N6776K5264o8134j9222
$$ plain form
2503 -18176 -61184 -16508 -62381 -47144 -39762 50803 110086 25890 -3808 -31358 -90299 23684
2491 23684 -63384 -91847 -75754 -84983 -126577 -67529 -25642 -8729 72562 6046 -72311 -51027
2479 -51027 -31895 -29078 72078 9812 -2892 -30774 -69426 -7911 8232 50086 -68000 1024
2467 1024 -25624 -3980 -9989 62265 57875 -57418 -72230 -75500 10857 -25903 12530 -59994
2455 -59994 -60832 -110727 -84302 45264 48284 11589 -74505 -125076 -151737 -73505 -58948 -89484
2443 -89484 -55545 -108500 -73486 -57572 -72335 -15141 43201 -27259 -40050 -159543 -182450 -187770
2431 -187770 -113590 -100575 -87597 98303 -39406 -34061 -72405 4613 -61066 -23513 346
2420 346 -89523 -69169 -126588 -81709 -44168 17972 41306 52572 109348 134612 66478 47256
2408D7256q3550k2954j0101m2596K2086L4516O8452k8673K3465p7554L8184K5403
2396f066l1330M3548K4270P445j39764K3033o7086J02728Q3560j9125M468q472
2384A7209j5816p8795J936J2236N7680N0332o1196k3401k5250r150l333M762n129
2371g7915M1662k397j0190M6457P27L0333m4753P26N6909j9321J7122L9406j40270
2358f1504O4058m4152J8702J04977K4526R266o7478L2352n7227K6970J6979k1580
2346D5889P823p794n034M3179N207L78R8156P953K9817J8159O1035J9806M2002
2333C66576P0273j6496M3351N5179L2277j6949J23723R9202J97387K45605M80800
2322A680928P99072J051044J087303K31384k64513m45695o47765n62678o68969
$$ plain form
2408 47256 -36294 -59248 -69349 -111945 -89859 -55343 13109 -15564 7901 -69653 -31469 -6066
2396 -6066 -37396 6152 30422 37867 -101897 -78864 -145950 -43222 40338 21213 25681 17209
2384 17209 1393 -77402 -75466 -63230 -5550 44782 -16414 -39815 -65065 -74215 -77548 -72786 -77915
2371 -77915 -36253 -38650 -48840 -2383 -1656 28677 -16076 -15350 41559 22238 39360 78766 -61504
2358 -61504 2554 -41598 -22896 82081 106607 115873 48395 80747 23520 50490 67469 45889
2346 45889 53712 45918 40884 84063 89270 89648 187804 195757 225574 243733 304768 324574 366576
2333 366576 436849 420353 463704 518883 551160 534211 657934 757136 954523 1200128 1680928
2322 1680928 2480000 3531044 4618347 4849731 4585218 4139523 3491758 2929080 2260111
2313B260111m08101m23260l04423j82839j55359j48057j68658o7092L8063J2329
2303D52714j7359r7682j15462j7205k4409N6725o9230N68l5508j1921n5644J1954
2291G7541k6071l3661J5510j4790O8473k1465M034k6015J9516j9340K7637O0565
2279A31934l9577J4618q2648r0049M3924K3936m5241n0735Q1780l2599p7657L3660
2267h8654j7698J22875O5451m1426o661Q5660j7138j08102M839R5263m4744n4117
2255d452o9295M9793k2207N1724K1944j0699K1354m3994P7048j25063J15885l3415
2243B8623q1392n0622l3445N8865N178L3036k9385M6747P460O5283n6396O5548
2231E9500J6559j9038j08663j7923p611P1668L5358o7293n9396m4116L3744m9391
$$ plain form
2313 2260111 1852010 1428750 1124327 941488 786129 638072 469414 402322 440385 452714
2303 452714 435355 337673 222211 205006 180597 237322 168092 168660 133152 121231 65587 77541
2291 77541 51470 17809 33319 18529 87002 65537 69571 43556 63072 43732 71369 131934
2279 131934 92357 106975 24327 -65722 -21798 2138 -43103 -93838 -12058 -44657 -122314 -88654
2267 -88654 -106352 16523 81974 40548 33887 119547 102409 -5693 -854 94409 49665 -4452
2255 -4452 -73747 -23954 -46161 5563 27507 16808 38162 -5832 71216 -53847 62038 28623
2243 28623 -52769 -103391 -136836 -77971 -72793 -39757 -69142 -22395 -14935 50348 -6048 59500
2231 59500 76059 57021 -51642 -69565 -77176 -5508 29850 -37443 -96839 -140955 -107211 -156602
$$ [...]
##END NTUPLES=NMR SPECTRUM
##END=
