##TITLE=1H_CA-9411-1
 200.13MHz,CDCl3.
 8 sc
 
 25.12.2025
##JCAMPDX= 6.0         $$ Bruker NMR JCAMP-DX V2.0
##DATA TYPE= NMR SPECTRUM
##DATA CLASS= NTUPLES
##ORIGIN= UXNMR, Bruker Analytische Messtechnik GmbH
##OWNER= pz
$$ XWIN-NMR		Version 3.5
$$ Thu Dec 25 15:19:17 2025 Russian Standard Time (UT+4h)  she@DPX200
##.OBSERVE FREQUENCY= 200.1313
##.OBSERVE NUCLEUS= ^1H
##.ACQUISITION MODE= SIMULTANEOUS
##.ACQUISITION SCHEME= undefined
##.AVERAGES= 8
##.DIGITISER RES= 18
##SPECTROMETER/DATA SYSTEM= spect
##.PULSE SEQUENCE= zg30
##.SOLVENT NAME= CDCl3
##.SHIFT REFERENCE= (INTERNAL, CDCl3, 0, 15.4869)
##AUDIT TRAIL= $$ (NUMBER, WHEN, WHO, WHERE, WHAT)
$$ ##TITLE= Audit trail, XWIN-NMR		Version 3.5
$$ ##JCAMPDX= 5.01
$$ ##ORIGIN= Bruker BioSpin GmbH
$$ ##OWNER= she
$$ F:/spectra/data/she/nmr/H-C/1/pdata/1/auditp.txt
$$ ##AUDIT TRAIL=  $$ (NUMBER, WHEN, WHO, WHERE, WHAT)
(   1,<2025-12-25 15:17:20.48 +0400>,<she>,<DPX200>,
      <created by zg, POWCHK disabled, PULCHK disabled
       configuration hash MD5:
       00 E9 B6 7A A2 85 ED C7 34 08 36 98 17 FE 4E 26
       data hash MD5: 16K
       FA 3B 1A 92 6E 5A E0 8D D4 D7 23 F5 3C 5D D9 13>)
(   2,<2025-12-25 15:18:02.71 +0400>,<she>,<DPX200>,
      <Start of raw data processing
       efp BC_mod = 2 LB = 0.25 FT_mod = 6 PKNL = 1 PHC0 = -3707.695 PHC1 = 12.19231 SI = 16K 
       data hash MD5: 16K
       FD 52 F7 0D 13 2C 48 E4 BD 92 BF 8D 1E 95 04 31>)
(   3,<2025-12-25 15:18:22.07 +0400>,<she>,<DPX200>,
      <pk PHC0 = 2.170087 PHC1 = 0 
       data hash MD5: 16K
       5B 64 9C DB F3 3C 1A 5C 68 DC 04 CF 82 2E 40 75>)
(   4,<2025-12-25 15:18:25.92 +0400>,<she>,<DPX200>,
      <abs ABSG = 5 
       data hash MD5: 16K
       1F A4 69 9B 13 19 1A 62 CB 49 42 7E B2 CA AE 44>)
$$ ##END=
$$ 
$$ hash MD5
$$ A3 14 D0 E9 54 8D A3 3D 51 A0 49 47 CC 32 10 59
##$RELAX= 
##$RELAX= 
##$RELAX= 
##$RELAX= 
##$RELAX= 
##$RELAX= 
$$ Bruker specific parameters
$$ --------------------------
##$DU= <F:/spectra>
##$EXPNO= 1
##$NAME= <H-C>
##$PROCNO= 1
##$TYPE= <nmr>
##$USER= <she>
##$AMP= (0..31)
100 100 100 100 100 100 100 100 100 100 100 100 100 100 100 100 100 100 
100 100 100 100 100 100 100 100 100 100 100 100 100 100 
##$AQSEQ= 0
##$AQ_mod= 1
##$AUNM= <au_zg>
##$AUTOPOS= <>
##$BF1= 200.13
##$BF2= 200.13
##$BF3= 200.13
##$BF4= 200.13
##$BF5= 200.13
##$BF6= 200.13
##$BF7= 200.13
##$BF8= 200.13
##$BYTORDA= 1
##$CFDGTYP= 0
##$CFRGTYP= 5
##$CHEMSTR= <none>
##$CNST= (0..31)
1 1 145 1 1 1 1 1 1 1 1 1 1 1 1 1 1 1 1 1 1 1 1 1 1 1 1 1 1 1 1 1 
##$CPDPRG= <>
##$CPDPRG1= <>
##$CPDPRG2= <>
##$CPDPRG3= <>
##$CPDPRG4= <mlev>
##$CPDPRG5= <mlev>
##$CPDPRG6= <mlev>
##$CPDPRG7= <mlev>
##$CPDPRG8= <mlev>
##$CPDPRGB= <>
##$CPDPRGT= <>
##$D= (0..31)
0 0.7 0 0 0 0 0 0 0 0 0 0.03 0 0 0 0 0 0 0 0 0 0 0 0 0 0 0 0 0 0 0 0 
##$DATE= 1766661439
##$DBL= (0..7)
120 120 120 120 120 120 120 120 
##$DBP= (0..7)
150 150 150 150 150 150 150 150 
##$DBP07= 0
##$DBPNAM0= <>
##$DBPNAM1= <>
##$DBPNAM2= <>
##$DBPNAM3= <>
##$DBPNAM4= <>
##$DBPNAM5= <>
$$ [...]
##$SUBNAM3= <"">
##$SUBNAM4= <"">
##$SUBNAM5= <"">
##$SUBNAM6= <"">
##$SUBNAM7= <"">
##$SUBNAM8= <"">
##$SUBNAM9= <"">
##$SW= 18.0517328524113
##$SWIBOX= (0..15)
0 0 2 0 0 0 0 0 0 0 0 0 0 0 0 0 
##$SW_h= 3612.71676300578
##$TD= 16384
##$TD0= 1
##$TE= 0
##$TE2= 300
##$TE3= 300
##$TEG= 300
##$TL= (0..7)
0 120 120 120 120 120 120 120 
##$TP= (0..7)
150 150 150 150 150 150 150 150 
##$TP07= 0
##$TPNAME0= <>
##$TPNAME1= <>
##$TPNAME2= <>
##$TPNAME3= <>
##$TPNAME4= <>
##$TPNAME5= <>
##$TPNAME6= <>
##$TPNAME7= <>
##$TPOAL= (0..7)
0.5 0.5 0.5 0.5 0.5 0.5 0.5 0.5 
##$TPOFFS= (0..7)
0 0 0 0 0 0 0 0 
##$TUNHIN= 0
##$TUNHOUT= 0
##$TUNXOUT= 0
##$USERA1= <user>
##$USERA2= <user>
##$USERA3= <user>
##$USERA4= <user>
##$USERA5= <user>
##$V9= 5
##$VALIST= <valist>
##$VCLIST= <CCCCCCCCCCCCCCC>
##$VD= 0
##$VDLIST= <DDDDDDDDDDDDDDD>
##$VPLIST= <PPPPPPPPPPPPPPP>
##$VTLIST= <TTTTTTTTTTTTTTT>
##$WBST= 1024
##$WBSW= 4
##$XGAIN= (0..3)
0 0 0 0 
##$XL= 0
##$YL= 0
##$YMAX_a= 707865
##$YMIN_a= -712539
##$ZGOPTNS= <>
##$ZL1= 120
##$ZL2= 120
##$ZL3= 120
##$ZL4= 120
##$ABSF1= 15.49568
##$ABSF2= -2.55617
##$ABSG= 5
##$ABSL= 3
##$ALPHA= 0
##$AQORDER= 0
##$ASSFAC= 0
##$ASSFACI= 0
##$ASSFACX= 0
##$ASSWID= 0
##$AUNMP= <proc_1d>
##$AZFE= 0.1
##$AZFW= 0.1
##$BCFW= 0
##$BC_mod= 2
##$BYTORDP= 0
##$COROFFS= 0
##$CY= -3
##$DATMOD= 1
##$DC= 0
##$DFILT= <>
##$DTYPP= 0
##$F1P= 0
##$F2P= 0
##$FCOR= 1
##$FTSIZE= 16384
##$FT_mod= 6
##$GAMMA= 0
##$GB= 0
##$INTBC= 1
##$INTSCL= 3.241238e-09
##$ISEN= 128
##$LB= 0.25
##$LEV0= 0
##$LPBIN= 0
##$MAXI= 10000
##$MC2= 0
##$MEAN= 0
##$ME_mod= 0
##$MI= 1.114404
##$NCOEF= 0
##$NC_proc= -6
##$NLEV= 6
##$NOISF1= 3.799351
##$NOISF2= 2.8
##$NSP= 0
##$NTH_PI= 0
##$NZP= 0
##$OFFSET= 15.48687
##$PC= 1
##$PHC0= -3705.525
##$PHC1= 12.19231
##$PH_mod= 1
##$PKNL= yes
##$PPARMOD= 0
##$PSCAL= 0
##$PSIGN= 0
##$REVERSE= no
##$SF= 200.130006971307
##$SI= 16384
##$SIGF1= 3
##$SIGF2= 2
##$SINO= 0.751879
##$SIOLD= 32768
##$SREGLST= <19F.Aceton>
##$SSB= 0
##$STSI= 16384
##$STSR= 0
##$SW_p= 3612.71676300578
##$SYMM= 0
##$S_DEV= 0
##$TDeff= 16384
##$TDoff= 0
##$TI= <>
##$TILT= no
##$TM1= 0
##$TM2= 0
##$TOPLEV= 0
##$USERP1= <user>
##$USERP2= <user>
##$USERP3= <user>
##$USERP4= <user>
##$USERP5= <user>
##$WDW= 1
##$XDIM= 16384
##$YMAX_p= 529721057
##$YMIN_p= -1734326
$$ End of Bruker specific parameters
$$ ---------------------------------
##NTUPLES= NMR SPECTRUM
##VAR_NAME=  FREQUENCY,     SPECTRUM/REAL,   SPECTRUM/IMAG
##SYMBOL=    X,             R,               I
##VAR_TYPE=  INDEPENDENT,   DEPENDENT,       DEPENDENT
##VAR_FORM=  AFFN,          ASDF,            ASDF
##VAR_DIM=   16384,         16384,           16384
##UNITS=     HZ,            ARBITRARY UNITS, ARBITRARY UNITS
##FACTOR=    0.220516191357247, 1,           1
##FIRST=     3099.38736344163, 0,            0
##LAST=      -513.329399564151, 0,           0
##MIN=       -513.329399564151, -1734326,    0
##MAX=       3099.38736344163, 529721057,    0
$$ Real data points
##PAGE= N=1
##DATA TABLE= (X++(R..R)), XYDATA
$$ [...]
12093h8206o6338L3053N626m931j07469J10888K26484J8827j02850P7041Q5366
12082A87491j04358p4339P6060j05322j68469R2085J03379J4861o774Q3212N0872
12071A48698q5139j12244q692j04138L1719J32105q7830l0122Q8741n5543p6151
12060a58596j57390J86680J88286m7478j743m6760P7161J47214J0151j38281l8200
12049B1044J6509p8584j14592N5511N1994m816k1563Q9772P412P7389p6155p8985
12037e5064R8602L4006J4193P1849N4779j2077n8441l386R1231o1691n0982n2885
12025G0134o9120n3633o9980o4304Q7319l7726p9018K7527J95397O232O9188j15900
12013c3884j85577n3410q898R0541J27942J00184N1049n2793o6384J84849n8681
$$ plain form
12093 -88206 -154544 -121491 -115865 -120796 -228265 -117377 109107 127934 25084 102125 187491
12082 187491 83133 8794 84854 -20468 -188937 -96852 6527 21388 14614 97826 148698
12071 148698 63559 -48685 -57377 -161515 -129796 2309 -85521 -115643 -26902 -82445 -158596
12060 -158596 -315986 -129306 58980 11502 9759 -37001 40160 187374 197525 59244 21044
12049 21044 37553 -41031 -155623 -100112 -48118 -52934 -74497 15275 22687 100076 23921 -55064
12037 -55064 43538 77544 91737 163586 218365 206288 147847 144461 235692 174001 123019 70134
12025 70134 1014 -52619 -122599 -186903 -99584 -137310 -216328 -188801 6596 12828 82016 -33884
12013 -33884 -219461 -272871 -281769 -191228 -63286 36898 87947 35154 -31230 153619 94938
12002I4938n49P0429j2757M3258O3051l1879j16930o1059r4468n907j02935r0722
11990b45530J66322K1851O4027R9870O2539j26651j09339m4293r4472J8326p2406
11979b59756J23667J19244p5521R3030K48014n1790N0980m9779k4529p1804M1743
11968A43499o9096j61483P514j04351J11591J6908j0912J3548J6780l3166j00171
11957a69339p9451j1994o803J71901q0145J00559Q7726J9107n0492o6979K75377
11946A89467K1921q9330j4170J631r4631N2661n0469j70023q337l9723p0541Q9790
11934a81754Q0927m8947n5668q115N5029r4054j95406J29514J0906K48293J14300
11923E5025p3983J9343L8835k1636p8089N5284K09782l9286k51904O0059M743
$$ plain form
12002 94938 94389 164818 152061 195319 258370 226491 109561 48502 -45966 -51873 -154808 -245530
11990 -245530 -79208 -57357 6670 106540 169079 42428 -66911 -111204 -205676 -187350 -259756
11979 -259756 -136089 -16845 -92366 664 248678 196888 247868 198089 173560 101756 143499
11968 143499 74403 -87080 -79566 -183917 -72326 -55418 -66330 -52782 -36002 -69168 -169339
11957 -169339 -248790 -260784 -267587 -95686 -175831 -75272 12454 31561 -18931 -85910 189467
11946 189467 211388 122058 107888 109519 14888 67549 17080 -152943 -161280 -201003 -271544 -181754
11934 -181754 -100827 -149774 -205442 -213557 -158528 -252582 -447988 -318474 -307568 -59275 55025
11923 55025 -18958 385 39220 17584 -60505 -5221 204561 165275 -86629 -26570 -21827
11912b1827l6318j12052R8268Q3674q0708J43576P7633r8296O3171M0601j16909
11901D0813l3228m808N3341O3130o8466j3811P2983j92076j83295J12155j2406
11890a65668j082m8810L5235K0080L2780j58522j0425J5580m5978M0439J65075
11879a21296K13442N7710j85838j073j152q4429K8087j24353M545O2319k4456
11868a76494R661J9743j02897R0580J39931j70021O5027K00303j13516n6940j0633
11857a05256j06479R6910m1071m0959J28390k2037N0010J39146j05574J4096P7244
11846H4420n6753q4546j03064K41584J06774r083o1888K615L0793j28993o2974
11835d1115J87125p9101j09937j16918m4107P7482J6685m3661m8418Q3308J8380
$$ plain form
11912 -21827 -58145 -170197 -71929 11745 -68963 74613 152246 53950 117121 157722 40813
11901 40813 7585 2777 56118 119248 50782 36971 109954 -82122 -265417 -153262 -165668
11890 -165668 -166750 -215560 -180325 -160245 -127465 -285987 -296412 -280832 -326810 -286371 -121296
11879 -121296 92146 149856 -35982 -37055 -38207 -122636 -94549 -218902 -214357 -152038 -176494
11868 -176494 -166833 -147090 -249987 -159407 -19476 -189497 -124470 75833 -37683 -94623 -105256
11857 -105256 -211735 -114825 -155896 -196855 -68465 -90502 -40492 98654 -6920 7176 84420
11846 84420 27667 -56879 -159943 81641 188415 179332 117444 120059 150852 21859 -41115
11835 -41115 146010 66909 -43028 -159946 -204053 -126571 -109886 -153547 -201965 -118657 -100277
11824a00277J0633J80629n9280j67767j06073K184P1489j20572R4831l2165J13644
11813a12724J67645N9409l4826r9487J04663P791l5851p7618L9404Q8087r4914
11802A1579k3326m9144j40806j44516P7779L1704R4670n4487M5832M3150k60285
11791c67850j10191M4518J66926J54453L5769l9965M980J09868o9216K6510M4976
11780G78j29087l8541J06547L1931N0754k7398q4956O9233k5213J52182J30733
11769B36963j90126p6650L00568m937j6236n2618j38081r0255l5419o4613J17766
11758a3638N9866j89654n4245p9359O1626R1396n8580m993J09035N1762j6166
11747d2950k5258k66847j16241N6727k5802J34670J61971J21383P3772o0737O0808
$$ plain form
11824 -100277 -89644 90985 31705 -136062 -242135 -239951 -168462 -289034 -194203 -226368 -112724
11813 -112724 54921 114330 79504 -19983 84680 92471 56620 -20998 18406 106493 11579
11802 11579 -11747 -60891 -201697 -346213 -268434 -236730 -142060 -196547 -150715 -107565 -367850
11791 -367850 -478041 -433523 -266597 -112144 -76375 -116340 -111360 -1492 -70708 -44198 778
11780 778 -128309 -166850 -60303 -28372 22382 -5016 -89972 -20739 -45952 106230 236963
11769 236963 46837 -29813 270755 265818 249582 196964 58883 -31372 -66791 -131404 -13638
11758 -13638 46228 -143426 -197671 -277030 -215404 -124008 -182588 -187581 -78546 -26784 -42950
11747 -42950 -68208 -335055 -451296 -394569 -420371 -285701 -123730 -2347 71425 10688 71496
11736G1496j41620o8584M5587k1868P926J14107p2398k2454J76081n6675k03336
11725a71738J877J02579m8126O136J07837J8311l0937q7755l8736J2232o096J8394
11713a16022P2363Q9169P1044j40583K8107n558j153Q1118q8968q6979l3633P7936
11701e3159j10405K1328K4331q225o6388M6916K20290L7170L6132j4875L8964
11690A72079k6197r3995J8791J42582O8652L6392p6357k9902o6638k43688O282
11679i1999o1132l4232j17349Q5615J01544O026n2236j79201o905J79772o538
11668a76635N7770O3903M5331J50163J25968j11791r521n7209q713m3979O3404
11657I8691j06739o5726l3696j8903R5422j54380L8395L8837j99518l1256J23236
$$ plain form
11736 71496 -70124 -138708 -93121 -114989 -107063 7044 -65354 -87808 88273 31598 -171738
11725 -171738 -169861 -67282 -115408 -109272 -1435 16876 -14061 -101816 -140552 -128320 -134416 -116022
11713 -116022 -43659 45510 116554 -24029 4078 -1480 -2633 78485 -10483 -97462 -131095 -53159
11701 -53159 -163564 -142236 -117905 -126130 -192518 -145602 74688 111858 147990 133115 172079
11690 172079 145882 51887 70678 213260 281912 318304 241947 212045 145407 -98281 -91999
11679 -91999 -153131 -187363 -304712 -219097 -117553 -111527 -163763 -342964 -349869 -170097 -176635
11668 -176635 -118865 -54962 -9631 140532 266500 154709 145188 87979 79266 35287 98691
11657 98691 -8048 -73774 -107470 -126373 -30951 -185331 -146936 -108099 -307617 -338873 -215637
11646b15637j52839k2310P43J68321K42239M6975M0298k1088R0110o7930m5534
11635F3348j42548N0580J99641j16783r6334J24274R63k6874o6416o8725p7693
11624a56567o5469o4540P7996J85594j15126l0980N2145Q6292j66816r6343N8499
11613b35315J53691J05237J51766n2427j70883m422k4097q7432J24916l8006q0923
11602a57895L7773q5493p0396J4071m1086M9134n3951r0225P6087R6792O4811
11591a60378K4915j40j7403O6544p3485K40310M3670k12654j8672O5984r0593
11580a31902j21607k052P5694p5896M6781J80248j1719N6506J26841J6619k58640
11569i9127J174j5330K8568R5406l7130N5808P8128j20471j6578Q2236L3636K8903
$$ plain form
11646 -215637 -368476 -390786 -390043 -221722 20517 67492 107790 86702 176812 108882 63348
11635 63348 -79200 -28620 171021 54238 -42096 82178 83141 56267 -10149 -78874 -156567
11624 -156567 -222036 -286576 -208580 -22986 -138112 -169092 -116947 -30655 -197471 -293814 -235315
11613 -235315 -81624 23613 175379 122952 -47931 -52353 -76450 -163882 -38966 -76972 -157895
11602 -157895 -120122 -205615 -276011 -261940 -303026 -253892 -307843 -398068 -321981 -225189 -160378
11591 -160378 -135463 -135603 -153006 -86462 -159947 80363 124033 -88621 -107293 -41309 -131902
11580 -131902 -253509 -255561 -179867 -255763 -208982 -28734 -40453 16053 142894 159513 -99127
11569 -99127 -97953 -113283 -84715 10691 -26439 29369 107497 -12974 -29552 52684 86320 115223
11557A15223n1533M9987n9666r4442L1167j6866r6633m8548n9401M0248K25077
11546C4613r1772r8056Q2251o4292k0182J04770L5787m312q1566Q283J864K7892
11534f4720L6240J21437M1345l6744K21428N3722k10988k169l2329m5644J4788
11523I6366o8824k6248l2027j60421J28030J40288o2337j75426j21228J15804
11513a66023J76259k42850j6452O9248k0952O5837J0714K8916J77280l1869j30041
11502g9933K29130j83844j03051O2009N2464n2474R3391K9060m6629L5475J7237
11491E2835m730J41565k2568K9024j60283r4993K8856j4518r1269o9655M1493
11480a64243J44712N1251k38139K4948Q7932l4692r7480J36389Q7842M5715r8062
$$ plain form
11557 115223 63690 113677 54011 -40431 -9264 -26130 -122763 -171311 -230712 -190464 34613
11546 34613 -57159 -155215 -72964 -137256 -157438 -52668 -16881 -21193 -102759 -94476 -92612 -64720
11534 -64720 -28480 92957 134302 97558 318986 372708 161720 159551 127222 81578 96366
11523 96366 27542 1294 -30733 -191154 -63124 77164 14827 -160599 -281827 -166023
11513 -166023 10236 -232614 -249066 -179818 -200770 -134933 -124219 -95303 81977 50108 -79933
11502 -79933 149197 -34647 -137698 -75689 -23225 -75699 17692 46752 123 35598 52835
11491 52835 48105 189670 167102 196126 35843 -59150 -30294 -44812 -136081 -205736 -164243
11480 -164243 -19531 31720 -206419 -181471 -93539 -128231 -225711 -89322 -1480 44235 -53827
11469e3827l8454N4012o8909k2990R0786P1968r6837M4094l795j69114r5085O5396
11457b22755P1543q2297J27480J09451j93390J00658k2309q4054Q5083R1552n6272
11446g5310j10905j1703N3121j1735N9395K0479N8615j6706j2717J32740K9796
11435A15070L3419j17092o7720l1379j78958J8034j10674j11588L2033J47760
11425b71095n339n8860m5047J7170L2137J20401K13472j7924q4605o6925J40788
11414b5827M5215M0356p969J5668k2551N6301J44551o5968m1496o9562j62855
11403i4137j20956p89k9549o1227J38737P4988k8431P0249O4697r1571K5012j05266
11391a58243M3481k1896l3892J16948j28470L2015J99178M2962o6958j33696J34314
$$ plain form
11469 -53827 -92281 -38269 -107178 -130168 -39382 32586 -64251 -20157 -23952 -193066 -288151 -222755
11457 -222755 -151212 -233509 -106029 3422 -189968 -89310 -111619 -195673 -110590 -19038 -75310
11446 -75310 -186215 -197918 -144797 -156532 -97137 -76658 -18043 -34749 -47466 85274 115070
11435 115070 148489 31397 -36323 -67702 -246660 -228626 -339300 -450888 -418855 -271095
11425 -271095 -276434 -335294 -380341 -363171 -331034 -210633 2839 -15085 -99690 -166615 -25827
11414 -25827 19388 59744 51775 67443 44892 101193 245744 179776 138280 68718 -94137
11403 -94137 -215093 -215882 -245431 -306658 -167921 -92933 -121364 -51115 13582 -77989 -52977 -158243
11391 -158243 -114762 -136658 -170550 -53602 -182072 -150057 49121 92083 25125 -108571 25743
11380B5743O2991j24599j44916J11232J41489j58761Q1494L000j83805j04765
11370b90897J64687l3602o2513N6917q326n030o6517K4202L0610n6553Q9069M6782
11358a11171m0273R6837k2849q3443r8585J26864J0557K9007M5975P5348j37375
11347a09108j62150J38680j6115J05614Q9175J8544J8301j01938p8231j45312
11337b42540m6223k0790m3542N9867m6336p9597J19293P6352q9881J54476J23041
11326c5880n9822J5847j0886j03546N2223J40590o9816k9982l2001O3310J21076
11315E1113o4512j67377L5996R7029K0341l4706M4490J81181j43084j64503J10230
11304c3802J5799O1021j10178k37036n2917P920k0074R4009J20434r5611J01823
$$ plain form
11380 25743 88734 -35865 -180781 -69549 71940 -86821 -5327 -2327 -186132 -290897
11370 -290897 -126210 -159812 -222325 -165408 -173734 -178764 -245281 -221079 -190469 -247022 -157953 -111171
11358 -111171 -151444 -54607 -77456 -160899 -259484 -132620 -122063 -93056 -47081 28267 -109108
11347 -109108 -271258 -132578 -148693 -43079 46096 64640 82941 -18997 -97228 -242540
11337 -242540 -288763 -309553 -353095 -293228 -339564 -419161 -299868 -223516 -313397 -158921 -35880
11326 -35880 -95702 -79855 -90741 -194287 -142064 -1474 -71290 -101272 -133273 -69963 51113
11315 51113 -13399 -180776 -144780 -47751 -27410 -62116 -17626 163555 20471 -144032 -33802
11304 -33802 -18003 43018 -67160 -304196 -357113 -349193 -369267 -275258 -154824 -250435 -148612
11293a48612j02859Q5385n6083K7385K68729r1498j80M7373J11681P878l39542
11282a90343L74l9666r503L5453l8404K9479J18944J15740k2204m9052Q943q8356
11270a28595L269K6780l6037J13320k2401j31381r4133J88859R506P3940k1612
11259a8485r5260k2854n8548L5581q413l429R6571J4160j06850M529Q346r2954
11247b47606j25366L9649J74801K9563J18443l3903n5131J06792J70356j9808
11237A57790j03238N7196o0813j55944K5688J05386o0724n3720j03948j27972
11227c20299N0915J12001l1864K5002M9674K6630j46307O284N0237M7701J09402
11216b0624n5970j12854J12431J28833L096J7846j0546j5266Q2314k0025M302
$$ plain form
11293 -148612 -251471 -166086 -222169 -194784 73945 -17553 -17733 29640 141321 149199 -190343
11282 -190343 -189969 -229635 -239138 -203685 -242089 -212610 -93666 22074 -130 -49182 -40239 -128595
11270 -128595 -125326 -98546 -134583 -21263 -43664 -175045 -269178 -80319 -70813 3127 -18485
11259 -18485 -113745 -136599 -195147 -159566 -167979 -171408 -74837 -60677 -167527 -162998 -154652 -247606
11247 -247606 -372972 -333323 -158522 -128959 -10516 -44419 -99550 7242 177598 157790
11237 157790 54552 111748 50935 -105009 -79321 26065 -34659 -88379 -192327 -320299
11227 -320299 -269384 -157383 -189247 -164245 -114571 -87941 -234248 -227964 -177727 -130026 -20624
11216 -20624 -76594 -189448 -77017 51816 54912 72758 62212 46946 129260 109235 113537
11205A13537k31903m0202j202Q160q5287J46384O0195k16816J50332l7019l4116
11194a67937N2462N4066k26137j8743k7656J16466M6360O5692K4605j0183j20993
11183b11998J2061R025o7520K13080N7262k287o8605q524r3432r931J66149n0956
11171e5676q3949K9030J77115K3513r5932l237N9736N6390j02666L3236j01598
11160f4038j21422r408K4615K7131J9975p158o4937K1272O7777n5798j41181l4651
11148c37823J26430M6979O5145J2392q8959J20223J18733O060J2019Q6855o6735
11137A01319o167n1926q4384m6435j05741q9139J84461L9495r2143L091N0677
11126i6892J7687L5241k8454o1220j1387j87270Q4024J47806J1452j6917o4141
$$ plain form
11205 113537 -118366 -158568 -159770 -151610 -236897 -90513 -30318 -247134 -96802 -133821 -167937
11194 -167937 -115475 -61409 -287546 -306289 -333945 -217479 -171119 -105427 -80822 -91005 -211998
11183 -211998 -199937 -190912 -258432 -45352 11910 9623 -58982 -67506 -160938 -170869 -4720 -55676
11171 -55676 -139625 -110595 66520 90033 -5899 -9136 50600 106990 4324 37560 -64038
11160 -64038 -185460 -194868 -170253 -143122 -123147 -130305 -195242 -173970 -106193 -161991 -303172 -337823
11148 -337823 -211393 -164414 -99269 -86877 -175836 -55613 63120 69180 81199 168054 101319
11137 101319 95152 43226 -41158 -87593 -193334 -282473 -98012 -58517 -150660 -147569 -96892
11126 -96892 -79205 -43964 -72418 -133638 -145025 -332295 -248271 -100465 -89013 -105930 -170071
11115a70071J9659J54305n6137m5619R6262n6293p353m260j42235R5980j7091
11104a32853j12821m2510R5376k0779J00460J53000q079r8421n4119p9033k9555
11093b29334L3699m5070J45928j9833l9152p0631j00644O2821K05601m8302o1356
11082a66273J49396J40089j65420j83399l880l1766J51800K02199q9064J50791
11072A54473N198j84171L8314j52547o8041J37322J820j8458j6768o8327R4429
11061g6756j04156O3837P2041p2236k1852M7648m1189P9241L8653j0639J37584
11050A12176j0396k9632J13326p0523j3587l0857m7203R3209j605p9407O6287
11039A01788r2361j76294K5922j54929M3532j3988q9190J42289O2550j56330K18641
$$ plain form
11115 -170071 -150412 3893 -52244 -97863 -1601 -57894 -65247 -69507 -211742 -115762 -132853
11104 -132853 -245674 -288184 -192808 -213587 -113127 39873 31794 -66627 -120746 -199779 -229334
11093 -229334 -195635 -240705 -94777 -114610 -153762 -224393 -325037 -262216 -56615 -104917 -166273
11082 -166273 -16877 123212 -42208 -225607 -229487 -261253 -109453 92746 3682 154473
11072 154473 159671 -24500 13814 -138733 -206774 -69452 -67632 -86090 -102858 -171185 -76756
11061 -76756 -180912 -117075 -45034 -117270 -139122 -91474 -132663 -53422 -14769 -25408 112176
11050 112176 101780 72148 185474 114951 101364 70507 23304 116513 114908 35501 101788
11039 101788 9427 -166867 -140945 -295874 -252342 -266330 -355520 -213231 -150681 -307011 -88370
11028h8370O5754P0848r6243M1365l9290r0025j29479L1956K54660j67976J85530
11017C8730J34106j27267n4865l5615K469j32848k10J79959N1938o2201R713J94616
11005A98525L9381R462j00541p5496n2910j53968Q535J67361j04731R3741R7196
10994A26555p5358q3220p1550r666K4016K3739O9150P033M1264j79012q3055j27587
10982c37691P818J90991j41653M3575M0218K4313N0191k0578J28929N1026p2019
10971c4880j4096j2015l7093P088L9587n225j6558l1384J01692J8029j19616k1772
10959a26243M5283j16667j3047m1943q695o7640N2529O6658j11916m0610o4165
10948d26456m5078J60453p1715p4154K8369m479R0583M5277O5162R9500N4495
$$ plain form
11028 -88370 -22616 48232 -48011 -6646 -45936 -135961 -265440 -233484 21176 -146800 38730
11017 38730 172836 45569 -9296 -44911 -42442 -175290 -175500 4459 56397 -5804 3909 198525
11005 198525 237906 247368 146827 71331 18421 -135547 -127012 40349 -64382 29359 126555
10994 126555 51197 -32023 -103573 -113239 -89223 -65484 3666 10699 51963 -127049 -210104 -337691
10982 -337691 -329873 -138882 -280535 -236960 -196742 -172429 -122238 -142816 -13887 37139 -34880
10971 -34880 -48976 -60991 -98084 -90996 -51409 -56634 -73192 -104576 -2884 15145 -104471 -126243
10959 -126243 -80960 -197627 -210674 -252617 -261312 -328952 -276423 -209765 -321681 -362291 -426456
10948 -426456 -471534 -311081 -382796 -456950 -428581 -433060 -342477 -297200 -232038 -132538 -78043
10937g8043o8369m5339K18743J49200N9619p4539j69570P2569n7614K9914n9070
10926b2499j37251J754M6946Q7323Q1994j9478j41912L7558M2486n744M5445j0250
10914F372j8258n340n5835k6372N0985o5626l4120N778J0964Q6781J24144o5149
10902A4324m0280r2105n5153J26457L759o9672p3292K9373J13655j4289o8787
10891a26010k0673P2055P9232M6704o7966n2167R9073j00159L225O7197j5079
10880a4568O0537p5443j1826J0465R388j33774r228R095Q2937K9254K4172M179
10868a4812m3278J8690j09659l3018P2911K20449l2455o5925J1716Q1468o4903
10857D1184J8862L8252j04288M017J59256m0699q0275o2504q699R9602K1944R1021
$$ plain form
10937 -78043 -146412 -191751 26992 176192 235811 161272 -8298 64271 6657 36571 -22499
10926 -22499 -159750 -157996 -111050 -23727 58267 38789 -103123 -65565 -23079 -28823 16622 6372
10914 6372 -11886 -17226 -73061 -99433 -48448 -114074 -148194 -142416 -131452 -44671 79473 14324
10902 14324 -25956 -118061 -173214 -46757 -42998 -112670 -185962 -156589 -42934 -57223 -126010
10891 -126010 -146683 -74628 4604 51308 -16658 -68825 30248 -69911 -66686 511 -14568
10880 -14568 45969 -29474 -41300 -30835 -21447 -155221 -164449 -155354 -72417 -43163 -18991 -14812
10868 -14812 -58090 -39400 -149059 -182077 -109166 111283 78828 12903 24619 106087 41184
10857 41184 60046 98298 -5990 -1973 157283 116584 36309 -26195 -34894 64708 86652 177673
10845A77673J0361r9250j69876j12523J17848K3908j20816o1518J72961k8569
10835h9801M5934j32178k4447P1423j69851O8595J34713M4843n6965j392j13870
10824b22996m6287p3260p7700L2284m8343K8596J88386N0926j3424j70750j1047
10813c63615J19904O0210m565l0864j31968k5850J05745J01471O4282R2708m8528
10802f1070r7541P6935Q627J9964m949j77581r1483j7226o0162J05136L1161M8440
10790b19749K6783j76608n5625R0447j81452K0916J99520K3828O8163m9781O3187
10779a90371J26624m3953J32007q9454k4151J29517N43q7775j49620J30797k0038
10768h5874J2340l6902o4207R7075o2248j73845O1456j2263J32853n4302l5800
$$ plain form
10845 177673 188034 88784 -81092 -193615 -75767 -51859 -172675 -234193 -61232 -89801
10835 -89801 -43867 -176045 -200492 -129069 -298920 -230325 -95612 -50769 -107734 -109126 -222996
10824 -222996 -269283 -342543 -420243 -387959 -436302 -407706 -219320 -168394 -181818 -352568 -363615
10813 -363615 -243711 -183501 -188066 -218930 -350898 -376748 -271003 -169532 -105250 -12542 -61070
10802 -61070 -158611 -81676 -73049 -53085 -58034 -235615 -327098 -344324 -404486 -299350 -268189 -219749
10790 -219749 -192966 -369574 -425199 -334752 -516204 -495288 -295768 -271940 -203777 -253558 -190371
10779 -190371 -63747 -107700 24307 -65147 -89298 40219 40762 -47013 -196633 -65836 -85874
10768 -85874 -73534 -110436 -174643 -77568 -139816 -313661 -252205 -264468 -131615 -185917 -221717
10757b21717J21071N0886m2715p6738m44k1614J56254L0848J2468j01422o6688
10746a59811Q1949J11519j30834K4524q785l4704M0035L7377J91264n9688J3621
10735A06467J2365j7893k00091k40918K37780J42033k5731j6317N6221J19796
10725A73712l0331j00587l813n1865r0703m0157J69309P4372q7246j00899o0467
10714a48675j39805m5832L2223J17448L09474M8967k488q6813J2635M5020K8959
10703A71113J153k6870j40256O7924r07j55050J80623k0083j86380K1908J44631
10692E7806n4652j07955j57347J24627J5989j70789J29015J6168l1029J42391
10682c5776q5177j8680J84300m0315P1825J03029q0130r1517J062L9803O8111
$$ plain form
10757 -221717 -100646 -49760 -92475 -169213 -169657 -191271 -35017 -4169 8299 -93123 -159811
10746 -159811 -77862 33657 -97177 -72653 -81438 -116142 -76107 -38730 152534 92846 106467
10735 106467 118832 100939 -99152 -340070 -102290 39743 14012 -2305 53916 173712
10725 173712 143381 42794 38981 -12884 -103587 -143744 25565 99937 12691 -88208 -148675
10714 -148675 -288480 -334312 -302089 -184641 124833 173800 171312 84499 97134 142154 171113
10703 171113 172266 145396 5140 73064 72157 -82893 97730 77647 -108733 -86825 57806
10692 57806 3154 -104801 -262148 -137521 -121532 -292321 -163306 -147138 -178167 -35776
10682 -35776 -120953 -139633 44667 4352 76177 179206 99076 7559 8621 48424 116535
10671A16535m4268j35609j12517N3334m8064j7151p4628K7841L07651M6620q7269
10660C2475p7987j27762l8766p5110M6243J84309J33509J4097Q2308O7337k08466
10649C2187j18228j42116R643j45686L9180j4868j29416P5527N2205q367J28151
10638b21788k4969j05403J39685k282O4793M2679m9470o4337L742O396J04737
10627a06217N0989q1977N7900J8175l7372l7358m53P6365K8684j91692j19646
10616c42602L6980k5204j19656R4445Q6545k2456M1094J47556P7001n5336p0326
10605a51959l5628j29429n6268J1440P5852J12074P1765J48353J57824p4205l12378
10594a82559o3226j83664m6718O6207J13436J02549Q1778k9618R1094r6133m3253
$$ plain form
10671 116535 72267 -63342 -175859 -122525 -170589 -187740 -262368 -234527 73124 119744 32475
10660 32475 -45512 -173274 -212040 -287150 -240907 -56598 76911 91008 173316 240653 32187
10649 32187 -86041 -228157 -218514 -364200 -325020 -339888 -469304 -393777 -341572 -349939 -221788
10638 -221788 -246757 -352160 -212475 -214757 -149964 -107285 -156755 -221092 -217350 -210954 -106217
10627 -106217 -55228 -137205 -79305 -61130 -98502 -135860 -136313 -59948 -31264 -222956 -342602
10616 -342602 -305622 -330826 -450482 -356037 -269492 -291948 -250854 -103298 -26297 -81633 -151959
10605 -151959 -187587 -317016 -373284 -361844 -285992 -173918 -102153 46200 204024 129819 -182559
10594 -182559 -245785 -429449 -476167 -409960 -296524 -193975 -112197 -141815 -50721 -146854 -190107
10583a90107R7474j49871p3490p89P1467O2186j39614M2833K16391p627j25773
10572a96920J99616O5369k8161Q5466l7509L5473p1357r2732P3725n8687j42994
10561a68711l133j12872q546L9737Q6484m5952O5448n766L1098L4747p0994n7916
10549b16376k7636J79351j03575J53952K03753P7907M9294J33219p4334j10957
10539B64598J096k17414m1002j6719j871K4961J06889P0351M5284N0425n8189
10528B28409m6971K3476j7613n55K9028j19984J81785P3700k05136k20776p0750
10517a45387J46951J17686J2996k0835J16676o9794j12173k3650j1143p0521o7956
10506a27150j25111J23718K6311J10182J79435j00324N0345N7094R459o8824P130
$$ plain form
10583 -190107 -92633 -242504 -315994 -316783 -245316 -183130 -322744 -279911 -63520 -71147 -196920
10572 -196920 2696 68065 39904 125370 87861 123334 51977 -40755 32970 -25717 -168711
10561 -168711 -171844 -284716 -293262 -253525 -167041 -212993 -147545 -153311 -122213 -87466 -158460 -216376
10549 -216376 -244012 -64661 -168236 -14284 189469 267376 316670 449889 375555 264598
10539 264598 265694 48280 7278 -9441 -11312 13649 120538 190889 236173 286598 228409
10528 228409 181438 204914 187301 186746 215774 95790 277575 351275 146139 -74637 -145387
10517 -145387 1564 119250 132246 111411 228087 158293 46120 22470 11327 -59194 -127150
10506 -127150 -252261 -128543 -102232 7950 187385 87061 137406 194500 203959 135135 142265
10495A42265L0019j33613N7083Q6366O1191r2726k1755J23415N0387j22285j77488
10484B859j646j5051k51036j00510q186J25271J5207J48058l9284j06757K39789
10473H714n7559j3114R5178p6917j96152Q0367J43318j39067j18090J5612M9396
10462b08314P0058P3906M1529J81101L2100j13905m9570q4211L1851l4554L5083
10451b4926j71395j301J12123L9425n6018M3831Q5266j18181j36566O405j5916
10440b37253l6948j07172j07474J94796J39301l525J2234K1340n5313o6555J19963
10429a26606Q2744J06718Q418j6401k3158l1028m762L3866k0069k5939q3468q2514
10417a82199m3006m8378k1056J8050n2017j11252P7803o1467R7666m5111p3328
$$ plain form
10495 142265 172284 38671 95754 182120 243311 150585 128830 252245 302632 180347 2859
10484 2859 1213 -13838 -264874 -365384 -373570 -248299 -233092 -85034 -124318 -231075 8714
10473 8714 -48845 -61959 33219 -43698 -239850 -159483 -16165 -155232 -273322 -257710 -208314
10462 -208314 -138256 -64350 -22821 158280 190380 76475 26905 -57306 -25455 -60009 -24926
10451 -24926 -196321 -197622 -85499 -46074 -102092 -58261 27005 -91176 -227742 -221337 -237253
10440 -237253 -274201 -381373 -488847 -294051 -154750 -158275 -146041 -124701 -180014 -246569 -126606
10429 -126606 -43862 62856 71274 54873 31715 687 -4075 29791 9722 -16217 -99685 -182199
10417 -182199 -225205 -273583 -294639 -276589 -328606 -439858 -362055 -423522 -325856 -370967 -444295
10406d44295K66725J31294J0584L8788O3154k0451q2611O2097J12265j2203j54202
10395b8855P1604J35534L4318Q964j25755k00389j32513l1819J6267j25032n9328
10384d37004K01298J66368o8766Q1309P5218J13759J49085K1269M8587N6417j13851
10373B93689J18773P5888k8396P058j5764j8890o3780L4330k0337m0964M2027
10362C83634q658q6569m4646j37592K0121O2496J65491Q2125l6416O5247n940
10351D59293j82543J29538L7870n5736L9813R1597q7825L554M8138k3592N5939
10340E16046j67845j20482Q3156O436p5787l3153M8066M8625K2073N1464J85221
10329E63820j31935q1505j8704m7213J3328m1731R0112Q7386k8993k18213K2873
$$ plain form
10406 -444295 -177570 -46276 -35692 3096 66250 45799 -36812 25285 137550 125347 -28855
10395 -28855 42749 178283 212601 221565 95810 -104579 -237092 -268911 -252644 -377676 -437004
10384 -437004 -235706 -69338 -138104 -56795 18423 132182 281267 302536 351123 407540 293689
10373 293689 412462 488350 459954 467012 451248 432358 368578 402908 382571 341607 383634
10362 383634 374976 288407 243761 106169 126290 188786 354277 436402 399986 465233 459293
10351 459293 276750 406288 444158 388422 428235 519832 432007 435561 483699 460107 516046
10340 516046 348201 227719 310875 317311 241524 208371 256437 305062 327135 378599 563820
10329 563820 431885 350380 331676 284463 297791 256060 346172 433558 404565 186352 209225
10318B09225m2705n0628J05967J18825O1804o9463j66461J5186n7526p0713M1235
10307I4746M3033Q1039P384j53902P7112N1840J8832k0296n0776m1838O8741J31165
10295C07080n5007L2904q8453o4595l7968J03860P8955J5441J2811l6425Q9940
10284C58543o5534j80001o8250M9829j27556q5095K4766j09385j15200M7658Q3923
10273a86302L2859j34006n1997P1601m4390K7651J01095k7003m321N7027K07389
10262D9603M0362j17945O665P4424j7435j8539o1815K6225M3942L4171o246p7195
10250b3783Q0368N8928o0595j08465r2176l8954J44359j9191j58329j7815P0723
10239a64930Q9135j00798j97546K47812J80641m8687n1790O7482J0815J3834l190
$$ plain form
10318 209225 166520 115892 221859 340684 402488 333025 166564 181750 124224 53511 94746
10307 94746 137779 218818 226202 72300 149412 201252 220084 199788 149012 107174 175915 307080
10295 307080 252073 284977 196524 131929 93961 197821 276776 292217 305028 268603 358543
10284 358543 293009 113008 44758 94587 -32969 -118064 -93298 -202683 -317883 -270225 -186302
10273 -186302 -153443 -287449 -339446 -267845 -312235 -284584 -183489 -210492 -214813 -157786 49603
10262 49603 89965 -27980 -21315 53109 35674 17135 -44680 -18455 25487 59658 53412 -23783
10250 -23783 56585 115513 54918 -53547 -145723 -184677 -40318 -59509 -217838 -235653 -164930
10239 -164930 -75795 -176593 -374139 -126327 54314 5627 -46163 21319 32134 45968 42778
10228D2778K0682n3413r9360M5027P0498L8764N3542k9854j11798J35815R0099
10217B02780M8519q6237o5564O2889j10859n1184L2135N4371J5634O4804O4448
10206B31736n6702j59102N0699J04874m4598j86118j32332J12138J48868q8457
10196a8994j55638Q90k0668n3215j26403O0884J73431r7672k3974N2312j42750
10185c51797k4541m3712R2814L3377Q3269J06830J9963K29701L2448j13652Q440
10174G3140j09762Q867K7256L3342q8079q9413P2883M4090k8927m0387J57870
10163F0880j66168Q312Q8162O4458M4034p5150j79983R5331M1763j30791P3138
10152g6014Q7034j02447k2964K248m1657n4443j59293J1178K30541N1532J4061
$$ plain form
10228 42778 63460 10047 -89313 -44286 26212 64976 118518 88664 -23134 112681 202780
10217 202780 251299 165062 99498 162387 51528 344 32479 86850 102484 167288 231736
10206 231736 175034 15932 66631 171505 126907 -59211 -191543 -79405 69463 -18994
10196 -18994 -174632 -173742 -194410 -247625 -374028 -313144 -139713 -237385 -261359 -209047 -351797
10185 -351797 -376338 -420050 -327236 -293859 -210590 -103760 -83797 145904 178352 64700 73140
10174 73140 -36622 -27755 -499 32843 -55236 -144649 -71766 -27676 -56603 -96990 60880
10163 60880 -105288 -96976 -8814 55644 99678 24528 -155455 -60124 -18361 -149152 -76014
10152 -76014 11020 -91427 -114391 -112143 -153800 -208243 -367536 -356358 -125817 -74285 -60224
10141f0224M9925n8425J34606m3992M596m999L6037K09077r6485j16723P8563
10130A31956j35044k2654n0169j5771J00179O8983k9764P2740J45186r2855k10001
10119c7214r3960j1930J66938j47341r1417J32188m9123K8179J46895J67749n5284
10108A55680j02698q3309J27250J01290j12108J2217j02874n4196O0750j50736
10098a48734n2973Q2818J98081O5858J17515J4041P8421j26228o9687J77559K276
10087C38947N0675O1820J4067n6477J09007J5412r1060j7427J53032q3479j15589
10076C78928j4098J3454K646r7211q9796R1690l8998M9738q2670k353J09910q2860
10064B38380j21221l4041M9469l1114O7696k1636K0457J67304j1046j83330k315
$$ plain form
10141 -60224 -10299 -68724 65882 21890 26486 21487 57524 266601 170116 53393 131956
10130 131956 -3088 -25742 -75911 -91682 8497 77480 47716 120456 265642 172787 -37214
10119 -37214 -131174 -143104 23834 -123507 -214924 -82736 -131859 -103680 43215 210964 155680
10108 155680 52982 -30327 96923 198213 86105 98322 -4552 -58748 2002 -148734
10098 -148734 -201707 -118889 79192 145050 262565 276606 355027 228799 159112 336671 338947
10087 338947 389622 451442 465509 409032 518039 533451 442391 424964 577996 494517 378928
10076 378928 364830 378284 380930 283719 193923 285613 246615 296353 213683 211330 321240 238380
10064 238380 117159 83118 132587 101473 169169 147533 167990 335294 324248 140918 138603
10053A38603o5784J31794m9366K799L6751K6546p3588L0768J416j14984M4425
10042A09380J30462L6291n9184L7263J08532K9709k35538j60398K565j7637r3141
10031a11696J28458J13840k5979r4929o5008P9432O4994j16815n1311Q9164o7294
10020e7144l3046K4803n6179j5430q6373K9605M5710J74382j20074j75923j3396
10009b83065J01398M222j8195K02316Q6814r8356j27310P8038n5171J13718Q0371
9998H4780M3713K5655j12919L9394o7124M5261j02386n8243L3998j14150Q9497
9987i2524M9444m8353J55423M7417j79674p9868k0192l2890M6594j24383p7479
9976c56485J95620M8079k8062l1237m1354j0697m7122N035K27922N6783j43586
$$ plain form
10053 138603 72819 204613 155247 158046 194797 221343 147755 178523 179939 64955 109380
10042 109380 239842 276133 216949 254212 362744 392453 156915 -3483 -918 -18555 -111696
10031 -111696 16762 130602 104623 9694 -55314 24118 89112 -27703 -79014 10150 -57144
10020 -57144 -90190 -65387 -121566 -136996 -223369 -193764 -148054 26328 -93746 -269669 -283065
10009 -283065 -181667 -177445 -195640 6676 93490 -4866 -132176 -54138 -109309 4409 84780
9998 84780 128493 154148 41229 80623 13499 58760 -43626 -101869 -67871 -182021 -92524
9987 -92524 -43080 -91433 63990 111407 -68267 -148135 -168327 -201217 -154623 -279006 -356485
9976 -356485 -160865 -112786 -140848 -172085 -213439 -224136 -271258 -266223 -38301 18482 -125104
9965a25104P9685M5926M504r3197j16504O054J31278K5985n835L2212o949K54827
9953B32882O1957J27163j73758j89815L2260J1342n4617l8030Q8779J43334K0505
9942B62002n2764n087n189J838k272l2391p169j8264O4679j41301l0373l0225
9930C484o9369L27257M7949Q552o789o3983j11357J28314o8272Q0335J83295o6901
9918C92515q5456j28944j06091J61452R6083j70825K06432M3836J0858Q3333j07762
9907C95431j35371P5575j60557N4285J55444n5682Q8147M2887n9447J60023J58273
9896G19008l2046r1268k9921J1691k6720m5098n8951J86927j19072p1245K5796
9885D69101m2815j4408p2985N7733q3502R4764P0178j07745j09054J00421J18376
$$ plain form
9965 -125104 -45419 507 5011 -88186 -204690 -198636 -67358 -41373 -47208 -14996 -21945 232882
9953 232882 294839 422002 248244 58429 90689 102031 47414 9384 98163 241497 262002
9942 262002 209238 204151 198962 200800 198528 166137 158968 140704 205383 64082 33709 3484
9930 3484 -65885 261372 309321 317873 311084 247101 135744 264058 195786 276121 459416 392515
9918 392515 307059 178115 72024 233476 329559 158734 365166 409002 419860 503193 395431
9907 395431 260060 335635 175078 229363 384807 329125 417272 460159 400712 560735 719008
9896 719008 686962 595694 565773 577464 550744 505646 446695 633622 514550 443305 469101
9885 469101 426286 411878 338893 396626 313124 407888 478066 370321 261267 361688 480064
9874D80064P5613R9083O1182J6153j66535j53500k7153Q0103r1527K17701N0287
9863F41471r7570o8767j17774K4067N2228L3351r61J32016L7959j68700R77j76363
9851B91934k05400M1310n9291l068J53254q292J43342K7377j07146K0997l1659
9840B63358j092n8309k5191k7777o214j1052k8725O1374K9696k8674J7038K2046
9828B06478l6568O9431L8249k5047J9918M8465j93088k43539R0129J47343o4219
9817E7552J8908J2929j8539m8688K1594J1704J21022k2737p8289J02116j63925
9806A3647K02750j4733p1823O0628L1503N5929o0864N2004k8676k22562r9034
9795h1231J08189j52011j26223J06150m7423Q3846m9200j57619j50683j06356
$$ plain form
9874 480064 555677 654760 715942 732095 565560 412060 384907 465010 373483 591184 641471
9863 641471 543901 475134 357360 381427 433655 467006 466045 598061 636020 467320 468297 291934
9851 291934 86534 127844 68553 65485 218739 210447 353789 381166 274020 295017 263358
9840 263358 262266 203957 178766 150989 144775 133723 104998 166372 196068 167394 184432 206478
9828 206478 169910 239341 277590 252543 272461 320926 127838 -115701 -25572 121771 57552
9817 57552 76460 89389 70850 22162 43756 55460 176482 153745 75456 177572 13647
9806 13647 216397 201664 129841 190469 221972 277901 217037 269041 240365 17803 -81231
9795 -81231 26958 -125053 -251276 -145126 -192549 -108703 -157903 -315522 -466205 -572561
9785e72561l1821M3264Q3125j52944K2314K15964K35079m099r6267J56K11071
9774d6719M8416M1972J52846K4430m65N5596j24353q8874j13268j48194J20732
9763g7881n7605p3525m972J46213P5507l8293J5115J55126o4364p8226r1L5133
9751C2137L7757J41760M9695K4151Q6008n8223j7609j22947j77433J24158o7658
9740E1796j65309J66445J14476j9969K6667J42965K0436J09372j09423j8807J71697
9729D90346L7672O576R1237j39589k11270J64163q3385j8953P7962q5637N6807
9718C85929R1811k7983K2207Q6464l533j66893l5621M3782J56158k1j10346M4418
9706D86372N0044O4756N5592m8191K8813J80589j79358k1395k6312o1896J55700
$$ plain form
9785 -572561 -604382 -561118 -477993 -630937 -608623 -392659 -157580 -161679 -257946 -257790 -46719
9774 -46719 1697 43669 196515 220945 220480 276076 151723 62849 -50419 -198613 -77881
9763 -77881 -135486 -209011 -213983 -67770 7737 -30556 -15441 139685 75321 -2905 -2996 32137
9751 32137 69894 211654 261349 285500 371508 313285 295676 172729 -4704 119454 51796
9740 51796 -113513 52932 167408 147439 174106 317071 337507 446879 337456 318649 490346
9729 490346 528018 534594 625831 486242 274972 439135 355750 336797 414759 329122 385929
9718 385929 477740 449757 471964 558428 554895 388002 352381 396163 552321 552300 441954 486372
9706 486372 536416 601172 656764 608573 637386 817975 638617 617222 590910 529014 684714
9695F84714j19792l6614P4938N0938m828J6287K494L6503j74011M1406K25375
9684G97410j53163j57597J03716K1598J19853J15682j04365J19217K5400l1840
9674H55911K1777j431j08346n2974l9726p334l611N0145K269k5873l3724n7092
9662E99991j3164O5610M4774j06978m0984k13034j96932P0129p2061q6934J20632
9651A71049R1440l7831M9635J87105n0125j23523q4859K186J06958j1334L9165
9640C39866P4134q2087j05785q6707J32902J00595J534Q8112j40150J0636j62070
9629A70980k07187L5401J10836L4163j83535J06930k5509n3616K12112j60085
9619D0490q119J28305M8059q9714M8592q4473N0018J37041K2534J03999p1038
$$ plain form
9695 684714 564922 528308 603246 654184 649356 665643 668137 704640 530629 572035 797410
9684 797410 644247 486650 590366 611964 731817 847499 743134 862351 887751 855911
9674 855911 877688 876257 767911 714937 675211 667877 664266 714411 716680 690807 657083 599991
9662 599991 586827 652437 697211 590233 549249 336215 139283 209412 137351 50417 171049
9651 171049 262489 224658 274293 461398 411273 287750 202891 205077 312035 300701 339866
9640 339866 414000 331913 226128 139421 272323 372918 374452 462564 322414 333050 170980
9629 170980 -36207 -806 110030 144193 -39342 67588 42079 -11537 200575 40490
9619 40490 32371 160676 208735 119021 167613 83140 133158 270199 292733 396732 325694
9608C25694q6007n4032q8376L7796p1060N1485J26666j67990q7645O5890O4583
9597A17004j6028J01317k780N0954J46508K6877K585k0652K49J64158L1562l7618
9585E64136j10877j29101r0307l7526O0915J95994J93379N5920L574j21391n9452
9574E25264k5433O6770J953N1534j6583P5283M3502J0348L2614O5781N230m2610
9562G93653K886n094j37781j29606J01543R1998J26007O7478N9378k2466j59192
9551G88804o7668r849j1395M9539J51284J00431J48260J19560j45325o800k4198
9540A092643J08185N8856L0265R8881N723j50008q8961L91J5900K1828M6238j02134
9528A137807P3518j4488J8761J61585L784N035J62495O4698n867j61662o8626
$$ plain form
9608 325694 239687 185655 97279 135075 64015 115500 242166 74176 -13469 52421 117004
9597 117004 100976 202293 199513 250467 396975 423852 426437 405785 406034 570192 601754 564136
9585 564136 453259 324158 233851 196325 257240 453234 646613 702533 706107 584716 525264
9574 525264 499831 566601 568554 620088 603505 678788 722290 732638 765252 831033 836263 793653
9562 793653 796539 791445 653664 524058 625601 717599 843606 911084 970462 947996 788804
9551 788804 721136 711287 699892 749431 900715 1001146 1149406 1268966 1123641 1116841 1092643
9540 1092643 1200828 1259684 1289949 1388830 1394553 1244545 1155584 1155975 1171875 1193703 1239941 1137807
9528 1137807 1211325 1196837 1215598 1377183 1380967 1386002 1548497 1613195 1607328 1445666 1377040
9517A377040P2249k9149r9576J12961J86587R9674J04174P2757M4600O7352n4876
9506A953793n2140q6160p1140R2158m5601P7410J26284L4998k6262j22723j68579
9495A712038l6885M416n555l634N0523j05054r3474J1444j15522j369Q2946p8029
9483A421845m8656j28245M8215m1923j41182k2082k0104Q1799K28409Q2913M436
9472A465425J65366k7620l0617k1223J30317j2565r7987J08421m2368k22783k39498
9461A174868o5708J94537J5883o096O8001m4894M6461j03069l0455Q7432j06571
9450A230389j52170N2063N8937j8404j9770n4109J27261J81714k02797k527j8207
9439A182380j05052J19555Q344n6805J47450K5900J5557P0542q898k4500r58q8646
$$ plain form
9517 1377040 1449289 1420140 1320564 1433525 1620112 1719786 1823960 1896717 1941317 2008669 1953793
9506 1953793 1901653 1815493 1744353 1836511 1790910 1868320 1994604 2029602 2003340 1880617 1712038
9495 1712038 1675153 1679569 1674014 1670380 1720903 1615849 1522375 1533819 1418297 1416928 1499874 1421845
9483 1421845 1373189 1244944 1293159 1251236 1110054 1087972 1067868 1149667 1378076 1460989 1465425
9472 1465425 1630791 1603171 1572554 1551331 1681648 1669083 1571096 1679517 1637149 1414366 1174868
9461 1174868 1109160 1303697 1319580 1313484 1381485 1336591 1383052 1279983 1249528 1336960 1230389
9450 1230389 1078219 1130282 1189219 1170815 1151045 1096936 1224197 1405911 1203114 1200587 1182380
9439 1182380 1077328 1196883 1205227 1148422 1295872 1321772 1337329 1407871 1398973 1374473 1373515 1284869
9427A284869K2840J51839r1620q6463P0749M9177j58254j11632J25145K21335
9417A477985J890p7841j2885p5795J1117P3516k5138L5531Q4985j08978J5196
9406A399583l9360j1237K35959J05049k01800j8015J42331O5270j47617l5023
9396A495140M3431K3198l9012L6765O2408J46232J92831Q0482L9924J4493r6912
9385A998980p9007J79334J08239J70599J27682J07181m4567n2669J01487O3289
9375B680548j02921J47482J06300j09017j04307M0138J21636L0105m0774K476
9365B771666P4301J94374J09218j21206N5527n6915k5155N8198J8817L6623k8014
9354C087434J17052J48472J3454J1276K33102K21463M246m0263p719r3020L590
$$ plain form
9427 1284869 1307709 1459548 1367928 1281465 1352214 1401391 1243137 1131505 1256650 1477985
9417 1477985 1479875 1402034 1389149 1313354 1324471 1397987 1372849 1408380 1493365 1384387 1399583
9406 1399583 1360223 1348986 1584945 1689994 1488194 1470179 1612510 1677780 1530163 1495140
9396 1495140 1538571 1561769 1522757 1559522 1621930 1768162 1960993 2041475 2081399 2095892 1998980
9385 1998980 1919973 2099307 2207546 2378145 2505827 2613008 2568441 2515772 2617259 2680548
9375 2680548 2577627 2725109 2831409 2722392 2618085 2658223 2779859 2809964 2769190 2771666
9365 2771666 2845967 3040341 3149559 3028353 3083880 3026965 3001810 3060008 3078825 3115448 3087434
9354 3087434 3204486 3352958 3366412 3377688 3610790 3832253 3836499 3796236 3788517 3695497 3699087
9343C699087K2591M1534L0149q7881N4432M8855j8661o6977R411o2713k16119
9332C453708J16620K71230O7876k8093k0160m9547J51452J87911O2627J35443
9322D349067j5148P189J09690N1821J817P4702L4607J19086O20l2835J57172k889
9310D854899m8687l1191K8057j56896o6694l7783J83571M397j38734M5008p3252
9299D562695j4243l2928O6955L572Q2475J28386J53075j6625J3707O4324J15893
9288E127286J45783Q476p4985O6936M3658k21766N9297R2445J7022M2162P7505
9277E383819j30898o3109j98407O4780N3947j9865j19631l3222j23640r5422j5365
9266D702987j62616l7540j3891k9779L23619L8222j38736p9775q618q7265L2326
$$ plain form
9343 3699087 3721678 3763212 3793361 3705480 3759912 3808767 3790106 3723129 3732540 3669827 3453708
9332 3453708 3570328 3841558 3909434 3881341 3861181 3811634 3963086 4150997 4213624 4349067
9322 4349067 4333919 4341108 4450798 4502619 4504436 4579138 4613745 4732831 4733451 4700616 4857788 4854899
9310 4854899 4806212 4775021 4803078 4646182 4579488 4541705 4725276 4729673 4590939 4635947 4562695
9299 4562695 4548452 4515524 4582479 4586051 4668526 4796912 4949987 4933362 4947069 5011393 5127286
9288 5127286 5273069 5281545 5206560 5273496 5317154 5095388 5154685 5247130 5264152 5306314 5383819
9277 5383819 5252921 5189812 4991405 5056185 5110132 5090267 4970636 4937414 4813774 4718352 4702987
9266 4702987 4540371 4502831 4488940 4459161 4782780 4821002 4682266 4602491 4593873 4506608 4538934
9255D538934J21147r3475P6061r3811L4792k0246l5170j635N2537J20209J21806
9244D821149j6334m682P2063O6723N0455J24317j10281r3781Q9047L2524q8539
9233D942661j3333k37014J40182K7756j10669m6560J62508J6161N992k9723M0058
9222D898019J23731l3222j17752j54902J1290R8045J74739N5109M7269L433m1266
9211E064493j485P2343L7985O2103J2695N6817J38272L2710j01291r0760K8588
9200E312470J27006J4909j0525J28328j9323j57032N6809J71878R5026K3834O1407
9189E804787P7322J8014n726L9700Q4083p9173J61472J35008N327J22320N8888
9178F422022j67123O6724N6622m7332J20924j0123J03384N6043J28406j4218Q7265
$$ plain form
9255 4538934 4660081 4566606 4642667 4548856 4583648 4563402 4528232 4526597 4579134 4699343 4821149
9244 4821149 4804815 4800133 4872196 4938919 4989374 5113691 5003410 4909629 4998676 5031200 4942661
9233 4942661 4929328 4692314 4832496 4860252 4749583 4703023 4865531 4881692 4887684 4857961 4898019
9222 4898019 5021750 4988528 4870776 4715874 4727164 4825209 4999948 5055057 5102326 5105759 5064493
9211 5064493 5063008 5135351 5173336 5235439 5248134 5304951 5443223 5475933 5374642 5283882 5312470
9200 5312470 5439476 5454385 5443860 5572188 5552865 5395833 5452642 5624520 5719546 5743380 5804787
9189 5804787 5882109 5900123 5894397 5934097 6018180 5939007 6100479 6235487 6240814 6363134 6422022
9178 6422022 6254899 6321623 6378245 6330913 6451837 6441714 6545098 6601141 6729547 6715329 6802594
9167F802594M3779N8909J80100l6346M4067J26201p4300r0942O6430Q9184J55646
9156G365322J11406J55855K48596O456l3104O8507J28988m790m57K56479J77208
9145H480466m0601J13138J15155M4674r8959J53818J46536M4300l8215J67316
9135I087628J92029L6043K37420J06263J09819L6326J14256M5086J31650J27329
9125A0223849L53049L51017O5168q0231O4775J50746P8138M6679J77992O0845
9115A1492027P9527K84083K63640K38402J41510L25946L57265J71354k0776J71357
9105A3504335K07747J96459J97767K23676M31883K83314J74980M83613L29152
9096A6032926J11126L81027M78800L52933J97755L76938M01544K09423K49457
$$ plain form
9167 6802594 6846373 6905282 7085382 7049036 7093103 7219304 7145004 7054062 7120492 7209676 7365322
9156 7365322 7476728 7632583 7881179 7887635 7854531 7923038 8052026 8047236 8046779 8303258 8480466
9145 8480466 8439865 8553003 8668158 8712832 8613873 8767691 8914227 8958527 8920312 9087628
9135 9087628 9279657 9315700 9553120 9659383 9769202 9805528 9919784 9964870 10096520 10223849
9125 10223849 10576898 10927915 10993083 10912852 10977627 11128373 11206511 11253190 11431182 11492027
9115 11492027 11571554 11855637 12119277 12357679 12499189 12825135 13182400 13353754 13332978 13504335
9105 13504335 13712082 13908541 14106308 14329984 14761867 15045181 15220161 15703774 16032926
9096 16032926 16144052 16525079 17003879 17356812 17554567 17931505 18333049 18542472 18791929
9087A8791929J53763L31955R7244K1904L98431L49350J33727M14337J67050J98038
9077B1057728L33738L92147M06603K61487L52901M30254M95620M52440N53335
9068B4736253O36517M03664N59161N12358M69680N87407O26188O50892Q47882
9059C0030002Q60318O64742Q15895J076987J085598R53561Q99201Q26269P97673
9050C8010246O44095R44542R67844J046824J307911J449772J500538J410092J320179
9041D8602043J489980J267619J097338J097106J241483J047005J133508J303897
9033E8279979J346468J507058J911258K095658K290837K098784J823984K019113
9025G3373139J738145J635996J946378K375866K620137L187119L710186M186810
$$ plain form
9087 18791929 18945692 19277647 19374891 19396795 19795226 20144576 20278303 20692640 20859690 21057728
9077 21057728 21391466 21783613 22190216 22451703 22804604 23234858 23730478 24182918 24736253
9068 24736253 25372770 25776434 26335595 26847953 27317633 27905040 28531228 29182120 30030002
9059 30030002 30890320 31555062 32370957 33447944 34533542 35487103 36386304 37212573 38010246
9050 38010246 38654341 39598883 40566727 41613551 42921462 44371234 45871772 47281864 48602043
9041 48602043 50092023 51359642 52456980 53554086 54795569 55842574 56976082 58279979
9033 58279979 59626447 61133505 63044763 65140421 67431258 69530042 71354026 73373139
9025 73373139 75111284 76747280 78693658 81069524 83689661 86876780 90586966 94773776
9017I4773776M431431M431165M919496N468378N831981O653630P330592Q063254
9009A41903703Q887395R602487J0835582J2150427J3717961J5089198J5338057
9002B27524810J4145298J1461161P697508L903686J059524l11714o37752k45904
8994B64596617J1210L50546J179418K461904L988943O539364J0107712J5299288
8986C04535002K1767971K9598644L7350903M2561263M1987588L3810556J8109130
8979E29721057j661194j8992384l0147777l4149869l2059408k6622061j9396109
8972C66692255j1996239n999613j637154L77300P39775L95512q0585j064503k017202
8963C45409546k968340l998696n320953o112508o063728m948040l260254q61697
$$ plain form
9017 94773776 99205207 103636372 108555868 114024246 119856227 126509857 133840449 141903703
9009 141903703 150791098 160393585 171229167 183379594 197097555 212186753 227524810
9002 227524810 241670108 253131269 260828777 264732463 265791987 265480273 264842521 264596617
8994 264596617 264607827 264958373 266137791 268599695 272588638 279128002 289235714 304535002
8986 304535002 326302973 355901617 393252520 435813783 477801371 511611927 529721057
8979 529721057 528059863 509067479 478919702 444769833 412710425 386088364 366692255
8972 366692255 354696016 348696403 347059249 347436549 348176324 348571836 348491251 347426748 345409546
8963 345409546 342441206 338442510 333121557 327009049 320945321 315997281 312737027 311875330
8955C11875330K002299N126972Q203265J1400496J4282321J7316737K0264251
8948C90471671K2891623K3448606K1586966J7624091J2725364Q957968O449706
8941E04155995N705972N762718M718347J616386l384558r471065j5266514j9783108
8933D74054173k2839102k4604608k5096755k4172342k2165782j9231604j6023258
8926C19920722j3467834j2164347j1182164r874510q229509o971113o187002n965920
8918B45878323n837760n588403n174464m621516m551294m376554n052493n939097
8910B04736742o501592o509005o439152o255398n707925m973280m303136l393452
8902A60653802k706722k210566k258836k886451l692223m674579n334483n574382
$$ plain form
8955 311875330 313877629 319004601 327207866 338608362 352890683 370207420 390471671
8948 390471671 413363294 436811900 458398866 476022957 488748321 497706289 504155995
8941 504155995 509861967 515624685 520343032 521959418 518574860 509103795 493837281 474054173
8933 474054173 451215071 426610463 401513708 377341366 355175584 335943980 319920722
8926 319920722 306452888 294288541 283106377 273231867 265002358 258031245 251844243 245878323
8918 245878323 240040563 234452160 229277696 224656180 220104886 215728332 210675839 204736742
8910 204736742 198235150 191726145 185286993 179031595 173323670 168350390 164047254 160653802
8902 160653802 157947080 155736514 153477678 150591227 146899004 142224425 136889942 131315560
8894A31315560n575114m896422m194375l255126k390891j951672j637728j626400
8886A05787832j994680k274378k277668j926549j812265j492700j030103r58854
8878I2020635p92051p39544q03912q23924j136420j271839j139543j209947j249340
8869H2854115j040720q13241n96448j4926J06897K18987M04526L54825M38433
8860H1912448L63404L66252N56084N46217O51661P91775Q47287R20155O74625
8851H7629908M62211O66650K92037J27018k4766j39809m25194m88053n64923m70337
8841H7064742l47250l69016r7137J22359K84619M26928N95458P31330P31116P87547
8831H9930696N17234N73767L03793J0059N2731k88062k74347k32849k75460k03059
$$ plain form
8894 131315560 125740446 120844024 116649649 113394523 111003632 109051960 107414232 105787832
8886 105787832 103793152 101518774 99241106 97314557 95502292 94009592 92979489 92020635
8878 92020635 91228584 90489040 89685128 88861204 87724784 86452945 85313402 84103455 82854115
8869 82854115 81813395 81000154 80403706 80388780 80495677 80714664 81119190 81474015 81912448
8860 81912448 82275852 82642104 83198188 83744405 84396066 85187841 86035128 86955283 87629908
8851 87629908 88092119 88758769 89050806 89177824 89153058 89013249 88588055 88100002 87535079 87064742
8841 87064742 86717492 86348476 86251339 86373698 86658317 87085245 87680703 88412033 89143149 89930696
8831 89930696 90447930 91021697 91325490 91335549 91388280 91100218 90825871 90593022 90317562 90114503
8821I0114503l61688n29647l15423o46995p74195p56848q36446q72183r59671
8812H4061407j101015j257292j367714j504016j568525j519847j674666j514982
8804G2553350j245092j220456j062267q19769p14684p07206o08385m49300n20119
8795F5206072q19911j153957j444273j661925j935625k345538k361443k416626
8787E1066774k680018k710338k353077k253342k227238j953203j881158j908488
8779C3099912j698179j466325j328034j406367j501662j138630j007154r61868
8771B2591693j022682r73366p57940o50198n52222n60833n39936o09971m58649
8762A6465896m91874o27100l95840l00255l12239m07042n83008l49726k56787
$$ plain form
8821 90114503 89752815 89223168 88907745 88260750 87486555 86729707 85893261 85021078 84061407
8812 84061407 82960392 81703100 80335386 78831370 77262845 75742998 74068332 72553350
8804 72553350 71308258 70087802 69025535 68205766 67491082 66783876 66175491 65726191 65206072
8795 65206072 64386161 63232204 61787931 60126006 58190381 55844843 53483400 51066774
8787 51066774 48386756 45676418 43323341 41069999 38842761 36889558 35008400 33099912
8779 33099912 31401733 29935408 28607374 27201007 25699345 24560715 23553561 22591693
8771 22591693 21569011 20595645 19837705 19187507 18635285 18074452 17534516 16924545 16465896
8762 16465896 15974022 15346922 14951082 14650827 14338588 13931546 13348538 12998812 12742025
8753A2742025n90521m08163l93201l87495l61661m21870l27988k94024k50962
8744I306140l16363j00357k61573k61036l0632r7587l60116o1463k54161k40931
8734G321921j42908k90370k72792Q126k02846j97628P9917j73752p3009j01779
8724E954880j15769l16815l56826q2881J51021k23664k38442O7650L3620j98759
8714D674015j32471j08907n6310j49197j79257L4767n9575k64684K2713N1934
8704C833028n2186J7819j13437o9241j17941o9279J45551k26579j56942J89234
8694C380027K51411n3133n892o2448j12654k16859q4258J68961N5850k16491m2047
8683C062467O7074l9085k08493j34466K5689K1491Q4294j44506R9440K5776q8651
$$ plain form
8753 12742025 12151504 11743341 11350140 10962645 10600984 10179114 9851126 9557102 9306140
8744 9306140 8989777 8889420 8627847 8366811 8336179 8238592 7878476 7817013 7562852 7321921
8734 7321921 7179013 6888643 6615851 6623977 6421131 6223503 6303420 6129668 6056659 5954880
8724 5954880 5839111 5522296 5165470 5082589 5233610 5009946 4771504 4839154 4872774 4674015
8714 4674015 4541544 4432637 4376327 4227130 4047873 4082640 4023065 3758381 3781094 3833028
8704 3833028 3780842 3798661 3685224 3615983 3498042 3428763 3574314 3347735 3190793 3380027
8694 3380027 3631438 3578305 3572413 3509965 3397311 3180452 3096194 3265155 3321005 3104514 3062467
8683 3062467 3129541 3090456 2881963 2747497 2773186 2794677 2878971 2734465 2833905 2859681 2771030
8672B771030l8212P3384l7986k68225n174O1668q0088j88769Q5581O3277j44218
8661B292268J80772J13118o4566p2002L9271N0523r9140k61515J45830J55248
8651B479807P1329Q002M6619J85522p1846N3500M595o4077J28814L6130M7500
8640B925895r9317j31142j08021O275p1912j97785m7017M2986O894r8128P01j4641
8628B214788p4271l202J13773M3204l4285j050J20766j3573l7172m8626R0501
8617B370853Q9616j25054j50751M2120N8855K3929J09696L3934j98708j62181
8607B092309j6313Q5103l5945j35250J19921k63305j61497j5969J8343j37529
8597A549868O4178m6255j5343q7845j20501J16834J10634j99171M8308r189J0932
$$ plain form
8672 2771030 2732818 2806202 2768216 2499991 2494817 2556485 2476397 2287628 2373209 2436486 2292268
8661 2292268 2473040 2586158 2521592 2449590 2488861 2539384 2440244 2178729 2324559 2479807
8651 2479807 2551136 2559138 2605757 2791279 2719433 2772933 2777528 2713451 2842265 2878395 2925895
8640 2925895 2826578 2695436 2587415 2593690 2521778 2323993 2276976 2319962 2326856 2228728 2229429 2214788
8628 2214788 2140517 2137315 2251088 2294292 2260007 2258957 2379723 2366150 2328978 2280352 2370853
8617 2370853 2460469 2335415 2184664 2226784 2285639 2309568 2419264 2453198 2254490 2092309
8607 2092309 2075996 2161099 2125154 1989904 2109825 1846520 1685023 1669054 1687397 1549868
8597 1549868 1614046 1567791 1552448 1464603 1344102 1460936 1571570 1372399 1420707 1411518 1422450
8586A422450m230n6353O9052q0093l4125R4332K9089j56421k8399Q0289L2709
8575A368300q8380O1491K4737J6410l9069p3296n8371j02097k1155Q7052j30831
8564A044791o627J6262p8813j5540K0467l30591M41J36300o3596k4025N7041J1035
8552G67145K8148j51046J0337J19396N7496q1664m1979q1224J883P2873K7248
8541G28613Q1872q9514p8932q5402Q2225n0175j39223M0669q2793k3904P8865
8530D62301n9859j00068K6223N0028j0013R2275j68826k0378J27039J2255R4806
8519E05783p9498l9429N992j132J72212Q9961O0373J22954k2927L4299N3064j12253
8507G89399j05007Q1080q9704n8511J01953J20883L0306j21715r4416J19696N1739
$$ plain form
8586 1422450 1418220 1361867 1430919 1350826 1316701 1411033 1440122 1283701 1255302 1335591 1368300
8575 1368300 1279920 1341411 1366148 1382558 1343489 1270193 1211822 1109725 1088570 1175622 1044791
8564 1044791 1038164 1054426 975613 960073 980540 649949 650390 786690 723094 699069 756110 767145
8552 767145 795293 644247 654584 773980 831476 749812 707833 626609 628492 701365 728613
8541 728613 810485 720971 642039 556637 638862 588687 449464 490133 407340 383436 462301
8530 462301 402442 302374 328597 378625 368612 460887 292061 271683 398722 410977 505783
8519 505783 426285 386856 392848 391716 563928 653889 714262 837216 814289 848588 901652 789399
8507 789399 684392 765472 675768 617257 719210 840093 870399 748684 654268 773964 825703
8496H25703k39010m9745R37r002N5177o993N4505k0348J15668m4749l9771n8423
8484E83949N002K503K5909n3097J4331l0735L8569k3225j47318j10944l7169J46253
8472D14028n5725k2445j0776j34519j14275J37883m8092j38467q7412o6426o7294
8461a93520J28388l46J5108n4710m5285k0516o3456j00538M0577k8624J5592n1793
8449c59123j18062R7568K27624R0831L6559k04090m3277P4552r182J20718j15361
8438b01243m9674O3714k83125O1710J1099j24399l8858N2706q361J16639j01364
8427e01156o1731P9260o8463J6083n9243O1581J9418J1692p2220J41388o9271
8416e02662j67152J03375K6952k17076K13062J54573k32569J44735M0317N789
$$ plain form
8496 825703 586693 536948 537885 528883 584060 577067 631572 611224 726892 682143 642372 583949
8484 583949 588951 591454 617363 564266 578597 547862 586431 563206 415888 304944 267775 414028
8472 414028 358303 335858 325082 190563 76288 214171 166079 27612 -59800 -126226 -193520
8461 -193520 -65132 -65478 -50370 -105080 -150365 -170881 -234337 -334875 -294298 -322922 -307330 -359123
8449 -359123 -477185 -379617 -151993 -61162 -24603 -228693 -271970 -197418 -206600 -85882 -201243
8438 -201243 -250917 -187203 -470328 -408618 -397519 -521918 -560776 -508070 -516431 -399792 -501156
8427 -501156 -562887 -483627 -552090 -536007 -595250 -533669 -514251 -502559 -574779 -433391 -502662
8416 -502662 -669814 -566439 -539487 -756563 -543501 -388928 -621497 -476762 -436445 -430656
8406d30656l5986k44012M553M9385j77772R3606J49968j54954r4193n3710r3225
8395i86996J93065J28609q1916J2428L3343Q6368N2395m1258o2907O1736M3732
8384e61401J60474o0911p7809O9514J71974o3823j90582K7055m8425N3083l309
8373e24160K5607n4776o5844o7082j25110R0533k1869Q8656K4380m0876R69n0476
8361g20048l6544J10921l7309j16486p8088M8060K38032J14024k4698O0928j1384
8350d52592L918j30505j18034J47017K6871k51220J02912J47969q4378L555k960
8339f07447P562J58839n1019j38296R7186p7358k31243Q9225L6040k9599J26336
8328f19774J71908j1014m0874k02326J24783L5833P6418L55708L3367j27253r1229
$$ plain form
8406 -430656 -466642 -710654 -706101 -656716 -834488 -740882 -590914 -745868 -840061 -893771 -986996
8395 -986996 -793931 -665322 -747238 -734810 -701467 -615099 -562704 -603962 -666869 -605133 -561401
8384 -561401 -400927 -461838 -539647 -470133 -298159 -361982 -552564 -525509 -573934 -520851 -524160
8373 -524160 -498553 -553329 -619173 -686255 -811365 -720832 -742701 -654045 -629665 -670541 -669572 -720048
8361 -720048 -756592 -645671 -682980 -799466 -877554 -829494 -591462 -477438 -502136 -441208 -452592
8350 -452592 -448674 -579179 -697213 -550196 -523325 -774545 -671633 -523664 -608042 -604487 -607447
8339 -607447 -599885 -441046 -492065 -630361 -533175 -610533 -841776 -752551 -716511 -746110 -619774
8328 -619774 -447866 -458880 -499754 -702080 -577297 -541464 -465046 -109338 -75971 -203224 -294453
8317b94453K2773J53335k9800m8669J83969P449k690k8079J44251m4007j77055
8306a12976k4130j824j38648j64584p4598M361Q0837P5589K1310R1581Q7108j0617
8294a66591l0965J0939n3885N6135N7762K10568Q4806J23274J96351k600j83703
8283C02091P101l9386m1687L556J92491j33974k41463m5076K25889N3557j98279
8272H4820j3243Q3392j43454k03846r223K3919m7716n9209M4720O4120m4961k53248
8260d73929N3232R2762m1993j0859R5341J36518R0344j7747j01003j83168M3097
8249c17405q719J2726K3359J17366J26562j57969j23352p8238n6699r4384k40354
8238g97107j27904J73873O4256Q885L9249j10834L50M8556J9933K07898L2038
$$ plain form
8317 -294453 -271680 -118345 -148145 -196814 -12845 -5396 -8086 -36165 108086 64079 -112976
8306 -112976 -137106 -138930 -277578 -442162 -516760 -512399 -431562 -355973 -334663 -243082 -155974 -166591
8294 -166591 -197556 -186617 -240502 -184367 -126605 83963 168769 292043 488394 485794 302091
8283 302091 309192 269806 228119 231675 424166 290192 48729 3653 229542 283099 84820
8272 84820 71577 154969 11515 -192331 -201554 -177635 -225351 -284560 -239840 -175720 -220681 -473929
8260 -473929 -420697 -327935 -369928 -380787 -285446 -148928 -58584 -76331 -177334 -360502 -317405
8249 -317405 -326124 -313398 -290039 -172673 -46111 -204080 -327432 -405670 -462369 -556753 -797107
8238 -797107 -925011 -751138 -686882 -677997 -638748 -749582 -749232 -700676 -680743 -472845 -440807
8227d40807q6070L972j44435N107j14005P4450J8142n7831P3742Q7189j478r0275
8215f72299J7008l1547j03261N966n4452M4270j8697j03413R7846O5442j17247
8204h70384K1171J01975n2017P5773o5876J02035L1994k52982O591p8723j23707
8193a104150k16095k96206N52966K33152M2233J98167K7994l12861j62790l0112
8183a067702m5153q2443r0568L6489J10219j61245N3929J04387n3653l3570k3872
8172a253182m6118m210j538M5573K4943j79546J1073M8114k0948L9093J05363
8161a231383J39583P6327j03087J68646r4750j02038j03393O8541k2643j2146
8151a216343j90662J10132J67705r5950j050Q9039l9639j18039Q5297j20243j90966
$$ plain form
8227 -440807 -526877 -522905 -667340 -662233 -776238 -701788 -683646 -741477 -667735 -580546 -582024 -672299
8215 -672299 -655291 -686838 -790099 -784133 -838585 -794315 -813012 -916425 -818579 -753137 -870384
8204 -870384 -849213 -747238 -799255 -723482 -789358 -687323 -655329 -908311 -901720 -980443 -1104150
8193 -1104150 -1320245 -1616451 -1063485 -830333 -788100 -589933 -561939 -874800 -1037590 -1067702
8183 -1067702 -1112855 -1195298 -1285866 -1249377 -1139158 -1300403 -1246474 -1142087 -1195740 -1229310 -1253182
8172 -1253182 -1299300 -1303510 -1305048 -1259475 -1234532 -1414078 -1403005 -1354891 -1375839 -1336746 -1231383
8161 -1231383 -1091800 -1015473 -1118560 -949914 -1044664 -1146702 -1250095 -1181554 -1204197 -1216343
8151 -1216343 -1407005 -1296873 -1129168 -1225118 -1226168 -1137129 -1176768 -1294807 -1209510 -1329753 -1520719
8140a520719K5469j78516J1918R1112O498J19844K0457k4532O3763K4499j51346
8129a511553q3172Q0555R655Q7003m7721N5074P0646n3215K34231j09340M0876
8118a226961M1209r4367J33840J74243j18745o9765m1825P0812l0019j2906N7179
8107a117305K12089m7334j48208J63798m2502k1131q8816q8346k8359L7244L2932
8096a135938P172j04425J63214K21747P04L0428N3988m6987o7067k09934m6237
8085a133335j7524Q2377M4388P487J45741Q6109m1238L4388L8181l2127j3286
8074g98839l7796j15148k2138K033P6080N3345L1734L0251K2639j00313J6407
8063h41745J42672j69897m026J95872j9110l2958o6715j52447N7607j0787M5421
$$ plain form
8140 -1520719 -1495250 -1673766 -1661848 -1570736 -1564238 -1444394 -1423937 -1448469 -1384706 -1360207 -1511553
8129 -1511553 -1594725 -1514170 -1504515 -1417512 -1465233 -1410159 -1339513 -1392728 -1158497 -1267837 -1226961
8118 -1226961 -1185752 -1280119 -1146279 -972036 -1090781 -1160546 -1202371 -1131559 -1161578 -1174484 -1117305
8107 -1117305 -905216 -952550 -1100758 -936960 -979462 -1000593 -1089409 -1177755 -1206114 -1168870 -1135938
8096 -1135938 -1128766 -1233191 -1069977 -848230 -847526 -817098 -763110 -810097 -877164 -1087098 -1133335
8085 -1133335 -1150859 -1068482 -1024094 -1016607 -870866 -784757 -825995 -791607 -753426 -785553 -798839
8074 -798839 -836635 -951783 -973921 -971888 -895808 -842463 -810729 -780478 -757839 -858152 -841745
8063 -841745 -699073 -868970 -872996 -677124 -696234 -729192 -795907 -948354 -890747 -901534 -856113
8052h56113J12397J04429K757L8777l5184n8939k8805j05887j1001J8615J9116
8041g99838J37098O6277P9549j9857J5330j66738K3836m8449p8740n5341K3531
8030h23342r6512k8799L8127n8796J61703J09945m1127j2704J16250l8852k1771
8019f95878j93947M474Q6465L6510Q2975O0918P0538L296p3931j29386K1382j90980
8007i17564P308J20628m7040q9111K6813j07261j51074j24372k7698J12694j30945
7996a327622n981K8162M3168P0893m776k5422J4323L0506j50161l043O4264J80759
7984a084930J42493p9804j62791l6972K3066Q6486J7461j10366O5796P6202j36777
7973a200136J64041k06j79480Q726J67488J48125j38367j61434j03676K6881N2546
$$ plain form
8052 -856113 -743716 -639287 -636530 -597753 -632937 -691876 -720681 -826568 -837569 -818954 -799838
8041 -799838 -662740 -596463 -516914 -536771 -521441 -688179 -664343 -712792 -791532 -846873 -823342
8030 -823342 -919854 -948653 -910526 -969322 -807619 -697674 -738801 -751505 -635255 -674107 -695878
8019 -695878 -889825 -885351 -798886 -762376 -679401 -618483 -547945 -544649 -618580 -747966 -726584 -917564
8007 -917564 -910256 -789628 -836668 -925779 -898966 -1006227 -1157301 -1281673 -1309371 -1196677 -1327622
7996 -1327622 -1333603 -1305441 -1262273 -1191380 -1196156 -1221578 -1207255 -1176749 -1326910 -1329953 -1265689 -1084930
7984 -1084930 -942437 -1022241 -1185032 -1222004 -1198938 -1112452 -1094991 -1205357 -1139561 -1063359 -1200136
7973 -1200136 -1036095 -1036301 -1215781 -1207055 -1039567 -891442 -1029809 -1191243 -1294919 -1268038 -1215492
7962a215492K6393O034r9675R4389J25272k98988j1146R5030P4115j14969o758
7951a325795J39403q2119q4386n0980j02365J1293j51609l9988J11644j11270
7941a686172m8154Q5627O6054m1328j7537M4403Q3258m452Q6384J64221L5931
7930a231765j05919M2940M5598j88653K79421R4876j38816N3629j4135q785Q8041
7919a083568j10335j2998J7633r3321P843k000J13835Q2309j66845R3128N6515
7908a097804j80223m380n1085r2637J07259j01575J10526K56380j51978q2905
7898a288422P5224J50845J39626J07561j09886p5376J153M531J93619k1272K04618
7887f17779L9782j23054k2691K5438p3895j28562l708L6872O2565J01018j14603
$$ plain form
7962 -1215492 -1189099 -1183065 -1282740 -1188351 -1063079 -1362067 -1373213 -1278183 -1204068 -1319037 -1325795
7951 -1325795 -1186392 -1268511 -1352897 -1403877 -1506242 -1494949 -1646558 -1686546 -1574902 -1686172
7941 -1686172 -1734326 -1648699 -1582645 -1623973 -1641510 -1597107 -1513849 -1518301 -1431917 -1267696 -1231765
7930 -1231765 -1337684 -1294744 -1249146 -1437799 -1158378 -1063502 -1202318 -1148689 -1162824 -1171609 -1083568
7919 -1083568 -1193903 -1206901 -1189268 -1282589 -1274746 -1276746 -1162911 -1080602 -1247447 -1154319 -1097804
7908 -1097804 -1278027 -1282407 -1333492 -1426129 -1318870 -1420445 -1309919 -1053539 -1205517 -1288422
7898 -1288422 -1213198 -1062353 -922727 -815166 -925052 -1000428 -999275 -994744 -801125 -822397 -617779
7887 -617779 -577997 -701051 -723742 -698304 -772199 -900761 -904469 -867597 -805032 -704014 -818617
7876h18617M480R5270m4330j74671j4424p403M9424o2234J65119K24584m6029
7865f28831j27445j3944k5203K1388J29041j24674J03059P5837J03063j36064
7855f23773l2707j19122j41681L023j7988m8326K6355l1515M302Q9802L1595Q107
7843h51928J69881P9666k9912j4391j13447O8134J65394r3219M8016M2494K6048
7832e03264j13480j20150m8573L1441j21019n0788M5685k7641j16152j11049J4592
7821a120398R6523m0437P0003J753q9456r0943p1480n5635J308J72676R2432N2529
7809i81125K02252N6608k17862R6463Q3898k1593o4470N938j00376k5853L4668
7798i31452k88286m4516Q2259J29546m7639P727N9701j13697n514j8799j4148
$$ plain form
7876 -818617 -814137 -718867 -763197 -937868 -952292 -959695 -910271 -972505 -807386 -582802 -628831
7865 -628831 -756276 -770220 -795423 -774035 -644994 -769668 -666609 -590772 -487709 -623773
7855 -623773 -656480 -775602 -917283 -914260 -932248 -980574 -954219 -985734 -981432 -891630 -860035 -851928
7843 -851928 -682047 -602381 -632293 -646684 -760131 -691997 -526603 -619822 -571806 -529312 -503264
7832 -503264 -616744 -736894 -785467 -754026 -875045 -925833 -880148 -907789 -1023941 -1134990 -1120398
7821 -1120398 -1023875 -1064312 -994309 -992556 -1082012 -1172955 -1244435 -1300070 -1298762 -1126086 -1033654 -981125
7809 -981125 -778873 -722265 -940127 -843664 -759766 -781359 -845829 -839891 -940267 -966120 -931452
7798 -931452 -1219738 -1264254 -1181995 -1052449 -1100088 -1092361 -1032660 -1146357 -1151871 -1170670 -1184818
7787a184818J0824j05864N1834J1424j04150L0427K906J12937O4233o5016j11408
7776a286671j0166J07493R8683M989J22428j74374j01237J9963j15267P0120j16516
7765a380555J38766K1646o7718n7604Q8873L6230P4455M8467j63498J05031O5709
7754a090198p7145R2951n5590j13901J76660o1496q6569J76299L6613o6143k7585
7743a096104n743O4800k6060j47925K40655J50292j11036Q8304n2319j09771k377
7732a007284M3201M2919J80505k12081J4620J11994k334r4099J6295l2796n6354
7721i95414m4587O667N1705l3948l3165L9418P9152o564J2656J65809J21291j12987
7709g49967K9816P6612J29249l7450J39751K02262k93806P1200m5203r2418o9222
$$ plain form
7787 -1184818 -1173994 -1279858 -1228024 -1216600 -1320750 -1290323 -1287417 -1174480 -1110247 -1175263 -1286671
7776 -1286671 -1296837 -1189344 -1090661 -1085672 -963244 -1137618 -1238855 -1218892 -1334159 -1264039 -1380555
7765 -1380555 -1241789 -1220143 -1287861 -1345465 -1256592 -1220362 -1145907 -1097440 -1260938 -1155907 -1090198
7754 -1090198 -1167343 -1074392 -1129982 -1243883 -1067223 -1128719 -1215288 -1038989 -1002376 -1068519 -1096104
7743 -1096104 -1101847 -1037047 -1063107 -1211032 -970377 -820085 -931121 -842817 -895136 -1004907 -1007284
7732 -1007284 -964083 -921164 -740659 -952740 -938120 -826126 -828460 -922559 -906264 -939060 -995414
7721 -995414 -1040001 -1033334 -981629 -1015577 -1048742 -1009324 -930172 -936736 -924080 -758271 -636980 -749967
7709 -749967 -720151 -643539 -514290 -551740 -411989 -209727 -503533 -432333 -477536 -569954 -639176
7698f39176K6427L7462n2178o6901J8903k6541j68553j03483l494N7599k4542
7687i44477n7978l0843J38938K808j98105J08210L5019m1965j21413n3221Q1637
7676a081390J06799O1070l3603J29968o9249n4066M2828k8129o2956j26912J39382
7665i76258J42832n1114Q541Q7800q8086k6389K80316K8528P018J6486j29241
7654f99567q4011p3457P588R3004N0962L7733n511k06490q1270p8042l4416o8151
7642a141628o1572J04212J00326R7008o8413j06838j2477k1570p0854K05742J61227
7631h14837Q1159n8849J35687p147l2069M2719J22476P8704o9435q9500K6794
7620e84298J0043k2403q4817n5803o256j47862j39814P1909Q1935J22267N1149
$$ plain form
7698 -639176 -612749 -575287 -627465 -694366 -675463 -702004 -870557 -974040 -977534 -919935 -944477
7687 -944477 -1002455 -1033298 -894360 -891552 -1089657 -981447 -946428 -988393 -1109806 -1163027 -1081390
7676 -1081390 -974591 -913521 -947124 -817156 -886405 -940471 -897643 -925772 -988728 -1115640 -976258
7665 -976258 -833426 -884540 -875999 -788199 -876285 -902674 -622358 -593830 -586812 -570326 -699567
7654 -699567 -783578 -857035 -849447 -756443 -705481 -667748 -673259 -879749 -961019 -1039061 -1073477 -1141628
7642 -1141628 -1203200 -1098988 -998662 -901654 -970067 -1076905 -1089382 -1110952 -1181806 -976064 -814837
7631 -814837 -733678 -792527 -656840 -663987 -696056 -653337 -530861 -452157 -521592 -611092 -584298
7620 -584298 -574255 -596658 -681475 -737278 -743534 -891396 -1031210 -959301 -877366 -755099 -703950
7609g03950L9914J016j59334l5228j1211R8204J37002J2532j00357j6773O3654
7598f74531n9938q3902r903Q8174J00299j11152r2834M803J5506r1159J7726O0873
7586h36038o2280K45371l7772R6381J32804n8300j28856n8454q3428J3422J31029
7575f46121L6914O8392l7512j43983Q8923K1772O0495j03712J1026m0915O7280
7564f17441J38521l4473n6925j09967l4400j07415J1753N9307N2809k340r0925
7553g91496m4437m8435j56971J6055J0098K20467K2993j816o0114j72384j3512
7542a019552N5145O7969m4536O1451l359M2610J02472j3275m8483K1107Q6637
7531f91814L7089J55227j9534L5080k828r3154M2339Q9725m4504J10318J2129
$$ plain form
7609 -703950 -664036 -663020 -822354 -857582 -868793 -770589 -633587 -621055 -721412 -738185 -674531
7598 -674531 -734469 -818371 -828274 -740100 -639801 -750953 -843787 -838984 -823478 -914637 -896911 -836038
7586 -836038 -898318 -652947 -690719 -594338 -461534 -519834 -648690 -707144 -790572 -777150 -646121
7575 -646121 -609207 -540815 -578327 -722310 -633387 -611615 -551120 -654832 -643806 -684721 -617441
7564 -617441 -478920 -513393 -570318 -680285 -714685 -822100 -810347 -751040 -698231 -700571 -791496
7553 -791496 -835933 -884368 -1041339 -1025284 -1015186 -794719 -771726 -773542 -833656 -1006040 -1019552
7542 -1019552 -964407 -896438 -940974 -879523 -882882 -840272 -737800 -751075 -799558 -778451 -691814
7531 -691814 -654725 -499498 -519032 -483952 -486780 -579934 -537595 -447870 -492374 -382056 -369927
7520c69927P316O7890O0823m6172j06931k08683L333j09233m7662l5873R026O7925
7508g08168p1489J501J32169k308j78325L7350M8349k5134L8181r6788m6458q230
7496h79350j70849J6100J53878K2603J40361K05656k3550N3006K6618j74854Q3571
7485e46810j3996k5595J27519j1817j10650R1029p2434k6083O4360n5691M7202
7474e32966N7278j29075n9236J26241J78711j06173j85768r0897N4801J58858
7464e28226J02193J06338N9181k629j31768o6645K3419L4390k9228J30443M6707
7453b55825L0636p5453o9775l769J58301R0716O9318l3718r4875J10484K533o0133
7441a31560m4233j70859M5455J41584M6732O2402j1687p8584Q0121j43045r7846
$$ plain form
7520 -369927 -362611 -294721 -233898 -280070 -387001 -595684 -592351 -701584 -749246 -785119 -776093 -708168
7508 -708168 -779657 -778156 -645987 -648295 -826620 -789270 -740921 -766055 -727874 -824662 -871120 -879350
7496 -879350 -1050199 -1034099 -880221 -857618 -717257 -511601 -535151 -482145 -455527 -630381 -546810
7485 -546810 -560806 -586401 -458882 -470699 -581349 -490320 -562754 -588837 -524477 -580168 -532966
7474 -532966 -475688 -604763 -663999 -537758 -359047 -465220 -650988 -741885 -687084 -528226
7464 -528226 -426033 -319695 -260514 -263143 -394911 -461556 -438137 -403747 -432975 -302532 -255825
7453 -255825 -225189 -300642 -370417 -374186 -215885 -125169 -55851 -89569 -184444 -73960 -71427 -131560
7441 -131560 -175793 -346652 -301197 -159613 -112881 -50479 -62166 -140750 -60629 -203674 -301520
7430c01520j55033M9019J09784L6680J41099L6413l4645L6968L6658Q6230Q8120
7419A29773l4464K9958l0241k3949J36520K1044r0450p9772q3127n636j25987
7408a56331p8620M0125m64j03733Q3579K662J611P4527j94685k11924J73600J07127
7396b62526p5688P5005J32335R6712M6060M9547N1570R2188n5007m3141k10209
7385a03154R6629r635l531J41946J32319J8150j20935l6909j94481j62426j11631
7374c53658j6398Q8506R9105L1553k9009n4769J5124j04806j55299Q5354q3787
7363d78084N1861k0986N3370R7591m2790m1756J15490M208l6350k6957p5454J23258
7351b76599O0280J55626M9867Q480l8002k1716j35766q5417J53808K4397r1863
$$ plain form
7430 -301520 -456553 -407534 -297750 -261070 -119971 -83558 -118203 -81235 -44577 41653 129773
7419 129773 95309 125267 95026 71077 207597 228641 138191 58419 -24708 -30344 -156331
7408 -156331 -234951 -194826 -195290 -299023 -215444 -212782 -211171 -136644 -331329 -543253 -369653 -262526
7396 -262526 -338214 -263209 -130874 -34162 11898 61445 113015 205203 150196 107055 -103154
7385 -103154 -6525 -16160 -19691 122255 254574 272724 151789 114880 -79601 -242027 -353658
7374 -353658 -370056 -281550 -182445 -150892 -179901 -234670 -219546 -324352 -479651 -394297 -478084
7363 -478084 -426223 -447209 -393839 -296248 -339038 -380794 -265304 -261096 -297446 -324403 -399857 -276599
7351 -276599 -216319 -60693 -10826 -2346 -40348 -62064 -197830 -283247 -129439 -105042 -196905
7340a96905m5147j14026J47038j08210j25167m727l4474k6781q4066k5626J2205
7329f05886n430N8427J92504J19465K4248J04663o3592j04066n9216j96309J38134
7318c97058R9813r7988J70557M9077N4034M8984l8090j13695N9303K10670Q3195
7307A28802n0468j39914m4211J10312p4446k9823l5747j8090K1918O3407j51908
7296b20168K8634O4554L3262J57352j21106j5282o8171j9299o409L7779R5163
7285c3691J61378R8828K6333k013l0654j55713J1633O1528P2158K7370O7867n8026
7273B46998Q1537K1416j8430J10740Q0208L4638j35937l5213j18767L630N6408
7262C27228J75023K93317N0704j01985K3343r2388o7873K4306Q4671M5222M9963
$$ plain form
7340 -196905 -242052 -356078 -209040 -317250 -442417 -447144 -481618 -508399 -592465 -618091 -605886
7329 -605886 -611316 -552889 -360385 -240920 -216672 -112009 -175601 -279667 -338883 -535192 -397058
7318 -397058 -297245 -395233 -224676 -175599 -121565 -72581 -110671 -224366 -165063 45607 128802
7307 128802 78334 -61580 -105791 4521 -69925 -99748 -135495 -153585 -131667 -68260 -220168
7296 -220168 -191534 -126980 -93718 63634 -57472 -72754 -140925 -160224 -166633 -128854 -33691
7285 -33691 127687 226515 252848 250835 220181 64468 76101 137629 209787 237157 305024 246998
7273 246998 328535 349951 331521 442261 522469 557107 421170 385957 267190 270820 327228
7262 327228 502251 795568 846272 744287 767630 675242 607369 631675 716346 761568 811531
7251H11531J4987M729j45160j21737Q4540R1529j04186O9981J72385Q1849J12893
7240A073341J28790J2249j21672r726P6594N340O5463N8207J09408P9674q0208
7229A397460J76859J54772K3764p5132J44932l6828j4380p8550j77094K2495j27127
7218A411171j36453k7819K3321o3317Q5670J32697J52714j08761p6662l3882J07066
7207A465745k880J15925J96066J30291j15850k3533J45607j11423N273N9030J54967
7196B019218J40087m151j17386j23382r1917O7945J25791J73560O1441K2642j12674
7185B161174m7069k8981J34856m740L3002O5658K81847J82912N9251J9426J3122
7174B870458n6944J70756J28961P6776R1485p1255L0264J45953N720O6718K58623
$$ plain form
7251 811531 826518 831247 686087 564350 648890 740419 636233 706214 878599 960448 1073341
7240 1073341 1202131 1214380 1092708 1082982 1159576 1164916 1230379 1288586 1397994 1477668 1397460
7229 1397460 1574319 1729091 1752855 1677723 1822655 1785827 1771447 1692897 1515803 1538298 1411171
7218 1411171 1274718 1246899 1270220 1206903 1292573 1425270 1577984 1469223 1392561 1358679 1465745
7207 1465745 1462865 1578790 1774856 1905147 1789297 1765764 1911371 1799948 1805221 1864251 2019218
7196 2019218 2159305 2155154 2037768 1914386 1822469 1890414 2016205 2189765 2251206 2273848 2161174
7185 2161174 2114105 2085124 2219980 2215240 2248242 2313900 2595747 2778659 2837910 2857336 2870458
7174 2870458 2813514 2984270 3113231 3190007 3281492 3210237 3240501 3386454 3392174 3458892 3717515
7163C717515J25525N1430J76760J53885J62152J70523J126J28808J05957J65546
7153D959227K56286J26646K40120L01256J84380L15421L10947J78096M10958M27260
7143G710597L06754L99790O34492M58188O51724O24945Q30751J087940Q34836
7134A3540017J033666J113309J351301J598317J713418J955276K528500K866059
7126B7699863L773318N136636P443220J1079726J5353415J8756547J9035155J4883031
7118A23160911N745614n688703j4348404j7351626j6143083j4742152j2569153
7111D8063404r729527p219605n231345l824322l019876k164619j592302j154721
7103A4127087j117255r35850r10584r68318o68266n49517o29329m90918m22289
$$ plain form
7163 3717515 3843040 3894470 4071230 4225115 4387267 4557790 4558916 4687724 4793681 4959227
7153 4959227 5215513 5342159 5582279 5883535 6067915 6383336 6694283 6872379 7283337 7710597
7143 7710597 8017351 8417141 9051633 9509821 10161545 10786490 11617241 12705181 13540017
7134 13540017 14573683 15686992 17038293 18636610 20350028 22305304 24833804 27699863
7126 27699863 31473181 36609817 44053037 55132763 70486178 89242725 108277880 123160911
7118 123160911 128906525 123217822 108869418 91517792 75374709 60632557 48063404
7111 48063404 38333877 31114272 25882927 22058605 19038729 16874110 15281808 14127087
7103 14127087 13009832 12073982 11163398 10195080 9526814 8977297 8347968 7857050 7434761
7094G434761m04973m34908n99944j42148m1589j27335k47867k49581j70079r6822
7084D919515n2895O6718l5626j14042j76786j13935p0636p6416l2604j2291j5028
7073D285974m627l8520m9249n7592q4576r8972p1209j9077m8633j0222Q2022N6302
7061C941621m5909R165J12153P7406k4884m428m586k04765j47802M9499p6055
7050C681415l929K5057O0305Q6794K4870j92310J5392J63978K1670P2061J85340
7039D140643o0800K1615J03081l0410K739k030K74248J74647P939J68635K20198
7028E020505J94818J21664n7684J37639K49303M6536K20044K97207L00603L73464
7018F904099K36519K18451M27537J93216K9973K41750J49773N245l5816L463J23276
$$ plain form
7094 7434761 7029788 6594880 5994936 5852788 5811199 5683864 5435997 5186416 5016337 4919515
7084 4919515 4866620 4933338 4897712 4783670 4606884 4492949 4422313 4345897 4313293 4301002 4285974
7073 4285974 4281347 4242827 4193578 4135986 4051410 3952438 3881229 3862152 3813519 3803297 3885319 3941621
7061 3941621 3895712 3904877 4017030 4094436 4069552 4065124 4060538 3855773 3707971 3757470 3681415
7050 3681415 3677486 3702543 3762848 3849642 3874512 3682202 3697594 3861572 3883242 3955303 4140643
7039 4140643 4079843 4101458 4204539 4174129 4176868 4174838 4449086 4623733 4631672 4800307 5020505
7028 5020505 5215323 5336987 5279303 5416942 5666245 5712781 5932825 6230032 6530635 6904099
7018 6904099 7140618 7359069 7786606 7979822 8009795 8251545 8401318 8406563 8370747 8374210 8497486
7007H497486J11854j92105K0642J7246O0001J28478J04350r0682J67410L34668
6997I159348J74068K26678M01594N12555O25693M40013P31607R21815P10913Q18655
6987A4722939J165935J156430J214335J274977J234440J308546J094632R13425
6979B4085659R10202Q22317O32580L46452m2817n74093q60610q92135j003951
6970B3423604p80442r05682o64572m96881l22568j98659R8536J23401M08627N78537
6960B1263901P58821Q65423R72068J288457J671062J848303K118119K329015K680598
6951C5795767K914693K984268L500882L799761L845399L483570L103665J883623
6943F1311628R13607l66133j474581k178192k722742k827261l111813k977971
$$ plain form
7007 8497486 8609340 8417235 8437877 8455123 8515124 8643602 8747952 8657270 8824680 9159348
6997 9159348 9333416 9560094 9961688 10474243 11099936 11539949 12271556 13193371 13904284 14722939
6987 14722939 15888874 17045304 18259639 19534616 20769056 22077602 23172234 24085659
6979 24085659 24995861 25818178 26450758 26797210 26754393 26180300 25319690 24427555 23423604
6970 23423604 22643162 21737480 21072908 20576027 20253459 20054800 20153336 20276737 20685364 21263901
6960 21263901 22022722 22888145 23860213 25148670 26819732 28668035 30786154 33115169 35795767
6951 35795767 38710460 41694728 45195610 48995371 52840770 56324340 59428005 61311628
6943 61311628 62225235 61859102 60384521 58206329 55483587 52656326 49544513 46566542
6935D6566542k917036k761862k147337j896813j600552q86149l44120n3668K08374
6926C4167379O21548R52785R97362J397321K023775K490376K818384L345414L959792
6917E2774136M478683N154123N421855N648176N393483M967326M080751K782675
6909I0701208J396302k70400k104336l713212m810103n626707n772423n721321
6901F4079008n250803m558066l947316l293855k514013j772006j304549j110986
6893D0327414n93274q2171L41785M69499R33021J367964J650190K076026K707964
6884D9198418L378590L895333M447214M916454N287356N121974M658878L605042
6876H4509259J986595J2875j684700l132096m452982n278972n570202n826420
$$ plain form
6935 46566542 43649506 40887644 38740307 36843494 35242942 34356793 34012673 33959005 34167379
6926 34167379 34788927 35741712 36739074 38136395 40160170 42650546 45468930 48814344 52774136
6917 52774136 57252819 62406942 67828797 73476973 78870456 83837782 87918533 90701208
6909 90701208 92097510 91827110 89722774 86009562 81199459 75572752 69800329 64079008
6901 64079008 58828205 54270139 50322823 47028968 44514955 42742949 41438400 40327414
6893 40327414 39734140 39651969 39993754 40463253 41396274 42764238 44414428 46490454 49198418
6884 49198418 52577008 56472341 60919555 65836009 71123365 76245339 80904217 84509259
6876 84509259 86495854 86508729 84824029 81691933 77238951 71959979 66389777 60563357
6868F0563357n533437m983524m207732l609768l202530k512110j889849j715310
6860C2909097j363289r18016o77586l29063j33967J66276M31215P42973P91361
6851C1619001J290006J542309J771752K095678K336278K384851K209345J674013
6843D6923233J008154K09940o90919j568356k220109k933572l328323l164444
6835C4235604l256038k898125k519727k216086j802881j503685j212622r54873
6827A7871567p90875n68613m57203m79731o01198m36308n31187j88827k6556k1393
6817A3769676K34954J78108J45289L79746L58899K43042K05989L8252j00244m30381
6807A5023330n51328p24767p91872r92561r20584o38259o67373l84166l73232
$$ plain form
6868 60563357 55029920 50046396 45838664 42228896 39026366 36514256 34624407 32909097
6860 32909097 31545808 30627792 29950206 29621143 29487176 29653452 30084667 30827640 31619001
6851 31619001 32909007 34451316 36223068 38318746 40655024 43039875 45249220 46923233
6843 46923233 47931387 48141327 47450408 45882052 43661943 40728371 37400048 34235604
6835 34235604 30979566 28081441 25561714 23345628 21542747 20039062 18826440 17871567
6827 17871567 17080692 16512079 16054876 15575145 14973947 14537639 14006452 13817625 13791069 13769676
6817 13769676 14004630 14182738 14328027 14707773 15066672 15309714 15515703 15553955 15453711 15023330
6807 15023330 14472002 13747235 12955363 11962802 11042218 10403959 9736586 9352420 8979188
6798H979188m31043n13072m98962m89218k10859l54206k73216j97827j50532j74152
6788E686101k77373k09639j49489j01029l36070Q7287o9014k10774Q7245j17623
6778D389622k09796j18366p3143n5132j99146k35008j05237J44504k6188l79931
6768C132179o1086j58437j5530j20127k56103J37021O0709k20844P6254N9798
6758B633834j03403k5144q1323m89J5169j14314j87877l0791k06281m2989k0079
6747A836313j54717o6133Q65l3597p257q0700q167j11909j69393j26791n3518
6736A024996j57615O3718O0534O0142N4582j50569M6760J80345J4442L5122n0106
6725A182351n796K4617J28518j5047O2409j3622L00M9310N7667N9513J32047J50964
$$ plain form
6798 8979188 8548145 8035073 7536111 7046893 6836034 6481828 6208612 6010785 5860253 5686101
6788 5686101 5408728 5199089 5049600 4948571 4612501 4699788 4630774 4420000 4507245 4389622
6778 4389622 4179826 4061460 3988317 3933185 3734039 3499031 3393794 3538298 3512110 3132179
6768 3132179 3071093 2912656 2897126 2776999 2520896 2657917 2718626 2497782 2574036 2633834
6758 2633834 2530431 2505287 2423964 2423475 2438644 2324330 2136453 2105662 1899381 1856392 1836313
6747 1836313 1681596 1615463 1616328 1582731 1575474 1494774 1486607 1374698 1205305 1078514 1024996
6736 1024996 867381 931099 991633 1051775 1106357 955788 1002548 1182893 1197335 1232457 1182351
6725 1182351 1176555 1201172 1329690 1314643 1377052 1363430 1363730 1413040 1470707 1530220 1662267 1813231
6713A813231m5052o0894k02021k40545j79264m7547j48346N193k1459j47192M2997
6702G69101Q6228r226p9433m1713j33714j77261L4745j3404O6871n3388k10480
6691B38326p823K15341k6023L2179k7602k6999q1689n5837j42484K8136Q6281
6680B31806R9576M4491o756L3704j05201M0608K93488j45067j5536R3638p4778
6669D89973o7944q3425K0779l5716R52j73497o012n9760J18125q2317M1520P5081
6657B37759R8035m1109j46736J18929j45544k51475Q1439J17747J09328M5937
6647B24310K5339L23j0302K8687K0798j1059q7902J7236L3662R3935R8481o195
6635D27313N7843j21378j79766N8903p3448j9374J24025Q5410j70025m1824J36284
$$ plain form
6713 1813231 1768179 1707285 1505264 1264719 1085455 1037908 889562 894755 873296 726104 769101
6702 769101 855329 846103 766670 724957 591243 413982 448727 435323 502194 448806 238326
6691 238326 230503 445844 419821 452000 424398 397399 315710 259873 117389 145525 231806
6680 231806 331382 375873 369117 402821 297620 338228 631716 486649 471113 564751 489973
6669 489973 422029 338604 359383 323667 324619 151122 145110 85350 203475 121158 162678 237759
6657 237759 335794 294685 147949 266878 121334 -130141 -48702 69045 178373 224310
6647 224310 249649 249972 239670 268357 289155 278096 190194 207430 241092 335027 433508 427313
6635 427313 485156 363778 184012 242915 169467 150093 274118 359528 189503 147679 283963
6624B83963j20843k667k5470N6300J50550n6986P5783j12889k0169j3056J21357
6613C35873O0295n5744j40386j76028P3935r1758j48443Q2739n2452N4888J7987
6602c9094r0636r6393J9364k1797q9756J67560K4275J49411J33676J53571k4579
6591B85602q1386K41432N2678M4489J24994J19939o8k05466j58919n1236J70296
6580E42355K4897k8032J76991j90820j97431L8179k5408k11369Q9432P1144M6129
6569C36067K5912r5739p9941j19679j07529j3200j7574M4528l6441L8346L50831
6558C25581L0898R3269J15433m389k8612L5155o4515l1518l4876p3594M107m884
6546C62055q7532P7535q6112n33n2554j0354j17966K9883n649j25059M8753q9798
$$ plain form
6624 283963 163120 160453 134983 191283 341833 284847 360630 247741 227572 214516 335873
6613 335873 396168 340424 200038 24010 97945 6187 -142256 -59517 -111969 -57081 -39094
6602 -39094 -129730 -226123 -206759 -228556 -318312 -150752 -126477 22934 156610 310181 285602
6591 285602 204216 445648 498326 542815 667809 787748 787680 582214 423295 372059 542355
6580 542355 567252 539220 716211 525391 327960 366139 340731 129362 218794 289938 336067
6569 336067 361979 266240 186299 66620 -40909 -54109 -71683 -27155 -63596 -25250 325581
6558 325581 356479 449748 565181 560792 532180 567335 502820 471302 436426 362832 366939 362055
6546 362055 274523 352058 265946 265413 212859 202505 84539 114422 108773 -16286 32467 -57331
6534e7331q229J1527k7906N8641J32269P5702l0811O7454R7739M3932J18469J45176
6522F26632l8806j46388K6020p9545R091o2884q7579N1041l148j39376L3700j34874
6510E3884j22902J8237j15694m8154J49006p2545m7776J77100K6037N1302J32869
6499B01364N4308M391r7739J5448J81881j22516q4556J58870l7822k49391K1018
6488D5256o4712k01607j5303J8326j8970O2505j68259J31931M4199O2170L0659
6477g3805j61307K1671P9803J27312J7581R3261L6795r849j45625L6050J82511
6466B04398J03115N67o9715j04348Q8267L8498K967P5629p013n0167j5348j9440
6454B47410O9958l4728j77705j3845J70476L7604M717J49634J19203P9401N2619
$$ plain form
6534 -57331 -65560 -54033 -81939 -23298 108971 184673 153862 221316 319055 362987 481456 626632
6522 626632 587826 441438 467458 387913 397004 334120 246541 297582 294434 155058 188758 53884
6510 53884 -69018 -50781 -166475 -214629 -65623 -138168 -185944 -8844 17193 68495 201364
6499 201364 255672 260063 162324 177772 359653 237137 152581 311451 273629 24238 45256
6488 45256 -19456 -221063 -236366 -218040 -237010 -174505 -342764 -210833 -166634 -104464 -73805
6477 -73805 -235112 -213441 -133638 -6326 11255 104516 141311 131462 -14163 21887 204398
6466 204398 307513 308080 238365 134017 222284 260782 263749 339378 332365 282198 266850 247410
6454 247410 317368 282640 104935 91090 261566 299170 303887 453521 572724 652125 704744
6443G04744J61603K2857r3185R714K53686J40364n8205J20966j5943k25781m0633
6432I80187k681l8927p8177o0222J39824N4970o9037P9561q2340j69037N8289
6421H12410J15723J66084J60780N3369j3967K4433p1733l5568n4012J8811N5515
6410A231845Q2507r2859J01612q6972j07612O8841q0025j3577J03596J05507J50428
6399A463291O4003m8094K0901r7931j43081L4346R8424N579J20284O478J1521
6388A535721j20186j89156P568j09215n1268j3318j0437j30605O0778K1747r3131
6377I08498k9668L0719J17249j7861R837N888J80412o4103k174p1459m8824r0936
6365I27578L7062J87981j2184j7717p4809K825J01561k09872j50481j108Q1392
$$ plain form
6443 704744 866347 889204 796019 805733 1059419 1199783 1141578 1262544 1246601 1020820 980187
6432 980187 977506 938579 860402 800180 940004 994974 925937 1005498 923158 754121 812410
6421 812410 928133 1094217 1254997 1308366 1294399 1318832 1247099 1211531 1157519 1176330 1231845
6410 1231845 1314352 1221493 1323105 1236133 1128521 1197362 1117337 1103760 1207356 1312863 1463291
6399 1463291 1527294 1479200 1500101 1402170 1259089 1293435 1391859 1397438 1517722 1524200 1535721
6388 1535721 1415535 1226379 1233947 1124732 1073464 1060146 1049709 919104 979882 1001629 908498
6377 908498 878830 909549 1026798 1008937 1018774 1024662 1205074 1140971 1138797 1067338 1018514 927578
6365 927578 964640 1152621 1140437 1122720 1047911 1050736 1152297 942425 791944 790836 872228
6354H72228q3215j51121l4216K3245o1394l4284R6186Q6356k9804J23901J35858
6343I43740q2965j33235j02634O1196l4771p1884N8670J01219J40486k2094J31626
6332I89354J10498q8040j26008J46627J9082j72330j43432M1872k4695q5745K0270
6321F87453O0567p0939j32452J24314J22255R9095j9426Q2977L1283N2492j88971
6310H48648K3369K5152m3257P984N8420k8440m9648j46168J08243m4215P925N3566
6298H21579J55063J94623j31323q2590Q3043J02078K4773Q4018J76154q4395m1775
6287A301248J27929K959j7460K1337J27434l4885j59883J9283L9497J8034p4114
6276A371379J8601N6658J9531M1704l2017Q6355j9943K2590J26330J33435K86548
$$ plain form
6354 872228 789013 637892 603676 626921 565527 531243 627429 713785 683981 807882 943740
6343 943740 860775 727540 624906 686102 651331 579447 638117 739336 879822 857728 989354
6332 989354 1099852 1011812 885804 1032431 1051513 879183 735751 777623 752928 667183 687453
6321 687453 748020 677081 544629 668943 791198 890293 870867 953844 985127 1037619 848648
6310 848648 872017 897169 853912 861896 920316 891876 842228 696060 804303 760088 768013 821579
6298 821579 976642 1171265 1039942 957352 1040395 1142473 1167246 1251264 1427418 1343023 1301248
6287 1301248 1429177 1432136 1414676 1436013 1563447 1528562 1368679 1387962 1427459 1445493 1371379
6276 1371379 1389980 1446638 1466169 1507873 1475856 1562211 1542268 1564858 1691188 1824623 2111171
6265B111171J37394o3763J45769N9365L9105K86479K12964m2209J36746k6726
6255B996295N0756R6293q2117k3543J29080J61266O7317M9135L1373p3265K2420
6244C425010Q4706K03526J49438J37473K05606J0133Q6159J56955J2658J82858
6234D654522L00448J57160K30558K26541L23362L03649K43542J01326L72820K51874
6224G165802L31153M32557M86516O35562M48805N75002P83733Q36850J019067
6215A2715047J297957J697724K256244K920580L843870M553009M513024L722439
6207C7519894K346127L30208j567421l228916m058830m205376l903417l388637
6199A9843632k482382k073355j615348j196021q64448o19519n41086m08924k40381
$$ plain form
6265 2111171 2248565 2184802 2330571 2389936 2429041 2715520 2928484 2886275 3023021 2996295
6255 2996295 3047051 3143344 3061227 3037684 3166764 3328030 3395347 3444482 3475855 3402590 3425010
6244 3425010 3509716 3713242 3862680 4000153 4205759 4215892 4302051 4459006 4471664 4654522
6234 4654522 4954970 5112130 5342688 5569229 5892591 6196240 6439782 6541108 6913928 7165802
6224 7165802 7496955 7929512 8416028 9051590 9500395 10075397 10859130 11695980 12715047
6215 12715047 14013004 15710728 17966972 20887552 24731422 29284431 33797455 37519894
6207 37519894 39866021 40196229 38628808 35399892 31341062 27135686 23232269 19843632
6199 19843632 17361250 15287895 13672547 12476526 11612078 10992559 10451473 10042549 9802168
6190I802168p1613k21395L9653L1515q4839N5645l967P8250K32842Q9155J6429
6179I963843k14645k97299N3898O6976J03127l1620M7566l3632K14004J39783
6169A0012001K53194L41539K57075N11971N00039M98029P76408O68024O16475
6160A4434755M46663K61651M62617J89478J37452L77095M60476P14404R06414
6151A8391005Q35674J162102J524217K066283K848169L859677M299727M589777
6143C9576631M335558K983761J267384p04252k205155l053053l336185k960054
6135C5904635k515228j735785j331828p39210l52816J90723Q13223J142657J667540
6126C3043911K221029K344859K876709K993903K890999K681955J945007J282292
$$ plain form
6190 9802168 9730555 9509160 9548813 9580328 9495489 9551134 9547167 9625417 9858259 9947414 9963843
6179 9963843 9749198 9451899 9505797 9572773 9675900 9644280 9691846 9658214 9872218 10012001
6169 10012001 10265195 10606734 10863809 11375780 11875819 12373848 13150256 13818280 14434755
6160 14434755 14881418 15143069 15605686 15795164 15932616 16309711 16770187 17484591 18391005
6151 18391005 19226679 20388781 21912998 23979281 26827450 30687127 34986854 39576631
6143 39576631 43912189 46895950 48163334 47459082 45253927 42200874 38864689 35904635
6135 35904635 33389407 31653622 30321794 29582584 29229768 29420491 30233714 31376371 33043911
6126 33043911 35264940 37609799 40486508 43480411 46371410 49053365 50998372 52280664
6118E2280664Q78070O32414Q31095J199069J235151J136006J179615R68052Q65780
6109F1205916O74761P92404J190831J844510K678019L282423L712734L987110
6101G9368708L580703K552409J605232J11482o52409j313780j390281j256015
6093H2606049n96800j68248J22969M49484L87993M53514m49633q97128j412331
6084H0495869k134303k404841k560191j947733j408253q11543j74551J44414P0471
6075F9269339k9421n47959p69635j043892j345461j204479j438974k075398k930999
6066E7883121l418796m000662m231512m115730l863163l708189l142515k581975
6058B8820579k161076j990986j607324j255316r58871p74263p17242n74516o66226
$$ plain form
6118 52280664 53158734 53791148 54622243 55821312 57056463 58192469 59372084 60340136 61205916
6109 61205916 61880677 62673081 63863912 65708422 68386441 71668864 75381598 79368708
6101 79368708 82949411 85501820 87107052 87218534 86566125 85252345 83862064 82606049
6093 82606049 82009249 81841001 81963970 82413454 82801447 83254961 82805328 81908200 80495869
6084 80495869 78361566 75956725 73396534 71448801 70040548 69229005 69054454 69198868 69269339
6075 69269339 69239918 68691959 67922324 66878432 65532971 64328492 62889518 60814120 57883121
6066 57883121 54464325 50463663 46232151 42116421 38253258 34545069 31402554 28820579
6058 28820579 26659503 24668517 23061193 21805877 20847006 20072743 19355501 18780985 18114759
6049A8114759o93909p03606n92147m02437n31533m74786m77524m15518m19837
6040A3403462l64616k48252l31358j42818n1639k25748k07998M8357k3913J03607
6030A1959084K11067J99699K34191J93050j18929j64762j67398l43723m40796
6021A1561483l48807l54334j97247j93464k42748j98259j39740P0210l8583K8644
$$ plain form
6049 18114759 17420850 16717244 16125097 15722660 15191127 14716341 14238817 13823299 13403462
6040 13403462 13038846 12790594 12459236 12316418 12264779 12039031 11831033 11879390 11855477 11959084
6030 11959084 12170151 12369850 12604041 12797091 12678162 12513400 12346002 12002279 11561483
6021 11561483 11212676 10858342 10661095 10467631 10224883 10026624 9886884 9957094 9918511 9947155
$$ [...]
##END NTUPLES=NMR SPECTRUM
##END=
