##TITLE=31Pdec_5-2026
CDCl3, 24 sc
 19.1.2026
##JCAMPDX= 6.0         $$ Bruker NMR JCAMP-DX V2.0
##DATA TYPE= NMR SPECTRUM
##DATA CLASS= NTUPLES
##ORIGIN= UXNMR, Bruker Analytische Messtechnik GmbH
##OWNER= root
$$ XWIN-NMR		Version 3.5
$$ Mon Jan 19 14:44:20 2026 Russian Standard Time (UT+4h)  she@DPX200
##.OBSERVE FREQUENCY= 81.013821
##.OBSERVE NUCLEUS= ^31P
##.ACQUISITION MODE= SIMULTANEOUS
##.ACQUISITION SCHEME= undefined
##.AVERAGES= 24
##.DIGITISER RES= 17
##SPECTROMETER/DATA SYSTEM= spect
##.PULSE SEQUENCE= zgpg30
##.SOLVENT NAME= DMSO
##.SHIFT REFERENCE= (INTERNAL, DMSO, 0, 198.062)
##AUDIT TRAIL= $$ (NUMBER, WHEN, WHO, WHERE, WHAT)
$$ ##TITLE= Audit trail, XWIN-NMR		Version 3.5
$$ ##JCAMPDX= 5.01
$$ ##ORIGIN= Bruker BioSpin GmbH
$$ ##OWNER= she
$$ F:/spectra/data/she/nmr/P31/2/pdata/1/auditp.txt
$$ ##AUDIT TRAIL=  $$ (NUMBER, WHEN, WHO, WHERE, WHAT)
(   1,<2026-01-19 14:43:06.17 +0400>,<she>,<DPX200>,
      <created by zg, POWCHK disabled, PULCHK disabled
       configuration hash MD5:
       00 E9 B6 7A A2 85 ED C7 34 08 36 98 17 FE 4E 26
       data hash MD5: 32K
       E8 D9 47 D3 64 13 A0 04 A1 02 CC BC B5 03 1C 37>)
(   2,<2026-01-19 14:43:09.57 +0400>,<she>,<DPX200>,
      <Start of raw data processing
       efp BC_mod = 2 LB = 1.5 FT_mod = 6 PKNL = 1 PHC0 = 1415.715 PHC1 = 49.90029 SI = 64K 
       data hash MD5: 64K
       12 EA 71 A3 4C A8 86 25 20 5E 3B 5F 96 AA 38 4D>)
(   3,<2026-01-19 14:43:32.07 +0400>,<she>,<DPX200>,
      <pk PHC0 = 3.276968 PHC1 = 0 
       data hash MD5: 64K
       6F 98 19 5D 99 4D BB 91 24 64 99 FE 6E 7E 9F F8>)
(   4,<2026-01-19 14:43:39.40 +0400>,<she>,<DPX200>,
      <abs ABSG = 5 
       data hash MD5: 64K
       54 28 62 5F F4 42 4A 2B 46 C9 CC 6E E0 C2 D7 05>)
$$ ##END=
$$ 
$$ hash MD5
$$ 27 FB D3 92 6B 08 15 F4 F9 65 7C F1 48 0C BC 1D
##$RELAX= 
##$RELAX= 
##$RELAX= 
##$RELAX= 
##$RELAX= 
##$RELAX= 
##$RELAX= 
##$RELAX= 
$$ Bruker specific parameters
$$ --------------------------
##$DU= <F:/spectra>
##$EXPNO= 2
##$NAME= <P31>
##$PROCNO= 1
##$TYPE= <nmr>
##$USER= <she>
##$AMP= (0..31)
100 100 100 100 100 100 100 100 100 100 100 100 100 100 100 100 100 100 
100 100 100 100 100 100 100 100 100 100 100 100 100 100 
##$AQSEQ= 0
##$AQ_mod= 1
##$AUNM= <au_zg>
##$AUTOPOS= <>
##$BF1= 81.014009
##$BF2= 200.13
##$BF3= 200.13
##$BF4= 200.13
##$BF5= 200.13
##$BF6= 200.13
##$BF7= 200.13
##$BF8= 200.13
##$BYTORDA= 1
##$CFDGTYP= 0
##$CFRGTYP= 5
##$CHEMSTR= <none>
##$CNST= (0..31)
1 1 145 1 1 1 1 1 1 1 1 1 1 1 1 1 1 1 1 1 1 1 1 1 1 1 1 1 1 1 1 1 
##$CPDPRG= <waltz16>
##$CPDPRG1= <>
##$CPDPRG2= <waltz16>
##$CPDPRG3= <>
##$CPDPRG4= <mlev>
##$CPDPRG5= <mlev>
##$CPDPRG6= <mlev>
##$CPDPRG7= <mlev>
##$CPDPRG8= <mlev>
##$CPDPRGB= <>
##$CPDPRGT= <>
##$D= (0..31)
0 1 0 0 0 0 0 0 0 0.06 0 0.03 2e-05 3e-06 0 0 0.0002 0 0 0 0 0 0 0 0 0 
0 0 0 0 0 0 
##$DATE= 1768819385
##$DBL= (0..7)
120 120 120 11 120 120 24 19 
##$DBP= (0..7)
150 150 150 150 150 150 150 150 
##$DBP07= 0
##$DBPNAM0= <>
##$DBPNAM1= <>
##$DBPNAM2= <>
$$ [...]
##$SUBNAM3= <"">
##$SUBNAM4= <"">
##$SUBNAM5= <"">
##$SUBNAM6= <"">
##$SUBNAM7= <"">
##$SUBNAM8= <"">
##$SUBNAM9= <"">
##$SW= 400.765351723535
##$SWIBOX= (0..15)
0 1 3 0 0 0 0 0 0 0 0 0 0 0 0 0 
##$SW_h= 32467.5324675325
##$TD= 32768
##$TD0= 1
##$TE= 0
##$TE2= 300
##$TE3= 300
##$TEG= 300
##$TL= (0..7)
0 120 53 12 22 120 120 120 
##$TP= (0..7)
150 150 150 150 150 150 150 150 
##$TP07= 0
##$TPNAME0= <>
##$TPNAME1= <>
##$TPNAME2= <>
##$TPNAME3= <>
##$TPNAME4= <>
##$TPNAME5= <>
##$TPNAME6= <>
##$TPNAME7= <>
##$TPOAL= (0..7)
0.5 0.5 0.5 0.5 0.5 0.5 0.5 0.5 
##$TPOFFS= (0..7)
0 0 0 0 0 0 0 0 
##$TUNHIN= 0
##$TUNHOUT= 0
##$TUNXOUT= 0
##$USERA1= <user>
##$USERA2= <user>
##$USERA3= <user>
##$USERA4= <user>
##$USERA5= <user>
##$V9= 5
##$VALIST= <valist>
##$VCLIST= <CCCCCCCCCCCCCCC>
##$VD= 0
##$VDLIST= <DDDDDDDDDDDDDDD>
##$VPLIST= <PPPPPPPPPPPPPPP>
##$VTLIST= <TTTTTTTTTTTTTTT>
##$WBST= 1024
##$WBSW= 4
##$XGAIN= (0..3)
0 0 0 0 
##$XL= 0
##$YL= 0
##$YMAX_a= 19341
##$YMIN_a= -19502
##$ZGOPTNS= <>
##$ZL1= 120
##$ZL2= 120
##$ZL3= 120
##$ZL4= 120
##$ABSF1= 198.0616
##$ABSF2= -202.7028
##$ABSG= 5
##$ABSL= 3
##$ALPHA= 0
##$AQORDER= 0
##$ASSFAC= 0
##$ASSFACI= 0
##$ASSFACX= 0
##$ASSWID= 0
##$AUNMP= <proc_1d>
##$AZFE= 0.1
##$AZFW= 0.5
##$BCFW= 0
##$BC_mod= 2
##$BYTORDP= 0
##$COROFFS= 0
##$CY= -3
##$DATMOD= 1
##$DC= 0
##$DFILT= <>
##$DTYPP= 0
##$F1P= 0
##$F2P= 0
##$FCOR= 1
##$FTSIZE= 65536
##$FT_mod= 6
##$GAMMA= 0
##$GB= 0
##$INTBC= 1
##$INTSCL= 9.790993e-09
##$ISEN= 30
##$LB= 1.5
##$LEV0= 0
##$LPBIN= 0
##$MAXI= 10000
##$MC2= 0
##$MEAN= 0
##$ME_mod= 0
##$MI= 50
##$NCOEF= 0
##$NC_proc= -4
##$NLEV= 6
##$NOISF1= 182.463
##$NOISF2= 159.3651
##$NSP= 0
##$NTH_PI= 0
##$NZP= 0
##$OFFSET= 198.0616
##$PC= 4
##$PHC0= 1418.992
##$PHC1= 49.90029
##$PH_mod= 1
##$PKNL= yes
##$PPARMOD= 0
##$PSCAL= 0
##$PSIGN= 0
##$REVERSE= no
##$SF= 81.0140089999434
##$SI= 65536
##$SIGF1= 159.3651
##$SIGF2= -187.1042
##$SINO= 113.3802
##$SIOLD= 16384
##$SREGLST= <1H.CDCl3>
##$SSB= 0
##$STSI= 65536
##$STSR= 0
##$SW_p= 32467.5324675325
##$SYMM= 0
##$S_DEV= 0
##$TDeff= 32768
##$TDoff= 0
##$TI= <>
##$TILT= no
##$TM1= 0
##$TM2= 0
##$TOPLEV= 0
##$USERP1= <user>
##$USERP2= <user>
##$USERP3= <user>
##$USERP4= <user>
##$USERP5= <user>
##$WDW= 1
##$XDIM= 65536
##$YMAX_p= 517783787
##$YMIN_p= -5392513
$$ End of Bruker specific parameters
$$ ---------------------------------
##NTUPLES= NMR SPECTRUM
##VAR_NAME=  FREQUENCY,     SPECTRUM/REAL,   SPECTRUM/IMAG
##SYMBOL=    X,             R,               I
##VAR_TYPE=  INDEPENDENT,   DEPENDENT,       DEPENDENT
##VAR_FORM=  AFFN,          ASDF,            ASDF
##VAR_DIM=   65536,         65536,           65536
##UNITS=     HZ,            ARBITRARY UNITS, ARBITRARY UNITS
##FACTOR=    0.49542278885378, 1,            1
##FIRST=     16045.7642231865, 0,            0
##LAST=      -16421.768244346, 0,            0
##MIN=       -16421.768244346, -5392513,     0
##MAX=       16045.7642231865, 517783787,    0
$$ Real data points
##PAGE= N=1
##DATA TABLE= (X++(R..R)), XYDATA
$$ [...]
41603G3995j16818p4480j2542L2619N5210M4433n0l3288j5917J7994J6835J0958
41591a051O4422J42058J36085L6329m1526l2428j3325n9906j17807r9394k2014
41580h557M5085R8963J60651J71642N6239j35498k58668k41141j30454M261J14176
41569a23301J38178N2963m7403m7295J3746k123r2822j05823l671N2834k3627
41558a88344q4136N606J24150R3995j3391Q33J21657J46024J9904r2882r5857
41547C7559q4017j25422j29153k8810P4637P0869R972j637K9023K9346o32o160
41535a24425J8351L2159J8770r016l8528m9305j9833K8549M7731M0092N1830P8697
41523G5072O6337J8124r39J3300l614m6097l1761K7448P922j03935j43263k3148
$$ plain form
41603 73995 -42823 -117303 -129845 -97226 -42016 2417 2367 -30921 -46838 -28844 -12009 -1051
41591 -1051 63371 205429 341514 377843 336317 303889 290564 230658 112851 13457 -8557
41580 -8557 36528 135491 296142 467784 524023 388525 129857 -111284 -241738 -237477 -123301
41569 -123301 14877 67840 20437 -26858 -13112 -15235 -108057 -213880 -217551 -164717 -188344
41558 -188344 -272480 -266874 -142724 -48729 -62120 -61287 60370 206394 226298 133416 37559
41547 37559 -46458 -171880 -301033 -329843 -255206 -184337 -174365 -176002 -146979 -117633 -118265 -124425
41535 -124425 -106074 -73915 -55145 -64161 -102689 -151994 -171827 -143278 -95547 -55455 -3625 75072
41523 75072 141409 159533 158594 171894 168280 122183 90422 117870 125792 21857 -121406 -144554
41511a44554J05421Q2876j9376m2216J1942M1803M2123N6850L9983m9690j06508
41500A8654k7245P9997M6365p0335p9175J5451L2287n6740q1114J3132O1477k9382
41488g6628j20533p7812K3205N1414K2961K5172N8687O9586M8321Q720n0779j00755
41476a18441p9239J3191J00174J39744J50279J18125J3068q8006n6990O4643P9506
41465C36054o4105j72088j04402J4307J9906l3000j3294L2186k7870j54455j80990
41454c47751o5082P6796J55399J74891J39922M6289m5062n5510p243J3383n173
41443H0859l597K5266K8050m057k2861j0186Q216K0502K1784k0661j09191j58622
41431a44498r3476K8915Q9483O9091L9398K8705P786j9976k7169l3760n8464l8338
$$ plain form
41511 -144554 -39133 43743 24367 -17849 -5907 35896 78019 134869 174852 125162 18654
41500 18654 -8591 71406 117771 47436 -31739 -16288 15999 -40741 -121855 -108723 -47246 -76628
41488 -76628 -197161 -274973 -251768 -200354 -177393 -152221 -93534 -23948 24373 33093 -17686 -118441
41476 -118441 -197680 -184489 -84315 55429 205708 323833 336901 248895 191905 256548 336054
41465 336054 271949 99861 -4541 9766 29672 -3328 -16622 15564 -12306 -166761 -347751
41454 -347751 -412833 -336037 -180638 -5747 134175 180464 135402 79892 72649 86032 80859
41443 80859 77262 102528 130578 126521 103660 93474 101690 122192 143976 123315 14124 -144498
41431 -144498 -237974 -209059 -119576 -50485 -11087 17618 25404 5428 -21741 -55501 -113965 -152303
41419a52303P1362J56982P0330j19720j78997l5851J17752J06840o920o5235l1896
41408f7656K4577N4809L8795l6721j24080j21526j6380O1428J2713q8123j16309
41397c78473p8265n6873m6650K0309J21370J55631J05985O3537P2819O6542p197
41386C8735r0968j08440p5259n5959o3417o7762o6817p3479n2127M9474J92445
41375c73574K48221J52527M004n2066n648K5507k4917q4445o0226K6783P8516
41364f5318M7224k6177p2583m7928M6417J48830J67675P6914l7454p3948l4840
41353A28812L979J2243K0438L2267J0878l6888m6564K261M0881J1487m4129m8412
41341H7253j673K6773O090j2723K5525R3067J01971J5360r2782j19215n9747o330
$$ plain form
41419 -152303 -80941 76041 146371 26651 -152346 -188197 -70445 36395 29475 -35760 -67656
41408 -67656 -43079 11730 50525 13804 -110276 -231802 -248182 -186754 -174041 -262164 -378473
41397 -378473 -456738 -513611 -560261 -539952 -418582 -262951 -156966 -93429 -20610 45932 38735
41386 38735 -52233 -160673 -235932 -291891 -355308 -423070 -489887 -563366 -615493 -566019 -373574
41375 -373574 -125353 27174 31178 -20888 -26536 -1029 -25946 -110391 -170617 -143834 -65318
41364 -65318 -18094 -44271 -116854 -164782 -118365 30465 198140 275054 237600 163652 128812
41353 128812 132791 145034 165472 197739 208617 171729 125165 127426 168307 179794 135665 87253
41341 87253 85580 112353 118443 105720 131245 224312 326283 341643 248861 129646 69899 63569
41329F3569j0418j6297L2721R1343Q6466M1899L6452O4455L8927o5034j61564
41318B02519j66740q7315J6793Q9754Q8902J0367p6169q5059k2498K7255K7635
41307B5444K2315L3449K2124k2212m6288k6762j1535k3094r763N1214Q7195L2918
41295A35005p2006j49786j77043j52411n5316Q7657J73355J44380P3007M2386
41285D9228K2870l7249q1858l4226M9722N5981r23j1343L3009K8886m8975r5687
41273g0565m1272O0610J41151J92251J96886J06794n3458j66533j68230j21216
41263G6418q8970l7895O2813J39370J05597q307j04616j41518j31738p6419J2472
41252a92793P0164M9961M670J3902N7775M8007l2645j04134r6360j4103R5529
$$ plain form
41329 63569 53151 36854 69575 160918 247384 289283 325735 390190 429117 364083 202519
41318 202519 35779 -51536 -34743 55011 143913 154280 78111 -6948 -29446 -2191 25444
41307 25444 47759 81208 103332 81120 34832 8070 -3465 -26559 -36322 14892 102087 135005
41295 135005 62999 -86787 -263830 -416241 -471557 -383900 -210545 -66165 6842 49228
41285 49228 72098 34849 -47009 -81235 -31513 24468 23545 12202 45211 74097 25122 -70565
41273 -70565 -111837 -51227 89924 282175 479061 585855 532397 365864 197634 76418
41263 76418 -12552 -50447 12366 151736 257333 249026 144410 2892 -128846 -205265 -192793
41252 -192793 -122629 -72668 -67998 -54096 3679 51686 19041 -85093 -181453 -195556 -100027
41241a00027J75088J68706P1424l9225q2200o9711o2503n6914n290O7816P7544
41230A44708J4919l6371m2558o5852j23197j17256P821J38922J34184K7731k8057
41219E4994P119J9349o1418j42741j04319L0685J31904J30096Q1283O9845J00544
41208C17341J05697L6393p6283j53394j51124r9858o0334n6740o4795n2696j3275
41197b69068M0396Q8494J05605O6444k7613j24135j42152m7501R0040J45600O9134
41186d756n5759j11675p9572k6416R904M7056P5682M5635l4227p0946j6492N4847
41174a66719O3831M5492O4400Q0108J4071r0412j07364k0092N4612M9606K8758
41163A6291M6752N0119j2365q1681q0110l6838k6532l5107R007R2462J10593K0110
$$ plain form
41241 -100027 75061 243767 315191 275966 193766 124055 61552 4638 -652 67164 144708
41230 144708 159627 123256 80698 14846 -108351 -225607 -217786 -78864 55320 83051 54994
41219 54994 62113 81462 20044 -122697 -227016 -196331 -64427 65669 146952 216797 317341
41208 317341 423038 459431 383148 229754 78630 -21228 -81562 -138302 -203097 -255793 -269068
41197 -269068 -228672 -140178 -34573 31871 4258 -119877 -262029 -309530 -219490 -73890 -4756
41186 -4756 -60515 -172190 -251762 -278178 -268274 -221218 -145536 -99901 -134128 -205074 -221566 -166719
41174 -166719 -102888 -57396 7004 87112 101183 10771 -96593 -116685 -62073 -12467 16291
41163 16291 63043 113162 100797 19116 -60994 -97832 -124364 -159471 -150464 -58002 52591 72701
41151G2701q1322p0358M7250J41255J11007K932n0074J159N7906J2534r0372j05607
41139D9011Q218J22900J08858l788q3562o7648j6439j9528q9135j45101r9887
41128b36101K8032J08502N5325m3075l7791N1765N2368r2730k11514j39495N4801
41117d09913J84136J77704Q6476m6415j76795k00750p3581N6422N906j67625k19541
41106g83976n5085J59066K51256K40043K08746J50182M4545l4786k1404K1074
41096A79661k961o0303m6949L1294O1370L017m8828j4143M9129L3537n5414r9314
41084C0096k8572P8728R8941K6843k9319j2918O013l9475r2717o7027J669J1295
41072a6443k6183L931J14122J58612M3716j17288j50690m9517M4720M4249k327
$$ plain form
41151 72701 -8621 -78979 -31729 109526 220533 223465 173391 174550 232456 244990 154618 49011
41139 49011 57229 180129 288987 285199 201637 133989 117550 98022 8887 -136214 -236101
41128 -236101 -208069 -99567 -44242 -87317 -125108 -73343 -20975 -113705 -325219 -464714 -409913
41117 -409913 -225777 -48073 38403 -8012 -184807 -385557 -459138 -402716 -396810 -564435 -783976
41106 -783976 -839061 -679995 -428739 -188696 20050 170232 214777 179991 158587 179661
41096 179661 176700 116397 69448 100742 162112 165129 116301 102158 151287 184824 129410 30096
41084 30096 1524 80252 179193 206036 176717 163799 169812 130337 37620 -29407 -27738 -16443
41072 -16443 -42626 -38695 75427 234039 277755 160467 9777 -39740 4980 49229 46902
41061D6902k0979j3060j4919j7440J8730P8286P2900n3912k19216k58615j19548
41050e00871N7432J04859L1055j9436K3069Q0917O8753P550k9615q991N6196J23009
41038f073J21269J2125j27051j53263l6001Q3411N9887q2831j93328j58789O427
41027d74217J87871K51457J49994j3292p6225j388Q8611Q4429K1132r879j029
41016B07464q619m7826q2027q4923n5805j545N1959O3475K9409m293j2883k4887
41004B9499n2434n4266j3161J5879q323l8822j3401N1362R7442J04059P4913Q083
40992B00830o2085o2626O470L0526o0844j60313j17871L8004J32721P8280l7779
40981a4687r3650o3466O776P1312J06276J07386Q2096K8589n3662j15418p9293
$$ plain form
41061 46902 25923 12863 -2056 -19496 -766 77520 150420 96508 -122708 -381323 -500871
41050 -500871 -443439 -338580 -307525 -326961 -303892 -222975 -154222 -146672 -176287 -185278 -129082 -6073
41038 -6073 115196 127321 270 -152993 -188994 -105583 -45696 -128527 -321855 -480644 -474217
41027 -474217 -286346 -34889 115105 101813 25588 24200 112811 197240 218372 208493 207464
41016 207464 198845 151019 68992 -15931 -71736 -73281 -21322 42153 71562 67269 54386 29499
41004 29499 -22935 -77201 -90362 -74483 -82806 -121628 -135029 -83667 13775 117834 192747 200830
40992 200830 138745 76119 82589 113115 52271 -108042 -225913 -187909 -55188 23092 -14687
40981 -14687 -108337 -171803 -165027 -93715 12561 119947 202043 230632 176970 61552 -17741
40970a7741M4521J29673Q6822j5053n3130j0880N1406J14365J76946J76428O2084
40959G45441q6264j42714j13984j05198j30761j06739l0922j2587q4258j23793
40949a91779l1119J20901J83568J12249o159n9917j4894N5911M3347o2533j41282
40938H293j04388k9386l0069n4935L0112J86114K14482N2621j20888j38883m7900
40927c4827J8698K7531J4448q136j6880L9518J31026J29604k594j21703j06644
40916G0041l8016m1135o4051J6553J46377J44939j6701j67259j74274q0359J7449
40905a86436Q0172Q5231R163r1508r7147J0226R4135M6314o0507q2031M51P9285
40893a12652P5753J1776n3860q5211o7155m733O5723J03756J06562R6751Q0376
$$ plain form
40970 -17741 26780 156453 243275 228222 175092 164212 215618 329983 506929 683357 745441
40959 745441 659177 516463 402479 297281 166520 59781 28859 16272 -67986 -191779
40949 -191779 -222898 -101997 81571 193820 187661 127744 112850 168761 212108 149575 8293
40938 8293 -96095 -125481 -155550 -210485 -180373 5741 220223 272844 151956 13073 -34827
40927 -34827 -16129 11402 25850 17714 834 40352 171378 300982 298388 176685 70041
40916 70041 32025 -9110 -73161 -56608 89769 234708 218007 50748 -123526 -203885 -186436
40905 -186436 -106264 -21033 -11870 -103378 -200525 -190299 -96164 -49850 -110357 -192388 -191937 -112652
40893 -112652 -36899 -25123 -78983 -164194 -231349 -236082 -170359 -66603 39959 136710 217086
40882B17086N1592K3242Q391j5355p0018j15069q7317o221L6359J1456m664L6209
40870H5691O6526J9726m3375k4458N0789P5011L1340K183J6910J3669l8576r6315
40858A59121j33755j62691j48216l7694J00920J18036O001p0768l0299J2886k3639
40847b10098l5375N9028J34121O6756k8964O913Q5704J9230j29522j24584N1919
40836a04872J67187J05493K560k7226m1558p6978m7337N9781R7735m967j05583
40825B4235o7868L6298P0479L6581R173p650l6000m4358j9341j6715n1940n0460
40813a17566J1972M6922J6154J1675P2253P9376l3185j24072o0763N0281L5390
40802a1563o3322p9515o737K1851j7996k1584M0577Q7228Q6412Q2857P2240O594
$$ plain form
40882 217086 268678 291920 300311 284956 214938 99869 12552 6331 42690 54146 49482 85691
40870 85691 152217 171943 128568 104110 154899 229910 261250 263433 280343 294012 255436 159121
40858 159121 25366 -137325 -285541 -323235 -222315 -104279 -98278 -169046 -199345 -186459 -210098
40847 -210098 -245473 -186445 -52324 14432 -14532 -7619 78085 97315 -32207 -156791 -104872
40836 -104872 62315 167808 170368 143142 101584 24606 -22731 37050 134785 129818 24235
40825 24235 -43633 -7335 63144 99725 108898 101248 65248 20890 1549 -15166 -67106 -117566
40813 -117566 -105594 -58672 -42518 -30843 41410 120786 87601 -36471 -97234 -46953 -11563
40802 -11563 -74885 -154400 -161137 -139286 -157282 -178866 -138289 -51061 35351 118208 190448 197042
40790A97042q0105j04161q3732j05562j46870r5259M3176J23723Q5693L7970O8841
40779e9244J12471P6712j0745o1117m6491n14L8417M3174J7102J8587R6490J89240
40767D14082J75564M5641p2969r1017o2230o9201j01254j08838r7176r0462o5543
40756a23403q64N1273J9901p7427j46751j27300m0384N7429J18876J11651L6810
40745a20189m5972n9862k896M1027J8207q414M6737J35869J15987l4559j49037
40734f3102r7688J8870K3527o2708o3146O4011J60422J19554K8815m538j0707
40723A13310m9768q5001o9111m0327k8464K1244J20726J52411M1836q4957o2509
40712B9390P4045J51965R7107k7057j48151k14368j62096J09J32113J26390O6589
$$ plain form
40790 197042 116937 12776 -70956 -176518 -323388 -418647 -375471 -251748 -166055 -128085 -59244
40779 -59244 53227 129939 119194 58077 11586 11072 49489 92663 109765 128352 224842 414082
40767 414082 589646 635287 562318 471301 409071 339870 238616 129778 32602 -57860 -123403
40756 -123403 -124267 -72994 -53093 -130520 -277271 -404571 -444955 -387526 -268650 -156999 -120189
40745 -120189 -166161 -226023 -228919 -187892 -169685 -178099 -131362 4507 120494 85935 -63102
40734 -63102 -160790 -141920 -118393 -181101 -244247 -180236 -19814 99740 128555 124017 113310
40723 113310 63542 -21459 -90570 -130897 -159361 -138117 -17391 135020 176856 91899 29390
40712 29390 103435 255400 352507 325450 177299 -37069 -199165 -199056 -66943 59447 126036
40701A26036P6587R4799j3686j83136k06039n2721Q1311O9044j479j5824Q952
40690a6156J7588K0460L4636L3001P258o704L512J4558K7218N1649M7321k1605
40678B12736r4167q8499l9202l4310n4769k3438K5272l731p1713m9450N4377J02340
40666f4554O7241N7020Q5657L9092q5976j28656k3021Q9414R0729M5320M0938
40655B13204M7433K4185K310k4213j21427k48149k43668p4375Q4918J12139R5669
40644a31974J25431J23483K1049p7584o5685j3653k6195o4319n4942l4442m0987
40633b39818j3538N8238M8688p6469j21813N1526K62143K56488Q5288j1646R347
40622C08434j4902j41125k45746k44908j75572o8633P1345J72489J52815N8356
$$ plain form
40701 126036 202623 297422 283736 100600 -105439 -158160 -76849 -7805 -9284 -25108 -16156
40690 -16156 1432 21892 56528 89529 96787 90083 93595 108153 135371 187020 234341 212736
40678 212736 118569 30070 -9132 -43442 -98211 -121649 -96377 -100108 -171821 -221271 -166894 -64554
40666 -64554 2687 59707 145364 184456 98480 -30176 -53197 36217 126946 172266 213204
40655 213204 260637 284822 287132 262919 141492 -106657 -350325 -424700 -339782 -227643 -131974
40644 -131974 -6543 116940 137989 60405 -5280 -18933 -45128 -109447 -164389 -198831 -239818
40633 -239818 -253356 -195118 -146430 -222899 -344712 -293186 -31043 225445 310733 299087 308434
40622 308434 293532 152407 -93339 -338247 -513819 -582452 -511107 -338618 -185803 -127447
40612a27447m10j2495k6491j4368O0166J09903M5796l9638j1422N7020K624j16535
40600g3297r4669N8595J12761K480o3855L8792J46173Q0599q0379j53739j05566
40589a32105k1110M8623Q8998P6764L3014K8172O1446M0114n6341j11721m8887
40578F967M9178P7383N0842J9717l7994j27713j50269l6272J05673J10400j4961
40567E2951j04875o0891M0367O8492p352j02495j16247l9147L5763K8196j9633
40556b24871q604N3776N5681l2581r1998l7352M2742K3264o7201j09730q6803
40545d83677q0192j04986p9299K8932J39249J76239J57767J25920P5246Q113j0957
40534d7645O1229J49379J34994J9032p3352o0488J914K2264p124m1387o7242q4809
$$ plain form
40612 -127447 -127857 -140352 -166843 -181211 -121045 -11142 34654 -4984 -16406 40614 43238 -73297
40600 -73297 -167966 -109371 3390 5870 -57985 -19193 126980 207579 127200 -26539 -132105
40589 -132105 -153215 -104592 -15594 61170 94184 122356 183802 223916 167575 55854 6967
40578 6967 56145 133528 184370 204087 166093 38380 -111889 -148161 -42488 67912 52951
40567 52951 -51924 -112815 -72448 -3956 -11308 -113803 -230050 -269197 -233434 -205238 -224871
40556 -224871 -233475 -179699 -124018 -156599 -248597 -285949 -243207 -219943 -287144 -396874 -483677
40545 -483677 -563869 -668855 -748154 -719222 -579973 -403734 -245967 -120047 -44801 -36688 -47645
40534 -47645 13584 162963 297957 316989 243637 183149 185063 207327 200203 158816 91574 6765
40522F765n6880L5304J15563Q8011j8764p6347l1414L4230L4466j7735o3175p2089
40510b2065l7884L1381Q8305Q0846K8477m896j2298k9268k9533M2989J36238J27846
40498D00138K0446n6285o5702j05364j82489j59934j5753O3782j7670q9919k680
40487b11430J20993J16422O0726Q8474J11027l873j32173q3970L1743k7695j94271
40476a24027j76796L7965J50275M6454l5793O5654J82888J32886o88o5318q0741
40465A32759j15766j25099p1077m1190r9456j66356j66285j45417j32251m0497
40455i70635J62402L32934L27758J87561M3053m3817n8585R846R8352Q7561j8726
40444A57704o6066J5555R8229O8884m058k7188m8559j35056k16067j84742n3320
$$ plain form
40522 6765 -50115 -14811 100752 188763 169999 93652 62238 96468 130934 113199 50024 -22065
40510 -22065 -59949 -28568 59737 140583 169060 164164 151866 122598 93065 136054 272292 400138
40498 400138 420584 364299 298597 193233 10744 -149190 -164943 -101161 -118831 -208750 -211430
40487 -211430 -90437 25985 86711 175185 286212 282339 150166 66196 97939 70244 -124027
40476 -124027 -300823 -262858 -112583 -66129 -101922 -36268 146620 279506 278818 213500 132759
40465 132759 16993 -108106 -179183 -220373 -319829 -486185 -652470 -797887 -930138 -970635
40455 -970635 -808233 -475299 -147541 40020 83073 39256 -19329 -9483 88869 176430 157704
40444 157704 91638 107193 205422 274306 270248 243060 194501 59445 -156622 -341364 -394684
40433c94684R6585K11814K34920J08978r2488j80156q9364L2922O3477N8627Q1167
40422A31798O1804l8540j10241q1287m8445q0377p3675L8447J24689P8039J0211
40411A2423L7307O8759J6354L055J17558J68945k0721k61338k58634q1388j3100
40400b10780o0571J607J68244J95740N2654k1690M2969L2259j33567k26791j05140
40389b65066M1984K1401n9396j7431R3978J09202K7784k5852r136L2247P8166
40378B7881J24634J30554P1539j3756q7711j47854j66645j01882M086N3208M3339
40367f2607N9861J01368P3883j7809n7647l7095q0084j84828j69976J1962J38971
40356b24001N5003p3283l3741Q6520P3871l8809m1878Q9540J71354J19373L4502
$$ plain form
40433 -394684 -298099 -86285 148635 257613 165125 -15031 -104395 -71473 -7996 50631 131798
40422 131798 193602 155062 44821 -36466 -84911 -165288 -238963 -200516 -75827 2212 12423
40411 12423 49730 118489 134843 137898 255456 424401 403680 142342 -116292 -197680 -210780
40400 -210780 -271351 -269744 -101500 94240 146894 125204 168173 200432 66865 -159926 -265066
40389 -265066 -223082 -201681 -261077 -278508 -184530 -75328 -47544 -73396 -82532 -50285 27881
40378 27881 152515 283069 354608 340852 253141 105287 -61358 -163240 -159154 -105946 -62607
40367 -62607 -2746 98622 172505 154696 97049 59954 -20130 -204958 -374934 -362972 -224001
40356 -224001 -168998 -242281 -276022 -189502 -115631 -154440 -196318 -106778 64576 183949 218451
40345B18451k3281j07838j97269j61105R18Q9846l570j11485m4400R9456P7942
40334a62335j06779j85855j8455J90285J77482j3611j22909n2686L9154K8211
40324b27498J634N9497J12664L5315r4957r6271L1899J09726N4421k1706j2944
40313d8220M7015J01395J64431K27241K05215P0285p0102j14525r8331j01418
40303C82986j14446q8796m4971l5629n5691p1579q5670r4513m3607Q6938K02234
40292C7256J92503P8171l0001q0048r8805r7404o2479l0152o1102j27517j21726
40281d01304j1383R6341R5613K1692j4017J7141M7553M2596N1035R7915J11166
40270A54348K7421q2918r4761j2455L5163r040o0228n2647l8193n2498k0835Q5789
$$ plain form
40345 218451 195170 87332 -109937 -271042 -270124 -180278 -183848 -295333 -339733 -240277 -162335
40334 -162335 -269114 -454969 -473424 -283139 -105657 -119268 -242177 -294863 -255709 -227498
40324 -227498 -225864 -166367 -53703 -18388 -113345 -209616 -177717 -67991 -13570 -35276 -48220
40313 -48220 -1205 100190 264621 491862 697077 767362 697260 582735 484404 382986
40303 382986 268540 179744 134773 99144 43453 -28126 -113796 -208309 -251916 -164978 37256
40292 37256 229759 307930 277929 197881 99076 1672 -60807 -90959 -152061 -279578 -401304
40281 -401304 -412687 -316346 -220733 -199041 -213058 -195917 -148364 -105768 -54733 43182 154348
40270 154348 181769 98851 4090 -8365 26798 17758 -42470 -95117 -133310 -185808 -206643 -120854
40258a20854J29435K573j55020j34309J5109O0531l6262o6906O2941J69373Q7870
40247A4481p4462j23582n4832M406Q852P411K4986N4921J02271J40386J01304
40236B06142p079o5946j2969N9385O4170N4697Q2607N8554q1656j91106r7805
40225F8994R9344J44593M485r6173l2519N1370J973j10444j32877o0679M361L4972
40213b2600Q5008J56331J71817Q3452n8940j54337j36381k4983Q2586R0509k54
40202B72208r0936r7065l8831L526l60n714K6231O3083M3803k9504p8769m2173
40190B5499M6739R9259P5607J4987k9713m4657l8266j5630J1329J8965m007m6247
40178A13865r0563j16085r1370q739P3831P6585k855p9331q1918k1837N0438J03671
$$ plain form
40258 -120854 8581 11154 -143866 -278175 -263066 -202535 -238797 -305703 -242762 -73389 14481
40247 14481 -59981 -183563 -238395 -233989 -225137 -217726 -192740 -137819 -35548 104838 206142
40236 206142 199063 133117 120148 179533 243703 298400 381007 439561 357905 166799 68994
40225 68994 168338 312931 317416 221243 188724 240094 242067 131623 -1254 -61933 -57572 -22600
40213 -22600 62408 218739 390556 474008 415068 260731 124350 99367 181953 272462 272208
40202 272208 181272 84207 45376 48902 48542 42828 69059 132142 175945 146441 67672 25499
40190 25499 72238 171497 247104 262091 232378 187721 149455 133825 145154 164119 160112 113865
40178 113865 23302 -92783 -184153 -192892 -119061 -42476 -45331 -124662 -206580 -228417 -177979 -74308
40166g4308J23753J02199M9840j1509p4711j25774j14765j8289Q0236O6093m2088
40155c9323j03481n3446J7589K3615N753K6672M8552J1899m3401l9289J0438K8054
40143a06368l191k6640m859M2619Q0742R1436Q1286Q1621J08582J13284L1764
40132D90276j01870j73078j42067q8683p1486n3309j3891p946l7487k951J14045
40121h8447J55877J8628j42642j13978N5807J27218K3040q4793m5840Q2195J55221
40110A42286J20836K9012m5591n9041l2887l3966p6454q8048l5766j0328q2026
40099a71973j49810p7331P5550J23170L0276n4742m2792n221l688J2199P6309
40088a88053J17141P4659p83l4671k6748r614Q932J4517k5247r5347j23494p1630
$$ plain form
40166 -74308 49445 151644 201484 189975 115264 -10510 -125275 -143564 -63328 2765 -39323
40155 -39323 -142804 -196250 -178661 -155046 -149293 -122621 -74069 -62170 -105571 -144860 -134422 -106368
40143 -106368 -109559 -136199 -141058 -98439 -17697 73739 155025 236646 345228 458512 490276
40132 490276 388406 215328 73261 -15422 -86908 -140217 -154108 -162054 -199541 -202492 -88447
40121 -88447 67430 86058 -56584 -170562 -114755 12463 35503 -49290 -95130 -12935 142286
40110 142286 263122 292134 246543 187502 154615 120649 44195 -43853 -79619 -89947 -171973
40099 -171973 -321783 -399114 -323564 -200394 -170118 -224860 -267652 -272873 -276561 -264362 -188053
40088 -188053 -70912 3747 2964 -31707 -58455 -68069 -59137 -44620 -69867 -165214 -288708 -360338
40076c60338K0954J02131J49252J44447Q8217L9348N0940O7649q231j46161k05455
40065e7247j40121n2407r061N2093J68984K45057J85445M1037p2803j15301j00767
40054A44909l3059N1499O1035l2944j21332r5977k48N1094L9025K3710J5214k1947
40042H0979o4342m5791K5992O8498M7468J5527J5578K2722M821k2207k7667q861
40030A12717K3647O6492J04551R9125K4100r2033j76509j70926q4009J3017N1094
40019b8734K4739j8104l7908l2466j1706J7610L4332J0918m0523o5536l6854M964
40007a79268J1598k813P001L9102N0515L4528L2046N1786L9640l1760r3257o5642
39995a06524J3990M0257J0022L5632J48966K10307J06821n5780r6888l0854k4377
$$ plain form
40076 -360338 -339384 -237253 -88001 56446 144663 184011 234951 302600 294369 148208 -57247
40065 -57247 -197368 -249775 -258836 -206743 -37759 207298 392743 433780 360977 245676 144909
40054 144909 111850 163349 224384 191440 70108 -25869 -26117 24977 64002 87712 102926 80979
40042 80979 16637 -29154 -3162 65336 112804 128331 143909 166631 171452 149245 121578 112717
40030 112717 136364 202856 307407 406532 430632 338599 162090 -8836 -92845 -79828 -28734
40019 -28734 -3995 -22099 -60007 -92473 -104179 -86569 -52237 -41319 -81842 -147378 -184232 -179268
40007 -179268 -167670 -170483 -163482 -124380 -73865 -39337 -7291 44495 84135 52375 -40882 -106524
39995 -106524 -92534 -52277 -42255 -6623 142343 352650 459471 403691 306803 275949 251572
39984B51572j08792j26584L532J51957J81267J22952O1484p358r4287j32687j00508
39973B02548r7554j70176j89072n4796J00681R9191m126k9571K3279M478j01361
39962b16479j48008p8161P551M2665O6650R0098O7950K6029M4551R8888Q1514
39951H3248p257n8603m9320n7446p9830k9464O9911R1367L2392K2271P0205L7848
39939A25322q3748j17608p653O6195k163o2443J3892J01858N5170k8717J2680
39928G2785J19272J17869P876o6216n0697j4676n412j5879m1069n6204j1025O5846
39916A22470N8514n5295j42711j24129q6693q6406k8419J10074J44431k8234j92483
39905c08881j08999J10641J86438R6098L4774M9883K1157n0225l8004L7866K5590
$$ plain form
39984 251572 142780 16196 19728 171685 352952 475904 537388 530030 435743 303056 202548
39973 202548 104994 -65182 -254254 -309050 -208369 -109178 -113304 -142875 -119596 -115118 -216479
39962 -216479 -364487 -442648 -435097 -392432 -325782 -235684 -167734 -141705 -97154 1734 83248
39951 83248 75991 17388 -31932 -89378 -169208 -198672 -128761 -37394 -5002 17269 87474 125322
39939 125322 41574 -76034 -83687 -17492 -19655 -82098 -68206 33652 88822 60105 72785
39928 72785 192057 309926 317802 251586 200889 186213 180801 164922 123853 67649 56624 122470
39916 122470 180984 125689 -17022 -141151 -227844 -314250 -342669 -232595 -88164 -116398 -308881
39905 -308881 -417880 -307239 -120801 -24703 10071 59954 81111 30886 -7118 30748 56338
39894E6338o3066n0475Q2341J40215M1616n3605k7458J9375k1191q1523o5274
39883b2707j1562l33k7838o3576j04686j06901K07J61438K02633O6255r4517j31115
39871a32702p2588q689N1318J05629Q7762j1746o9312l94R1973P0211k2382m1408
39859D7672K1574L1298p4866j91356j89524p2908M7232Q6881O8411P1637J20029
39848c3920J43585Q0686j8254n2750j7790j938m0047o5054l1608P441m854l8404
39836g2907l5601o44K5641L1855K7676R677k1105m0641l6701l3206n1671p4210
39824b71837o6846k0073M2789Q0766O7115K7391J9902M7875L8669l5179p6370
39813a45798K271J15904J07210j8656j01462o7673j1761p945P68N9717R4041M1782
$$ plain form
39894 56338 -6728 -57203 25138 165353 206969 153364 125906 145281 124090 42567 -22707
39883 -22707 -34269 -34602 -62440 -126016 -230702 -337603 -337396 -175958 26675 92930 -1587 -132702
39871 -132702 -205290 -213979 -162661 -57032 30730 18984 -50328 -50722 41251 111462 89080 47672
39859 47672 69246 100544 25678 -165678 -355202 -428110 -380878 -293997 -225586 -153949 -33920
39848 -33920 109665 190351 172097 119347 101557 99619 59572 -5482 -37090 -29649 -34503 -72907
39836 -72907 -108508 -109152 -83511 -51656 -23980 -14303 -35408 -76049 -112750 -145956 -197627 -271837
39824 -271837 -338683 -358756 -315967 -235201 -168086 -140695 -120793 -72918 -34249 -69428 -145798
39813 -145798 -143527 -27623 79587 60931 -40531 -108204 -119965 -127910 -127142 -67425 26616 68398
39801F8398j8290J5902J05811J34564P4033j0192p1896j04261q4503K6Q5049P9951
39789B74592r619p9958o0729O075L0818k2021j09858j58631j20546q596J08619
39778a49854J54671J03710j704r3957j44033j70814j80337j31437r018R8066Q2302
39767d42405j4636k9641Q4916J72706J04946j7561k2182O9117R2400N829p1799
39756f8310o8579l7957k1598J1046O1403P8470O4065P4653R9056O5428j3197m1333
39744B03147r415q738n2096m7670N168k1310j48444k03098p4830J02727J55761
39733i8798J07910P3739N2529p005m7747J0240R8948Q9350K03l8618M323L9752
39721B84826K1605q213k6042m7266m9488K670O3039N3889L970J0995O3493L6402
$$ plain form
39801 68398 50108 66010 171821 306385 380418 370226 298330 194069 109566 109592 194641 274592
39789 274592 264973 185015 124286 130361 161179 139158 29300 -129331 -249877 -258473 -149854
39778 -149854 4817 108527 106823 12866 -131167 -301981 -482318 -613755 -622773 -524707 -442405
39767 -442405 -457041 -486682 -401766 -229060 -124114 -141675 -163857 -94740 -2340 3489 -68310
39756 -68310 -136889 -174846 -196444 -185398 -123995 -45525 18540 93193 192249 257677 244480 203147
39744 203147 193732 184994 132898 85228 90396 69086 -79358 -282456 -357286 -254559 -98798
39733 -98798 9112 82851 135380 128375 80628 90868 189816 279166 279369 240751 245074 284826
39721 284826 306431 298218 272176 224910 175422 178092 241131 295020 298990 309985 373478 409880
39709D09880j03222k13600j64227q826R9555R8810N0502K4901K5266J7201j8781
39698B17459p4603j27988j53184j26676m1986O7457J34026J13257L4647l3128
39688I281o3075p7571q2619n5408q185M621k6028l4075J9754P4773N4502k1554
39676b05584o8824m8470N399M3978M4390J5135k740L2627J00904J26150P9461
39665A22426K6745K7758L7452k5259j42586k05430j48888k0871Q7254J32024J31766
39654B2391J24211J26435J25267R8696M0545m2122j38328k14582k09151r6423
39644a63061M7895J04263M4592l7943m5594K2285R0571Q4447j7716j54929k07449
39633b32639j09643N8713J53531J33729P8922N1839L4253K345l2655p5320j40770
$$ plain form
39709 409880 306658 93058 -71169 -79995 19560 118370 168872 193773 219039 236240 217459
39698 217459 142856 14868 -138316 -264992 -306978 -239521 -105495 7762 42409 9281
39688 9281 -53794 -131365 -213984 -269392 -277577 -272956 -298984 -333059 -313305 -238532 -184030 -205584
39676 -205584 -274408 -322878 -317479 -273501 -229111 -213976 -216716 -184089 -83185 42965 122426
39665 122426 149171 176929 214381 189122 46536 -158894 -307782 -328653 -241399 -109375 22391
39654 22391 146602 273037 398304 497000 537545 495423 357095 142513 -66638 -163061
39644 -163061 -115166 -10903 33689 -4254 -49848 -27563 63008 147455 129739 -25190 -232639
39633 -232639 -342282 -283569 -130038 3691 82613 134452 168705 171050 138395 63075 -77695
39622g7695j79314j09116M4468J41967J02231n956p5904p6248k6438M0808O3158
39611a58039k824q9654q3397Q8L0026k6143n5984q539K1285j6768k5471N6828
39599c58592J33525J21299Q8096R7278P0344n0433j46917r4680L4463R7824R2010
39588H4217P8513K4943r6991j69733q7581L7510L4317m6173k6633Q5764J19746
39577C7899L6400l0770k7599m3003r9111r3258R55O4148K7277k2347K305N9852
39565h7252P2794L8071o705l8197l7152j891K1745L538K89O5125J23006O7008
39553B20379n3211r3950n1078n6063j30873j37061j8844Q4027N4010k5331j9031
39542b27026M7048M9933k3861n9479J3648J21674J41785N5804k7677j2088N9028
$$ plain form
39622 -77695 -257009 -366125 -321657 -179690 -77459 -83415 -159319 -235567 -262005 -221197 -158039
39611 -158039 -160863 -250517 -333914 -333826 -303800 -329943 -385927 -394466 -373181 -389949 -415420 -358592
39599 -358592 -225067 -103768 -15672 81606 151950 101517 -45400 -140080 -105617 -7793 84217
39588 84217 162730 187673 90682 -79051 -166632 -129122 -94805 -140978 -167611 -81847 37899
39577 37899 74299 43529 15930 -27073 -126184 -219442 -218487 -154339 -127062 -149409 -147104 -87252
39565 -87252 -14458 23613 16908 -21289 -58441 -60332 -38587 -35049 -34760 30365 153371 220379
39553 220379 167168 73218 22140 -33923 -164796 -301857 -320701 -236674 -182664 -207995 -227026
39542 -227026 -179978 -130045 -153906 -213385 -199737 -78063 63722 119526 91849 79761 138789
39531A38789O6110r796o8108o0306n5209p8701l3809J12566K02797R9404r0628
39520B23109j69500j25673p5948l1806N9215J18079K7992j15199j00513N6504
39510a33740J21248P702j11617j06282n2807l0079J3881R5345J09517K3175l4764
39499i8421J4723P2094N0762K6749P7503J27277Q1565j5464p5187r6040r6871
39488F8690m1812O3589J18895P2374M739j9955n9094j48576j90233j02362L5970
39477a97775J12274J39102J61100J20708l2674j88782j91015n4335O7139R0890
39467B6632O3152L8723K0440O265L587r94k4084m9897n4847m2640k4087K60J4070
39454b3420p358m2156l3693K1511O0419M5713P207j7585j6123K0034O8846N2436
$$ plain form
39531 138789 204899 195103 126995 66689 11480 -67221 -101030 11536 214333 313737 223109
39520 223109 53609 -72064 -148012 -179818 -120603 -2524 25468 -89731 -190244 -133740
39510 -133740 -12492 -4790 -116407 -222689 -275496 -305575 -291694 -196349 -86832 -63657 -98421
39499 -98421 -83698 -11604 39158 65907 143410 270687 352252 336788 261601 165561 68690
39488 68690 26878 90467 209362 281736 286475 266520 207426 58850 -131383 -233745 -197775
39477 -197775 -85501 53601 214701 335409 302735 113953 -77062 -131397 -64258 26632
39467 26632 89784 128507 148947 155212 158799 157805 133721 83824 28977 -13663 -37750 -37490 -23420
39454 -23420 -30778 -72934 -106627 -85116 -24697 21016 28223 10638 -5485 14549 83395 135831
39442A35831n8746j46636q4104N4151Q3120m276l5284M2610P6230k1176j21436
39431g9716r6269k91N4875M9517J360p5793r8606J7927J66926J42391j4445k8086
39419C9790J52083K13055k6028k86650k52195m6249J7454n8298m6472O2365P9093
39408a52052o436j9273N9499O9176j0280j3326J04312J81685J24473K6283l1741
39397C32320q6664j44973j27313k4555O1556Q3965R7528J04497K0890j51784k75284
39386a09817k52728j31278O282J19961J58447P6977m6700n5148P6727J96155J82922
39375B21800Q0692k3133j12290j74214j48179k8784P5839P5470J7355M686N6750
39364D5992J10640J09386L8696p3260j50371j17700l085O1117p890j27712j50818
$$ plain form
39442 135831 77085 -69551 -153655 -99504 -16384 -20660 -55944 -13334 62896 41720 -79716
39431 -79716 -175985 -176276 -121401 -71884 -70524 -146317 -244923 -226996 -60070 82321 67876 39790
39419 39790 191873 404928 378900 92250 -159945 -206194 -188740 -247038 -293510 -231145 -152052
39408 -152052 -158488 -177761 -118262 -49086 -59366 -72692 31620 213305 337778 364061 332320
39397 332320 245656 100683 -26630 -51185 10371 94336 191864 296361 317251 165467 -109817
39386 -109817 -362545 -493823 -487541 -367580 -209133 -132156 -178856 -234004 -157277 38878 221800
39375 221800 302492 279359 167069 -7145 -155324 -184108 -108269 -32799 -15444 -10758 45992
39364 45992 156632 266018 304714 231454 81083 -36617 -39702 21415 13525 -114187 -265005
39353b65005n6417K9317J3361l5455N630J19219J59045O8605k1768J2114R8437
39342A27083R3462J8001O539O1580M9916n4040j18994q4568m2707m1676j3990
39331F06L2465k3662j62774j68634K7299J78246Q7481p6220n7342Q3127J08404
39320B8996J465o3663m6177n2664q4622l5606Q2826J40321R8391L1876k3981p0150
39308G012m8413O3838J35289N2152p4281p5464l02P550o987P5228J52534M2042
39296C30198j52218j57546O816N0194r0796j49458k169J19380K8848j19249j10241
39285b46241J3010R1514R8068P8615K4490n0733o2467l104J0495o5540j14260
39274b26153n7318K0473L5286L0863N2171N2193J3537J0846O9196J05145P6606
$$ plain form
39353 -265005 -321422 -292105 -278744 -314199 -308569 -189350 -30305 38300 16532 28646 127083
39342 127083 220545 238546 245085 306665 356581 302541 183547 98979 56272 14596 606
39331 606 33071 9409 -153365 -321999 -294700 -116454 -28973 -105193 -162535 -79408 28996
39320 28996 30461 -33202 -79379 -132043 -216665 -252271 -169445 -29124 69267 101143 77162 7012
39308 7012 -41401 22437 157726 209878 135597 60133 59831 67381 60394 135622 288156 330198
39296 330198 177980 20434 27250 77444 -13352 -162810 -164979 -45599 -16751 -136000 -246241
39285 -246241 -233231 -141717 -43649 34966 59456 8723 -53744 -56848 -46353 -111893 -226153
39274 -226153 -283471 -262998 -227712 -196849 -144678 -92485 -78948 -68102 1094 106239 182845
39263A82845M4026K9728k2522r9812j04196l1195J1877O82J5690M7630M102o6174
39251A2681j5769R5991L9803j66135k07646K2001K08089J00596j04449j18967
39241a33805j1673p451p4070l6166O7229O5032j6676j0828P5790P8772l3082j22587
39229a59515j14793o0725J478P1872J08094P5669L7446N8860Q8252N9424K4214
39218A90276M4327N4374j2555p0849k5524L6682j1440j01067p6631L3831O7513
39207A28937o257o9961p1123n9632m1020K2488Q2856N1752l6210o3030j5510J4531
39195f2179j563q515J389k1660p1836q9533o3980k8529J4307O2977O6803J3138
39183a89181o190O5868J30700Q7892J3427K2945N7785K780p3651l0327N8828o400
$$ plain form
39263 182845 226871 256599 234077 134265 30069 -1126 10751 11433 27123 74753 78855 12681
39251 12681 -3088 92903 132706 -33429 -241075 -219074 -10985 89611 -14838 -133805
39241 -133805 -145478 -152929 -226999 -263165 -195936 -130904 -147580 -158408 -82618 -3846 -36928 -159515
39229 -159515 -274308 -335033 -333555 -261683 -153589 -77920 -40474 18386 106638 166062 190276
39218 190276 234603 288977 276422 205573 180049 216731 205291 104224 27593 61424 128937
39207 128937 122680 52719 -18404 -78036 -119056 -96568 -13712 38040 1830 -61200 -76710 -62179
39195 -62179 -63742 -72257 -70868 -92528 -164364 -253897 -317877 -346406 -332099 -269122 -202319 -189181
39183 -189181 -195371 -129503 1197 89089 102516 125461 183246 186026 112375 82048 140876 134476
39171A34476j87982k12995M919K04617J46783o5956j77356j26380n0783m1923
39161c72580n2388j8237M4090P8981P1201N7432O6351O7272J1716p4171r9351
39150b19684l4450M3022O9027P2095P6334L2098o5375r6141J7109J50247J35114
39139A79396Q864n3697p966L2166R359j3171j2044n6682j59057k15146j57598
39128d45576n4627L730K4978N7338Q8152O9238M792m3206k8649K7764O1892L4507
39116a99667k7816o8921o8044m0629P711P4601J17995Q7432j068q4125j28378
39105c30909j14651O587K15610L24564J65602j26179k31491q0715O4681L1279
39095g5622k7520N4879J60676J05315n0860j33825j39765j60152j54212l1983
$$ plain form
39171 134476 -53506 -266501 -261582 -56965 89818 23862 -153494 -279874 -330657 -372580
39161 -372580 -424968 -443205 -399115 -320134 -248933 -191501 -125150 -57878 -46162 -120333 -219684
39150 -219684 -254134 -211112 -142085 -69990 6344 38442 -26933 -123074 -105965 44282 179396
39139 179396 188260 134563 126597 158763 168122 154951 142907 86225 -72832 -287978 -445576
39128 -445576 -500203 -496473 -471495 -414157 -326005 -256767 -251975 -295181 -323830 -296066 -234174 -199667
39116 -199667 -227483 -296404 -364448 -405077 -397366 -322765 -204770 -117338 -118406 -202531 -330909
39105 -330909 -445560 -438973 -223363 101201 266803 140624 -90867 -171582 -106901 -75622
39095 -75622 -103142 -48263 112413 217728 166868 33043 -106722 -266874 -421086 -453069
39085d53069J26457J57622O4708l210K9266J14065J81095J61835P147j97327k56625
39074f8036j29801j3453l1689m2367P5516J69645Q4698l4692N353R1889J7638
39063A24701j26394j20726l0051o7096j62482p7060J32159J80283N4854J9100
39053g2712J09908P3196j37495k31916p6359Q1338M3066m0869N428P9913L7189
39042a29313l7729j0581N6591M3787j1838j3910K1619L3864K6016Q03p5077j54490
39030b50258j08848O8489K03479J66478K1741j01997j46050r1298M3124J37127
39020e8013P6887n3119p0593P892k623j12984j16922M7319J67615R8837k0204
39009c5908k3387L6043L9847O635n171k3831o2093m4525M8284J09201P3238J3299
$$ plain form
39085 -453069 -326612 -168990 -104282 -107492 -78226 35839 216934 378769 385916 188589 -68036
39074 -68036 -197837 -211290 -242979 -285346 -209830 -40185 44513 9821 15174 107063 124701
39063 124701 -1693 -122419 -152470 -219566 -382048 -459108 -326949 -146666 -91812 -72712
39053 -72712 37196 110392 -27103 -259019 -335378 -254040 -210974 -251843 -246415 -166502 -129313
39042 -129313 -167042 -177623 -121032 -77245 -89083 -102993 -81374 -47510 -21494 -20691 -95768 -250258
39030 -250258 -359106 -290617 -87138 79340 101081 -916 -146966 -238264 -195140 -58013
39020 -58013 18874 -34245 -104838 -96946 -99569 -212553 -329475 -282156 -114541 -15704 -35908
39009 -35908 -59295 -23252 16595 23230 18059 -5772 -67865 -112390 -64106 45095 118333 131632
38997A31632m574r915j9330o963j9451j26738k28836j39997R1156J97345R0016
38986d5655k6635j8048o735q2653j18865l2651L8525n248m0659L1552R2646L9397
38974a75029j9450J5149L9201l7567j01603n3524K041k1596o437J25399K05402
38963b8014R0927o4434n7814L7234M2163j1020L139L6310j3350n8046K8752J40932
38951A46779R2017o1143j12525m3143n510l5553l0031K5853L6651j3262l7750
38940c7617k393N2472J07157J47295J09456k7813j61478j88933j39496q2787j5089
38929b39226N7979N9812j1981k0486R3602J75946Q6945q0169j61678j52839j17042
38918c09137k6965J23860K01439J13344j9078m1605J4055M7174O3439P1544j3617
$$ plain form
38997 131632 127058 117143 97813 90850 71399 -55339 -284175 -424172 -333016 -135671 -45655
38986 -45655 -72290 -90338 -97073 -179726 -298591 -331242 -292717 -297965 -338624 -307072 -214426 -175029
38974 -175029 -194479 -179330 -140129 -177696 -279299 -332823 -330782 -352378 -358815 -233416 -28014
38963 -28014 62913 -1521 -59335 -22101 20062 9042 12181 48491 35141 -22905 5847 146779
38951 146779 238796 177653 65128 21985 16475 -19078 -49109 -23256 13395 133 -37617
38940 -37617 -40010 12462 119619 266914 376370 348557 187079 -1854 -141350 -224137 -239226
38929 -239226 -181247 -121435 -133416 -153902 -60300 115646 202591 122422 -39256 -192095 -309137
38918 -309137 -336102 -212242 -10803 102541 83463 41858 55913 103087 166526 238070 224453
38907B24453j82532k37998r2170M1699k3018j32239n9687J08436J44928O5223
38897a42905L6388N0265k179n6202J3973J14007O9363m8086l8999O5480P4559
38886A35664r670k4159L1010J2901o5421o3811p690m6266j41340j02839O7316
38875b14305J59242R4324O990k5291o7150j17782p1703P3890J87563K02081J56192
38864C84051N5704j05062k14737j55809j6091K5834j4467J6217J15754J40093
38854B31487P6433M6292N5460o49r0178o4414O3215J06651M468r7624r2135l4879
38842B04127o7Q229j2197n8013o1698J5170P6238K7766n7461p5311p7603j35447
38830a46267j49840k5124J05895Q4318J3281O3302J34114L3400j33877j11020
$$ plain form
38907 224453 41921 -196077 -288247 -246548 -269566 -401805 -461492 -353056 -208128 -142905
38897 -142905 -106517 -56252 -58431 -114633 -100660 13347 82710 34624 -4375 61105 135664
38886 135664 125994 101835 132845 145746 80325 16514 8824 -37442 -178782 -281621 -214305
38875 -214305 -55063 39261 46251 20960 -46190 -163972 -235675 -161785 25778 227859 384051
38864 384051 439755 334693 119956 -35853 -51944 -26110 -40577 -24360 91394 231487
38854 231487 307920 354212 409672 409023 318845 254431 317646 424297 428765 331141 239006 204127
38842 204127 204060 212289 200092 142079 80381 95551 171789 199555 142094 66783 -10820 -146267
38830 -146267 -296107 -321231 -215336 -131018 -117737 -54435 79679 113079 -20798 -131818
38820a31818O8251J46595P9663L8839M0273m6890j63768j21794K2537L7641n7180
38809h7651l1387J02178R0279q4515j54579m2303L2039j7449j6713P7814P6133
38798e6154n1513p9802N1405J14195K0939j5796R9054J52077K2860r1322m3653
38787A22290J5526l9903p2587K4442R8819K2380o8294k5319O1521O2302K6734
38776B27911L4075L7090L407M657M8086L6216j8650J6320J17322R2359p3583j59111
38764C66099q1103j6963n6257o0160J9458K4341p3629o6401J08285K18836J31446
38753E13952J1895j6754o1493j42976p6868J30881J64218q7917k80804j52163
38743A971N8384L7359r9579p8497N4162Q3670K1677R530K3193k1672n1204R522
$$ plain form
38820 -131818 -63567 83028 162691 201530 241803 194913 31145 -90649 -68112 -30471 -87651
38809 -87651 -119038 -16860 73419 -11096 -165675 -207978 -175939 -193388 -210101 -132287 -56154
38798 -56154 -107667 -187469 -136064 -21869 -930 -16726 82328 234405 257265 165943 122290
38787 122290 137816 97913 25326 49768 148587 170967 102673 77354 138875 201177 227911
38776 227911 261986 299076 302483 307140 355226 391442 372792 389112 506434 598793 525210 366099
38764 366099 284996 268033 211776 151616 171074 195415 121786 55385 163670 382506 513952
38753 513952 525847 509093 447600 304624 227756 358637 522855 434938 154134 1971
38743 1971 60355 97714 -1865 -80362 -26200 57470 79147 88677 111870 90198 38994 48516
38731D8516M5255l5904r4962o469R8513P1775J2050M6934P6178j0860q3225l926
38719A63875R0933K5490r4140o8945N1701Q7043L4681J2769K5023P003j6327n026
38707C14080m285k4968J1236Q6417N6116p5415j00418L7097J12486K792j04818
38696C10320o6886k7892j03249j40875l1680N8754J0575j8401P2267R8342l2675
38685A28600p5281J14771K52209Q4723j54702j40959J0889J3537p6972m0970N3584
38674A69429R707r1314n2739M6817J5103p0857j8855J00702Q8195k4566p4243
38663I7379o5249o7441n441J51833K08169N1897q5511N065J46979J08074O481
38652E52235K3841J7295j69834l05368j33656J22067J04980o5400l2042J56030
$$ plain form
38731 48516 93771 57867 -37095 -43564 54949 126724 138774 185708 261886 251026 167801 163875
38719 163875 254808 280298 186158 117213 168914 255957 290638 303407 328430 335433 319106 314080
38707 314080 309795 284827 296063 382480 438596 363181 262763 299860 412346 415138 310320
38696 310320 243434 215542 112293 -28582 -60262 -1508 9067 -9334 62933 161275 128600
38685 128600 53319 168090 420299 505022 350320 209361 220250 233787 156815 115845 169429
38674 169429 179136 87822 35083 81900 97003 26146 7291 107993 196188 171622 97379
38663 97379 32130 -35311 -40752 111081 319250 371147 285636 290701 437680 545754 552235
38652 552235 576076 593371 423537 118169 -15487 106580 211560 146160 114118 270148
38642B70148J62902k2350j06627k5279J9544k5199l3642m294j4279J2142J33160
38631C66226J56899m9198k22650q7001J50583J26407p2526j06172J5431L0602
38621C08601m7368j4654O3734j2085j25880l6390J22635N3596j28989p4769J60122
38610B68553J99432M407r6041K318O5144j5546j00900j28779j50528j06480N4616
38599c804J48061K3715j07778j6321J08038J485j50550m4726J51122R8563p8890
38588A28915n7486M9159m8880j72275K0542L09076K29712p5016r5077J22923R7072
38577E08665j64644j99369J0274J7237k11865k34490J3086J14555r530J1582K11074
38566F6575J86122r5827j78515N1722J74810K8589n0129O6927Q0107q4810j13061
$$ plain form
38642 270148 433050 410700 304073 278794 298338 273139 239497 235203 220924 233066 366226
38631 366226 523125 473927 251277 164276 314859 441266 368740 262568 277999 308601
38621 308601 261233 246579 310313 298228 172348 135958 258593 312189 183200 108431 268553
38610 268553 467985 472392 376351 378669 443813 428267 327367 198588 48060 -58420 -3804
38599 -3804 144257 167972 60194 43873 151911 153396 2846 -41880 109242 207805 128915
38588 128915 71429 120588 71708 -100567 -80025 229051 458763 383747 288670 411593 508665
38577 508665 344021 144652 154926 172163 -39702 -274192 -261106 -146551 -156081 -144499 66575
38566 66575 252697 156870 -21645 30077 204887 233476 183347 250274 330381 245571 132510
38555A32510M7134N9992j25419j64519l067K4112j12009o3474J64719J61160r7442
38544B3697j60123O3542J54990R27l5200J12005P9480j35690r6078K06183K55134
38533D68867l9833j75904j6710n739k19677j70090J96509K86407m7587j94200
38523H2043Q4812K20248o0583k09660Q4886L07952J17841j3719K64075N13813
38513A391708L71890K09523L25727L19193j07020n03860m59620k82556l22648
38504I42337l49406j58977n7750k02045k01613J06707K58011K2120j38031M5450
38494B66803J47519o7288j56280R2921J92149p2822j64296J45343K48372j44029
38484D88392l71517k9189K64986M7591j31060J60917L35031q4719m78119k38935
$$ plain form
38555 132510 179644 239636 114217 -50302 -53369 -29257 -141266 -204740 -40021 121139 23697
38544 23697 -136426 -72884 82106 83033 47833 159838 239318 103628 7550 213733 468867
38533 468867 429034 253130 236420 230681 11004 -159086 37423 323830 276243 82043
38523 82043 166855 387103 326520 116860 201746 509698 627539 613820 877895 1391708
38513 1391708 1763598 1973121 2298848 2618041 2511021 2007161 1547541 1264985 942337
38504 942337 592931 433954 376204 174159 -27454 79253 337264 359384 221353 266803
38494 266803 414322 347034 190754 283675 475824 403002 238706 384049 632421 488392
38484 488392 116875 87686 352672 400263 269203 430120 765151 680432 202313 -36622
38474c6622J33412L5387j32202J25149L44853L3621k80523j4085L37574J28129
38464F74693k36839j26462J29614q317j83996R0529L76151J30179k09318o1832
38454E74402J85533k131k21917K6270K81434K8089k30531N3033L48033O6682k53887
38443H55010R04K89128j8321l59711q2225K33693q1834l97314K8958N52073L32105
38432A352466o9019J71051N10345J66644k66968q40L12309j48215o44079k37796
38422A145898L34053M0323m40525q1650M15029O659n35323q2806N55406J36787
38412A493851n52941j96583M58486R0306n07940K2826P87636K90650n24423K637
38402A364505R29533M35205n77503j46116R03320N38774m46284J3914J060006
$$ plain form
38474 -36622 96790 132177 -25 125124 469977 503598 223075 208990 546564 674693
38464 674693 437854 311392 441006 432689 248693 339222 715373 845552 636234 574402
38454 574402 759935 757804 535887 562157 843591 871680 641149 694182 1042215 1108897 855010
38443 855010 855914 1145042 1126721 767010 684785 918478 836644 439330 468288 1020361 1352466
38432 1352466 1283447 1454498 1964843 2131487 1864519 1863679 2175988 2027773 1383694 1145898
38422 1145898 1479951 1520274 1079749 998099 1413128 1419787 884464 801658 1357064 1493851
38412 1493851 940910 744327 1202813 1293119 785179 808005 1595641 1886291 1361868 1364505
38402 1364505 2294038 2729243 2151740 2005624 2908944 3447718 3001434 3015348 4075354
38393D075354N29415n96243P5019J514613J053797l41370J86119J701338J213972
38384I412014k23375O58924K711383K332538Q07387K173485M987265M675574K984947
38375C0520142N451592J0395547J1620224J1405175J7471468K7371184L3149720
38368A47385052M2939740P3699407J11876274J07793962L4089352o6372682j19997287
38361C31413818j03658429n9763383l3866576k8148320k2973296j4287327j0660995
38354E8055492j1541489r201902m193133k969766m925296m303878j373849r98236
38346A8547943k877557k627763m29569k09309j852083j784190l1161J68831j207229
38337G697913j201963K44988M19117p80873q96528J45530R8754r94662r16669
$$ plain form
38393 4075354 4604769 4008526 4083545 5598158 6651955 6310585 6496704 8198042 9412014
38384 9412014 9188639 9847563 12558946 14891484 15698871 17872356 22859621 27535195 30520142
38375 30520142 35971734 46367281 57987505 69392680 86864148 114235332 147385052
38368 147385052 190324792 264024199 375900473 483694435 517783787 451411105 331413818
38361 331413818 227755389 167992006 134125430 105977110 83003814 68716487 58055492
38354 58055492 46514003 37312101 33118968 30149202 25223906 20920028 19546179 18547943
38346 18547943 15670386 13042623 12613054 12403745 10551662 8767472 8736311 8905142 7697913
38337 7697913 6495950 6740938 7160055 6379182 5482654 5628184 5726938 4732276 3815607
38328C815607L07250M79301n08460o17367L06832L85674n14966o15386K07775
38319C246260K57026n70713o21403K15019L22021m38430n01750K87446L96702
38310B592178l74348n38592J75731L86948k08518l74972J15681J01480n13409
38301A362179m79023L02434M87291j57448l43464K30577L56308k75401m86467
38292I96986P5112K94158k03457l79254J15359K72174k41307m17652R8635L19605
38282I30359j42623l42492J24547L55408o5922k85302J04282K80866j46383l53762
38272D58978P4842L34324l4772k89397M3431K96087K1409j74296R1818K16995
38262A039419j34846l21047J4882K29401o2126k50151M4850K30552o7920k64725
$$ plain form
38328 3815607 4122857 4602158 4093698 3476331 3783163 4168837 3653871 3038485 3246260
38319 3246260 3503286 2932573 2311170 2526189 2848210 2409780 1908030 2195476 2592178
38310 2592178 2217830 1679238 1854969 2241917 2033399 1658427 1774108 1875588 1362179
38301 1362179 883156 1185590 1672881 1515433 1171969 1402546 1758854 1483453 996986
38292 996986 1072098 1366256 1162799 783545 898904 1171078 929771 512119 610754 930359
38282 930359 787736 445244 569791 925199 859277 573975 678257 959123 812740 458978
38272 458978 533820 868144 833372 543975 587406 883493 904902 730606 822424 1039419
38262 1039419 904573 583526 598408 827809 765683 515532 560382 790934 723014 458289
38252D58289K8273K51207J1767j71494N7940J82511j24314l04964l312K14422
38242F00325n5306k79777l1030K04448j113k03878Q11J85546l6737k33757L499
38231A53031K78113J73461J8154J68936L12601J51090J2560J48937K10277K4083
38221A651243O3853N05134O72300J23860n31972o20924m05912l85471l83416j11290
38211E77405J01022o8908k47168n7524J44907k6884k09671L0392L53027K52157
38201H48755n4593r7359J2750n4347j58445n7229K6873j33756k42249l6627J44847
38190A98620j5472j77409K6494K79596J71332n1405j0864P0923j17423k71512
38180A02880k7124K75524J48999j74254j90756j1614l9652j65265m7978J61464
$$ plain form
38252 458289 486562 737769 749536 578042 635982 818493 694179 389215 385903 600325
38242 600325 545019 265242 234212 438660 437547 233669 234480 420026 383289 149532 153031
38231 153031 431144 604605 622759 791695 1104296 1255386 1267946 1416883 1627160 1651243
38221 1651243 1715096 2220230 2892530 3016390 2484418 1863494 1457582 1072111 688695 577405
38211 577405 678427 609519 362351 304827 449734 422850 213179 243571 596598 848755
38201 848755 794162 696803 709553 655206 496761 439532 466405 332649 90400 53773 198620
38190 198620 183148 5739 32233 311829 483161 431756 420892 491815 374392 102880
38180 102880 75756 351280 500279 326025 135269 123655 84003 -81262 -129240 32224
38170C2224J20671k3627L9098J29503m7652k39223p3375K00683J36224r1081l8011
38159A45434J58352O7683j85360j54263Q3024R6987o7882j6541J97471J56653
38149D81558j31118k39968o2855J02084J31766J46213R4246j42326l36732j83122
38139a40254J37986K12377P0051M9979J44012O8658j35809j69604l9189k243n1418
38128A44546J1057J06053K0100j20056n2049R3145J7135j52474p5031J45774J23275
38117B61475j10846j75381k1143N4081o65L1047J19656L2870j55655j58364j9712
38106a42637k1553j15083j5637K02185J93360j5493o4162Q2273J02115n5813r9838
38095D9717K4501N3357n2313l5096J28021J52869k3739j39853r3282n7645p5798
$$ plain form
38170 32224 152895 129268 168366 297869 250217 10994 -62381 138302 274526 183445 145434
38159 145434 303786 371469 186109 31846 114870 211857 143975 127434 324905 481558
38149 481558 350440 110472 47617 149701 281467 427680 521926 379600 42868 -140254
38139 -140254 -2268 210109 280160 330139 474151 542809 407000 237396 198207 195964 144546
38128 144546 155603 261656 281756 161700 109651 202796 219931 67457 -7574 138200 261475
38117 261475 150629 -24752 -45895 8186 7521 38568 158224 191094 35439 -122925 -142637
38106 -142637 -164190 -279273 -294910 -92725 100635 85142 20980 103253 205368 149555 49717
38095 49717 74218 127575 75262 40166 168187 321056 297317 157464 64182 6537 -69261
38084f9261q328Q8227R544j51394r1198J53073K28038O0138o4392l8478n2178
38073F3791j35228q3613R8513J60282N9979L909J0045r5165k39641j66003N9238
38062b63893J11145p428J6882J88203J76066l8981r2592R3026J62762j3384j24557
38051B07249k6547J3755j21921j62499P435J02101j9226p9757P4769J63191r758
38040A48792j81589r3235Q8929J13171L3071j5479p3106j43765p5758J09924J29977
38029D0932r3100k35595p7902J56717K05530J45663J23307O4912p2761j03505
38019A54198N9519J83869Q9726n3581n0831o92m2173q0023k4952k1180j62730
38008E1150k49693j06975R0703Q8221n7091j09164j2343J06398J54095J19210
$$ plain form
38084 -69261 -77589 10638 20182 -131212 -222410 -69337 158701 218839 154447 115969 63791
38073 63791 -71437 -155050 -56537 103745 163724 167633 177678 82513 -157128 -323131 -263893
38062 -263893 -152748 -160176 -143294 44909 220975 181994 89402 182428 345190 331806 207249
38051 207249 180702 194457 72536 -89963 -82528 19573 347 -79410 -4641 158550 148792
38040 148792 -32797 -126032 -37103 76068 109139 93660 20554 -123211 -198969 -89045 40932
38029 40932 -52168 -287763 -365665 -208948 -3418 142245 265552 330464 257703 154198
38019 154198 213717 397586 487312 433731 382900 382208 340035 260012 235060 213880 51150
38008 51150 -198543 -305518 -214815 -126594 -183685 -292849 -305192 -198794 -44699 74511
37998G4511L2562j2649M8149R8689j2022j68519j19089Q7008J46413J6913k3955
37987A68011R2414R5661r1814j72261k1343N9017j02208j98899J7215K77762K42813
37976C66368L9605k7974Q969m3912j27267p1898M8473N8235l994r876J572l8535
37964A99766l3828P6876J34552K4968r5195q0552n5903j34473j47772M2905K20496
37953A51840J28598j01984j71457o6366J9268M2166P8596Q9925J1334o2839l6153
37942H2928j478m9267p0075K3134Q8067J3769l7917Q1100K04299J22521o0047
37931C97034j32992j27071j57234j39588J6115J39568N4921q8306o2169N4456
37921d5266O2874J7244O6969J20631K7431q5017k1715R9713N2150q1840p6529
$$ plain form
37998 74511 107073 94424 142573 241262 229240 60721 -58368 28640 175053 191966 168011
37987 168011 260425 356086 264272 92011 70668 129685 27477 -171422 -154207 123555 366368
37976 366368 405973 377999 386968 343056 215789 143891 192364 250599 246605 236729 238301 199766
37964 199766 165938 242814 377366 402334 307139 226587 170684 36211 -111561 -68656 151840
37953 151840 280438 178454 6997 -59369 -40101 2065 80661 170586 181920 119081 82928
37942 82928 81450 32183 -37892 -14758 73309 87078 49161 130261 334560 457081 397034
37931 397034 264042 136971 -20263 -159851 -143736 -4168 50753 -37553 -99722 -45266
37921 -45266 17608 34852 101821 222452 249883 164866 143151 242864 295014 213174 136645
37910A36645R352k8518j18216m7368R9084O6315r6162j17095P404L6433m9413
37899a01539l4898R1288J07276j5512n6775M3870R7858L5603R117O9447P3773
37888C19508k1663q0679n5561n2654q8499n6693L0612L9797k3658j9030N5865
37877D7345O6080J3254K4306P0760j088j54681j87272q6511m9833j19645j17950
37866d95235Q955R7640Q2404R5640J79239J93201R5172K5267K9069k0504j38305
37855A52543j51691j3344Q9483N2658J2343O1470P6226k6654j05361l2761Q6738
37844B01650J03030M7129K3857L0874J4964k2819p4953j48913j78254p1476R2263
37833A7352J00012q5915k39800j81657J950J34992J72107J42063M4084q2020j25539
$$ plain form
37910 136645 145997 117479 -737 -48105 50979 117294 21132 -95963 -88559 -52126 -101539
37899 -101539 -136437 -45149 62127 46615 -10160 33710 131568 167171 176288 245735 319508
37888 319508 297845 217166 161605 108951 20452 -36241 -5629 34168 10510 -8520 47345
37877 47345 113425 126679 150985 221745 220657 65976 -121296 -207807 -257640 -377285 -495235
37866 -495235 -486280 -388640 -306236 -210596 -31357 161844 257016 282283 311352 290848 152543
37855 152543 852 -12492 76991 129649 141992 203462 279688 253034 147673 114912 201650
37844 201650 304680 351809 375666 406540 421504 398685 323732 174819 -3435 -74911 17352
37833 17352 117364 31449 -208351 -390008 -388058 -253066 -80959 61104 105188 23168 -102371
37822a02371n2989L3663O2757Q2490J18358R7271J086n4644L115Q1057P0302J065
37810C41160m7774q0707j29530j61372j37011q8169o1909m8550j7449L2694R1228
37799c07389J45105J58404J05265K1662l8430p3314q9535m3698O9907J37865O5879
37788A51721n7362p8381n410L9490L5036M8257N9045n544r6250j01097n1500o5144
37776a27139j14179p2008L1983M5718k1883m333J13764J48581K9451q4887p6026
37765a30958k8401l7107n4154j6636M2340Q5645J23602J25881L4646j03230j68941
37754a27313j45224j00205k4459J21683K34472J75924L4011J4987R1490M9831
37744C25197j07736j36758K2762J31090N7343k3573K5201P2262m981r2702o8358
$$ plain form
37822 -102371 -155360 -121697 -58940 23550 141908 239179 240265 185621 188736 269793 340095 341160
37810 341160 293386 212679 83149 -78223 -215234 -303403 -365312 -413862 -431311 -398617 -307389
37799 -307389 -162284 -3880 101385 123047 84617 11303 -78232 -121930 -52023 85842 151721
37788 151721 94359 15978 10568 50058 85094 133351 192396 186852 90602 -10495 -61995 -127139
37776 -127139 -241318 -313326 -281343 -235625 -257508 -261841 -148077 504 29955 -54932 -130958
37765 -130958 -159359 -196466 -250620 -267256 -224916 -139271 -15669 110212 144858 41628 -127313
37754 -127313 -272537 -372742 -397201 -275518 -41046 134878 168889 183876 275366 325197
37744 325197 217461 80703 103465 234555 291898 268325 293526 365788 360807 268105 199747
37733A99747j0413j1024q706L4275J7752p6813q6469M9495J38086L7548j12016
37722A71462j39142r6476q1937l2980R5232J59470N3793q3628r6228n5754q0450
37711a86638j00775k5447M5903P282l2269N0425J38972P4928m6252l9514M4496
37700f8889K8996o4749p6023n676N363n6554p4602k3801K2381O2952J38449J77669
37688F5516Q6136n1941o8379K0676M4747l7143q1372j668J05704J13051J5725
37677B11052q7686r2699J9856J34620J02041n4816j32714k7021J06322Q1270n1719
37666B08506j12053n2964L2101P3675N2085m8409j70469j67539j727J45846J13657
37655G2709j735j2004O8835Q6475J4292l7500k1743J3693M3999O4756L3465m5457
$$ plain form
37733 199747 189334 178310 169604 203879 221631 144818 58349 107844 245930 283478 171462
37722 171462 32320 -64156 -146093 -179073 -83841 75629 129422 45794 -50434 -106188 -186638
37711 -186638 -287413 -312860 -266957 -259675 -291944 -241519 -102547 -27619 -73871 -113385 -68889
37700 -68889 -39893 -104642 -180665 -186341 -180978 -237532 -312134 -335935 -313554 -250602 -112153 65516
37688 65516 151652 99711 31332 52008 96755 59612 -21760 -23428 82276 195327 211052
37677 211052 123366 30667 50523 185143 287184 232368 99654 72633 178955 260225 208506
37666 208506 96453 43489 75590 149265 201350 152941 -17528 -185067 -186794 -40948 72709
37655 72709 70974 58970 127805 214280 228572 191072 169329 183022 227021 291777 325242 279785
37643B79785o1091L3109R2933p166j50718j55080o1252l2891o1282j0176J09882
37632b3947J56746J10601P8591O7837j3419j32145j39423k7433L4485l4598j10607
37621c3312o9401M4069J07955P0727k9287j04459p6395K8375P6450N120p1157
37610e1315m3615M72o7320j61826r4855J04929K05397J07138l6156o4109m87M8192
37598e3555L9823q337o3526p9460l2855L2982O2711O1560N3796K9364M335M4685
37586I1523J33008J20817n5821k23471j92763l1612N9149M8283N2464Q6808N4030
37575A42415n2236j29064j27873p2797L9275J92760K69160J84864M7175m915k7009
37564D61755j32083k29547j55494J1652M6994m9230o4438N2362J21168N7378j4247
$$ plain form
37643 279785 218694 251803 344736 337570 186852 31772 -29480 -62371 -123653 -133829 -23947
37632 -23947 132799 243400 321991 389828 376409 244264 104841 77408 111893 77295 -33312
37621 -33312 -102713 -58644 49311 120038 90751 -13708 -90103 -61728 14722 19842 -51315
37610 -51315 -94930 -94458 -161778 -323604 -418459 -313530 -108133 -995 -37151 -101260 -101747 -53555
37598 -53555 -13732 -22069 -85595 -165055 -197910 -164928 -102217 -40657 13139 42503 46838 91523
37586 91523 224531 345348 289527 66056 -126707 -158319 -99170 -50887 1577 88385 142415
37575 142415 90179 -38885 -166758 -239555 -200280 -7520 261640 446504 493679 488764 461755
37564 461755 329672 100125 -55369 -43717 3277 -45953 -110391 -58029 63139 120517 106270
37553A06270j8973l9151r6713p7533M6062J38816J26664R4124R1623M9142m6588
37542C73743q4921k0205M5536L4806j0920n3403j08857j43557q9993M422J6899
37531c6450m7915p3930m8538n8387q0203r769R9095Q1167l7304n5343M9378P4723
37519a43476l9185r9067m862R1186Q3921P7921J20141O9996j02154j78974m9437
37508a73990P7257K1695o6028M265J17662P0591o7601r3275j5776P691l3830l2693
37496a84032Q059O744j2626K4426P9127P6671N9128Q3215P1034m5827j42894p5099
37484e2074O3507P5006k6565o4426m421K5012j2835j8583L6299O9232O5227J00208
37472B55587J61001J25658l1292j71403j83320j10648m0271J6560P1215Q5238
$$ plain form
37553 106270 87297 48146 -48567 -126100 -80038 58778 185442 279566 371189 420331 373743
37542 373743 288822 268617 314153 348959 338039 284636 175779 32222 -57771 -53349 -36450
37531 -36450 -84365 -158295 -206833 -265220 -345423 -355192 -256097 -174930 -212234 -267577 -218199 -143476
37519 -143476 -182661 -281728 -286590 -195404 -111483 -33562 86579 156575 54421 -124553 -173990
37508 -173990 -96733 -75038 -141066 -136801 -19139 51452 -16149 -109424 -125200 -117509 -151339 -184032
37496 -184032 -175973 -169229 -181855 -157429 -78302 -1631 57497 140712 211746 165919 23025 -52074
37484 -52074 11433 86439 59874 -4552 -8973 16039 3204 -15379 20920 90152 155379 255587
37472 255587 416588 542246 510954 339551 156231 45583 5312 21872 93087 178325
37462A78325K6020o0435r5026o3214k8315m5829q2945n2559N4298J16925L6275
37451a6480r7147r9055M9559J71407J45180M8437j739r903k8742n0570n6134o3356
37439h543n9817m322M9226j9332j70604j85472J7889K24170K21277Q9460J9296
37428A73228O210o0716j38851j03505L614L4883n149R059O7595L4728q2828j08011
37416a69743J9350J28880P1979p2309j35566q4513j3680O161j3239k7745p881
37405b98306M4924R4224R2700L0920l8956l7484O4313J85452J87714L7820j18145
37394B45176j22950j9980J4893o5611j30948r3309j6201L6245R3255J57175J50868
37383B48613O5263N215N887l3412j40197j72799n4342P2213O5639j400n344J6334
$$ plain form
37462 178325 204345 143910 48884 -14330 -42645 -88474 -171419 -223978 -169680 -52755 -16480
37451 -16480 -113627 -212682 -163123 8284 153464 201901 200162 190259 161517 110947 54813 -8543
37439 -8543 -68360 -72682 -23456 -42788 -213392 -398864 -380975 -156805 64472 153932 173228
37428 173228 179438 118722 -20129 -123634 -120020 -85137 -90286 -81227 -13632 21096 -61732 -169743
37416 -169743 -150393 -21513 50466 -21843 -157409 -241922 -255602 -249441 -262680 -290425 -298306
37405 -298306 -253382 -159158 -66458 -35538 -74494 -111978 -47665 137787 325501 363321 245176
37394 245176 122226 102246 117139 51528 -79420 -172729 -188930 -152685 -59430 97745 248613
37383 248613 313876 319091 324978 291566 151369 -21430 -75772 -3559 62080 60680 55336 71670
37371G1670j0862j6882P6654J69837J30403J2684n4108p7246j13405j02262K759
37360H9242O5291l8618j67160j03422R2417J78105J02100J8849r017n2306r5876
37349G9605n0140L1713J0307p2014m2957P7866Q5899m8307j05647K3351J64309
37338A53985J43138K2593n3251n8637k3582N7368J47031J42137K5691q1128r6737
37327C78608q8850j39167k15285k42753k02125j04601K9914J34269J33886N3867
37317b62237o483j3056r763m620L1384O0743J4702o6219o6486K5048J04999J20312
37305g1676J03140N5301m3891j23266q1999L4317Q7342O8626Q6059J34885R0583
37294C39421n0940j37817j07133o4189p2733o7615k8170l3724q1287m8903Q3158
$$ plain form
37371 71670 60808 43926 120580 290417 420820 433504 379396 302150 188745 86483 89242
37360 89242 154533 115915 -51245 -154667 -62250 115855 217955 236804 227787 175481 79605
37349 79605 29465 61178 71485 -529 -43486 34380 120279 71972 -33675 -10324 153985
37338 153985 297123 319716 266465 207828 184246 241614 388645 530782 556473 475345 378608
37327 378608 289758 150591 -64694 -307447 -509572 -614173 -584259 -449990 -316104 -262237
37317 -262237 -268720 -281776 -291539 -296159 -264775 -204032 -189330 -255549 -322035 -296987 -191988 -71676
37305 -71676 31464 86765 42874 -80392 -162391 -128074 -40732 27894 113953 248838 339421
37294 339421 288481 150664 43531 -20658 -93391 -161006 -189176 -222900 -304187 -353090 -269932
37283b69932J67249J23035M9383K2936k1979j20348j71109j08972j4314M0402
37273c03649Q7352J27148Q0825l2862o4369K2042O6927j1735p1444l842O5988
37262c7619K285j05220j07425l7783p594j995M0753P4055M0022M476L3052N0714
37250e2279j7426q9124o9405k2403l1023k3532O9955J26407J7704j26038q5827
37239c02991R3676J70879P7871k4687m4133n9598j08759j00825k873P5798O0211
37228a65431K0437L1518M5994j4184j23773j82643j32591q602R6917J13718O1396
37217b57244K0211J7415j700n6793p2509k389P7603R1278Q8410J33652J55928
37206A93862N6125r5486j33904m4983K3847m390m7861l1014L603m889l4779l3057
$$ plain form
37283 -269932 -102683 20352 69735 92671 70692 -49656 -220765 -329737 -344051 -303649
37273 -303649 -216297 -89149 -8324 -41186 -105555 -83513 -16586 -28321 -99765 -103607 -37619
37262 -37619 -35334 -140554 -247979 -285762 -293356 -295351 -254598 -180543 -140521 -136045 -102993 -52279
37250 -52279 -69705 -158829 -228234 -250637 -281660 -305192 -235237 -108830 -91126 -217164 -302991
37239 -302991 -209315 -38436 39435 14748 -29385 -88983 -197742 -298567 -301440 -225642 -165431
37228 -165431 -144994 -113476 -67482 -81666 -205439 -388082 -520673 -529275 -432358 -318640 -257244
37217 -257244 -237033 -219618 -221318 -278111 -350620 -353009 -275406 -184128 -95718 37934 193862
37206 193862 249987 154501 20597 -24386 -539 -4929 -52790 -83804 -80201 -85090 -119869 -152926
37194a52926J1339Q1680J51462J64331P0393q4407j69761j12766J3293P4358K2533
37183F9529o5019p8416O601J01465J01653N154r2888j18063p9083q932Q2684J65703
37171I0388J71186P4847m8248j04905q3998l9279j6570l2352p5733r8301n3304
37160b16269K6690N1148j986m9944k5668L9796Q7541J02506Q1427J8280m0259
37149G3262k0725N4347P2310K458n3634l4052o386j6859O477J01614J60476R0186
37137D29474k9971p6648o1191n8194o2307m4485m6965r0265r0637o723M4425l0370
37125a23857j18325p5073K9334L7180k0195M628R3959R5148J2m1743J3170M8792
37113e6970J9826J7971O9469P2787k45k9922M5267J14294P5529r953m2450l7597
$$ plain form
37194 -152926 -141587 -59907 91555 255886 326279 241872 72111 -40655 -27362 46996 69529
37183 69529 4510 -73906 -67305 34160 135813 140967 48079 -69984 -149067 -157999 -75315 90388
37171 90388 261574 336421 288173 183268 99270 59991 43421 11069 -64664 -162965 -216269
37160 -216269 -189579 -138431 -140417 -190361 -216029 -176233 -88692 13814 95241 113521 73262
37149 73262 52537 106884 179194 181652 128018 93966 87580 70721 77198 178812 339288 429474
37137 429474 399503 322855 261664 203470 141163 96678 49713 -40552 -131189 -137912 -93487 -123857
37125 -123857 -242182 -317255 -287921 -250741 -270936 -266308 -172349 -77201 -77189 -118932 -105762 -56970
37113 -56970 -37144 -19173 50296 123083 122838 92916 138183 252477 328006 318053 275603 238006
37101B38006n3392o2090n271Q3194J07835M1670m1469o0021j6412Q425m4562j17926
37089G7987q7207O6568J97068J67539K4256q7112j14139r5387k1600J47982L33673
37078F09628L51098J32251j65676l25338k83016j45502m7563l0427l9424j7565
37068C8466J5235K247m8950p5977p3764r8657j37763r6789K8573J02281N2131
37057b92967q848K8686R2094O8164L01m826L9428O3246Q3844J25470J02124m1395
37045B55321j68883j24754J9125Q4818P0673R7837J49657J01746k8167r1591n5315
37034C10467k9619o4498j01697r8544k9435J60844M07941M40318J01652l28355
37024G69074m33856k18591l8432l3305p566J18542J53887K7707n1832J8399M2141
$$ plain form
37101 238006 184614 122524 117253 200447 308282 349952 308483 248462 232050 240475 195913 77987
37089 77987 -9220 57348 254416 421955 446211 359099 244960 149573 127973 275955 609628
37078 609628 960726 1092977 927301 601963 318947 173445 125882 95455 56031 38466
37068 38466 53701 55948 6998 -68979 -142743 -241400 -379163 -475952 -447379 -345098 -292967
37057 -292967 -301815 -273129 -181035 -112871 -112570 -117396 -77968 -14722 69122 194592 296716 255321
37045 255321 86438 -38316 -19191 65627 136300 234137 383794 485540 457373 365782 310467
37034 310467 280848 216350 114653 16109 -13326 147518 555459 995777 1097429 769074
37024 769074 335218 116627 78195 44890 37324 155866 309753 337460 285628 304027 346168
37013C46168j03333k15508j03767R0006J36664O4651L5348N6446L5366k1554m7923
37002B72564m2706k3120K7479P0146J8857q4745q8807L416P995j12003j53067
36991a03991l1304M3949o6061j65344m7862J56470K11778J43292J12961J09700
36981C63588L3401n9325n4400m790k2241o6332n9480p3776j77388k40049j31411
36970d92203K9827P1081N7258J20591J61492L1650j25416o9735R9512Q1593j04915
36959a39265j35542P2770K18880J07166p0772q0655K1281O3432L5781K1454J9856
36948A34386r667m3967m8439m3428m8998m8723m3689n0019l3464M5693J28900
36937f1415J26127P1949P0650J02591N4112o2594j05234l7767J5825n155n696
$$ plain form
37013 346168 242835 27327 -76440 13566 150230 214881 250229 306675 342041 320487 272564
37002 272564 229858 206738 234217 304363 323220 238475 149668 153084 161079 49076 -103991
36991 -103991 -135295 -91346 -157407 -322751 -370613 -214143 -2365 140927 253888 363588
36981 363588 396989 337664 283264 278474 256233 189901 130421 56645 -120743 -360792 -492203
36970 -492203 -462376 -391295 -334037 -213446 -51954 -20304 -145720 -215455 -115943 -34350 -139265
36959 -139265 -274807 -202037 16843 124009 53237 -27418 -6137 57295 93076 114530 134386
36948 134386 124719 80752 32313 -11115 -60113 -108836 -152525 -202544 -236008 -190315 -61415
36937 -61415 64712 136661 207311 309902 364014 301420 196186 158419 174244 169089 163393
36926A63393O8619J14006L8827q3007j22974o5702P381K8296q603m5014K255J27068
36914B24545J82221N0294j58550k15406p1467R2711J17029J8571j03683j72776
36904c6511j34039L97R7400L9755q2472p6702O2060J52035J21688R2877J27955
36893C64443J16520k815j11080j07527o5723p9217j05359p4488j7748J7217N0180
36882a5597P9328M3800l9871n0562L7332Q3180J1088n5769j5379L0990k7473r6716
36870a5649m4448N3467M0549m7396n0981M0903R9724R1997R4876J00391J7671
36859C81104j18351j45519k7997O8673K3050p8904j07789p7467o3315m9559J2165
36848a83909O6315J8274q8196r4519M7273J85489J65975L5398m0325q705L2946
$$ plain form
36926 163393 232012 346018 384845 301838 178864 113162 120543 148839 140236 95222 97477 224545
36914 224545 406766 457060 298510 83104 11637 104348 221377 239948 136265 -36511
36904 -36511 -170550 -170153 -72753 -32998 -115470 -192172 -130112 21923 143611 236488 364443
36893 364443 480963 478148 367068 259541 193818 114601 9242 -65246 -82994 -65777 -15597
36882 -15597 63731 107531 67660 17098 54430 137610 148698 92929 77550 108540 81067 -15649
36870 -15649 -60097 -6630 33919 -13477 -64458 -23555 76169 168166 263042 363433 381104
36859 381104 262753 117234 89237 157910 180960 102056 -5733 -83200 -146515 -196074 -183909
36848 -183909 -117594 -99320 -187516 -282035 -234762 -49273 116702 152100 111775 103070 136016
36837A36016K5666M0469J27282J89351J16362l1010r8988o7219n8959j24402j54999
36826I9569o0876Q0119J24914M6408n6351q8172m6050M83j1125o4870p9972j9693
36814g5616M7164M5293Q829J4439M0011M306p6379j04568p0032n7021p1763k4758
36802c20095P5428Q5384l3986j06126J0031J90367K14659P3782m5151k9659M5355
36791A59989O3298R106m9102n5099k5965l2718r7961j27914k8216J15280J06591
36780C7289o4131j52865J322K16088K07090j1357j63919j09997L683R488m6168
36769g3477k1405Q9058J55619J04253R920j4404L0667L6036n9697j70420j67545
36758h1395n3618M5139N0653O932k6436n1702p3411o5743m3215n8785q2938p683
$$ plain form
36837 136016 161682 202151 329433 518784 635146 604136 505148 437929 378970 254568 99569
36826 99569 38693 118812 243726 290134 233783 145611 99561 100044 88919 24049 -55923 -75616
36814 -75616 -28452 16841 25670 40109 80120 84426 8047 -96521 -166553 -223574 -295337 -320095
36802 -320095 -244667 -159283 -193269 -299395 -289364 -98997 115662 189444 144293 114634 159989
36791 159989 223287 232393 183291 128192 102227 69509 -28452 -156366 -184582 -69302 37289
36780 37289 -26842 -179707 -178385 37703 244793 233436 69517 -40480 -36797 -27309 -73477
36769 -73477 -94882 -5824 149795 254048 263968 249564 280231 316267 256570 86150 -81395
36758 -81395 -135013 -89874 -39221 -32289 -58725 -110427 -183838 -249581 -292796 -351581 -434519 -442202
36746d42202J57810K31328J06734o5498q4600K0701P8171M8864L1517M4062K256
36735A29143q8553j09320k7734L7186N14p1082q1517l2465K7059Q1557J21511
36724a3701J12302M5622l1262p1520o9011l4521R844J4347m5870j02143o3208
36713b49121L8150O7222k1154j12627r4666K985P9142R1183N7180j080n3806n6591
36701b53183p528L2487K5616J6904N6700J07986R2302R58r4089j24579q0380L172
36689b23634P4634R4374O1272O658m2149o8348m3055M7280J39233J30270J7139
36678A93674p2888m8209J4210j5584j21265j61898p6682M0537Q7520P7238P6173
36667g174R7840J11114R9867O3649J232o3565q1629m5667j1895j1660R41N4108
$$ plain form
36746 -442202 -284392 -53064 53670 -11828 -96428 -75727 2444 51308 82825 126887 129143
36735 129143 40590 -68730 -96464 -59278 -58764 -129846 -211363 -243828 -216769 -135212 -13701
36724 -13701 98601 144223 112961 41441 -27570 -62091 -52247 -37900 -83770 -185913 -249121
36713 -249121 -210971 -143749 -164903 -277530 -372196 -369211 -290069 -198886 -141706 -142786 -196592 -253183
36701 -253183 -260711 -228224 -202608 -185704 -129004 -21018 71284 72242 -21847 -146426 -226806 -223634
36689 -223634 -149000 -54626 6646 13304 -28845 -97193 -140248 -92968 46265 176535 193674
36678 193674 120786 72577 86787 71203 -50062 -211960 -288642 -248105 -160585 -83347 -7174
36667 -7174 90666 201780 301647 365296 366528 302963 221334 175667 163772 152112 153053 207161
36655B07161P7824R656p4545n7392K2389J2146j09679j83607j10502L046K2198
36644a81305k1272k0417K4157L9689K4756K6695K7308k0524p7108o1026J2705
36633b26342N6268N2640O0382Q8850Q4878M0293M638o688j8246k4039j3411l6498
36621F2725j21405j62947m8516J26586J49974O747q6773m406J21716J23885J8339
36610A85925q4521j35719j21032k0806J06188J28175K3850o2794l5207K3235J9620
36599B6914N210M4506P3333K1565m6630n0029l2185n3227n8204M629N0776j261
36587a4603o6634l2311M3482M0597q957J871M7037K8928j7381J9829J10213J13424
36575B65495J1853o5369m5005J6457N1143L7024l7081j33643j36436M612J50431
$$ plain form
36655 207161 284985 294641 220096 162704 185093 197239 87560 -96047 -206549 -203503 -181305
36644 -181305 -202577 -222994 -198837 -159148 -134392 -107697 -80389 -100913 -178021 -239047 -226342
36633 -226342 -170074 -117434 -57052 31798 116676 156969 161607 154919 136673 112634 99223 62725
36621 62725 -58680 -221627 -270143 -143557 6417 13164 -73609 -78015 43701 167586 185925
36610 185925 101404 -34315 -155347 -176153 -69965 58210 82060 19266 -15941 7294 26914
36599 26914 32124 76630 149963 171528 124898 74869 42684 -10543 -68747 -64118 -13342 -14603
36587 -14603 -81237 -113548 -70066 -29469 -38426 -36555 10482 39410 22029 41858 152071 265495
36575 265495 277348 211979 166974 183431 234574 271598 234517 100874 -35562 -30950 119481
36564A19481J38757J3154o4633n6219k7815K6002J31873J80722N6257j21722j25525
36553B70332L1008J18133N4998j0775M30o920p2113r9732p1763q7643j30980n7855
36541f2880J04794J27948l9030j37541o442J46991Q3968r0294j23215o761P0500
36530F8038L4431l7548r2493j12664l7458J33557K36944J30378q1935j80825j27830
36519f7405o0890n3753n6769l9805k4292P537Q2678J33471O9608n4897q5701J7707
36507a32511J34957J58191R9870J6428p0968j50799j90595j62679p0758M3537
36497c25327J06519P2741O690L0898J47659K04696J08596k9651o3492k6122m1803
36486A91404j00117q3317J4438O1247p371r5354r3392j5744M9526N3677J7057
$$ plain form
36564 119481 258238 271392 206759 150540 122725 148727 280600 461322 517579 395857 270332
36553 270332 301340 419473 474471 463696 464126 457206 385093 285361 213598 125955 -5025 -62880
36541 -62880 41914 169862 130832 -6709 -13151 133840 217808 127514 4299 -2462 68038
36530 68038 102469 64921 -27572 -140236 -177694 -44137 192807 323185 241250 60425 -67405
36519 -67405 -128295 -182048 -238817 -278622 -302914 -295377 -212699 -79228 -9620 -64517 -150218 -132511
36507 -132511 2446 160637 260507 276935 205967 55168 -135427 -298106 -368864 -325327
36497 -325327 -218808 -146067 -139377 -108479 39180 243876 352472 322821 259329 233207 191404
36486 191404 91287 7970 22408 83655 76284 -19070 -112462 -128206 -78680 -25003 -7946
36475g946p342J6977O9333Q7865M8097p177m2717p9918j27854j32112n8127L3045
36463b07876O3542M0179J2007r095j5852K6163Q9049N0138j32120k88002k25962
36452e97829J348J71114J91169J63220J62821J36460N0941j3756R229O5732O6270
36441D06719J727p5894j23706j23304q2470m4023m1827m4818m881M9035M4864
36430c8578r311l0736J78R656l3229n0854J9938J20571J51251J02719M6176K8327
36418C16108L0897J5982k7163p2546p8743l4894R945q229q3709j30086p2544O2917
36406g2065J64282J35347j1666j58889j90202j01986Q739O0597N3517K0098k3483
36395a15711n2995k9284M0112Q9214Q7230Q1647R8918P8775j8678j13242j08570
$$ plain form
36475 -7946 -15288 1689 71022 158887 206984 199807 157090 77172 -50682 -182794 -240921 -207876
36463 -207876 -144334 -104155 -92148 -101243 -117095 -90932 -1883 48255 -83865 -371867 -597829
36452 -597829 -596481 -425367 -234198 -70978 91843 228303 279244 265488 274717 340449 406719
36441 406719 408446 332552 208846 85542 3072 -40951 -82778 -127596 -132477 -83442 -38578
36430 -38578 -47889 -78625 -78447 -68791 -102020 -152874 -132936 -12365 138886 241605 287781 316108
36418 316108 347005 362987 335824 263278 184535 149641 159586 151357 67648 -62438 -134982 -72065
36406 -72065 92217 227564 215898 57009 -133193 -235179 -226440 -165843 -112326 -92228 -115711
36395 -115711 -168706 -197990 -157878 -68664 18566 100213 199131 277906 259228 145986 37416
36384C7416m0118j3430l7366l4307R264K4990n333j7166J4415K0472n1509j43493
36372b36165j48098k9945J34189K16755J49687j353r5622p5453k2430k2296m3414
36361a74145j5629M0259N6336L7158L2568L4888J1939L232O2517J31947J02060
36350C23130j4835r8458j02271r0160q9005m7971K7291M1029l4737q7089j8164
36339a91240J16182J92081J69981R7304J6846o2308j30666j60603j21400j5779
36329h9602Q4113P6958m1118j35170r1224K7689Q0892N9547O8632J24234J19727
36318B84678J0448j06949j36910r0111j5023N9984Q6089J8660p7231o9404M4673
36307H904J09072L7335n8871n0254K1790M3265J5709K1517N9968M2111o2491j64493
$$ plain form
36384 37416 -2702 -16132 -53498 -87805 -78541 -53551 -58884 -76050 -61635 -41163 -92672 -236165
36372 -236165 -384263 -414208 -280019 -63264 86423 85070 -10552 -86005 -108435 -130731 -174145
36361 -174145 -189774 -149515 -93179 -56021 -23453 11435 23374 26606 89123 221070 323130
36350 323130 308295 209837 107566 17406 -71599 -119570 -92279 -51250 -85987 -173076 -191240
36339 -191240 -75058 117023 287004 384308 401154 338846 208180 47577 -73823 -89602
36329 -89602 -5489 71469 30351 -104819 -196043 -168354 -87462 -27915 40717 164951 284678
36318 284678 295126 188177 51267 -38844 -53867 6117 92206 110866 33635 -35769 8904
36307 8904 117976 155311 96440 46186 67976 111241 126950 148467 208435 250546 188055 23562
36295B3562j53590j8047J37291J83923R8566q768k8897J3058K1307j2765k1776
36284B33864r341n0642j34435j45762m7993M7165M5637r976m0419l3062O980Q6820
36272e1164J50627J05090j5691n1781L8664R2328J861r9292n9590L2347J263j13540
36260C1122j25250r677O7925K9927o287O3385J69582J80518P1412p0439j44963
36249B57255j13417k1220M0850L0032q684k3705k9398m9590n1866j1990J6314
36238C4581j4829m9223j4636L9719J1469q0521j14047m5058M5180Q3296P4049
36227c0020L5149k6997o5446k6271M6136M5749k5302l7174O7457J62406J07399
36216B53086n3918j60956j48375q7825m1615J0251P2334O9721l6113j31156o7801
$$ plain form
36295 23562 -130028 -148075 -10784 173139 271705 262937 234040 247098 268405 255640 233864
36284 233864 224523 173881 39446 -106316 -154309 -107144 -61507 -71483 -111902 -144964 -137984 -51164
36272 -51164 99463 204553 188862 137081 175745 268073 269934 170642 111052 143399 144662 31122
36260 31122 -94128 -103805 -35880 -5953 -12240 51145 220727 401245 472657 402218 257255
36249 257255 143838 122618 163468 193500 184816 161111 131713 82123 30257 18267 34581
36238 34581 19752 -29471 -44107 -4388 7081 -73440 -187487 -232545 -187365 -104069 -30020
36227 -30020 5129 -21868 -87314 -113585 -67449 -21700 -47002 -84176 -16719 145687 253086
36216 253086 199168 38212 -110163 -197988 -239603 -229352 -157018 -87297 -123410 -254566 -322367
36205c22367J06035J70356L9460q8000n644J82148K03162K6320r9527l7130M7897
36194B22710j4039j25895j16006k4955L766q440N3939J41494R6302n6290j12693
36183E9893j5664M7198n9851k15503k35690j23774r380N1624R0929J11043P5213
36172b23962p068o7690n1464L8785J49285K01827J47269K3027p2261q3832m8041
36161E875k0374m554J7756L2901J5266k5006n3504n5490l8099l540M6663Q5347
36149C241P1843N313n5221n2770j1122j4319q8991j49467j07762l485N0242L3331
36137c19167L4630Q9927J12615L6751o4350p6694M454R4821J33664J08112K4101
36126A78864p1693r4294k4779L3184j8562j26888j49964l8140J16050J83936J07485
$$ plain form
36205 -322367 -216332 -45976 -6516 -94516 -100160 81988 285150 311470 211943 174813 222710
36194 222710 208671 82776 -33230 -58185 -54419 -62859 -8920 132574 228876 172586 59893
36183 59893 44229 91427 31576 -183927 -419617 -543391 -552771 -501147 -410218 -299175 -223962
36172 -223962 -231030 -298720 -350184 -311399 -162114 39713 186982 210009 137748 53916 5875
36161 5875 -14499 -19053 -1297 31604 46870 21864 -31640 -87130 -125229 -128769 -82106 3241
36149 3241 75084 80397 25176 -27594 -38716 -53035 -142026 -291493 -399255 -402740 -352498 -319167
36137 -319167 -284537 -194610 -81995 -45244 -109594 -186288 -181834 -87013 46651 154763 178864
36126 178864 107171 12877 -11902 21282 2720 -124168 -274132 -312272 -196222 -12286 95199
36115I5199n8428j66516j00562P2764J50828M7716r5284j18355m3539K9083R1501
36104i5593J52985J19858o6497k58084k57882q8626P3800J62450K15134J87469
36094A45014J9377j52243j19345N6566J04744k4295q0694N6395J72163P9845q0190
36083A77337r8481k8537l7047r6642o8640K6661N8024K8003N0098J20973J18434
36072B50183K0381n1581k6651J9685m000q6527j56631j67792j19944m9638o237
36061c78752m697j2670j636K6598P5878J49379J87147J08040m1659r6421k404
36050H803Q1983K3137p3930m1724O1693M0636j08286j72859n5687P2916L6194
36039a27124r2099j16405p135Q2377N6981N449M7446J44281J47250J2428j24490
$$ plain form
36115 95199 36771 -129745 -230307 -157543 -6715 41001 -54283 -172638 -216177 -187094 -95593
36104 -95593 57392 177250 110753 -147331 -405213 -493839 -420039 -257589 -42455 145014
36094 145014 164391 12148 -107197 -50631 54113 29818 -50876 5519 177682 257527 177337
36083 177337 78856 50319 13272 -83370 -152010 -125349 -67325 -39322 10776 131749 250183
36072 250183 270564 218983 192332 212017 208017 121490 -35141 -202933 -322877 -372515 -378752
36061 -378752 -383449 -396119 -397755 -371157 -295279 -145900 41247 149287 107628 11207 8803
36050 8803 90786 113923 39993 -1731 59962 100598 -7688 -180547 -236234 -163318 -127124
36039 -127124 -219223 -335628 -342763 -260386 -203405 -197956 -150510 -6229 141021 153449 28959
36028B8959j24930k6512L1233J1835L466M6582O6380J2094n1209n2787k1904r838
36016h6631O390N5127P9943J9585p5085j05435o9676m5768n5464m2627J9788Q5822
36004b14031J04927P1386O026n6999p0476j4492O3178Q8547M3295k2167m9258
35993e0064k5918N329j1240o9824q4044j65Q9596M9421p8788r4832O4189J95114
35981a1226J08035q8180j35034J4577J53124J15345l3173j22149p7228L6472R7774
35970E8337L9037p9745j16921j3826J21194J49546P4811K823k0778l4150n0871
35959A29457l4353K0003O1628N2477M500m2305m2990J5814O7831K0096r9681j39797
35947A2680l9840O0459L3446l4272l141O4072Q353j32744j65075n2716L2650j380
$$ plain form
36028 28959 -95971 -122483 -91250 -79415 -75949 -29367 37013 49107 -2102 -54889 -76793 -86631
36016 -86631 -80241 -25114 54829 74414 -671 -106106 -175782 -221550 -277014 -319641 -299853 -214031
36004 -214031 -109104 -37718 -31692 -88691 -159167 -173659 -110481 -21934 21361 -806 -50064
35993 -50064 -75982 -70653 -81893 -151717 -235761 -235926 -146330 -96909 -175697 -270529 -206340 -11226
35981 -11226 96809 8629 -126405 -111828 41296 156641 123468 1319 -75909 -39437 58337
35970 58337 97374 17629 -99292 -113118 8076 157622 232433 235256 214478 180328 129457
35959 129457 95104 115107 176735 229212 233712 191407 148417 164231 232062 252158 152477 12680
35947 12680 -27160 33299 66745 32473 29332 93404 101757 -30987 -196062 -248778 -216128 -217508
35935b17508m5477l800O5584R5453J12943J16574K6533j36970j89380l0393J72219
35924c4222J91605M0047q2512o7475J4510O3733N7843J3760n2971j11614j19518
35913h6814o1859L0082R6041Q4866N777o5064p1962n2196n6124l4772P5913J81718
35901D5606J08305j14217k22840o8519J64407K10810O7512o5497q3794m5078K822
35890d83P6892J45565J19316q745j23647j29402n4609O509j269o1018j04370o3407
35878a98668N3234J47918J44498Q6586O6457Q5565O5778j5612r0629j05932q2354
35867A56841n3190j7144K2155L5873K1790K0680M5079M1031l4230j32042j60497
35856e3654r8012j3792K4094K1076K1570L4556L0648O193L268M0537O2877J2430
$$ plain form
35935 -217508 -262985 -266785 -201201 -105748 7195 123769 150302 13332 -176048 -206441 -34222
35924 -34222 157383 197430 114918 47443 61953 125686 183529 197289 144318 32704 -86814
35913 -86814 -148673 -118591 -22550 62316 68093 3029 -68933 -121129 -177253 -212025 -136112 45606
35901 45606 153911 39694 -183146 -251665 -87258 123552 191064 125567 41773 -3305 -483
35890 -483 76409 221974 341290 332545 208898 79496 24887 31396 30127 -30891 -135261 -198668
35878 -198668 -145434 2484 146982 233568 300025 385590 451368 435756 345127 239195 156841
35867 156841 103651 86507 108662 144535 166325 187005 232084 273115 238885 106843 -53654
35856 -53654 -151666 -165458 -141364 -120288 -98718 -64162 -33514 -27321 -24053 16484 79361 91791
35844I1791o7474o8020L3871J27802J09930J4152n0423m9496l9270m9171k8783
35833B4909O3289J71475J90552Q7867n5858j33153j14889n4863j0684L219j1308
35822A60556n3098q5140m1600O9559J22648K3135j29126j39394J5819J44996J02099
35811A90454l0183q9709n6973j8805Q317Q0561J82888K17163J46992M9723p99
35800F79629j5939k8475l2268l1416p3784j67323k16733j30555K7532Q6426j3166
35789H3928j29261j06241Q954L5140p3300j42467j7398K08428L00144J73352k6518
35778C14761j25697r9804l4418l179k6042p8633j00925n0860K1245J5213o8883
35767b37222r8151J7429J81024K18722R6343n2227r9655n6450j7639l1807n5640
$$ plain form
35844 91791 24317 -43703 -9832 117970 227900 242052 191629 142133 102863 53692 24909
35833 24909 88198 259673 450225 538092 482234 349081 234192 179329 168645 171864 160556
35822 160556 107458 22318 -19282 50277 172925 196060 66934 -72460 -56641 88355 190454
35811 190454 160271 70562 13589 -5216 3101 83662 266550 483713 630705 680428 679629
35800 679629 663690 635215 602947 571531 497747 330424 113691 -16864 10668 97094 83928
35789 83928 -45333 -151574 -142620 -107480 -180780 -323247 -340645 -132217 167927 341279 314761
35778 314761 189064 89260 54842 51663 25621 -53012 -153937 -204797 -183552 -168339 -237222
35767 -237222 -335373 -317944 -136920 81802 178145 125918 26263 -30187 -47826 -79633 -135273
35756a35273k5853N0756J03140R2537O1381N5199M5736l187l9260R318R3959R6048
35744D04501J4096l5257j9912m0699j27710j54676n0044O1501N3787l683P629
35733A09533L8679j4939q5618l0869J01042J25655K4698l0267K3647M2384n6505
35722B47440j32881n0944R0478J00314l0226j36361j12801j8555L4825Q392n7763
35711e8082j07384j19785j12547r8246n8491J4068P7027R0985Q2916R2638Q8333
35700a08568K3571m7581k5684O7493J00133K6852m6357k6852N0260J11312J31331
35689B55910Q9200l7096j70979j66372j8373Q5398K5383o7434j9068J15792J53178
35678B45539O4263k1851n1223r1657j52482j38326j9698R5859J15635P2892L9167
$$ plain form
35756 -135273 -161126 -110370 -7230 85307 146688 201887 247623 244436 205176 214494 308453 404501
35744 404501 418597 383340 363428 322729 195019 40343 -9701 51800 105587 101904 109533
35733 109533 148212 133273 47655 16786 117828 243483 268181 237914 261561 303945 247440
35722 247440 114559 63615 154093 254407 224181 87820 -24981 -43536 -8711 -319 -58082
35711 -58082 -165466 -285251 -397798 -496044 -554535 -540467 -463440 -372455 -289539 -196901 -108568
35700 -108568 -84997 -132578 -158262 -90769 9364 36216 -10141 -36993 13267 124579 255910
35689 255910 345110 308014 137035 -29337 -47710 37688 63071 -4363 -23431 92361 245539
35678 245539 309802 287951 236728 145071 -7411 -145737 -165435 -69576 46059 118951 158118
35667A58118K2781K162k0990m4522p5238q8586m7615K0385M4045K1663K5712O9665
35655H7580P1169p424q0396o4408J981L5901L1892K7499J3302l4589q0105p1450
35643f9048k6653r24k105n935j2816j6383L2558J39177J92396R4467p1642j34373
35631A18719p5632l6099p4445q5731p574N6054J2539n4718k4530O3134Q6859M8013
35619B6589M3681P8516O0980j8714n5678q60O2396N2942m960n8781j08354j52340
35607g4583j43242o6617L235j514m5176n4859l4404l6884o0754n6007j8262K031
35595e87036j1103o979N4267J38481J78649J54294J06523Q2331Q0019N7367q024
35584B38789q2647j16929j04881p3673k7860M6891J23729J36355O4308k8890p0062
$$ plain form
35667 158118 180899 183061 162071 117549 42311 -46275 -93890 -73505 -29460 -7797 17915 87580
35655 87580 158749 151325 70929 6521 8502 44403 76295 103794 117096 82507 2402 -69048
35643 -69048 -95701 -96625 -98730 -104665 -117481 -133864 -101306 37871 230267 324734 253092 118719
35631 118719 43087 6988 -67457 -153188 -160762 -104708 -92169 -146887 -171417 -108283 -21424 26589
35619 26589 70270 148786 209766 191052 135374 134514 196910 249852 244892 186111 77757 -74583
35607 -74583 -217825 -284442 -281207 -282721 -327897 -382756 -417160 -454044 -514798 -570805 -589067 -587036
35595 -587036 -598139 -605118 -550851 -412370 -233721 -79427 27096 109427 189446 246813 238789
35584 238789 156142 39213 -65668 -139341 -167201 -120310 3419 139774 204082 175192 105130
35573A05130n3065k1343j2830m0075q2015q0434J270R7614Q8459l7653j40742
35562a75684j03701J8102Q8739P2169L8521L4490L7247J8590j9720o4178q8909
35551a44334n9511J3831O4348O0207N3433P4559N3630n4146j36337n7492J14980
35540a6832J77312P5393l7951n1825l3279n4714n1979L2630R6565J6421j32521
35529A9220j54841j7481R1754K5031j20241j40450j0217Q3177M411j33293j23778
35518d76708L6973J47490R8856J8486M0668Q7905K7088p6542o0244M8327O7723
35507c9978k6249n7106M9480J44531J14431N0313N1235N3626p169m4919O639L3037
35495C27871o4476j53962o9103R1086R7893m2024j08543k9626L2344k1040p9204
$$ plain form
35573 105130 52065 30722 17892 -22183 -104198 -184632 -183362 -85748 2711 -34942 -175684
35562 -175684 -279385 -261283 -172544 -100375 -61854 -27364 9883 28473 8753 -55425 -144334
35551 -144334 -203845 -190014 -125666 -65459 -12026 62533 116163 62017 -74320 -131812 -16832
35540 -16832 160480 235873 197922 146097 112818 58104 6125 38755 135320 151741 19220
35529 19220 -135621 -153102 -61348 -36317 -156558 -297008 -307225 -224048 -219637 -352930 -476708
35518 -476708 -439735 -292245 -193389 -174903 -134235 -46330 -19242 -95784 -156028 -107701 -39978
35507 -39978 -66227 -123333 -73853 70678 185109 235422 286657 340283 333114 288195 294834 327871
35495 327871 263395 109433 40330 131416 229309 187285 78742 49116 81460 60420 -18784
35484a8784m5756p37m0423j16525j36947r8282l0299O9224J59136J39173J0032
35473a10188o4337L0605J79528J91807O1118n6400o8744k3668J1374K1003m00
35462A71698n5703r9838p1931J4804Q0056P7275L0789k2411o7053q8343p4819
35451a05476m3650j6458J8249O9042R3774N6587R487K9491Q3978O0891n3513j33995
35439F8407r4383q288J2681j9524j3684M5922P8377K5553p3196j27895q6643J2939
35427a79734O6966J2640p7176o5263O1930J59066J22930L4325J5565M0083R319
35416B00651n3848m8552M097j5378r6013p8841P8342J94209J18632m9422j17147
35405A36730n7991J2059L2007L4794M2664M7104O0756Q9897R0745M0692K884K6026
$$ plain form
35484 -18784 -64540 -65277 -105700 -222225 -359172 -457454 -487753 -418529 -259393 -120220 -110188
35473 -110188 -174525 -143920 35608 227415 288533 232133 163389 139721 151095 172098 171698
35462 171698 115995 16157 -55774 -40970 39086 116361 147150 124739 57686 -30657 -105476
35451 -105476 -149126 -165584 -147335 -78293 15481 72068 81555 111046 195024 255915 202402 68407
35439 68407 -25976 -34264 -21583 -41107 -54791 -8869 69508 95061 21865 -106030 -192673 -179734
35427 -179734 -112768 -100128 -177304 -242567 -180637 -21571 101359 135684 151249 191332 200651
35416 200651 146803 98251 102348 86970 -9043 -87884 -9542 184667 303299 253877 136730
35405 136730 78739 90798 122805 157599 200263 247367 308123 398020 488765 529457 532341 558367
35393E58367L9787l7633j44492j58372r0044n2236o3729l7274M4933R7668Q6800
35382B43775P1129O8891K4968n8688r9789p9023o7698p4740j8912R1124J12819
35371B13856n236j08027o0766M2680L6139o0517r2436j1415P9418Q7722J9454
35360A40872o9791j14516o2232N6525J19049N3246n6006q3744l0428K1854N4502
35349B9331R7756J19504N8195n3693j17102j09265r6280j12352j23875j05563
35339d13344o2869O413Q7254J13799N8061J4570P7663J67533J22401m7495j56337
35328c2351j11577k7739k4032n7865l6587L1469Q9126J31836J62372J29374J3174
35317B67200q9557p0156L8280J00352N0269n1111j16666j20297q2892k8177K7551
$$ plain form
35393 558367 598154 560521 416029 257657 167613 115377 51648 14374 59307 156975 243775
35382 243775 314904 383795 408763 350075 250286 171263 103565 28825 9913 101037 213856
35371 213856 208620 100593 39827 82507 118646 58129 -34307 -45722 33696 121418 140872
35360 140872 71081 -43435 -105667 -49142 69907 123153 67147 -16597 -47025 -25171 29331
35349 29331 127087 246591 304786 251093 133991 24726 -71554 -183906 -307781 -413344
35339 -413344 -476213 -469800 -382546 -268747 -210686 -196116 -118453 49080 171481 123986 -32351
35328 -32351 -143928 -171667 -195699 -253564 -290151 -258682 -169556 -37720 124652 254026 267200
35317 267200 177643 107487 145767 246119 296388 245277 128611 8314 -74578 -102755 -75204
35306g5204O4994N9271Q79o8497o7570L0087J30151J17298K0531r469Q6489J81132
35294D70092J36421r635j13749j22247r7948q8666p3781m0864k4157m2287o1474
35283f8295m8530j5878Q792K0976K6766K3410J3906J5019K7463J7880m1229j18558
35271a38278j35590m4209J09737K11361J81979O6960l64N2932J40554J09744o0833
35260D93993k10872j85684k8207Q4096O8535J0274j065L205l2682o6626l5825
35249I9142J0520j8930q9753q0759J4596O9956L2377p74L4627N5586p715o8875
35237D9998k4570O6142P9973K9410J6346L9829R760o9312q8065j8672L2917k915
35225A20841o1394o5917m2291m5428n4966k0638L6749M2395k6557j00187r1130
$$ plain form
35306 -75204 -10210 49061 49940 -18557 -86127 -56040 74111 191409 211940 202471 288960 470092
35294 470092 606513 596878 483129 360882 262934 174268 100487 59623 35466 -6821 -68295
35283 -68295 -116825 -132703 -123911 -102935 -76169 -52759 -38853 -23834 3629 21509 -19720 -138278
35271 -138278 -273868 -318077 -208340 3021 185000 251960 251596 304528 445082 554826 493993
35260 493993 283121 97437 69230 153326 221861 232135 231070 234275 201593 134967 99142
35249 99142 109662 90732 979 -79780 -65184 4772 37149 36375 71002 126588 118873 49998
35237 49998 25428 91570 171543 200953 217299 257128 266888 197576 109511 90839 123756 120841
35225 120841 59447 -6470 -48761 -94189 -149155 -169793 -133044 -90649 -117206 -217393 -308523
35214c08523K929Q6651P3858j737k7167L3134Q9033O2165p918m8889o3436p5357
35202a85257m9996L2688R8697Q5343N7320R2242J19789K7324j27468j82512j21551
35191a53381p8021r7134q1351R612Q8370J06409J17558J31332P6742l1965o7764
35180B0407k47L6128l4980j06551p9516j5779P533L5998J04675J21019K7741n3927
35168F2501m678Q7273P1456j5773l2438J3928j2098j30872k08916j63996n8654
35157c92267K2284O1914O5229L1764m626R020P1594J22633J08556K1989r1188
35146B6902j33424l1095J40602J89342L4323j76854k57716j96596q7790L9427
35136d52879J83835K55894J71476J7451m0835L408O940q7909j75953j58220n8592
$$ plain form
35214 -308523 -305594 -218943 -145085 -146822 -173989 -140855 -51822 10343 2425 -46464 -109900 -185257
35202 -185257 -235253 -202565 -103868 -18525 38795 131037 250826 278150 150682 -31830 -153381
35191 -153381 -231402 -328536 -409887 -400275 -311905 -205496 -87938 43394 120136 88171 20407
35180 20407 20160 56288 21308 -85243 -164759 -180538 -173005 -137007 -32332 88687 116428 62501
35168 62501 57823 145096 216552 200779 168341 182269 170171 39299 -169617 -333613 -392267
35157 -392267 -369983 -308069 -242840 -211076 -215702 -206682 -135088 -12455 96101 118090 26902
35146 26902 -106522 -137617 2985 192327 226650 49796 -207920 -404516 -492306 -452879
35136 -452879 -269044 -13150 158326 175777 134942 138350 145290 57381 -118572 -276792 -335384
35125c35384M4870R6797O7031k1889p3472k2355N7181N5282P635L6987J34648
$$ plain form
35125 -335384 -290514 -193717 -126686 -148575 -222047 -244402 -187221 -131939 -124304 -87317 47331
$$ [...]
##END NTUPLES=NMR SPECTRUM
##END=
