##TITLE=31Pdec_1-2026
CDCl3, 24 sc
 13.1.2026
##JCAMPDX= 6.0         $$ Bruker NMR JCAMP-DX V2.0
##DATA TYPE= NMR SPECTRUM
##DATA CLASS= NTUPLES
##ORIGIN= UXNMR, Bruker Analytische Messtechnik GmbH
##OWNER= root
$$ XWIN-NMR		Version 3.5
$$ Tue Jan 13 14:19:07 2026 Russian Standard Time (UT+4h)  she@DPX200
##.OBSERVE FREQUENCY= 81.013821
##.OBSERVE NUCLEUS= ^31P
##.ACQUISITION MODE= SIMULTANEOUS
##.ACQUISITION SCHEME= undefined
##.AVERAGES= 24
##.DIGITISER RES= 17
##SPECTROMETER/DATA SYSTEM= spect
##.PULSE SEQUENCE= zgpg30
##.SOLVENT NAME= CDCl3
##.SHIFT REFERENCE= (INTERNAL, CDCl3, 0, 198.062)
##AUDIT TRAIL= $$ (NUMBER, WHEN, WHO, WHERE, WHAT)
$$ ##TITLE= Audit trail, XWIN-NMR		Version 3.5
$$ ##JCAMPDX= 5.01
$$ ##ORIGIN= Bruker BioSpin GmbH
$$ ##OWNER= she
$$ F:/spectra/data/she/nmr/P31/2/pdata/1/auditp.txt
$$ ##AUDIT TRAIL=  $$ (NUMBER, WHEN, WHO, WHERE, WHAT)
(   1,<2026-01-13 14:17:40.71 +0400>,<she>,<DPX200>,
      <created by zg, POWCHK disabled, PULCHK disabled
       configuration hash MD5:
       00 E9 B6 7A A2 85 ED C7 34 08 36 98 17 FE 4E 26
       data hash MD5: 32K
       A6 97 A9 61 27 4B 6C 88 E1 31 55 2B 7D 92 7F AE>)
(   2,<2026-01-13 14:17:58.70 +0400>,<she>,<DPX200>,
      <Start of raw data processing
       efp BC_mod = 2 LB = 1.5 FT_mod = 6 PKNL = 1 PHC0 = 1251.711 PHC1 = 332.5002 SI = 64K 
       data hash MD5: 64K
       94 F7 43 4A F4 C9 C1 83 0A 54 44 33 2A 08 BC D6>)
(   3,<2026-01-13 14:18:30.35 +0400>,<she>,<DPX200>,
      <pk PHC0 = 156.2816 PHC1 = -272.7999 
       data hash MD5: 64K
       54 16 CC 55 40 8D CC 96 99 EA C7 06 28 69 E0 1A>)
(   4,<2026-01-13 14:18:34.26 +0400>,<she>,<DPX200>,
      <abs ABSG = 5 
       data hash MD5: 64K
       64 42 31 19 75 0F 6D 93 72 FB C9 DC DF BC 55 DC>)
$$ ##END=
$$ 
$$ hash MD5
$$ CC F7 79 9F EF 71 D2 72 D2 26 74 9D 6F 87 2D 8C
##$RELAX= 
##$RELAX= 
##$RELAX= 
##$RELAX= 
##$RELAX= 
##$RELAX= 
##$RELAX= 
##$RELAX= 
$$ Bruker specific parameters
$$ --------------------------
##$DU= <F:/spectra>
##$EXPNO= 2
##$NAME= <P31>
##$PROCNO= 1
##$TYPE= <nmr>
##$USER= <she>
##$AMP= (0..31)
100 100 100 100 100 100 100 100 100 100 100 100 100 100 100 100 100 100 
100 100 100 100 100 100 100 100 100 100 100 100 100 100 
##$AQSEQ= 0
##$AQ_mod= 1
##$AUNM= <au_zg>
##$AUTOPOS= <>
##$BF1= 81.014009
##$BF2= 200.13
##$BF3= 200.13
##$BF4= 200.13
##$BF5= 200.13
##$BF6= 200.13
##$BF7= 200.13
##$BF8= 200.13
##$BYTORDA= 1
##$CFDGTYP= 0
##$CFRGTYP= 5
##$CHEMSTR= <none>
##$CNST= (0..31)
1 1 145 1 1 1 1 1 1 1 1 1 1 1 1 1 1 1 1 1 1 1 1 1 1 1 1 1 1 1 1 1 
##$CPDPRG= <waltz16>
##$CPDPRG1= <>
##$CPDPRG2= <waltz16>
##$CPDPRG3= <>
##$CPDPRG4= <mlev>
##$CPDPRG5= <mlev>
##$CPDPRG6= <mlev>
##$CPDPRG7= <mlev>
##$CPDPRG8= <mlev>
##$CPDPRGB= <>
##$CPDPRGT= <>
##$D= (0..31)
0 1 0 0 0 0 0 0 0 0.06 0 0.03 2e-05 3e-06 0 0 0.0002 0 0 0 0 0 0 0 0 0 
0 0 0 0 0 0 
##$DATE= 1768299460
##$DBL= (0..7)
120 120 120 11 120 120 24 19 
##$DBP= (0..7)
150 150 150 150 150 150 150 150 
##$DBP07= 0
##$DBPNAM0= <>
##$DBPNAM1= <>
$$ [...]
##$SUBNAM3= <"">
##$SUBNAM4= <"">
##$SUBNAM5= <"">
##$SUBNAM6= <"">
##$SUBNAM7= <"">
##$SUBNAM8= <"">
##$SUBNAM9= <"">
##$SW= 400.765351723535
##$SWIBOX= (0..15)
0 1 3 0 0 0 0 0 0 0 0 0 0 0 0 0 
##$SW_h= 32467.5324675325
##$TD= 32768
##$TD0= 1
##$TE= 0
##$TE2= 300
##$TE3= 300
##$TEG= 300
##$TL= (0..7)
0 120 53 12 22 120 120 120 
##$TP= (0..7)
150 150 150 150 150 150 150 150 
##$TP07= 0
##$TPNAME0= <>
##$TPNAME1= <>
##$TPNAME2= <>
##$TPNAME3= <>
##$TPNAME4= <>
##$TPNAME5= <>
##$TPNAME6= <>
##$TPNAME7= <>
##$TPOAL= (0..7)
0.5 0.5 0.5 0.5 0.5 0.5 0.5 0.5 
##$TPOFFS= (0..7)
0 0 0 0 0 0 0 0 
##$TUNHIN= 0
##$TUNHOUT= 0
##$TUNXOUT= 0
##$USERA1= <user>
##$USERA2= <user>
##$USERA3= <user>
##$USERA4= <user>
##$USERA5= <user>
##$V9= 5
##$VALIST= <valist>
##$VCLIST= <CCCCCCCCCCCCCCC>
##$VD= 0
##$VDLIST= <DDDDDDDDDDDDDDD>
##$VPLIST= <PPPPPPPPPPPPPPP>
##$VTLIST= <TTTTTTTTTTTTTTT>
##$WBST= 1024
##$WBSW= 4
##$XGAIN= (0..3)
0 0 0 0 
##$XL= 0
##$YL= 0
##$YMAX_a= 44610
##$YMIN_a= -46042
##$ZGOPTNS= <>
##$ZL1= 120
##$ZL2= 120
##$ZL3= 120
##$ZL4= 120
##$ABSF1= 198.0616
##$ABSF2= -202.7028
##$ABSG= 5
##$ABSL= 3
##$ALPHA= 0
##$AQORDER= 0
##$ASSFAC= 0
##$ASSFACI= 0
##$ASSFACX= 0
##$ASSWID= 0
##$AUNMP= <proc_1d>
##$AZFE= 0.1
##$AZFW= 0.5
##$BCFW= 0
##$BC_mod= 2
##$BYTORDP= 0
##$COROFFS= 0
##$CY= -3
##$DATMOD= 1
##$DC= 0
##$DFILT= <>
##$DTYPP= 0
##$F1P= 0
##$F2P= 0
##$FCOR= 1
##$FTSIZE= 65536
##$FT_mod= 6
##$GAMMA= 0
##$GB= 0
##$INTBC= 1
##$INTSCL= 9.790993e-09
##$ISEN= 30
##$LB= 1.5
##$LEV0= 0
##$LPBIN= 0
##$MAXI= 10000
##$MC2= 0
##$MEAN= 0
##$ME_mod= 0
##$MI= 50
##$NCOEF= 0
##$NC_proc= -3
##$NLEV= 6
##$NOISF1= 182.463
##$NOISF2= 159.3651
##$NSP= 0
##$NTH_PI= 0
##$NZP= 0
##$OFFSET= 198.0616
##$PC= 4
##$PHC0= 1407.993
##$PHC1= 59.70032
##$PH_mod= 1
##$PKNL= yes
##$PPARMOD= 0
##$PSCAL= 0
##$PSIGN= 0
##$REVERSE= no
##$SF= 81.0140089999434
##$SI= 65536
##$SIGF1= 159.3651
##$SIGF2= -187.1042
##$SINO= 113.3802
##$SIOLD= 16384
##$SREGLST= <1H.CDCl3>
##$SSB= 0
##$STSI= 65536
##$STSR= 0
##$SW_p= 32467.5324675325
##$SYMM= 0
##$S_DEV= 0
##$TDeff= 32768
##$TDoff= 0
##$TI= <>
##$TILT= no
##$TM1= 0
##$TM2= 0
##$TOPLEV= 0
##$USERP1= <user>
##$USERP2= <user>
##$USERP3= <user>
##$USERP4= <user>
##$USERP5= <user>
##$WDW= 1
##$XDIM= 65536
##$YMAX_p= 467028283
##$YMIN_p= -2073116
$$ End of Bruker specific parameters
$$ ---------------------------------
##NTUPLES= NMR SPECTRUM
##VAR_NAME=  FREQUENCY,     SPECTRUM/REAL,   SPECTRUM/IMAG
##SYMBOL=    X,             R,               I
##VAR_TYPE=  INDEPENDENT,   DEPENDENT,       DEPENDENT
##VAR_FORM=  AFFN,          ASDF,            ASDF
##VAR_DIM=   65536,         65536,           65536
##UNITS=     HZ,            ARBITRARY UNITS, ARBITRARY UNITS
##FACTOR=    0.49542278885378, 1,            1
##FIRST=     16045.7642231865, 0,            0
##LAST=      -16421.768244346, 0,            0
##MIN=       -16421.768244346, -2073116,     0
##MAX=       16045.7642231865, 467028283,    0
$$ Real data points
##PAGE= N=1
##DATA TABLE= (X++(R..R)), XYDATA
$$ [...]
41669 -104434 -64806 -12364 -4693 -47159 -71408 -29836 31013 41763 17625 26070 73212 106577
41657 106577 121162 165409 228227 222366 120415 14282 -16708 -11704 -34328 -55565 -21890
41646 -21890 24688 3457 -64339 -79798 -18118 42379 42293 3469 -35222 -59924 -49812 13812
41634 13812 87729 93902 31427 -10474 21221 76033 93448 90662 106368 120359 94783 52684
41622 52684 46962 74600 85317 66004 57664 82698 103886 75232 3989 -59792 -81584 -71227
41610 -71227 -56203 -43693 -21993 7937 25742 24160 24162 39495 50031 38633 31669 61917 106021
41597 106021 108713 66273 33529 40221 52767 36925 8030 -10167 -32502 -78331 -121505 -119359
41585 -119359 -78254 -50937 -69632 -110790 -131339 -119892 -101548 -100369 -110968 -115143 -116599 -133866
41573 -133866 -154985 -135936 -68132 -10307 -11209 -32700 -7577 49360 60809 10866 -30011 -15610
41561 -15610 17847 27383 20525 1758 -62310 -172005 -253887 -252443 -209162 -187179 -168916 -104579
41549 -104579 -21385 5012 -28198 -42672 7311 85264 143530 176950 191337 179402 151205
41538 151205 138588 142299 113936 18829 -109615 -200578 -211770 -152725 -65380 4028 32943
41527 32943 38300 55915 99307 148241 174974 167263 130164 83082 50518 37443 20287 -19029
41515 -19029 -61638 -78194 -72602 -67082 -55943 -15637 42523 73632 58402 20898 -18709 -65023
41503 -65023 -109673 -121517 -99139 -88548 -113856 -129047 -84975 -17875 -15802 -101958 -201582 -235586
41491 -235586 -207614 -178432 -183369 -203508 -204888 -176136 -124144 -55559 21008 82428 100039 69545
41479 69545 23736 4095 18702 35143 18077 -31295 -79269 -101830 -112606 -138982 -176329 -186296
41467 -186296 -148009 -90183 -54385 -44327 -36539 -22648 -3539 42737 130996 206112 178416 48866
41455 48866 -64875 -73558 -32397 -51352 -135823 -195281 -183419 -141428 -105858 -61958 -7248 16921
41443 16921 -8945 -47307 -67290 -84641 -101168 -66722 42515 156430 187540 144910 107358
41432 107358 104730 95761 58103 28494 36821 59514 68363 81012 124550 176659 185465 141063
41420 141063 92118 83356 100689 97213 64257 50496 97431 174580 209043 177854 134515 128259
41408 128259 133710 96131 20766 -32311 -35371 -23252 -27878 -33312 -20779 -13500 -35210 -54523
41396 -54523 -22548 44868 74929 34378 -28134 -54722 -52834 -65574 -96754 -108718 -86824 -65754
41384 -65754 -81713 -123427 -143405 -105932 -19385 67460 100400 64923 -1894 -54533 -86079 -113689
41372 -113689 -130625 -111052 -63735 -36873 -53209 -80767 -90386 -98737 -120083 -120505 -73978 -29515
41360 -29515 -53309 -119883 -136150 -77009 -21702 -34395 -79267 -91139 -68096 -42647 -10837 46202
41348 46202 99844 98164 42349 -15309 -45982 -69859 -109248 -160373 -211810 -249174 -243592 -182788
41336 -182788 -115390 -110241 -159528 -178722 -126485 -67213 -74613 -124693 -141119 -109499 -78667 -67637
41324 -67637 -45377 -6152 6149 -26172 -51328 -17342 55420 109621 129124 140931 157974 161106
41312 161106 133096 80038 21158 -21863 -34238 -27020 -32169 -54861 -51789 6398 69258 53432
41300 53432 -49022 -161425 -225193 -254377 -272764 -262026 -214503 -184137 -221626 -285179 -280958
41289 -280958 -189894 -99192 -95233 -165062 -221081 -195506 -94266 20822 83876 69966 7737
41278 7737 -46687 -50366 4636 95260 185514 251093 296356 340242 381713 394438 363773 309856
41266 309856 260098 217249 171220 123244 77687 27420 -30512 -80649 -111362 -132014 -145044
41255 -145044 -124864 -55357 32998 97385 132725 150728 134563 64912 -25505 -79770 -93146
41244 -93146 -108503 -140128 -159020 -154243 -148046 -141548 -106284 -45460 -4553 4 5603 32646 47370
41231 47370 27554 8579 21494 33591 -908 -67540 -114788 -121113 -98687 -59383 -16086 9634
41219 9634 18146 42481 94743 135173 132117 115777 126201 142578 117962 57424 7595 -9250
41207 -9250 515 37166 89390 106112 53958 -13847 -18102 25086 20119 -66254 -154310 -160778 -92663
41194 -92663 -9288 47319 56134 10550 -53254 -67614 -12929 49050 55680 24261 18216 62124
41182 62124 126266 172528 181132 149696 98556 66235 73690 100824 114095 102575 72645 29349
41170 29349 -16130 -41544 -41056 -41395 -67721 -109740 -144437 -172743 -203758 -218868 -188934 -122594
41158 -122594 -62698 -32158 -14225 6550 13658 -14673 -68461 -115251 -136253 -136341 -123950 -98884
41146 -98884 -62272 -24907 711 7608 -10833 -58315 -113937 -128576 -73217 9771 37814 -15982
41134 -15982 -88385 -108125 -82892 -73580 -106529 -152037 -176013 -169792 -134445 -78822 -34475 -31884
41122 -31884 -57644 -73550 -80011 -114806 -180195 -220986 -196233 -130740 -72573 -38714 -24994 -27336
41110 -27336 -25849 7640 52092 33324 -76701 -197207 -229871 -180787 -132339 -120696 -110458
41099 -110458 -77189 -40833 -13310 18793 46156 34476 -10331 -34788 -21511 -21215 -65501 -104757
41087 -104757 -84470 -38749 -45334 -114202 -184638 -219528 -236663 -244205 -210954 -125545 -34972 11232
41075 11232 22432 37043 54702 37888 -26930 -104831 -152413 -158377 -141651 -130198 -144091 -176887
41063 -176887 -187060 -131411 -21012 75523 103097 79499 62801 72816 74479 36404 -25719
41052 -25719 -74132 -93336 -95485 -98783 -113511 -134442 -135647 -91365 -17687 27372 9969 -31243
41040 -31243 -35535 -5743 872 -32153 -47610 -2743 54655 45534 -28535 -87617 -85756 -66324
41028 -66324 -85227 -125838 -133102 -108087 -114963 -185409 -255947 -228989 -83537 97528 209226
41017 209226 217444 167791 118289 80515 27937 -54099 -143097 -202135 -212706 -180352 -121858 -58760
41005 -58760 -15542 -10041 -43260 -99310 -148075 -150025 -82885 20334 82073 58142 -6415 -29383
40993 -29383 9166 53914 55133 19616 -23854 -63009 -87678 -79685 -45480 -24770 -36647 -47721
40981 -47721 -25115 9995 18933 6246 -133 -4338 -26380 -47162 -26801 25983 57571 46873
40969 46873 28435 29612 34540 26424 19045 22544 16344 -16867 -58695 -80147 -76448 -60072 -43681
40956 -43681 -44924 -79851 -131800 -151573 -109427 -28144 49048 100147 121579 113046 84760 55195
40944 55195 23830 -28920 -99128 -147358 -149247 -126164 -102682 -69726 -20552 15070 16120 17636
40932 17636 59397 109099 97531 23927 -34993 -29653 4344 12282 -5917 -21317 -36906 -76817
40920 -76817 -129712 -147083 -103488 -28571 30960 56178 46616 -8192 -110923 -215935 -251321
40909 -251321 -200958 -130261 -102509 -102340 -82051 -50751 -54546 -83752 -76619 -23867 7988 -14112
40897 -14112 -31061 10814 67628 66289 17184 -11709 -2512 820 -28539 -73768 -116738 -148090
40885 -148090 -143395 -88068 -22466 -5202 -31867 -45388 -27119 -18013 -41372 -64055 -52697 -18255
40873 -18255 14609 38507 47486 33596 14572 21319 43868 38107 3116 -3012 47991 104941
40861 104941 115966 107296 131873 177543 186974 149338 113183 111404 123382 118270 96287 74586
40849 74586 60456 52690 52302 60075 70947 74851 59132 14653 -51609 -113483 -144533 -139866 -114999
40836 -114999 -86647 -58455 -22314 27791 79963 105858 86086 30992 -32070 -84235 -115811
40825 -115811 -115019 -80244 -36527 -13475 -10886 -12356 -23612 -60032 -101119 -104771 -72752 -52352
40813 -52352 -59870 -57974 -35161 -48362 -137657 -244161 -274603 -221940 -161291 -141171 -140915 -132816
40801 -132816 -123046 -116260 -93352 -51119 -24898 -41988 -79710 -98441 -97115 -107996 -148035 -200928
40789 -200928 -241287 -253859 -231976 -180398 -123015 -86590 -68788 -42010 -1177 15065 -22724
40778 -22724 -77055 -79853 -28105 2232 -41812 -116229 -144063 -119698 -99424 -108469 -116458 -103528
40766 -103528 -93311 -107327 -135007 -165484 -203343 -232382 -209921 -128070 -43691 -14731 -36576
40755 -36576 -70354 -101245 -133111 -154167 -149750 -132782 -127382 -136822 -154128 -181545 -209003 -200497
40743 -200497 -141484 -76600 -56492 -67587 -62526 -40460 -37043 -43056 -2253 94459 172145 159778
40731 159778 75449 -4693 -31299 -7834 41744 97397 143483 168654 167831 141229 99244 65418
40719 65418 54891 47455 5494 -73374 -145169 -173210 -169307 -163622 -157087 -134095 -110459 -129958
40707 -129958 -202039 -271103 -272879 -211015 -151518 -140278 -153783 -145252 -113042 -93720 -102869 -119971
40695 -119971 -127031 -121599 -88609 -5931 105092 178640 180710 148266 123203 89862 21367 -49477
40683 -49477 -63968 -23658 12608 8603 -22102 -59446 -93095 -97865 -49809 23387 57668 32774
40671 32774 -5111 -14510 -10812 -28093 -63255 -80283 -50009 23709 98938 120885 79098 28965
40659 28965 20536 25122 -11338 -59375 -34098 60435 110288 54522 -18898 -3552 72454 105319
40647 105319 73577 44935 55190 73440 79407 89708 102289 92092 73798 94158 140247 127239
40635 127239 14162 -127022 -199436 -189256 -143487 -89571 -34973 -10526 -43562 -97776 -102695
40624 -102695 -47075 10480 32053 46598 84274 115870 97197 40368 -2983 -10547 -354 13132
40612 13132 29330 33533 7353 -25401 -11013 55838 108399 93371 46522 44924 106961 180126
40600 180126 213060 198149 150794 90133 42975 28516 31717 24482 17946 54865 136193 194763
40588 194763 171019 88873 23329 6644 1305 -31743 -67528 -42166 59755 165249 183328
40577 183328 112631 47090 58079 104737 98660 31875 -15728 8797 69993 111141 125900 132814
40565 132814 125259 89029 40754 8398 -9458 -33356 -68259 -106716 -148167 -186775 -200296 -183654
40553 -183654 -173307 -197826 -219519 -174808 -71766 3584 -5404 -54124 -59913 -8081 40778 36507
40541 36507 -5791 -42804 -61869 -77735 -88719 -73862 -37481 -18191 -30757 -30967 24334 104818
40529 104818 142484 129326 123687 155256 182182 162534 114604 74989 42578 789 -43597 -81527
40517 -81527 -124009 -163208 -151212 -69223 16436 29353 -8332 -7672 58240 124308 132369 93848
40505 93848 41563 -17245 -71548 -81702 -25356 57489 98625 71616 12049 -21896 -971 53418
40493 53418 96673 113863 128347 144211 115234 15408 -86311 -88795 5801 87790 84873 43251
40481 43251 34885 50300 36623 -4027 -18106 15035 54787 53405 5531 -53199 -76384 -46844
40469 -46844 -2315 17 -37809 -44439 21023 94850 84480 -5251 -82696 -98957 -100001 -132888
40457 -132888 -160359 -111033 16384 141312 185883 144901 75887 41377 64404 127249 201038
40446 201038 266743 305899 291745 216878 124151 75167 76955 70513 11993 -62620 -84579 -45315
40434 -45315 -3962 -7083 -39468 -61518 -59454 -40111 -5145 40940 71845 56609 -6702 -90828
40422 -90828 -165915 -209713 -202660 -140145 -49958 25968 71906 103487 133269 152758 149556 117782
40410 117782 49471 -52475 -142778 -152560 -67418 38600 78752 46834 3898 -12753 -26954
40399 -26954 -70584 -131829 -172152 -171911 -142338 -104392 -70810 -46616 -37103 -46320 -61840 -48959
40387 -48959 18122 112908 167882 146686 86584 48393 42774 34054 2437 -32996 -49721 -47661
40375 -47661 -37442 -30002 -39893 -72547 -105582 -109712 -93281 -98968 -146660 -202494 -215939 -171003
40363 -171003 -94087 -27663 197 -1083 12131 72801 159613 218473 226544 206985 176831 116342
40351 116342 10128 -107197 -173924 -163114 -108443 -74223 -102488 -175957 -229817 -215026 -151214
40340 -151214 -100119 -91336 -102232 -108704 -114162 -115311 -82949 -7862 65695 89406 73815 65674
40328 65674 77145 77119 47078 3428 -43248 -111257 -205444 -277076 -261229 -152742 -18397 73857
40316 73857 115063 129928 116967 53084 -44918 -108623 -90275 -16768 53667 101253 140258 171364
40304 171364 180867 172721 159638 133058 84196 43818 51232 87764 93349 50481 -2766 -47132
40292 -47132 -105587 -174019 -193593 -130666 -36413 13314 1148 -43118 -99396 -161804 -213197 -235091
40280 -235091 -229400 -206089 -166227 -113536 -60221 -10225 34904 50109 11578 -45175 -51287 -8153
40268 -8153 2104 -57022 -112111 -93184 -40770 -29583 -46106 -28295 16357 26596 -2037 -13275
40256 -13275 11628 34806 39887 51078 67568 50768 -8955 -73115 -115614 -149175 -180754 -189302
40244 -189302 -157843 -88813 9322 108531 148483 94314 -1071 -52477 -53201 -66174 -111860 -141420
40232 -141420 -127536 -104569 -99776 -93748 -71185 -48794 -33309 -11328 5472 -9374 -28503 13446
40220 13446 114984 196054 217304 229407 268733 291189 261683 226946 233239 243274 209345 167949
40208 167949 179869 222713 226343 183204 144927 131748 119178 101488 101466 120457 129468 105132
40196 105132 40336 -58994 -152503 -175721 -117720 -53087 -46469 -65126 -44934 -213 6368 -31119
40184 -31119 -68999 -100203 -145163 -173622 -131771 -47298 -12680 -49232 -74877 -29117 52381 115385
40172 115385 157552 181899 155316 67342 -26903 -76848 -105154 -156052 -214814 -232451 -202069
40161 -202069 -157823 -114764 -57795 14863 74803 92030 59867 -4223 -68521 -107756 -125477
40150 -125477 -142906 -159669 -149545 -106538 -65546 -55835 -60402 -48774 -27406 -23590 -33400 -23606
40138 -23606 14926 49271 50825 35008 34950 47747 33112 -27717 -94625 -114861 -96052 -96575 -137490
40125 -137490 -166745 -136979 -81301 -70056 -117069 -173839 -198741 -185750 -141750 -87991 -69501
40114 -69501 -102388 -121870 -53206 67600 125691 92742 69774 127890 195553 169412 66487
40103 66487 -15084 -39542 -51993 -78602 -90915 -66929 -22329 21969 51852 42670 -16886 -82419
40091 -82419 -88428 -35493 2737 -25591 -86619 -109165 -68081 -617 42601 47213 40583 52076
40079 52076 72419 68518 38591 19380 24809 20002 -12885 -28450 11714 60207 40985 -37210
40067 -37210 -94221 -92170 -63075 -30519 12302 37020 -18166 -146397 -247095 -249391 -199986 -179684
40055 -179684 -187670 -166005 -97941 -24237 10178 -21281 -125169 -258143 -330414 -297014 -223002
40044 -223002 -200447 -222263 -204459 -121342 -43704 -33268 -66061 -85160 -77717 -70031 -83544 -123103
40032 -123103 -181215 -231609 -240807 -203205 -146690 -96013 -54094 -23866 -17318 -34027 -62350 -108919
40020 -108919 -186984 -263457 -267591 -181765 -78268 -26814 -7763 33023 83333 89687 63425 79996
40008 79996 162274 237190 237302 184973 135562 89448 18792 -49975 -50011 28637 112900 138449 127662
39995 127662 145482 200564 228246 173972 65469 -16352 -26684 5974 33297 49778 78556
39984 78556 113023 113954 71284 29896 30673 55082 58940 38604 25373 28738 30404 31776 58440
39971 58440 106340 130471 111269 91473 112421 146622 137953 88367 54329 61221 69337 35110
39959 35110 -32270 -91103 -113609 -95422 -46262 7128 29477 11719 -15591 -21283 -11126 -8029
39947 -8029 -13049 -13628 -17598 -43692 -79343 -83922 -45855 -7650 -14797 -60046 -101011 -119825 -138487
39934 -138487 -175747 -212819 -214251 -173115 -123216 -104695 -121386 -136033 -110179 -46648 13420 35475
39922 35475 24345 8926 6420 13452 24195 38996 53601 55930 40873 17158 -8253 -41636
39910 -41636 -86043 -120862 -114969 -63013 3961 50568 71688 87427 108546 117474 87449 17229
39898 17229 -57049 -87433 -55121 11855 63218 70601 46652 21436 7264 -6641 -30219 -57081
39886 -57081 -76377 -87240 -90829 -77283 -37670 12483 40574 34943 19256 17087 17691 -3248 -39755
39873 -39755 -60274 -55810 -52951 -67108 -70150 -27557 49663 115978 143912 139928 115319 72263
39861 72263 21385 -15678 -31525 -39269 -45055 -36474 -8978 18978 30848 28625 7531 -58621
39849 -58621 -176565 -296753 -354176 -340947 -307230 -292992 -290184 -273215 -234043 -178353 -113940
39838 -113940 -53179 -5190 40435 97696 147121 145669 86039 15787 -19342 -21745 -13673 2544
39826 2544 27062 38207 25370 20665 50947 76439 32638 -70586 -148914 -152762 -122960 -116037
39814 -116037 -124555 -109074 -71454 -47742 -45673 -36826 -10764 2774 -21425 -62921 -76831 -45363
39802 -45363 5288 37168 41570 44941 75670 130487 178858 195705 178624 134772 68217 -11921
39790 -11921 -84654 -131684 -153267 -161111 -161648 -154949 -144273 -134833 -122648 -93615 -40420 20137 54969
39777 54969 50389 36904 59096 115117 151876 138253 113978 131373 174260 186178 164385 159466
39765 159466 177804 159499 82226 16367 26323 74506 86171 63364 58891 67393 29323 -59895
39753 -59895 -125553 -116282 -68372 -45329 -64128 -103109 -136939 -139425 -92579 -20993 13666 -22196
39741 -22196 -96118 -150526 -156869 -120753 -66126 -27514 -25949 -38808 -23412 22306 60620 80912
39729 80912 112922 154785 147743 61691 -43674 -89229 -65932 -7459 78291 182602 236724
39718 236724 166972 8823 -109336 -114256 -61640 -42386 -69831 -93141 -81116 -48693 -17703
39707 -17703 9393 33754 41769 16284 -35166 -72506 -57215 1206 47129 38029 -11634 -58173
39695 -58173 -82501 -95449 -104390 -102443 -85993 -60612 -33545 -18253 -36928 -95359 -160853 -186461
39683 -186461 -154474 -83921 -9449 31351 13325 -44888 -85248 -78777 -68495 -104730 -160749 -166861
39671 -166861 -115212 -67691 -59687 -62409 -53974 -59083 -85564 -82419 -10857 84088 125423 101735
39659 101735 63317 39116 12077 -22826 -27117 31582 125720 190131 190867 152185 114238 85641
39647 85641 56369 41108 67937 115490 110814 26855 -58539 -57684 1144 15435 -36360 -69044
39635 -69044 -33768 6105 -11546 -39256 2322 94243 151076 153211 162182 209350 246864 224375
39623 224375 154213 78716 20385 -11697 -6131 29489 56845 43823 -1266 -50262 -92677 -131720
39611 -131720 -157340 -151431 -119390 -92343 -88659 -90814 -75976 -56520 -64455 -96912 -109370 -78815
39599 -78815 -43800 -50996 -83305 -82271 -32038 25236 58647 84342 118520 140299 125943 84633
39587 84633 36185 -14128 -54656 -56915 -18291 13688 -5720 -62885 -112186 -133675 -133718 -115075
39575 -115075 -85553 -76041 -106735 -145089 -136112 -72175 -3965 15116 -23769 -81715 -98511 -41187
39563 -41187 53149 104551 80105 28504 4988 4367 2623 15540 60258 99377 92533 76415
39551 76415 119551 213055 280061 285002 259215 223147 164386 99622 76318 93578 97238 75872
39539 75872 83071 132373 151766 95626 33874 63466 176241 277031 301395 259688 189923
39528 189923 122148 78320 64799 67939 76135 87327 82062 28189 -61779 -120773 -110992 -77625
39516 -77625 -78532 -103583 -116037 -132582 -191963 -266464 -278427 -203031 -93353 -1154 70363 129052
39504 129052 165343 178158 184677 185763 156482 86450 477 -71127 -114388 -118225 -73147 4925
39492 4925 78992 130150 166111 185658 170177 124277 90155 99145 133926 157514 154909 127256
39480 127256 72669 273 -57881 -78976 -79604 -86784 -92994 -72334 -33331 -19681 -55151 -118295
39468 -118295 -178507 -227086 -260243 -262091 -229067 -189279 -166866 -139921 -68529 38108 119603
39457 119603 139411 129174 138965 170154 183940 157514 102359 38990 -16601 -48798 -54756 -57391
39445 -57391 -77670 -98620 -89497 -62359 -63346 -100001 -118949 -74231 17147 107354 169704 193495
39433 193495 164671 92302 31302 34872 91398 141870 152738 138943 119434 85843 24214 -55841
39421 -55841 -125004 -157467 -148417 -116153 -85435 -66387 -59051 -75871 -132291 -205707 -238530 -207133
39409 -207133 -157247 -138638 -134618 -99111 -37786 2664 11820 21089 33468 11748 -48554 -94182
39397 -94182 -90105 -70863 -81045 -105739 -102243 -71756 -55001 -71630 -101674 -118178 -108014 -70484
39385 -70484 -24478 -6399 -30532 -61931 -62636 -54647 -92279 -170865 -214078 -173362 -96881 -65056
39373 -65056 -88869 -114337 -107136 -81646 -50360 69 64720 99410 77290 34157 18647 20164
39361 20164 -8189 -66427 -98475 -71975 -21386 5332 3404 -9183 -32754 -70771 -96378 -75419
39349 -75419 -18761 20577 6978 -42002 -83120 -95004 -93326 -107299 -144825 -180688 -183199 -150068
39337 -150068 -107223 -76641 -65207 -81480 -130200 -182762 -191942 -156231 -132487 -156965 -192028 -189422
39325 -189422 -167551 -170305 -178295 -133006 -42530 10962 -15173 -66879 -77057 -52276 -39772 -51773
39313 -51773 -67360 -81977 -110495 -153304 -194043 -222784 -233429 -208770 -140289 -58942 -13260 -9845
39301 -9845 -1987 48485 115864 135724 79563 -12257 -74774 -82540 -61306 -47302 -53911 -77788
39289 -77788 -114414 -153629 -175257 -168126 -147223 -136987 -141930 -145605 -132856 -102760 -67709 -48931
39277 -48931 -59598 -80637 -71944 -25599 13642 7586 -16988 -6398 38592 66040 54877 44748
39265 44748 71800 117241 141654 138258 126092 111736 84277 40376 -3196 -22089 -7640 17178
39253 17178 12254 -34309 -83278 -87992 -53660 -25267 -20090 -6102 45613 116119 157684 137697
39241 137697 58583 -45867 -130219 -170507 -176133 -156258 -95587 4559 84558 79340 5998
39230 5998 -56743 -75000 -84134 -102435 -95081 -50851 -22955 -46786 -74301 -45466 18751 53182
39218 53182 46056 39322 49273 44443 1356 -60515 -104174 -110921 -93481 -88304 -121961 -173882 -195887
39205 -195887 -180381 -173892 -203436 -232636 -222312 -189945 -165831 -132897 -65844 3845 25623 10216
39193 10216 7239 16505 -10724 -83692 -149485 -166765 -146965 -112412 -67619 -28591 -29878 -74859
39181 -74859 -114249 -100224 -39454 23847 56091 52332 25685 -7398 -39269 -68808 -80583 -44329
39169 -44329 40760 117983 123903 58204 -30330 -114113 -198616 -271096 -291775 -248538 -177756 -116194
39157 -116194 -68681 -35454 -31921 -60479 -93841 -107562 -106321 -103448 -97945 -85571 -71123 -58579
39145 -58579 -48956 -52844 -79351 -107771 -101652 -61291 -31010 -41071 -73182 -98407 -115589 -129856
39133 -129856 -124967 -89585 -50735 -46400 -71421 -78465 -34653 39737 91940 87869 42266 1281
39121 1281 -5240 8584 6964 -27764 -86116 -146479 -180619 -160285 -88160 -14512 8521 -14152
39109 -14152 -38147 -49779 -78145 -134877 -186693 -203228 -193503 -174407 -137634 -75354 -13521 10273
39097 10273 -9541 -45859 -74038 -93664 -120197 -161207 -198386 -200785 -166955 -138265 -147362 -170986
39085 -170986 -168119 -147347 -148063 -164765 -149002 -89521 -29474 7440 44624 87737 100675 78550
39073 78550 76368 117782 138237 80202 -6949 -32650 8299 49449 64163 81524 102363 83234
39061 83234 16231 -44553 -59362 -52489 -61649 -81214 -82391 -58150 -24327 1912 8586 -6106
39049 -6106 -23091 -14903 21966 62933 86690 92121 83266 60989 33618 12137 -11433 -58114
39037 -58114 -127466 -191490 -230695 -252135 -259954 -234032 -161310 -73170 -23923 -30518 -51351 -32502
39025 -32502 33122 101374 130331 127892 136409 175195 216231 222406 191794 150261 114839 84139
39013 84139 56534 35215 15196 -15709 -57972 -94815 -110122 -103849 -87910 -74300 -68908 -70856
39001 -70856 -75181 -77633 -76272 -69102 -54917 -36067 -13517 19425 66772 111261 119620 74823 -1545
38988 -1545 -61163 -61115 4919 93417 139729 121527 84135 77358 82859 46666 -25953 -67461 -48467
38975 -48467 -17419 -14573 -10902 23113 47135 13105 -45114 -57401 -27544 -21629 -55570 -71258
38963 -71258 -35391 6540 1481 -38195 -65965 -69950 -76678 -103376 -131491 -124257 -64727 17502
38951 17502 62449 35385 -41551 -125451 -199669 -260226 -281215 -239631 -165173 -117844 -114285 -117861
38939 -117861 -103536 -87856 -86128 -83617 -66153 -44855 -34855 -38722 -61113 -107295 -154895 -159969
38927 -159969 -107671 -31077 30825 65627 70369 37802 -22511 -78198 -107384 -117339 -122314 -128933
38915 -128933 -146800 -178104 -191039 -147862 -73258 -45061 -90624 -141149 -128093 -82104 -84364 -148272
38903 -148272 -207694 -213165 -186168 -171647 -178354 -182468 -166542 -140306 -131126 -155579 -194210 -202774
38891 -202774 -161625 -106544 -94473 -140900 -203332 -225961 -193398 -142135 -122239 -145095 -172394
38880 -172394 -164571 -130978 -114159 -133074 -168443 -198593 -215466 -205484 -156031 -90269 -53710 -51674
38868 -51674 -43748 -18906 -24323 -84904 -143076 -128831 -54455 13121 45257 58942 53928 10456
38856 10456 -53501 -86262 -74686 -61252 -75635 -95086 -88917 -59995 -21725 27919 83444 113495
38844 113495 95411 50697 22239 27193 47870 56781 37601 -5456 -46129 -55259 -31426 -651
38832 -651 20390 42207 73505 97466 98072 93073 113345 156855 191234 202936 215876 249310 279137
38819 279137 262875 194783 114810 61566 34575 10576 -18206 -37087 -33608 -14874 -852 -8589
38807 -8589 -38249 -64758 -51538 9856 77403 95044 50493 -22117 -92365 -156698 -209329 -227645
38795 -227645 -205113 -168427 -138871 -104172 -56233 -28883 -57818 -118595 -147771 -122450 -80726
38784 -80726 -62850 -70223 -88458 -111937 -128901 -114838 -65086 -13637 2821 -13777 -34609 -42168
38772 -42168 -36307 -13319 35732 104353 165562 193292 182427 149466 121705 121498 147232 169046
38760 169046 158006 124235 110448 137231 171511 170516 144092 137574 150317 117084 1850 -124011
38748 -124011 -149694 -63183 30958 41098 -13766 -59062 -70547 -80329 -103526 -112126 -82626 -29784
38736 -29784 18357 52638 76978 87779 73652 31328 -23539 -60865 -55995 -11575 44510 88646
38724 88646 121360 149362 157689 116748 19397 -96855 -168675 -154012 -72886 -1009 -4218 -71653
38712 -71653 -130359 -131217 -95519 -64973 -39910 924 43632 46557 -143 -60314 -100306 -118874
38700 -118874 -122578 -105424 -71546 -54044 -84452 -148536 -191531 -172360 -105291 -42177 -15846 -10782
38688 -10782 4778 31354 42950 31794 17552 7941 -14167 -47660 -52878 -4798 60093 85693
38676 85693 66068 36667 11627 -27463 -85600 -138830 -168811 -179097 -172034 -140783 -92683 -53645
38664 -53645 -37820 -30680 -9577 31180 76744 103560 101221 90714 103093 126930 107980 31240
38652 31240 -29825 4079 107186 178681 173876 142576 135456 140481 132699 126838 146617 184288
38640 184288 220208 246904 250638 208271 128403 57183 15163 -33085 -114158 -188656 -199275 -147641
38628 -147641 -83356 -39992 -21278 -29953 -66918 -112039 -143192 -167896 -204628 -240999 -243367 -205556
38616 -205556 -160114 -140403 -150840 -171191 -173484 -141112 -86913 -44780 -31636 -31367 -28196 -34485
38604 -34485 -65957 -110668 -146724 -171039 -184377 -169574 -119291 -70085 -69900 -116216 -159358 -164613
38592 -164613 -141878 -117449 -107303 -118504 -148091 -175914 -180355 -162763 -138293 -107827 -62285 -10833
38580 -10833 20958 21457 -180 -35294 -81070 -126611 -157047 -171345 -175500 -161834 -118528 -56686
38568 -56686 -4075 25180 32853 18982 -7704 -13494 23424 63080 41127 -35104 -81466 -51214
38556 -51214 -2619 -12692 -65784 -83299 -41251 2565 -1830 -33777 -44622 -22237 11542 40378
38544 40378 62659 75946 76987 71382 64887 51081 27153 17738 57491 141230 210805 207448 129549
38531 129549 28839 -41892 -67272 -66008 -63924 -67406 -57385 -19018 20380 9892 -50147 -84673
38519 -84673 -36239 43593 53963 -12894 -60392 -31765 12091 -170 -36724 -24598 24594 34631
38507 34631 -13198 -62270 -80618 -96680 -123597 -127831 -103640 -107330 -170055 -232744 -224805 -166931
38495 -166931 -133293 -138061 -127954 -80768 -42721 -50943 -74670 -66658 -35710 -27605 -52149 -69554
38483 -69554 -49155 -10063 6615 -14629 -55277 -86141 -86211 -51839 -4748 17216 -3738 -42363
38471 -42363 -61261 -59066 -63770 -81523 -85436 -62399 -34637 -16516 13879 70227 116564 109925
38459 109925 60966 8429 -45621 -119680 -184214 -179095 -112357 -74620 -120962 -192210 -199338 -144512
38447 -144512 -102645 -108241 -122097 -105856 -72868 -51625 -42309 -32396 -26826 -37880 -58929 -66032
38435 -66032 -38895 26985 117005 197939 234372 216072 162403 96159 27568 -29852 -50974 -28270
38423 -28270 6036 14542 3197 3909 11691 -18485 -94649 -146257 -98347 28682 131263 133319
38411 133319 56286 -21241 -45737 -25382 -7900 -29648 -72887 -77508 -15486 57045 58494 -9798
38399 -9798 -60503 -37363 14429 22721 -12490 -37656 -30681 -16733 -16068 -24489 -39533 -62921 -76872
38386 -76872 -55433 -3911 41463 55071 40562 14995 756 22110 74150 101061 45151 -78190
38374 -78190 -186332 -212846 -158564 -67475 9678 31120 -11316 -74963 -110847 -129206 -180122
38363 -180122 -266560 -327310 -319773 -269868 -220054 -176884 -135284 -105830 -84817 -42739 18578 39252
38351 39252 -22863 -124153 -189987 -206738 -209044 -204181 -169665 -111043 -61392 -27297 8632 32016
38339 32016 3145 -68722 -113919 -91443 -46034 -45239 -91980 -132909 -131013 -95666 -52384 -15688
38327 -15688 6997 9021 -8418 -33362 -53010 -60711 -50431 -13016 50302 110678 124368 78501
38315 78501 16406 -5045 16340 27782 -4902 -55436 -87116 -110600 -154188 -197858 -185776 -104535
38303 -104535 -6798 52834 70993 72683 69382 60891 52214 42696 15660 -36047 -86441 -103237
38291 -103237 -90752 -81485 -89139 -96662 -92876 -91864 -102539 -103424 -71587 -23167 1968 -7838 -25940
38278 -25940 -31508 -35627 -52132 -69471 -72474 -70180 -74393 -66875 -22136 44028 84120 77712 47807
38265 47807 16713 -16960 -48661 -55776 -35250 -18222 -22755 -25621 -11828 -18959 -87730 -188317
38253 -188317 -244772 -228379 -184430 -165044 -174642 -188147 -185599 -154963 -93144 -24737 3899 -27286
38241 -27286 -82748 -109845 -99088 -87815 -105409 -132088 -122369 -63844 1405 21731 -8083 -52100
38229 -52100 -87084 -121597 -155568 -157686 -110224 -49922 -27599 -41487 -48009 -29956 -13353 -16906
38217 -16906 -24945 -18086 5092 46003 108718 170653 187660 149857 99401 68374 33899 -29571
38205 -29571 -84665 -69831 6846 65123 52275 2846 -17850 5582 39265 54290 47704 22809
38193 22809 -17494 -57497 -76879 -78732 -85490 -97021 -78889 -15501 43869 28154 -65087 -153945
38181 -153945 -160680 -93473 -22751 3638 -5519 -24826 -50112 -83819 -107361 -94957 -53779 -29241
38169 -29241 -56150 -110619 -127502 -72188 18025 77389 85565 75705 73527 62080 22398 -20268
38157 -20268 -23637 9114 28446 5119 -30230 -30851 -464 8099 -37810 -102746 -121460 -78633
38145 -78633 -26139 -11335 -13664 17991 78883 102396 48368 -41002 -94464 -91868 -67041 -55692
38133 -55692 -69325 -102826 -138645 -155772 -158346 -177925 -220556 -235322 -177138 -84710 -44617 -80332
38121 -80332 -130386 -145647 -151382 -184173 -216703 -194559 -122804 -63584 -49717 -44946 -3963 60059
38109 60059 92753 68221 14677 -27883 -48749 -52806 -30158 29295 98120 125763 102242 75974
38097 75974 87516 112057 95501 27521 -53144 -111432 -138606 -130822 -85081 -22057 18626 17961
38085 17961 -4884 -17797 -3852 30192 53943 31587 -32700 -77032 -45791 30644 60071 -747
38073 -747 -97745 -154117 -154908 -135628 -119230 -95991 -51216 11818 71622 100227 83817 37380
38061 37380 -11923 -55291 -98924 -134119 -139202 -114622 -85079 -58332 -14474 49903 99769 104827
38049 104827 77553 47414 24041 9465 19157 58377 95967 94700 57379 14288 -25541 -79120
38037 -79120 -146619 -192174 -178601 -110802 -39845 -24500 -79871 -158048 -190515 -158203 -109387 -102137
38025 -102137 -143492 -193422 -210675 -180958 -116166 -44715 4057 17214 -4660 -64931 -163342
38014 -163342 -266324 -314884 -280765 -193963 -100642 -20577 37031 52371 24761 -4367 -62
38003 -62 14696 1036 -20519 4777 68031 89438 30123 -46798 -66472 -47195 -57211 -92279
37991 -92279 -69168 47203 174029 209992 165445 137705 171106 205543 179612 124961 110400
37980 110400 127220 94307 -22264 -148570 -182825 -103387 23129 115284 135175 94013 31272
37969 31272 -10907 -12307 15075 40413 38934 9300 -26856 -44144 -35606 -12097 16766 43142
37957 43142 42428 -13007 -105892 -175402 -192641 -195723 -213072 -200728 -120036 -36031 -47447 -135716
37945 -135716 -184825 -156493 -137577 -181756 -211425 -140952 -12773 67010 67614 31854 -14371 -70077
37933 -70077 -109446 -100762 -58821 -19455 17973 68992 111230 111117 80126 48416 9253 -48992
37921 -48992 -83368 -42188 44571 93436 79558 51353 35986 2290 -71238 -152993 -198762 -189524
37909 -189524 -124164 -23340 55230 55443 -13388 -89374 -132185 -144208 -131904 -102913 -94366 -139958
37897 -139958 -206065 -223489 -189109 -170521 -196776 -212850 -169510 -98353 -61071 -68183 -82388 -71171
37885 -71171 -30303 20160 47899 38575 17671 17905 34411 46491 64715 104680 132017 100942
37873 100942 37999 10510 13498 -24676 -112511 -165587 -137095 -88280 -84469 -103128 -98667 -83939
37861 -83939 -86208 -86184 -63433 -46446 -58470 -69894 -64822 -93696 -186425 -269187 -253933 -169781 -116323
37848 -116323 -116134 -106975 -65132 -40535 -61919 -90471 -89359 -73560 -64470 -46785 -1264 51601
37836 51601 66570 20720 -60422 -115928 -99455 -29828 25619 31863 21079 27121 27943 -6854
37824 -6854 -49882 -50637 -9833 33400 64203 85953 74443 3654 -91223 -137555 -111469 -50861
37812 -50861 8543 55369 70069 33192 -30410 -70028 -74221 -68390 -55057 -17839 18552 2558
37800 2558 -61612 -114208 -135538 -169355 -229379 -258290 -218938 -160287 -143408 -154957 -145510 -109649
37788 -109649 -75073 -47696 -19582 -2373 -2647 9847 57465 99937 79901 10016 -41711 -49394
37776 -49394 -55420 -91765 -128953 -125537 -86518 -42690 -960 50770 104313 130297 116740 85112
37764 85112 62292 51677 38422 12419 -19867 -38072 -19707 36918 94805 102245 51491 -5162
37752 -5162 -24201 -36544 -100214 -195390 -227717 -154929 -51350 -7605 -17667 -21089 -15711 -52288
37740 -52288 -131681 -186165 -176479 -145421 -150498 -188382 -210679 -181960 -104253 -12598 41666 32575
37728 32575 -5716 -14644 14030 33038 10849 -34259 -75885 -104818 -101696 -42528 44214 84294
37716 84294 56726 30344 58271 94436 77412 45849 85488 186952 247138 213165 141313
37705 141313 93747 52522 -24105 -115665 -159221 -125819 -39766 55858 121293 128980 84996 31510
37693 31510 1957 -16088 -51687 -99570 -126455 -116734 -80757 -26422 38844 77372 38690 -69810
37681 -69810 -164468 -172424 -118335 -87999 -114672 -142457 -109595 -30222 29995 34755 3357 -32444
37669 -32444 -64038 -91901 -101949 -76772 -24360 21969 38765 39483 56157 95252 124684 111801
37657 111801 62064 5702 -43583 -93421 -140311 -163084 -157980 -151173 -157085 -148341 -94571 -15886
37645 -15886 33715 33407 20518 45472 118403 201206 240209 211024 145192 106984 129257 179545
37633 179545 204555 194349 177108 162383 127775 66059 9482 -9071 6623 34950 69847
37622 69847 112372 144142 137297 90809 36224 914 -20606 -48701 -80595 -87484 -54859 -11377
37610 -11377 -458 -26761 -49702 -33915 11058 48134 53204 29976 1789 317 45808 123474
37598 123474 191077 220620 219636 205675 182706 153963 130502 108260 63786 -3917 -54350 -56606
37586 -56606 -35371 -36496 -69593 -112158 -141318 -130348 -52919 61851 116151 48364 -74315
37575 -74315 -135371 -120559 -114393 -158703 -204134 -210768 -207072 -217690 -208540 -145934 -53058 29126
37563 29126 85943 104120 62094 -14762 -44980 13501 101874 140204 126795 110064 102408 80431
37551 80431 44533 21551 20851 31569 49816 69915 64871 15883 -50078 -87875 -89742 -83967 -91564
37538 -91564 -113416 -147250 -188896 -226403 -252732 -269555 -265735 -220915 -149933 -108159 -123691 -157664
37526 -157664 -162749 -143921 -125110 -97970 -54170 -31736 -67751 -128200 -146614 -119166 -103940 -134721
37514 -134721 -188813 -231408 -239498 -192880 -100030 -27421 -41439 -117606 -164540 -142917 -102893 -95904
37502 -95904 -111979 -124027 -135118 -150361 -148478 -115479 -72532 -42581 -20187 1848 9027 -4962
37490 -4962 -15960 -7305 -3624 -33513 -79216 -100043 -94798 -103924 -148645 -200343 -223742 -227979 -249880
37477 -249880 -290085 -293368 -212262 -76360 31519 66404 52975 20107 -46516 -151520 -231352
37466 -231352 -208148 -90860 28680 79984 70643 39628 2216 -43621 -90249 -117187 -99275
37455 -99275 -20885 95274 184373 197823 156387 108896 55165 -34316 -130231 -150068 -72365
37444 -72365 20274 48294 31850 37072 69894 77269 31045 -37726 -79749 -69092 -12826 52980
37432 52980 84648 69663 35253 5761 -26943 -71491 -102482 -90516 -49771 -21002 -15290 -6248
37420 -6248 24894 64571 88778 88499 72137 59007 68282 98169 118709 102188 60346 36707
37408 36707 60276 115826 158462 151190 95294 32835 11179 35144 64166 66896 60946 76791
37396 76791 98932 80575 17320 -34496 -32612 -9934 -27796 -86828 -126620 -113523 -84722 -86041
37384 -86041 -104069 -96710 -67057 -58453 -81053 -93479 -70177 -42065 -45235 -67047 -77567 -84924
37372 -84924 -115829 -156748 -161077 -117249 -73369 -82332 -143066 -205130 -221224 -193040 -168002 -181770
37360 -181770 -205705 -180599 -112459 -90211 -170877 -284034 -305810 -208440 -77704 8552 54445
37349 54445 93292 126690 143869 153846 163450 150988 88832 -23512 -159689 -279037 -335559
37338 -335559 -306393 -223465 -149558 -112602 -89662 -60405 -39261 -38435 -33125 9673 84806 150976
37326 150976 172254 152698 135712 158728 196174 174064 72600 -18866 -5410 79828 120417
37315 120417 83412 49199 63676 64430 668 -66887 -60663 -11689 -2978 -31484 -18455 59106
37303 59106 131858 139734 104796 83887 92119 95062 57398 -11579 -58479 -42106 10359 32404
37291 32404 9544 -3450 23365 40029 -1090 -59370 -63613 -18382 15441 19859 25405 32341
37279 32341 5969 -44420 -55439 1979 83033 138373 168866 187605 180164 137964 91399 72028
37267 72028 69496 59098 46865 50344 52229 14672 -62017 -129560 -148343 -128136 -101048 -77131
37255 -77131 -48571 -23813 -26017 -53998 -73825 -64996 -51450 -64771 -97521 -121046 -129336 -129680 -110710
37242 -110710 -69125 -52430 -110032 -203363 -239588 -209415 -208413 -284637 -350959 -316044 -231078 -215036
37230 -215036 -278430 -321582 -290903 -237164 -209630 -183479 -126811 -71203 -66655 -103651 -123278 -90782
37218 -90782 -31435 3422 -6481 -29587 -22371 13136 33370 20484 10112 29573 46897 19375
37206 19375 -40470 -93083 -134727 -177486 -194722 -154447 -92219 -78171 -112691 -125538 -86183 -45584
37194 -45584 -51027 -83783 -105197 -106879 -89989 -51293 -18440 -41361 -110625 -138623 -70502 31261
37182 31261 68297 36708 12954 30903 43695 13125 -25497 -16395 37112 79956 74446 31953
37170 31953 -17906 -59922 -87254 -87537 -57183 -18913 -424 1924 13237 33535 31625 -6427
37158 -6427 -54983 -88905 -110958 -119221 -88404 -19459 29225 9526 -42542 -54732 -24846 -20407
37146 -20407 -73813 -134943 -142593 -99276 -54462 -40913 -43967 -20403 54630 149274 196145 168302
37134 168302 112375 80869 60602 8474 -68069 -119041 -125164 -109378 -84555 -44048 367 25806
37122 25806 43780 86457 145458 174685 157858 125830 104248 89691 77140 64897 37184 -8319
37110 -8319 -24860 32753 128910 182571 176485 160590 150619 107536 29594 -21326 -13442 9151
37098 9151 3924 -14960 -25350 -30854 -18175 46324 143739 197317 176231 136036 121944 107728
37086 107728 70925 47484 58537 60025 25893 8711 50721 102982 105641 85364 94971 113343
37074 113343 88420 31390 -15033 -58346 -121596 -167546 -148159 -99175 -93019 -117774 -94790 -8089
37062 -8089 69732 81308 39374 -22438 -83204 -115920 -100783 -65548 -60171 -89651 -118199 -130282
37050 -130282 -136069 -129463 -98765 -69299 -76200 -101194 -92810 -42247 14997 59848 92615 91242
37038 91242 36969 -25059 -22988 41796 97784 106655 95511 85172 61649 32171 38173 89582
37026 89582 143537 165323 158230 127578 77175 46498 78683 138576 140029 75327 34911 66740
37014 66740 103742 81963 46849 69177 122431 129913 88274 54343 36311 -9816 -81503 -116512
37002 -116512 -95319 -80927 -123018 -181383 -188812 -147621 -111072 -92459 -51282 28456 99151 112750
36990 112750 86887 74585 89928 101160 85673 51214 5045 -55451 -114762 -142324 -134442 -113595
36978 -113595 -76892 3679 109223 159974 112751 23913 -29012 -41202 -45908 -37593 -232 25785
36966 25785 -13420 -93386 -138194 -128073 -107750 -98461 -81204 -65776 -92003 -147896 -164296 -114681
36954 -114681 -52768 -26715 -20786 -8983 -1919 -4886 13049 66384 115033 118490 91987 75348
36942 75348 79051 90397 101722 106719 98801 93586 119837 169419 193369 168465 129731 114458
36930 114458 112391 95931 62342 20750 -25979 -61584 -57214 -18786 6253 -851 4003 53079
36918 53079 98391 69527 -24631 -104044 -118404 -96636 -95529 -131176 -166829 -152322 -76324 12320
36906 12320 44820 1955 -68795 -109937 -108492 -87807 -69584 -58362 -46254 -22182 9150 15295
36894 15295 -34832 -125926 -203535 -229462 -207056 -155306 -91865 -42868 -29843 -35887 -18683 32281
36882 32281 82345 101654 94590 73648 41813 11268 4908 28170 66355 108488 141585 133166
36870 133166 67518 -9553 -38399 -29368 -32473 -32704 34169 149465 195526 113504 -9488 -64976
36858 -64976 -59027 -61549 -85372 -87584 -47587 18109 84765 117079 80695 775 -38524 -36
36846 -36 50317 39684 -16372 -67488 -114116 -171690 -207564 -192269 -165233 -168347 -159397 -80757 23290
36833 23290 54938 5592 -44829 -56753 -63274 -77858 -66136 -22797 7455 5944 6094 25078
36821 25078 36122 30928 48675 114181 192555 228730 198240 110097 -1495 -81072 -88887 -45696
36809 -45696 -8905 -1351 3818 30572 70830 108381 136881 153825 165668 191874 235558 264656
36797 264656 252300 213571 168892 105679 24220 -17689 25384 99242 108934 48728 -4215 -14323
36785 -14323 -21677 -52695 -82762 -99383 -121451 -137836 -104540 -27869 20594 -480 -55398 -102833
36773 -102833 -147321 -193915 -219708 -223074 -237899 -265283 -253407 -181222 -100213 -53206 -13067 52332
36761 52332 112990 127231 108532 89009 63458 24985 10636 47980 92256 83296 38902 24091
36749 24091 43924 36641 -26014 -93223 -104359 -59868 -6801 15543 1590 -26131 -34113 945
36737 945 79356 182869 281636 337466 323893 257844 194591 175910 195831 225785 251728 271538
36725 271538 277997 266719 248049 233469 219827 197926 165208 124920 89890 87345 129957 175401
36713 175401 154254 60587 -20592 -9234 72383 134979 137031 122627 147606 205790 242462 221227
36701 221227 160787 107913 84093 68806 37241 -1405 -18713 -6773 20215 52471 81170
36690 81170 77332 17727 -62831 -88929 -31809 54866 101951 93036 50392 -5179 -50203 -48218
36678 -48218 16658 110163 179422 202156 186601 142595 77295 6790 -48228 -70620 -45414 27596
36666 27596 111689 153819 143313 120475 110806 88962 35703 -8991 6009 67621 119135 141804
36654 141804 167512 212284 242069 216771 139541 50811 -8440 -21388 677 31432 51787
36643 51787 58158 48418 15501 -34124 -71531 -71476 -35962 20652 90933 158710 185366 145662 69990
36630 69990 18751 14035 23818 14974 -7494 -21923 -22378 -12997 9005 43694 74950 88751 97275
36617 97275 121119 150356 151215 116858 79515 54671 8393 -81594 -159139 -142750 -42245 41032
36605 41032 48005 34271 72531 137460 143872 66072 -38396 -105325 -113488 -73591 -17471 11580
36593 11580 1740 -4770 29798 78627 93688 83044 89077 114961 138504 175703 251482 321860
36581 321860 314810 247964 213077 234247 239319 194694 166160 202811 256370 274446 288608 339491
36569 339491 387474 377733 338516 334768 367657 400243 450218 573683 765939 943599 1024227
36558 1024227 982886 849121 694752 604806 608024 642054 623076 536458 430881 352022 320315
36547 320315 343212 400233 436269 415590 366230 332548 308186 261171 202022 173756 185219
36536 185219 201717 196213 171355 139219 114858 119524 155018 184282 169952 123289 87331 83713
36524 83713 101527 123128 135559 132317 125253 135873 158946 163326 145086 140409 162276 170183 136853
36511 136853 100379 109460 158320 217368 283104 348674 370205 322489 254330 231152 252332 277264
36499 277264 296261 316105 312367 265726 219070 229021 279727 309093 301966 293912 300430 306660 313719
36486 313719 334986 358911 369076 381757 410019 417802 370504 302959 270963 263177 231440 179743
36474 179743 146073 122821 77985 31482 23595 32052 16627 23263 129396 289889 358488 283220
36462 283220 170270 122592 119065 97636 64375 60776 89954 127722 159008 170068 151288 127597
36450 127597 135341 159581 154467 129212 138760 181344 191609 153301 127705 143398 152580 134001
36438 134001 141849 201653 252282 253465 259026 307231 325564 241835 123834 100382 181444 258209
36426 258209 260541 218389 173302 121107 59507 21083 29373 64953 95999 112361 116842 110323
36414 110323 100764 109095 149109 203244 228382 198065 142228 123582 153544 154918 50161 -123718
36402 -123718 -238679 -217644 -106104 4360 72887 113729 152337 203296 259903 290441 275330
36391 275330 250815 272437 330718 355586 315539 255411 217783 188644 152738 145577 203906 301108
36379 301108 373414 388372 361865 329667 317867 317725 286607 206633 135459 147399 228526 297505
36367 297505 335154 411542 560430 712930 804852 878643 1018522 1236899 1481895 1713057
36357 1713057 1913489 2062317 2148434 2187476 2184564 2104506 1912947 1625122 1293248 975524
36347 975524 729394 588866 527509 488194 462627 485390 538522 541445 468788 397914 390049
36336 390049 399246 359860 295356 268559 280143 290928 298863 319579 328896 299010 262593 270118
36324 270118 305491 309889 273004 241009 246257 281493 333821 399219 470616 543514 620313 687651
36312 687651 715833 702437 682462 672980 648520 595169 542824 518406 517695 546451 625642 724904
36300 724904 763014 717326 660992 644949 622487 549386 475203 459187 472115 466527 472091 524984
36288 524984 567150 523769 432814 389754 401810 404993 394189 422808 488098 525122 513767 496263
36276 496263 485563 443856 361204 281861 243612 247615 282540 324318 328760 281987 236886 243554
36264 243554 276065 289500 304225 353489 391034 348385 255487 205302 218641 241726 258285
36253 258285 297813 341456 329505 269639 237452 256104 267032 234383 191698 169198 157060
36242 157060 158183 200183 275179 333291 348076 329808 278473 193488 123457 126820 182564 215980
36230 215980 209038 204503 207847 179086 126269 111238 147286 179792 184165 195010 220616 218794
36218 218794 183314 169721 205582 250275 267359 261648 227056 144345 58227 66768 188650 314636
36206 314636 338383 275783 214589 202396 224605 245120 232183 180085 127203 118577 145807 167828
36194 167828 186212 238670 316186 354634 320538 243817 157703 70745 6625 2067 46939 85828
36182 85828 93976 98444 117885 136885 143732 141228 124848 102261 115888 183696 244029 233738
36170 233738 190528 190347 217347 202442 162447 176695 239125 265319 245182 251839 289296 274351
36158 274351 195716 149030 173072 186363 136340 83969 85435 109596 126793 161936 206722 199885
36146 199885 149484 149131 212486 224973 134651 56366 92582 176064 198210 182255 211647 279476
36134 279476 327962 361662 407692 426895 371732 281207 225471 205520 188265 184516 212359 240063
36122 240063 241951 252383 291563 303773 248388 187475 199519 263834 308910 315976 297138 235218
36110 235218 132373 62854 89102 167927 213847 209672 188208 159575 126275 115201 126710
36099 126710 108726 45849 10192 56333 133679 173580 190381 217826 219643 154064 65348 22543
36087 22543 20684 20395 26286 49650 56876 31574 21111 46121 40652 -33875 -96529 -63993 17092
36074 17092 54757 53444 66224 80022 63112 60633 123814 200499 211069 177910 165518 152724
36062 152724 91140 36815 85006 206937 284224 284953 282177 313392 340694 344024 345678 342258
36050 342258 304208 239941 182629 125611 41564 -53318 -115822 -126934 -77894 39162 171782
36039 171782 215907 157172 119063 185098 268273 261570 215344 230791 270752 238061 173718 202107
36027 202107 314230 373160 325175 257935 249102 284679 326673 350832 325609 252215 203333
36016 203333 229081 265325 235639 189950 224075 313381 354408 328441 297247 278518 249800
36005 249800 231242 243660 239755 198435 211438 334152 436651 375933 238645 216105 301253
35994 301253 327037 264105 244883 299098 303014 221552 180910 245263 314139 305486 271098 265027
35982 265027 247162 181833 107149 57943 29001 36600 102441 170253 160691 105113 94362 111809
35970 111809 69299 -6445 4191 105376 177070 186137 224904 314099 350476 296947 257402
35959 257402 306608 390345 441373 461888 458290 426412 425477 534281 718473 875020 1013352
35948 1013352 1251239 1628048 2057943 2447685 2708387 2693403 2327776 1792263 1379056 1162596
35938 1162596 1002051 841925 771084 782663 736976 610268 540471 569571 571783 498430 463537
35927 463537 514264 539374 483514 438416 444670 413441 320128 267158 283746 275107 235909 288412
35915 288412 435294 508536 449260 403216 444432 443075 318283 191678 169352 186323 181741
35904 181741 216321 303878 336087 283379 265242 325581 352906 310392 313310 389754 411838 357951
35892 357951 379641 503113 540669 419244 315312 333609 344087 280229 291025 426338 480528
35881 480528 345052 217295 249554 288217 190781 110151 210119 367012 413083 422856 499281
35870 499281 525879 402471 293934 371493 520223 560877 547220 591541 615540 531575 458361
35859 458361 508776 577437 569904 603276 741834 795263 639160 471342 479700 529965 468436
35848 468436 444857 612597 785707 740405 605152 606613 674460 645360 612696 714901 812792
35837 812792 737967 634270 700441 826379 831604 816145 921837 1009674 940584 900308 1063428
35826 1063428 1221811 1147502 1028916 1124367 1283171 1255163 1173704 1267349 1394490 1344625
35816 1344625 1295850 1476943 1686767 1659935 1584966 1729933 1900480 1833824 1767086 2003694
35806 2003694 2281921 2229648 2085446 2273635 2616547 2696048 2646685 2829545 3072869 3038652
35796 3038652 2990993 3358804 3885899 4087741 4181414 4638322 5209964 5402305 5519243 6151448
35786 6151448 7020647 7487656 7813330 8677267 9854218 10717223 11637946 13396820 15594376
35777 15594376 17280697 18813387 21324294 24649803 27686334 30509284 34112835 38423471
35769 38423471 42904780 48769360 57937958 70192583 84440368 102314129 126818240
35762 126818240 158392606 197935593 252770329 329133803 412950801 467028283 459491877
35755 459491877 394889103 309784267 238249716 188677125 152508799 123279073 100744898
35748 100744898 84106810 70484377 59008188 50885798 45677743 41182322 36579946
35741 36579946 32677904 29446388 25938034 22335749 19744942 18127878 16425335 14509610
35733 14509610 13187792 12462160 11509862 10269648 9463117 9113763 8509191 7591172 7018808
35724 7018808 6866585 6535521 5960740 5699076 5784416 5634817 5155298 4864115 4854080 4647096
35714 4647096 4170242 3905594 3953155 3855862 3485341 3242776 3242553 3112747 2757377 2547243
35704 2547243 2593635 2552470 2307248 2168055 2242601 2255637 2132154 2133892 2280151 2243305 1964181
35693 1964181 1787595 1843271 1853380 1692733 1589693 1628148 1586077 1418394 1382595 1531151
35683 1531151 1577693 1420992 1317970 1383996 1398209 1264454 1196843 1274111 1262378 1068193
35673 1068193 938870 1016505 1093751 1009022 909225 927835 953253 900388 882949 948027 954731
35662 954731 865481 845370 936671 952019 823605 739080 795933 838316 774457 742586 820810
35651 820810 877519 848792 863649 957175 959592 809809 684175 676262 643574 509132 414730
35640 414730 428949 404227 281732 241274 377771 514310 512531 490840 553554 579854 481086
35629 481086 407502 485871 583684 544885 449578 437616 469810 457456 445850 487267 506300
35618 506300 459629 456242 561085 654896 639260 598606 610386 586978 465810 366108 387809
35607 387809 435888 413358 407403 503981 589564 528225 387870 309732 291656 273004 296171
35596 296171 405798 509218 507630 460204 468777 508354 509299 492643 491437 457125 373252 339508
35584 339508 416170 510088 535257 549809 611119 645968 604797 594830 704273 835287 878518
35573 878518 928663 1156011 1564584 2023443 2425460 2671663 2629540 2286193 1848522 1527281
35563 1527281 1304787 1058675 808745 670341 645472 633122 596096 573282 572430 571527 575600
35552 575600 573064 504343 365393 258014 248176 273376 279278 326594 453667 557897 539748
35541 539748 452371 388673 339670 286541 298963 399525 459720 384235 276014 262417 286162
35530 286162 241212 187703 233453 310170 279855 182482 166784 235565 265081 232999 229538 271647
35518 271647 289449 274787 274934 265113 191759 115274 144401 249285 300603 277487 277200 327299
35506 327299 343816 281287 187434 102736 25656 -23071 -10585 40264 85002 131477 191098
35495 191098 209963 155994 114666 173095 263361 254645 154263 81609 84071 112937 141344 172190
35483 172190 168797 109383 67443 108997 165008 143636 103043 152465 244581 250110 193727 216705
35471 216705 323418 365688 288276 202259 188275 197835 185147 182412 203650 207208 187935 190086
35459 190086 211445 207877 194716 223551 264341 239607 168609 142615 164786 155350 106990 85784
35447 85784 85561 42776 -3424 61199 220362 319315 292126 233475 212131 181982 123808 106558
35435 106558 142692 135531 41997 -48189 -61429 -39170 -28156 -1688 48252 68202 55717 90710
35423 90710 192882 271501 277858 279824 320364 335929 292505 269769 317434 349604 283706 177759
35411 177759 127175 122209 111714 119411 186430 268900 298490 290841 301614 323776 313695 278392
35399 278392 262430 281760 325948 385471 431725 420332 357461 308513 303528 297467 260149 228311
35387 228311 222018 191386 106715 26049 6158 13943 -4530 -28616 -9477 39202 68919 78019
35375 78019 104595 166263 251095 336123 381604 347577 247592 145146 76101 25298 -6007
35364 -6007 20216 104297 183917 216352 221408 218253 194686 166073 179829 223918 217018 134224
35352 134224 57390 51571 77580 82185 87269 122825 151783 134626 100182 83722 61998 19112
35340 19112 10376 84042 193132 255411 254287 222729 182763 159614 194937 278813 322579 265818
35328 265818 162720 104289 107691 139071 184523 231180 234790 179218 122677 118811 136419 119055
35316 119055 76694 54761 57419 63689 76725 99159 102825 75600 51111 45266 23153 -19693
35304 -19693 -13834 80577 195188 251782 272656 311120 336286 284135 177664 100136 78545
35293 78545 76774 75028 76935 64827 22758 -19211 -26889 -17164 -13117 11984 77897 130037 106077
35280 106077 33035 -15674 -22481 -12015 22201 95201 169984 202306 216643 259663 310477 317599
35268 317599 292105 277892 258612 186585 86379 39745 74488 144700 209902 260134 276863
35257 276863 245087 195857 169704 151917 108747 65592 76557 135285 189557 227267 274157
35246 274157 322326 336043 317230 296014 270813 225376 186067 190731 219441 227794 227003 254397
35234 254397 286907 268456 209114 173714 181710 197092 204750 215325 207989 155771 98813 102567
35222 102567 146627 146085 86017 43586 65019 106305 113949 89125 55229 30401 43450 109042
35210 109042 177782 178147 116136 68182 72433 97229 119861 157418 203886 210425 154421 73414
35198 73414 13516 -9638 3543 38326 54574 26519 -12439 -16233 -594 -11359 -40226 -41326
35186 -41326 -10020 28991 85005 166292 209222 145198 22316 -47670 -53512 -80292 -145826 -170355
35174 -170355 -124570 -78002 -67804 -43923 11702 32139 -12017 -48147 -24122 5369 -15549
35163 -15549 -42799 -10275 68443 144530 207630 250590 232772 147480 62916 32134 22399 -9046
35151 -9046 -36673 -26078 -2478 9176 45924 132595 206226 196218 130409 82360 59950 28212
35139 28212 -141 13593 51442 64839 64624 103226 178782 234977 252311 266656 294069 303787
35127 303787 275690 226768 168132 88414 -1307 -51098 -29006 31338 65186 48174 16571
35116 16571 18307 55784 87353 84786 70604 82876 120879 152936 163988 160626 140343 97006
35104 97006 48771 15587 -22540 -93007 -165216 -181077 -147578 -125789 -123016 -80273 13174 83413
35092 83413 89731 92730 148462 211423 213048 173830 158070 162578 133002 66077 20038 30669
35080 30669 75033 114744 130222 116369 80055 37967 -4334 -56839 -112852 -138315 -112169 -49230
35068 -49230 30941 118218 178395 159015 63844 -24843 -39448 -3870 20720 25583 44510 88125
35056 88125 135335 169164 185785 187536 189729 207386 221091 196406 150013 141057 176856 194383
35044 194383 167361 156648 204202 249844 220568 143614 100415 118397 178179 281448 440213
35033 440213 639335 873637 1169877 1496614 1709016 1682796 1470565 1232443 1043295 868932
35023 868932 704022 607574 589061 568944 488514 380961 303267 264055 245606 237567 222617
35012 222617 180849 132330 129859 189903 272576 345038 420004 510554 585027 593660 521999 406224
35000 406224 307170 263005 249687 203056 102466 6480 -29361 -38298 -91064 -180386 -223263
34989 -223263 -175705 -82679 -5721 43247 81101 115107 146160 176111 195764 190969 167518 145800
34977 145800 130429 111453 92745 89709 100208 105732 99672 89446 76000 56793 42729 46368
34965 46368 57846 52733 17864 -41039 -100166 -119435 -76449 -10757 9303 -18421 -24061 17999
34953 17999 38684 -9166 -58089 -26722 49296 79389 60880 56033 63901 31341 -25404 -30902
34941 -30902 13276 19058 -38913 -71934 -12079 94575 172042 208384 217590 182216 92805 -7231
34929 -7231 -67916 -88016 -90411 -81868 -67371 -64418 -73920 -72765 -57762 -58161 -83517 -100303 -83135
34916 -83135 -49134 -18455 19171 72165 116757 126732 107746 81674 58978 38990 15760 -21015
34904 -21015 -67068 -89653 -63772 -15101 10365 9847 14525 30888 45418 75613 149213 232748
34892 232748 251257 191304 120071 88378 78539 64188 55109 57838 51899 31995 21237 22031 8464
34879 8464 -15185 -9839 22857 25205 -26353 -76730 -72569 -32078 930 22981 56014 107936
34867 107936 172938 230425 233822 158001 68988 73790 177292 264681 256212 196998 151485 99004
34855 99004 2179 -96181 -126910 -94140 -46645 5545 71405 114717 90101 24341 -7159 23615
34843 23615 76692 107101 103714 78698 55558 53048 56384 31706 -11643 -20703 10014 8652 -60624
34830 -60624 -112907 -44803 116830 244626 266436 220094 168203 131057 105608 88795 67231
34819 67231 22953 -39874 -95239 -117917 -90886 -11697 85424 139479 123951 77166 49552 50365
34807 50365 69038 108200 160311 189100 174305 143805 126773 109866 74055 35176 10803 -10527
34795 -10527 -28293 -6095 66047 134159 153252 145634 134292 80792 -37583 -144586 -148237 -71961
34783 -71961 -16915 -21013 -39030 -39363 -34085 -25793 -4965 7760 -13063 -44475 -54960 -72327 -133046
34770 -133046 -190568 -167943 -86531 -42915 -61723 -72736 -40603 -14142 -24927 -32414 -2632 40279
34758 40279 72854 108089 143041 142683 105705 78042 73645 51489 -1391 -37383 -31224 -22289 -36839
34745 -36839 -40702 -12635 5795 -17101 -47739 -58380 -86938 -160322 -216635 -180876 -78126 4321
34733 4321 39678 73058 126748 164692 151332 92032 15358 -39630 -24240 79607 212224
34722 212224 272817 221749 122651 72549 107101 178403 208458 158057 53646 -47574 -116670
34711 -116670 -168181 -216886 -241746 -209733 -123025 -24091 42708 65480 68168 87557 137463 187210
34699 187210 185732 117643 28288 -16808 5991 61705 95741 82112 35060 -17557 -60089 -82125
34687 -82125 -60835 21223 136473 220444 237353 216487 207288 221767 239289 240891 216216 166392
34675 166392 125970 145083 213314 240922 166135 46176 -18359 -18283 -22418 -51381 -50092 13373
34663 13373 101341 170777 212842 216310 165885 98839 91575 157820 221633 222343 186176 161419
34651 161419 145329 118788 98059 101543 106729 86260 52042 25091 -1076 -28988 -28846 15389
34639 15389 66613 84102 79106 77650 62185 2418 -79024 -123109 -104786 -48428 10627 43581
34627 43581 28165 -26257 -68184 -58816 -24725 -17966 -38959 -42418 -9091 36353 76766 122392
34615 122392 168937 181453 146442 110338 131766 203833 253644 226625 150460 96542 90306 92032
34603 92032 71021 58262 94993 159223 189178 167227 135318 131335 151891 174148 171489 113524
34591 113524 1602 -96968 -106280 -39090 17921 19501 -778 -13888 -37218 -68736 -59825 2503
34579 2503 55325 50644 23170 15690 1626 -53489 -110645 -112623 -78018 -64364 -69788 -46874 8090
34566 8090 52383 69319 78070 82975 74975 73791 109119 166258 203978 217184 230062 241984 239228
34553 239228 247016 301816 373722 384837 315352 230700 187440 166754 123442 56065 2413 -5952
34541 -5952 32719 91364 131857 139308 133576 128345 100511 35453 -21688 -14286 37501 55960 13041
34528 13041 -41183 -64581 -75490 -98332 -113546 -95572 -57803 -23019 18016 79514 134996 141583
34516 141583 105794 88875 132548 197745 199478 105987 -15727 -72597 -51241 -18104 -18342 -25371
34504 -25371 -9091 2872 -20523 -40198 8266 113244 190425 185861 127719 74028 49993 41108
34492 41108 18389 -28506 -64834 -38783 38845 80847 35052 -30003 -15701 63423 108981 91377
34480 91377 76834 98754 101949 45221 -26651 -57662 -57554 -56857 -45879 -12313 8028 -24573 -87632
34467 -87632 -121754 -102579 -53396 -6247 21852 34401 57440 111382 166454 161438 85502 1322
34455 1322 -36999 -45957 -63819 -88248 -105748 -139247 -208069 -267552 -250172 -158298 -64598 -23272
34443 -23272 -26173 -44662 -65839 -76948 -58006 -13607 17492 12084 4709 49151 138237 190372
34431 190372 134119 -7026 -137324 -191210 -183823 -157681 -123830 -83773 -67562 -96922 -132836
34420 -132836 -119685 -73169 -61281 -95341 -108249 -60337 -377 14198 -581 -1718 -2111 -46586
34408 -46586 -127450 -180304 -162057 -95630 -37915 -29491 -71029 -125425 -145117 -112640 -50163 15085
34396 15085 75525 124053 137414 101236 34252 -31660 -79796 -103017 -93735 -62027 -44476 -68691
34384 -68691 -117590 -145972 -125040 -63827 -2009 15368 -19719 -57296 -42199 7754 18935 -32293
34372 -32293 -85607 -93984 -92785 -123042 -143920 -96640 -19217 -7777 -69235 -98984 -25142 97945
34360 97945 175909 194414 201720 210463 182038 106315 43159 58532 142593 218061 224220 169469
34348 169469 98296 34266 -22298 -59545 -54330 -8756 44775 82458 105450 111061 82765 26684
34336 26684 -14467 -9993 21122 46845 70552 109488 145494 139764 92757 52599 57455 95253
34324 95253 127756 133771 117475 86953 40482 -20898 -72654 -74610 -13252 73131 131403 149150
34312 149150 149698 140827 107032 55886 28910 47802 82845 93229 70104 26430 -21808 -49164
34300 -49164 -33570 6267 26800 31149 73822 165026 227118 194043 105487 45515 29446 16385
34288 16385 -432 8501 37378 43969 17280 -14331 -37947 -59770 -60134 -10281 64410 104000
34276 104000 104495 121860 170750 189431 136426 59458 24896 27581 18861 -12846 -40918 -56189
34264 -56189 -72290 -83989 -66299 -20720 11307 -6511 -66474 -132448 -177838 -195742 -185492 -153182
34252 -153182 -126639 -141180 -188663 -201530 -124983 1806 80940 76917 51958 62858 79821
34241 79821 47512 -23031 -77836 -97838 -94892 -62826 39 44373 22028 -28055 -26590 16916
34229 16916 11408 -63278 -104150 -30533 93203 142978 93857 29435 20068 51463 68271 44690
34217 44690 4447 -10357 12285 36532 22028 -20964 -48140 -48875 -54866 -75383 -74790 -36169 600
34204 600 -3858 -33790 -56462 -77158 -113095 -141869 -123766 -60151 11456 69952 122307 170874
34192 170874 201739 202481 169281 105489 31872 -19186 -42201 -69320 -114327 -132381 -77963 16420
34180 16420 72003 68415 60544 81609 86013 21034 -84253 -146289 -128627 -77571 -56610 -76715
34168 -76715 -102048 -101478 -74846 -39693 -15752 -23294 -72589 -141232 -179993 -162923 -121325 -103000
34156 -103000 -103924 -73403 6190 78583 76042 3846 -64270 -70501 -32416 -14743 -53577 -117134
34144 -117134 -143912 -115619 -77968 -79757 -108520 -111459 -69639 -15535 24356 62304 107230 129640
34132 129640 103973 61938 62277 114175 166287 172876 138941 93296 49195 11262 -2977 18933
34120 18933 49731 37376 -33424 -116035 -155569 -151066 -140782 -139433 -125257 -88021 -50565 -31162
34108 -31162 -20683 -13540 -22976 -41280 -25140 42974 114057 135651 123095 119117 115361 76650
34096 76650 19548 -4509 7625 17527 27842 76286 141651 144150 65808 -9269 -11368 28663
34084 28663 48410 39748 19798 -17799 -67379 -83928 -48699 -12238 -16885 -27808 161 41674
34072 41674 56258 71828 129452 187262 174178 112945 90915 119575 123840 76401 42938 66790
34060 66790 95655 65764 -5127 -51143 -37753 23750 97951 135588 106654 49810 45952 115515
34048 115515 183508 173873 96445 10813 -51149 -87251 -90427 -63424 -45030 -73446 -132929 -172396
34036 -172396 -167080 -131601 -86015 -43084 -19249 -23177 -36650 -35962 -28178 -37650 -61367 -69414 -48922
34023 -48922 -14462 28177 91493 166158 206508 181412 115324 51695 -3078 -64654 -115540 -112489
34011 -112489 -54611 -9 6256 -14668 -21799 -20546 -40645 -70022 -64585 -22068 7067 -3890
33999 -3890 -18490 -272 25254 10454 -37389 -60859 -26972 36083 76891 71625 35158 -1145
33987 -1145 -19042 -27818 -46275 -69209 -66619 -23621 36190 78032 89049 73760 39875 5894
33975 5894 -953 21590 38553 24180 1878 9233 40258 56262 42857 19018 -8325 -61358
33963 -61358 -150389 -237925 -260792 -189205 -66317 14380 -9202 -100164 -157569 -129885 -67344
33952 -67344 -45083 -67592 -80701 -51387 4237 57079 91193 101211 94217 88490 89519 81277
33940 81277 60161 52915 74951 98943 96121 77902 60653 26423 -32679 -67895 -33645 34485
33928 34485 69795 79201 120883 191493 221369 184921 133079 103251 76983 47137 47196 81516
33916 81516 99122 76827 63652 98017 138748 128938 81644 50605 50209 50135 22896 -38484 -122182
33903 -122182 -187614 -186486 -123813 -65172 -55647 -68545 -63078 -48732 -52112 -59070 -37845 6056
33891 6056 39689 45773 23511 -25455 -77728 -86394 -38830 10999 8309 -30092 -49112 -34390
33879 -34390 -14040 -4446 -185 64 1427 29471 93963 149552 137236 56292 -44203 -133029
33867 -133029 -213288 -281101 -314623 -306404 -271277 -221929 -167284 -130537 -134256 -165676 -184910 -170585
33855 -170585 -137559 -111741 -104438 -106554 -96256 -63009 -29992 -29649 -50368 -44628 -5480 11987
33843 11987 -25767 -74917 -81509 -54959 -26909 8174 47357 31100 -69062 -155751 -107950 35948
33831 35948 110172 46078 -45739 -48055 13716 49693 44075 40845 50536 48372 33938 30355 43430
33818 43430 67626 109545 161926 178627 123775 31331 -27257 -23730 16173 67281 123966 168855
33806 168855 170742 127600 78644 56409 49268 29201 779 -457 42388 98936 125963 123596
33794 123596 137641 198644 275229 303821 254799 153891 50091 -17331 -32476 -13235 -4794
33783 -4794 -35192 -77998 -84359 -48502 -11912 -5450 -21400 -42501 -59425 -54698 -12901 39548
33771 39548 48318 6248 -26515 -6100 28789 11047 -62937 -136118 -166475 -159214 -134273 -102053
33759 -102053 -72249 -54705 -44414 -26429 -1152 9217 -17576 -82881 -164060 -226234 -246661
33748 -246661 -236438 -227982 -233849 -233611 -211439 -184710 -174836 -168703 -138053 -87658 -53660 -53928 -66273
33735 -66273 -61916 -40252 -21592 -19948 -33421 -54561 -81835 -120144 -169320 -211710 -218528 -177538
33723 -177538 -112961 -69746 -74804 -114855 -151754 -158590 -140874 -121458 -107473 -83547 -42752 -6984
33711 -6984 2679 3601 30705 80321 107343 86921 48847 33743 40445 40558 29095 34174 77815
33698 77815 141049 169466 115875 -8815 -128093 -166087 -126960 -82827 -76519 -73735 -32038 24629
33686 24629 42884 22824 9941 14818 -1292 -51780 -88558 -68293 -17422 5220 -10369 -20213
33674 -20213 2274 26181 7704 -47944 -91386 -89593 -60822 -43800 -48738 -54186 -44239 -28247
33662 -28247 -20651 -20164 -21155 -33821 -75345 -139203 -183743 -160695 -61049 66083 147223 144665 80333
33649 80333 -1791 -81117 -154919 -208345 -224149 -217092 -220782 -234497 -221053 -171151 -130030 -133597
33637 -133597 -151965 -132868 -77595 -33445 -23725 -25302 -11841 16580 48804 76550 88579 76771
33625 76771 52516 35447 26047 13874 10540 40203 89678 103996 52445 -27827 -78910 -92290
33613 -92290 -103898 -133620 -163145 -171732 -162461 -145544 -122835 -103748 -113123 -157992 -198423 -180772
33601 -180772 -101973 -17713 19352 9828 -9188 -6431 29803 92698 148631 151823 98831 50900
33589 50900 65456 118163 134827 92496 39635 15994 8807 1568 7026 22125 4063 -65913
33577 -65913 -137551 -157425 -143573 -142908 -146584 -110017 -37973 16764 35665 52583 83240 94990
33565 94990 64125 15416 -15761 -22301 -10360 15689 35329 17170 -34387 -69489 -52988 -7117
33553 -7117 25757 34121 29032 13081 -16341 -54069 -97934 -149399 -187554 -177091 -127885 -107307
33541 -107307 -152158 -202054 -173811 -78696 -3151 16937 33150 87624 148948 173404 169630 158456
33529 158456 118025 27819 -63394 -79593 -19546 41643 54587 43478 43461 49940 54920 76665
33517 76665 110910 100169 8915 -102484 -143666 -116407 -100659 -122778 -117518 -43091 42216 66338
33505 66338 48740 58473 105019 138110 138152 139936 164287 182819 165195 120139 74331 42575 31295
33492 31295 43334 67183 84381 93953 105248 104309 61228 -17221 -74267 -61943 8720 90147
33480 90147 146098 161956 136333 89424 60592 69171 88294 81362 54042 43460 61560 78652
33468 78652 68084 42079 29598 35886 43841 48214 62837 84381 72334 -5093 -110330 -157884
33456 -157884 -110139 -20632 40509 71972 114015 162020 164072 102763 24935 -23362 -45620 -60936
33444 -60936 -66036 -58204 -58083 -75849 -83665 -57352 -23497 -27645 -67826 -93983 -69473 -7055 54366
33431 54366 89651 105414 128476 171203 208512 208764 185694 181625 189767 146262 32937 -64793
33419 -64793 -60988 6431 25100 -37259 -105671 -124525 -128544 -160295 -188050 -155144 -66416 24686
33407 24686 86753 119957 112593 40742 -80517 -180576 -189450 -104691 3502 52393 14984
33396 14984 -64398 -116930 -107110 -48085 20744 58448 44092 -1203 -24484 1088 40124 46346
33384 46346 33671 51666 100209 126682 113355 104485 125666 139615 118928 103595 132657 164870
33372 164870 130966 36698 -46568 -73618 -50400 12517 105556 186681 207827 179484 153447
33361 153447 139168 95928 13713 -62006 -101614 -124353 -137123 -105352 -23112 44752 40518 -8409
33349 -8409 -39352 -47260 -73381 -124732 -161098 -155422 -122359 -87855 -64120 -52698 -45651 -28509
33337 -28509 -2746 6319 -15654 -46626 -60284 -62153 -66985 -64778 -43152 -20488 -17984 -18663 4933
33324 4933 41068 59663 63666 72911 76752 56614 37405 53418 74911 39226 -46468 -105879
33312 -105879 -102096 -70322 -32262 36165 123125 154188 98807 31521 27558 59111 60682 41653
33300 41653 55526 96366 110173 91135 86996 110407 115295 72876 15084 -15790 -20546 -28065
33288 -28065 -52462 -79587 -86583 -73167 -71916 -107826 -147470 -128871 -55994 -11128 -41203 -87326
33276 -87326 -76388 -27901 -2496 8004 53654 119452 138082 99551 60553 45538 23607 -11625
33264 -11625 -26456 -25068 -56147 -118226 -143459 -108415 -77946 -94328 -100911 -34478 70519 134082
33252 134082 137712 117316 90399 54860 32425 51211 96627 125581 120303 96211 72716 63510
33240 63510 73474 79199 40343 -41102 -102553 -92957 -35163 12753 27699 23427 15948 20277 50149
33227 50149 89696 97510 64527 26899 -1754 -51375 -113273 -110851 -13880 88997 113848 113764
33215 113764 186788 303875 351205 316767 302777 353737 405970 430717 493012 615314 706139
33204 706139 708345 721688 872705 1117855 1275738 1231785 1034698 808291 639302 549719
33194 549719 523146 546029 640158 837772 1115803 1411781 1745785 2253018 2992453 3746235
33184 3746235 4125213 3915714 3265878 2513908 1901368 1479541 1203321 1019348 881230
33175 881230 760619 668000 628194 626466 610001 551734 483030 447994 448546 452178 435430 399800
33163 399800 358614 330096 334033 372085 415214 431370 422204 411645 404609 385667 355822 333539
33151 333539 312269 258601 173421 115265 128169 175748 187845 152158 114656 101347 90136
33140 90136 64039 46434 65919 116906 172596 215888 243618 256445 255234 236841 192260 124136
33128 124136 63690 47263 72513 100087 104320 100239 111792 134572 144202 128404 97635 69765
33116 69765 51364 32504 1119 -37297 -66631 -91981 -140409 -209131 -239121 -180498 -71876
33105 -71876 -8189 -27995 -76972 -91746 -74140 -60750 -58300 -43271 -5203 39315 66868 63171
33093 63171 28394 -18683 -49293 -47743 -20989 14802 43916 48343 17188 -32342 -58740 -31136
33081 -31136 44163 128375 173258 153406 95709 62713 80511 99755 64427 1866 -8413 49474
33069 49474 104568 103649 79139 85851 121445 145810 140122 109429 57041 -7231 -53682 -55754 -12106
33056 -12106 64891 153646 206759 174154 67141 -40491 -101166 -141266 -193116 -231659 -224328
33045 -224328 -198358 -200168 -217405 -198781 -133139 -58947 -10782 803 -23375 -60282 -64740 -26707
33033 -26707 -2288 -36589 -85861 -80083 -36377 -32001 -77206 -100978 -69327 -32582 -30825 -29158
33021 -29158 13462 72285 99180 92251 80695 75489 74194 85264 109400 119312 93955 57486
33009 57486 53240 88977 131903 149473 136445 109916 93025 97176 110445 109201 82972 38356
32997 38356 -15778 -67257 -91626 -74880 -46157 -54287 -104131 -147794 -147523 -113817 -70931 -23502
32985 -23502 23449 49312 50983 61254 104191 155903 178121 169330 155055 149058 153312 174270
32973 174270 204209 204664 148603 69303 27158 31984 39485 27600 31508 82858 149032 165098
32961 165098 111583 32730 -17526 -24449 -8270 3480 -11448 -63685 -135336 -178917 -160661 -106327
32949 -106327 -77194 -94581 -119179 -117303 -106928 -108026 -90621 -28059 27632 -498 -88878 -122210
32937 -122210 -49025 46323 66638 29227 12626 30897 35766 12201 -7841 -17210 -43462 -80356
32925 -80356 -79056 -29550 8822 -7550 -36530 -6594 86256 179388 224055 223980 197331 138866
32913 138866 36429 -92279 -197764 -236840 -211220 -166980 -152547 -176009 -206467 -215474 -208703
32902 -208703 -213244 -239831 -265022 -253905 -201268 -145543 -130312 -149043 -145089 -81892 801 26625
32890 26625 -24924 -94274 -116394 -91812 -67226 -69649 -86899 -100779 -108011 -106096 -84954 -45405
32878 -45405 -10757 -5964 -31123 -64147 -84308 -85918 -74611 -59527 -46955 -34319 -12365 20615
32866 20615 50711 63284 63011 68105 85563 104832 118135 133792 163532 207151 254555 291364
32854 291364 298893 266791 216062 188864 195875 192185 134254 48789 7860 35093 75631 73291
32842 73291 42263 35164 64477 91078 83062 53779 36846 45953 67836 80457 70431 42917
32830 42917 20811 25615 52450 70340 53203 5327 -48931 -93178 -126409 -146885 -144158 -113567
32818 -113567 -69272 -34034 -20132 -25553 -40578 -47921 -25396 32323 94224 113572 74886 8623
32806 8623 -43609 -63671 -55373 -31674 -15434 -33038 -88759 -154792 -196285 -193904 -140401 -45377
32794 -45377 42759 57841 -8026 -78889 -84248 -46738 -32938 -43013 -16895 57400 118736 133323
32782 133323 148260 207239 272135 280761 241737 214765 220444 226718 217601 223796 275360 356120
32770 356120 414375 401289 302993 158704 45060 15734 49045 70747 31209 -53008 -130644
32759 -130644 -168001 -165087 -138030 -100459 -60701 -29496 -22366 -45773 -80494 -90295 -56083 2562
32747 2562 45202 47481 19522 -7978 -15673 -15190 -29979 -54588 -53692 -18074 3524 -36438 -110272
32734 -110272 -146414 -127879 -105588 -109789 -109733 -83284 -66683 -95457 -141763 -154081 -124059 -74462
32722 -74462 -16158 41583 73788 77279 88976 119189 110210 24955 -64455 -60848 9569 27887
32710 27887 -42036 -107364 -93537 -41159 -13743 6609 67868 152883 205705 215750 209555 182532
32698 182532 105529 -5152 -82525 -86914 -51168 -32054 -40515 -37142 12016 87558 130790 108846
32686 108846 56156 32694 45692 42600 -11264 -81784 -113168 -98504 -75651 -71941 -83037 -95420
32674 -95420 -99610 -83730 -40031 17105 55270 51392 10905 -34558 -43785 4853 84906 131979
32662 131979 102077 20081 -42237 -37140 16343 56000 34967 -39157 -115316 -148071 -135404 -106493
32650 -106493 -83415 -70865 -72783 -88243 -91346 -53456 3479 18170 -20531 -38458 26066 122369
32638 122369 143176 64664 -31187 -73173 -74202 -71010 -55906 -11339 34132 39571 17718 14988
32626 14988 36097 38607 2342 -43977 -75762 -106768 -147474 -167005 -131554 -59042 841 31714
32614 31714 61465 107962 145212 137109 87679 42422 42558 84118 124078 128988 112840 112742 129190
32601 129190 121136 76498 51729 100399 185915 221675 193363 177779 222809 270440 240758 148842
32589 148842 85545 103088 166383 207060 184759 101158 -6466 -82167 -93799 -66424 -53704
32578 -53704 -76372 -109415 -126628 -132185 -144963 -173675 -214794 -260130 -298640 -316723 -300487 -242471
32566 -242471 -157661 -89364 -74010 -93514 -90994 -44980 6844 35929 71299 144041 222355 250571
32554 250571 225310 182743 134812 74019 21843 9884 23282 25291 31115 88953 184663 235893
32542 235893 198749 119996 63226 37980 22450 4122 -23841 -58379 -61604 7356 117208
32531 117208 177564 150281 91514 60030 48868 41254 63021 124716 169499 141923 67167 5023
32519 5023 -33993 -66698 -72264 -23123 41004 42220 -36103 -134149 -193993 -202879 -167109 -98693
32507 -98693 -31690 -4215 -13736 -23575 -18024 -20831 -55251 -110441 -150743 -143402 -83291 -3788 48019
32494 48019 57094 43930 19394 -27148 -82885 -105021 -88039 -86281 -128923 -163995 -140067 -94566
32482 -94566 -94922 -133283 -154540 -154660 -166048 -168456 -109892 -13887 27231 -17295 -72591 -66366 -10538
32469 -10538 48940 94928 118642 96302 28415 -37171 -55483 -29542 13783 61155 109589 154813
32457 154813 192684 206909 163653 61505 -22400 2521 122264 224546 233868 180027 120615
32446 120615 66853 14761 -17951 -27982 -46499 -85002 -109099 -98189 -77548 -58174 -8931
32435 -8931 64483 79608 -14908 -141175 -177512 -109075 -21083 28999 51394 50982 2977 -82541
32423 -82541 -142115 -136898 -105645 -111563 -163939 -214100 -211795 -151283 -71572 -17752 748 7578
32411 7578 14175 159 -46815 -99506 -127452 -142056 -170083 -199280 -192249 -148541 -111749 -109347
32399 -109347 -117586 -95089 -28812 58784 128851 148738 113279 49177 -10430 -52787 -79274 -85329
32387 -85329 -65277 -30500 -4230 562 -11919 -28556 -34040 -20959 -2122 1803 -5821 -723 16859
32374 16859 11619 -29784 -63530 -43710 14088 62541 92059 124619 155287 152926 116541 81719
32362 81719 65568 48784 20772 759 -227 -1537 -18446 -34340 -25259 10469 60336 111462
32350 111462 142397 126477 65240 2594 -16171 6505 26790 12013 -22167 -27667 24099 107199
32338 107199 165875 176207 165192 158079 135748 77061 20428 29594 97116 136180 90011 6408
32326 6408 -27321 9423 65553 95252 96377 80160 46163 -464 -34460 -31447 6923 58873
32314 58873 105336 137788 149148 130114 81528 27679 8002 46164 124514 193218 209179 168647
32302 168647 105161 58422 42126 36510 12201 -35027 -75077 -75451 -41790 -16522 -30650 -64588
32290 -64588 -70236 -31579 14761 31749 37889 81411 160410 207735 176450 107510 75418 88237
32278 88237 89072 48616 1874 -15899 -16317 -17055 -1759 41309 75431 54885 -10631 -70440 -98689
32265 -98689 -109170 -115246 -114262 -109993 -114532 -121942 -108475 -67906 -25672 -8665 -14607 -18472 -2043
32252 -2043 26007 38342 21834 299 9006 44438 62005 33035 -19945 -58359 -73037 -77107
32240 -77107 -78690 -82481 -97215 -121677 -142897 -158384 -167366 -131649 -2984 177851 273010 200702
32228 200702 49928 -28634 -8972 13124 -20479 -70490 -94952 -106889 -118674 -111419 -87385
32217 -87385 -82826 -100214 -91199 -35065 26746 61841 89529 120311 117781 64038 6028 -11101
32205 -11101 -7825 -20755 -37069 -30049 -18927 -39386 -86954 -138029 -193405 -251488 -273821 -233958
32193 -233958 -170880 -134036 -100574 -13205 113865 193950 173400 83907 -10938 -71086 -82117
32182 -82117 -53716 -23641 -20242 -16952 33518 118338 166746 141126 75922 11127 -59562 -143896
32170 -143896 -201399 -187383 -124604 -83798 -96110 -123884 -127296 -127142 -174200 -267658 -337397 -323341
32158 -323341 -252708 -208964 -226824 -250987 -212415 -118331 -42490 -41081 -100103 -156685 -155144 -91006
32146 -91006 -13913 22888 24576 46785 113582 172838 161320 91036 35147 41123 91251 137659
32134 137659 140881 82468 -19227 -101685 -101269 -15975 92286 157692 154758 93187 1553 -80902
32122 -80902 -123568 -124637 -100314 -60788 -14712 15657 12470 -11401 -30807 -43428 -56999 -55202
32110 -55202 -17046 36529 60142 47729 33521 27300 795 -48686 -75203 -52084 -17305 -15590
32098 -15590 -30931 -17036 29430 67265 71034 57780 55394 69018 80700 69375 32554 -7033
32086 -7033 -24128 -20526 -17088 -18891 -14596 -12035 -37259 -82850 -94416 -37104 51580 106346 111035
32073 111035 100832 105439 122796 138841 143216 130375 107801 95191 95805 82295 35074 -19461
32061 -19461 -37910 -16870 7985 11157 -3283 -22548 -33081 -14377 39297 91407 91344 33553
32049 33553 -39669 -91457 -112744 -97077 -40858 23403 44052 21544 17836 66224 113526 90262
32037 90262 5658 -70035 -94157 -79973 -56422 -44989 -62305 -97668 -96337 -16502 96731 145405
32025 145405 95587 13263 -27776 -24236 -10590 332 9964 7541 -10240 -21855 -16070 -14389
32013 -14389 -26178 -18476 25971 57726 26360 -29861 -28445 36174 87563 82052 54411 38250
32001 38250 17829 -12707 -14938 23184 41985 -8643 -85634 -106734 -56685 13153 63466 90758
31989 90758 94938 80813 80066 118096 165215 168895 126451 76253 26819 -44629 -121483 -141260
31977 -141260 -80714 5491 56752 71852 75226 63435 26626 -7185 3565 53723 91272 79575
31965 79575 36962 9113 14894 28680 18672 -3059 11101 73931 127404 111721 53687 37327
31953 37327 87700 139283 135623 104527 98806 107770 78850 3714 -68118 -96292 -90304 -80889 -80938
31940 -80938 -81169 -65799 -28610 16785 46798 55055 56780 56550 34502 -13322 -43814 -12927 56530
31927 56530 93585 69444 31846 34593 64626 66123 19196 -37707 -63649 -64984 -73424 -91274
31915 -91274 -86490 -45606 -4327 -3633 -31493 -39202 -11972 11851 1574 -19260 -8423 38925
31903 38925 97260 153318 206299 235265 207351 127595 49153 15171 10000 -10678 -52244 -69027
31891 -69027 -24119 57708 112028 102792 52682 7482 -9102 2320 35800 78266 103316 95772
31879 95772 76632 74221 74183 34293 -46761 -116476 -140326 -145078 -161176 -159315 -90484 30202 128710
31866 128710 158075 137469 103747 67326 29780 5145 -4528 -28076 -85227 -141024 -136996 -68818
31854 -68818 1808 26085 26785 49456 79662 57708 -22910 -82991 -50370 51475 142415 183877
31842 183877 194672 191560 170404 142120 131884 134197 118263 89589 95000 146855 192676 188488
31830 188488 156083 133676 114559 78400 46187 52732 88201 114646 122823 128251 127408 104878
31818 104878 74734 70714 98300 131390 149607 146695 114468 54949 -2496 -30948 -38818 -39442
31806 -39442 -14217 44973 83935 46105 -26827 -31652 51393 125711 111458 40137 -16958 -47494
31794 -47494 -75979 -96242 -86279 -59680 -46210 -37080 3174 77469 145490 167841 134899 61989
31782 61989 -18044 -67838 -76681 -70472 -70495 -58654 -11960 43467 51909 1838 -55481 -73283 -68417
31769 -68417 -92621 -157539 -212302 -202628 -139882 -94681 -118640 -187726 -235374 -228111 -187831 -149336
31757 -149336 -125145 -111947 -101743 -79845 -39105 -4301 -14090 -67282 -115299 -121960 -101163 -78219
31745 -78219 -47925 347 45395 60174 56529 63917 73621 46780 -19310 -72511 -70054 -34269
31733 -34269 -20485 -41675 -51563 -10006 52817 62490 -4999 -81151 -82212 -11571 51933 61141
31721 61141 47691 51703 57612 35788 8821 26577 91272 150889 161900 124604 62345 -190
31709 -190 -39942 -49175 -49409 -67269 -97402 -112724 -105846 -91273 -71066 -33718 10734 32667 30686
31696 30686 40703 78238 105532 85353 42131 31777 61653 79948 49734 66 -15438 10471
31684 10471 35925 32237 21000 37133 73389 84735 46387 -12675 -42972 -29163 -66 10191
31672 10191 -1201 -10406 -1260 13433 9745 -13257 -31096 -30100 -29752 -55741 -105953 -162454 -221365
31659 -221365 -281582 -316297 -297100 -247629 -230145 -265815 -306879 -305056 -268845 -229583 -189944 -141102
31647 -141102 -99279 -82977 -73366 -38434 13719 40799 18391 -42070 -116148 -177442 -197149 -165425
31635 -165425 -108463 -59639 -24213 3658 9800 -16609 -43978 -27448 27107 69713 75891 68536
31623 68536 67448 59159 29754 -6468 -28545 -37289 -48658 -69875 -85841 -65508 3814 80119
31611 80119 95863 46942 12377 42872 73211 13019 -108069 -173476 -145891 -105013 -111491 -131859
31599 -131859 -127723 -123608 -136389 -121738 -53806 13233 32594 49964 121457 198697 188136 96847
31587 96847 29155 45564 101788 128962 108208 60286 17373 10669 39194 51322 1848 -79403
31575 -79403 -124301 -122192 -123103 -150770 -174777 -173576 -163108 -149082 -107674 -32865 45159 104488
31563 104488 148527 169497 149876 114064 116392 152085 142731 48271 -63902 -108539 -90603 -69599
31551 -69599 -60436 -35946 -44 11906 -2089 -6822 6246 2946 -36527 -86136 -110829 -101082
31539 -101082 -60414 10442 100178 175940 200146 156160 64081 -19394 -33995 25692 93505
31528 93505 99841 51005 15929 41964 112915 182749 215223 192373 123311 51605 18546 11022
31516 11022 -18782 -74157 -98085 -56105 8866 37142 31344 33524 50996 55171 42460 45676
31504 45676 80392 120688 138285 133089 114306 81890 41143 8906 -11252 -36476 -69847 -81910
31492 -81910 -49939 3992 41048 56476 72065 88690 82865 51100 22445 17449 24538 28569
31480 28569 32016 30938 3476 -48240 -73530 -33002 32999 44931 -8016 -51258 -31019 10090
31468 10090 -4306 -79889 -150784 -166630 -141005 -117678 -123569 -159144 -206902 -239567 -238415 -211002
31456 -211002 -178836 -149252 -117789 -95457 -104902 -140565 -160004 -133865 -85035 -55582 -48401 -29156
31444 -29156 16727 57006 53749 13813 -20508 -27400 -33011 -71144 -124733 -130545 -54027 55653
31432 55653 108513 71658 4231 -11536 43776 120019 158444 138817 74839 -9337 -86393 -125201
31420 -125201 -104411 -33248 49143 103211 116417 98995 64701 33033 40203 109375 196191 204679
31408 204679 96840 -39157 -80614 -18558 42795 36528 16892 65809 173135 255925 258445
31397 258445 185828 68338 -55138 -134750 -142356 -104161 -66024 -38190 -10112 2176 -22022
31386 -22022 -50120 -24097 46116 76319 15292 -89903 -158099 -160384 -119334 -64873 -21281 -3227
31374 -3227 6205 44002 106078 129940 71906 -27153 -90406 -94782 -72684 -46653 -10826 32005
31362 32005 63218 81754 104850 128190 122073 82026 52701 77360 138441 170085 128036 35386
31350 35386 -41460 -54582 -9809 51547 91809 94270 61079 15098 -6499 12027 38621 31651
31338 31651 2510 3091 46156 82194 72342 39354 17945 -2399 -44149 -85408 -85606 -47329 -7655
31325 -7655 16380 29633 20747 -26915 -86811 -97423 -31259 70093 134436 116601 27872 -70930
31313 -70930 -118884 -117812 -125915 -169910 -201094 -174036 -123820 -106862 -102766 -50493 41495 105124
31301 105124 122216 134726 143739 95120 -9677 -79332 -51321 28469 85281 102974 87891
31290 87891 21965 -82913 -143934 -95209 20224 108487 140862 152888 162438 156550 140512 137556
31278 137556 146635 147312 136950 125786 112374 98042 100222 116586 111044 77027 71145 127495 182481
31265 182481 158431 87387 65432 103459 117448 67457 14001 15922 51042 67889 53149 19381
31253 19381 -21153 -48312 -50293 -62361 -130770 -221357 -232733 -132876 -17824 9757 -35270 -67689
31241 -67689 -54436 -31265 -30345 -50871 -84917 -122092 -137651 -117402 -88065 -88739 -118201 -139566
31229 -139566 -130579 -103110 -79237 -71688 -82992 -103829 -115283 -105664 -80158 -49143 -20889 -8741
31217 -8741 -21783 -40183 -27225 21089 65735 76492 62420 36311 -10877 -73649 -109475 -90075
31205 -90075 -46095 -25185 -33593 -53314 -81370 -106380 -82707 8482 94674 81298 -15499 -72791
31193 -72791 -10293 121031 216126 227496 175710 98707 29931 -2566 7552 39636 73632
31182 73632 106381 130230 123277 81490 36833 18379 13028 -8901 -41050 -41948 12560 97689
31170 97689 163001 175664 140428 86814 39996 1997 -39180 -86190 -126192 -146903 -149049 -142601
31158 -142601 -140660 -155803 -188332 -216062 -210818 -170777 -124040 -95015 -80144 -63474 -42902 -29802
31146 -29802 -29617 -32697 -23566 2100 27029 23304 -17070 -67011 -92828 -93412 -93119 -98494 -88152 -53950
31132 -53950 -27259 -44154 -96647 -137732 -132902 -95265 -69074 -82388 -115553 -119166 -68617 5016
31120 5016 48751 44320 14054 -21516 -64496 -116675 -163847 -191763 -194912 -164140 -94462 -16272
31108 -16272 12518 -33647 -118290 -188950 -226858 -234276 -207689 -154963 -110120 -92688 -74416 -27076
31096 -27076 16090 -4628 -87815 -167769 -199176 -197814 -190753 -174205 -139358 -100980 -75777 -59168
31084 -59168 -44393 -42960 -67218 -108090 -142362 -149277 -118363 -61784 -17975 -13665 -21341 9571
31072 9571 75356 116492 105812 87452 101881 122925 110349 81667 79042 95266 89990 63125
31060 63125 57206 92044 143053 181278 196229 187236 171590 188646 250325 300244 274785 194662
31048 194662 135461 113932 77206 11728 -20970 11563 50507 37063 47 -7843 -4313 -33396
31036 -33396 -67839 -41919 32336 65132 13920 -61301 -88217 -68490 -41420 -7492 64146 167166
31024 167166 238496 221303 136527 75600 108218 199903 245474 194539 113078 93185 129891
31013 129891 132611 47283 -81431 -172752 -190816 -151295 -85112 -17021 41937 97271 153461
31002 153461 190495 178268 117683 44919 -9836 -46071 -73325 -93224 -105395 -106338 -79731 -16090
30990 -16090 54656 83401 63267 38541 42685 62014 72418 72185 59371 18789 -38428 -60051
30978 -60051 -15917 52162 81935 67585 45595 28683 3455 -20606 -14582 15766 26885 -1888
30966 -1888 -43377 -68843 -82583 -95940 -100951 -91209 -82189 -86130 -85537 -58507 -21391 -19819 -72448
30953 -72448 -138885 -155059 -100772 -25795 277 -35115 -74562 -62836 -13850 15339 1728 -27141
30941 -27141 -49432 -76730 -108334 -99686 -16298 101541 173094 174453 160794 182044 215961 211362
30929 211362 168169 134225 133306 139428 129358 121189 138732 166666 171985 154062 142158 150414 163555
30916 163555 163386 142297 93844 20599 -46699 -68970 -45103 -12168 4090 7691 -2380 -43444
30904 -43444 -108410 -153073 -148960 -115231 -76053 -28981 12114 -6599 -103164 -198588 -201882 -135037
30892 -135037 -97960 -119032 -126163 -76144 -21609 -11320 -6018 44144 100670 92041 29787 -9615
30880 -9615 1567 26420 55266 128152 244087 322613 300175 214847 149579 128867 119255 102852
30868 102852 95617 104426 114734 117628 108559 65895 -22276 -111310 -133560 -90431 -59363 -89679
30856 -89679 -143238 -166757 -168848 -181581 -194974 -188185 -186554 -217926 -239389 -186752 -85168 -26174
30844 -26174 -31024 -25219 29531 68588 36219 -14777 -2133 63678 108260 104349 81006 49613
30832 49613 -1827 -49594 -43913 10441 40102 -10319 -114395 -200224 -223117 -194356 -159551 -152115
30820 -152115 -156772 -132140 -82199 -71540 -134721 -205146 -190047 -95800 -17070 -12095 -54524 -105744
30808 -105744 -160383 -204634 -201685 -152496 -114357 -121221 -132905 -103647 -60731 -68705 -140457 -224227
30796 -224227 -263381 -238864 -168323 -90196 -36614 -4322 31795 67501 63808 12274 -31728 -16642
30784 -16642 31001 39770 -15728 -94509 -147756 -159666 -135362 -86038 -32563 3122 19571 34017
30772 34017 56781 80219 91951 86878 69029 53119 59094 91195 125628 132310 107340 72925
30760 72925 48201 33694 25939 33165 64651 107153 126422 104793 70604 67648 90790 80887
30748 80887 3977 -91648 -131105 -105637 -67239 -44436 -18123 15435 15555 -43434 -124459 -167271
30736 -167271 -147552 -77603 18980 108783 154331 147595 120081 100721 84559 58227 29137 9179
30724 9179 -5237 -16664 -14346 3495 21431 36959 66955 104996 110055 65660 14002 -2575
30712 -2575 386 -10775 -21593 9610 84056 159709 202897 206261 173058 123600 101294 128590
30700 128590 165792 153073 85442 9263 -43885 -76447 -85072 -51018 19879 85154 109305 98180
30688 98180 82328 82214 91946 84779 38176 -36657 -100437 -129566 -135253 -128441 -96007 -35063 19147
30675 19147 31961 12775 -10223 -32366 -55997 -61291 -36676 -14105 -27455 -55571 -55140 -33575
30663 -33575 -37827 -80095 -122881 -132090 -103945 -50988 -4347 -13724 -94286 -184262 -205435 -155838
30651 -155838 -94726 -53845 -23300 -9653 -35544 -82213 -102646 -97945 -111898 -139627 -115149 -15228
30639 -15228 88297 113716 59602 -16771 -67561 -77262 -58018 -45568 -68962 -112779 -139997 -149267
30627 -149267 -165597 -181281 -166198 -137702 -150954 -206102 -233764 -195249 -133317 -99372 -93153 -99569
30615 -99569 -119041 -130360 -89393 -2683 56848 42851 -13899 -76284 -149944 -222597 -233008 -158655
30603 -158655 -66922 -18387 15603 74924 121178 108663 84371 121115 192592 212573 170782
30592 170782 132659 120746 95470 53844 51886 108457 163909 162598 119070 78846 61715 65016
30580 65016 81964 95202 80755 33265 -30066 -89535 -128635 -133391 -113118 -105355 -128149 -146638
30568 -146638 -124787 -89567 -96982 -149457 -196938 -210219 -201596 -177768 -126694 -58825 -15785 -23688
30556 -23688 -65794 -105152 -111038 -70674 -3415 45075 49676 34038 28035 22042 -3619 -33986
30544 -33986 -47225 -56650 -73748 -59600 23690 134428 191024 176707 140793 112031 83255 70183
30532 70183 103114 157966 175642 159609 176199 242777 292694 273121 204762 121666 27050 -61956
30520 -61956 -103193 -104618 -140500 -243825 -343149 -357204 -297936 -227817 -167025 -102436 -46374 -21591
30508 -21591 -12438 13801 53663 79699 87881 92758 91949 71950 35336 -6072 -47254 -75992 -69075
30495 -69075 -29199 2996 3248 -187 22510 48067 37700 2748 -13897 -5657 -7544 -42240 -98570
30482 -98570 -157040 -202636 -215696 -180802 -108291 -30790 19505 24365 -12981 -64246 -100717 -130465
30470 -130465 -183930 -253893 -288843 -264337 -217191 -180666 -133029 -53207 15560 15497 -38661 -79778
30458 -79778 -79531 -65990 -62441 -64001 -71409 -95284 -122469 -123625 -100486 -84497 -82555 -65362 -19900
30445 -19900 26672 52308 73629 109703 138876 123631 69169 27709 36884 73176 85729 69015
30433 69015 70328 111535 139474 95726 11986 -23843 9317 46388 49454 60101 104585 128781
30421 128781 89386 40649 49352 75910 33636 -66452 -129185 -120005 -97455 -97961 -84301 -29799
30409 -29799 32753 78265 128811 186344 194102 115114 -1474 -80554 -108259 -117209 -121661 -112051
30397 -112051 -87347 -52086 -65 66888 121524 138810 123692 92434 49560 1259 -36184
30386 -36184 -60771 -87503 -108989 -93101 -46221 -33493 -93159 -168009 -173905 -110521 -49954 -33511
30374 -33511 -37381 -34331 -32893 -46956 -69279 -84861 -79406 -35455 43057 102389 76907 -34363
30362 -34363 -160557 -231946 -228176 -159347 -50143 46969 76330 43460 13222 19016 19001 -25350
30350 -25350 -76567 -76782 -36180 -5149 12899 49988 89615 74279 5459 -39849 -18711 18732
30338 18732 16262 -5831 -7653 -14496 -72187 -147632 -152886 -67906 25557 45031 -7940 -77756
30326 -77756 -124401 -142905 -147411 -157065 -176640 -181708 -145816 -86168 -54018 -74898 -127008 -179404
30314 -179404 -215062 -215390 -170652 -118934 -123731 -187959 -236930 -217182 -166941 -150905 -167670 -167953
30302 -167953 -130286 -70570 -6748 36164 15965 -72608 -154374 -146785 -66181 -2453 2579 -12341
30290 -12341 -12066 -8904 -10577 4979 36258 41186 8120 -10077 25450 72398 67367 19379 -9211
30277 -9211 4349 21188 6819 -25160 -41154 -27169 8512 50242 84968 112141 147435 203594
30265 203594 264706 291283 255800 167143 59589 -33982 -95732 -119817 -107748 -70175 -26361
30254 -26361 7566 29990 45666 48008 24938 -13361 -32613 -14974 14523 20416 1429 -19028
30242 -19028 -33456 -53083 -77924 -94985 -105240 -122766 -144475 -149361 -133437 -118248 -116833 -117504
30230 -117504 -111271 -108874 -115378 -110932 -77424 -30801 -7682 -24503 -60687 -79218 -59986 -18177
30218 -18177 9571 3613 -17108 -19384 7324 52324 110337 181437 246812 270916 235736 160139
30206 160139 85638 53055 79896 138707 170744 150552 125632 155665 221474 241811 184183
30195 184183 108784 84044 102113 105695 65281 -2433 -70803 -125400 -158525 -166514 -156010 -146218
30183 -146218 -162908 -219425 -290582 -318388 -267958 -169602 -81861 -27335 4385 13389 362 5801
30171 5801 72123 164064 194763 145245 89825 79642 73198 22374 -40831 -61526 -53718 -68246
30159 -68246 -100712 -96142 -33934 41207 70077 32094 -41243 -88157 -74464 -42215 -63699 -134115
30147 -134115 -166046 -117508 -56570 -48821 -51109 6003 87122 101113 50784 30765 79818 129662
30135 129662 115761 58184 6493 -28936 -58049 -73929 -67735 -49622 -34041 -27229 -34424 -51040
30123 -51040 -47183 3702 78002 117307 93977 34113 -18847 -32909 6968 81025 130515 112768
30111 112768 53110 4142 -27935 -65947 -91984 -64338 612 35036 16380 -7608 -417 21318
30099 21318 38115 50351 34139 -50602 -177751 -251395 -224798 -161278 -135440 -135739 -114751 -77111
30087 -77111 -54200 -35226 9396 62511 77712 45121 -9172 -70794 -136448 -182898 -186679 -167218
30075 -167218 -166779 -190791 -204020 -182716 -139701 -100722 -81101 -80600 -80749 -55510 -1335 56452 100213
30062 100213 140105 180834 198724 179159 148577 137378 137918 134229 143274 179388 200837 150176
30050 150176 43480 -34969 -35969 180 6389 -30245 -70135 -79195 -61832 -43875 -39811 -44327
30038 -44327 -54459 -85146 -144063 -200762 -214834 -195362 -189061 -199081 -170541 -86314 -18876 -33304
30026 -33304 -85591 -86312 -33746 -5523 -31900 -57975 -36002 18627 75986 125643 142854 92705
30014 92705 2458 -35194 21724 97402 100250 47887 27275 59559 77489 35327 -24719 -37636
30002 -37636 -3122 22987 4334 -35651 -46415 -9213 41900 58736 36324 21941 61653 148573
29990 148573 233720 276884 272186 233617 177796 121575 77695 46690 24340 17705 37619 71535
29978 71535 84098 58587 22594 13109 25872 24316 -1924 -15301 20128 87664 135416 133563
29966 133563 95937 52378 19604 -2399 -22505 -48033 -69824 -61800 -11556 52640 85210 72538
29954 72538 39495 10590 -8584 -10730 18157 69726 108303 114689 112644 131477 161584 170248
29942 170248 149424 127230 137503 187450 244744 253382 185028 83182 28197 43952 70836
29931 70836 51742 7772 -5053 20277 48059 65970 90966 119612 125841 108352 91451 73730
29919 73730 24228 -57229 -120412 -126580 -94863 -64693 -42674 -12613 24930 51549 58023 51690
29907 51690 44504 48383 73854 117784 154761 150829 89391 -12929 -111546 -162200 -156507 -126279
29895 -126279 -102782 -80854 -38381 21825 75924 117923 162607 206295 215627 169215 90704 27496
29883 27496 8102 25856 52844 66513 70496 84495 105563 97993 45001 -8682 -4004 51798
29871 51798 95118 95409 87387 103950 123095 103437 37795 -48726 -123433 -152260 -115903 -41736
29859 -41736 10599 16556 10573 24893 41164 28648 -5887 -39366 -70468 -98959 -97110 -46543
29847 -46543 16632 38503 17286 -3077 1800 17454 28967 40349 58893 91863 150839 226413
29835 226413 270208 243033 175529 139541 160925 201125 222115 221670 199986 144310 66767 14221
29823 14221 14908 46122 72586 84043 78895 50601 14537 8968 38670 55540 31914 13858
29811 13858 51319 108067 106199 44488 893 13606 31130 5218 -30666 -20727 19902 25633
$$ [...]
##END NTUPLES=NMR SPECTRUM
##END=
