##TITLE=31Pdec_4-2026
CDCl3, 24 sc
 19.1.2026
##JCAMPDX= 6.0         $$ Bruker NMR JCAMP-DX V2.0
##DATA TYPE= NMR SPECTRUM
##DATA CLASS= NTUPLES
##ORIGIN= UXNMR, Bruker Analytische Messtechnik GmbH
##OWNER= root
$$ XWIN-NMR		Version 3.5
$$ Mon Jan 19 14:36:02 2026 Russian Standard Time (UT+4h)  she@DPX200
##.OBSERVE FREQUENCY= 81.013821
##.OBSERVE NUCLEUS= ^31P
##.ACQUISITION MODE= SIMULTANEOUS
##.ACQUISITION SCHEME= undefined
##.AVERAGES= 24
##.DIGITISER RES= 17
##SPECTROMETER/DATA SYSTEM= spect
##.PULSE SEQUENCE= zgpg30
##.SOLVENT NAME= DMSO
##.SHIFT REFERENCE= (INTERNAL, DMSO, 0, 198.062)
##AUDIT TRAIL= $$ (NUMBER, WHEN, WHO, WHERE, WHAT)
$$ ##TITLE= Audit trail, XWIN-NMR		Version 3.5
$$ ##JCAMPDX= 5.01
$$ ##ORIGIN= Bruker BioSpin GmbH
$$ ##OWNER= she
$$ F:/spectra/data/she/nmr/P31/2/pdata/1/auditp.txt
$$ ##AUDIT TRAIL=  $$ (NUMBER, WHEN, WHO, WHERE, WHAT)
(   1,<2026-01-19 14:34:41.43 +0400>,<she>,<DPX200>,
      <created by zg, POWCHK disabled, PULCHK disabled
       configuration hash MD5:
       00 E9 B6 7A A2 85 ED C7 34 08 36 98 17 FE 4E 26
       data hash MD5: 32K
       5E 7F 68 CF 0B BE E7 30 D6 5E 0F F1 FE B1 EA 3E>)
(   2,<2026-01-19 14:34:43.87 +0400>,<she>,<DPX200>,
      <Start of raw data processing
       efp BC_mod = 2 LB = 1.5 FT_mod = 6 PKNL = 1 PHC0 = 1407.993 PHC1 = 59.70029 SI = 64K 
       data hash MD5: 64K
       5A 42 7A 71 95 7E F4 36 B1 8B 60 BF 8E 2B 3B 9A>)
(   3,<2026-01-19 14:35:09.23 +0400>,<she>,<DPX200>,
      <pk PHC0 = 7.722189 PHC1 = -9.799999 
       data hash MD5: 64K
       7B EC 79 5A B0 BB B5 C1 F0 EB 02 E4 68 15 34 90>)
(   4,<2026-01-19 14:35:15.78 +0400>,<she>,<DPX200>,
      <abs ABSG = 5 
       data hash MD5: 64K
       49 49 14 34 97 5E EE C3 95 DC 60 35 91 D8 C7 DA>)
$$ ##END=
$$ 
$$ hash MD5
$$ 32 1E B7 5F 3A 36 CE 18 4E C6 A1 BE B6 E0 21 CD
##$RELAX= 
##$RELAX= 
##$RELAX= 
##$RELAX= 
##$RELAX= 
##$RELAX= 
##$RELAX= 
##$RELAX= 
$$ Bruker specific parameters
$$ --------------------------
##$DU= <F:/spectra>
##$EXPNO= 2
##$NAME= <P31>
##$PROCNO= 1
##$TYPE= <nmr>
##$USER= <she>
##$AMP= (0..31)
100 100 100 100 100 100 100 100 100 100 100 100 100 100 100 100 100 100 
100 100 100 100 100 100 100 100 100 100 100 100 100 100 
##$AQSEQ= 0
##$AQ_mod= 1
##$AUNM= <au_zg>
##$AUTOPOS= <>
##$BF1= 81.014009
##$BF2= 200.13
##$BF3= 200.13
##$BF4= 200.13
##$BF5= 200.13
##$BF6= 200.13
##$BF7= 200.13
##$BF8= 200.13
##$BYTORDA= 1
##$CFDGTYP= 0
##$CFRGTYP= 5
##$CHEMSTR= <none>
##$CNST= (0..31)
1 1 145 1 1 1 1 1 1 1 1 1 1 1 1 1 1 1 1 1 1 1 1 1 1 1 1 1 1 1 1 1 
##$CPDPRG= <waltz16>
##$CPDPRG1= <>
##$CPDPRG2= <waltz16>
##$CPDPRG3= <>
##$CPDPRG4= <mlev>
##$CPDPRG5= <mlev>
##$CPDPRG6= <mlev>
##$CPDPRG7= <mlev>
##$CPDPRG8= <mlev>
##$CPDPRGB= <>
##$CPDPRGT= <>
##$D= (0..31)
0 1 0 0 0 0 0 0 0 0.06 0 0.03 2e-05 3e-06 0 0 0.0002 0 0 0 0 0 0 0 0 0 
0 0 0 0 0 0 
##$DATE= 1768818881
##$DBL= (0..7)
120 120 120 11 120 120 24 19 
##$DBP= (0..7)
150 150 150 150 150 150 150 150 
##$DBP07= 0
##$DBPNAM0= <>
##$DBPNAM1= <>
$$ [...]
##$SUBNAM3= <"">
##$SUBNAM4= <"">
##$SUBNAM5= <"">
##$SUBNAM6= <"">
##$SUBNAM7= <"">
##$SUBNAM8= <"">
##$SUBNAM9= <"">
##$SW= 400.765351723535
##$SWIBOX= (0..15)
0 1 3 0 0 0 0 0 0 0 0 0 0 0 0 0 
##$SW_h= 32467.5324675325
##$TD= 32768
##$TD0= 1
##$TE= 0
##$TE2= 300
##$TE3= 300
##$TEG= 300
##$TL= (0..7)
0 120 53 12 22 120 120 120 
##$TP= (0..7)
150 150 150 150 150 150 150 150 
##$TP07= 0
##$TPNAME0= <>
##$TPNAME1= <>
##$TPNAME2= <>
##$TPNAME3= <>
##$TPNAME4= <>
##$TPNAME5= <>
##$TPNAME6= <>
##$TPNAME7= <>
##$TPOAL= (0..7)
0.5 0.5 0.5 0.5 0.5 0.5 0.5 0.5 
##$TPOFFS= (0..7)
0 0 0 0 0 0 0 0 
##$TUNHIN= 0
##$TUNHOUT= 0
##$TUNXOUT= 0
##$USERA1= <user>
##$USERA2= <user>
##$USERA3= <user>
##$USERA4= <user>
##$USERA5= <user>
##$V9= 5
##$VALIST= <valist>
##$VCLIST= <CCCCCCCCCCCCCCC>
##$VD= 0
##$VDLIST= <DDDDDDDDDDDDDDD>
##$VPLIST= <PPPPPPPPPPPPPPP>
##$VTLIST= <TTTTTTTTTTTTTTT>
##$WBST= 1024
##$WBSW= 4
##$XGAIN= (0..3)
0 0 0 0 
##$XL= 0
##$YL= 0
##$YMAX_a= 29081
##$YMIN_a= -28566
##$ZGOPTNS= <>
##$ZL1= 120
##$ZL2= 120
##$ZL3= 120
##$ZL4= 120
##$ABSF1= 198.0616
##$ABSF2= -202.7028
##$ABSG= 5
##$ABSL= 3
##$ALPHA= 0
##$AQORDER= 0
##$ASSFAC= 0
##$ASSFACI= 0
##$ASSFACX= 0
##$ASSWID= 0
##$AUNMP= <proc_1d>
##$AZFE= 0.1
##$AZFW= 0.5
##$BCFW= 0
##$BC_mod= 2
##$BYTORDP= 0
##$COROFFS= 0
##$CY= -3
##$DATMOD= 1
##$DC= 0
##$DFILT= <>
##$DTYPP= 0
##$F1P= 0
##$F2P= 0
##$FCOR= 1
##$FTSIZE= 65536
##$FT_mod= 6
##$GAMMA= 0
##$GB= 0
##$INTBC= 1
##$INTSCL= 9.790993e-09
##$ISEN= 30
##$LB= 1.5
##$LEV0= 0
##$LPBIN= 0
##$MAXI= 10000
##$MC2= 0
##$MEAN= 0
##$ME_mod= 0
##$MI= 50
##$NCOEF= 0
##$NC_proc= -3
##$NLEV= 6
##$NOISF1= 182.463
##$NOISF2= 159.3651
##$NSP= 0
##$NTH_PI= 0
##$NZP= 0
##$OFFSET= 198.0616
##$PC= 4
##$PHC0= 1415.715
##$PHC1= 49.90029
##$PH_mod= 1
##$PKNL= yes
##$PPARMOD= 0
##$PSCAL= 0
##$PSIGN= 0
##$REVERSE= no
##$SF= 81.0140089999434
##$SI= 65536
##$SIGF1= 159.3651
##$SIGF2= -187.1042
##$SINO= 113.3802
##$SIOLD= 16384
##$SREGLST= <1H.CDCl3>
##$SSB= 0
##$STSI= 65536
##$STSR= 0
##$SW_p= 32467.5324675325
##$SYMM= 0
##$S_DEV= 0
##$TDeff= 32768
##$TDoff= 0
##$TI= <>
##$TILT= no
##$TM1= 0
##$TM2= 0
##$TOPLEV= 0
##$USERP1= <user>
##$USERP2= <user>
##$USERP3= <user>
##$USERP4= <user>
##$USERP5= <user>
##$WDW= 1
##$XDIM= 65536
##$YMAX_p= 296577600
##$YMIN_p= -4099536
$$ End of Bruker specific parameters
$$ ---------------------------------
##NTUPLES= NMR SPECTRUM
##VAR_NAME=  FREQUENCY,     SPECTRUM/REAL,   SPECTRUM/IMAG
##SYMBOL=    X,             R,               I
##VAR_TYPE=  INDEPENDENT,   DEPENDENT,       DEPENDENT
##VAR_FORM=  AFFN,          ASDF,            ASDF
##VAR_DIM=   65536,         65536,           65536
##UNITS=     HZ,            ARBITRARY UNITS, ARBITRARY UNITS
##FACTOR=    0.49542278885378, 1,            1
##FIRST=     16045.7642231865, 0,            0
##LAST=      -16421.768244346, 0,            0
##MIN=       -16421.768244346, -4099536,     0
##MAX=       16045.7642231865, 296577600,    0
$$ Real data points
##PAGE= N=1
##DATA TABLE= (X++(R..R)), XYDATA
$$ [...]
44316 -33159 -96675 -144423 -93003 21886 94451 81575 45119 53026 77120 30231 -105012
44305 -105012 -231948 -242853 -134457 3608 90542 114322 108980 110316 131472 152848 135492
44294 135492 66917 -10873 -43769 -30119 -13416 -14823 -10310 19032 53204 69947 84755 124287
44282 124287 173683 179898 112951 11151 -44710 -8169 81853 138707 123025 81789 76686 98486
44270 98486 89142 35060 -10481 -3805 34704 60029 59737 48135 31471 6842 -18721 -28139 -5190
44257 -5190 59977 157615 244699 269500 221823 138199 52597 -26047 -79280 -69257 4215 73603
44245 73603 75546 33147 22560 67559 111524 97248 37182 -9288 -5009 32466 55420 33503
44233 33503 -18127 -54318 -44464 2 39987 41397 -3981 -73513 -127121 -143547 -146356 -174010
44221 -174010 -223020 -249176 -230455 -193128 -161713 -122663 -62888 -6722 20548 35304 63053
44210 63053 90134 91330 83937 105665 151316 180013 179961 179294 192575 200519 187694 160434 120478
44197 120478 57596 -21713 -88487 -121297 -116557 -71874 5424 72319 73824 5111 -80763 -133843
44185 -133843 -143925 -114985 -48521 31881 82139 89696 92312 121234 155206 156338 125535 95788
44173 95788 91865 120401 178243 245332 288181 294866 289243 289271 274850 226327 172562 160729 187255
44160 187255 197257 153492 74227 -322 -48796 -67655 -57782 -31013 -15603 -36192 -88404 -140127
44148 -140127 -158587 -136446 -94524 -59677 -40328 -27194 -15432 -12926 -21692 -26773 -17862 -10196
44136 -10196 -23415 -43503 -28611 39980 128159 180060 168945 108142 22830 -69513 -149290 -186826
44124 -186826 -164584 -105123 -58657 -54112 -72027 -73734 -47215 -12098 12357 25299 29225 14392
44112 14392 -30173 -94840 -146668 -151981 -104958 -36106 11532 19278 4526 -4363 3202 19891
44100 19891 37698 54857 71012 84647 93304 93610 85920 76439 63054 25871 -42828 -101643 -92627
44087 -92627 -23290 27621 12585 -21098 -10656 22947 15228 -32857 -58340 -36407 -3863 17282
44075 17282 44001 66803 36625 -50175 -118214 -107350 -51559 -22818 -39478 -71973 -99692 -115835
44063 -115835 -106907 -73616 -49709 -60044 -80986 -78344 -60172 -53041 -50301 -28812 723 6477
44051 6477 -11265 -21878 -13171 910 18317 57306 122767 190772 228946 215486 147211 50563
44039 50563 -24359 -41843 -6379 57523 125617 158278 105404 -31519 -170157 -228192 -217038
44028 -217038 -209793 -232843 -242165 -199832 -120050 -36984 24246 40106 2105 -49944 -53974 -4062
44016 -4062 34782 10381 -52183 -94664 -106162 -126703 -181368 -242196 -265505 -252059 -248317 -279773
44004 -279773 -304805 -266384 -179193 -117009 -107539 -99550 -60492 -40666 -87508 -154067 -165759 -135425
43992 -135425 -127587 -137030 -97641 -3826 70853 84174 67781 45847 -1311 -66348 -90601 -49446
43980 -49446 5982 28021 29269 28317 9649 -21472 -15671 36558 62904 12177 -58094 -64129 -17259
43967 -17259 10535 5722 19147 69705 113734 111751 74523 39793 36648 67056 98342 90540
43955 90540 51335 33652 55506 65397 22517 -37580 -67051 -87990 -145422 -213692 -222228 -156322
43943 -156322 -69203 -11144 -4099 -59425 -148964 -180141 -84144 73630 150111 97545 7495
43932 7495 -24724 -2159 26498 46841 68708 89046 99828 98505 74373 22426 -23148 -18417
43920 -18417 19032 22948 -25477 -72183 -75601 -54076 -27287 19099 75135 83331 26191 -21569
43908 -21569 9902 81600 103801 63887 27523 33132 54806 67038 84234 123363 171999 209363
43896 209363 229432 230711 204573 146455 71586 17227 26948 114299 231927 297842 272794 199520
43884 199520 150675 152514 173837 172201 133497 80407 55419 79915 121655 125274 82052 37617
43872 37617 20156 3987 -32801 -60631 -45481 -3600 34495 78293 144446 201352 206457 177750
43860 177750 165331 164805 125722 44575 -18117 -26790 -18474 -40674 -89292 -129935 -139725 -107124
43848 -107124 -29154 66293 126659 127610 97974 77650 75711 81253 84488 70645 23421 -44341
43836 -44341 -88996 -86988 -67384 -74565 -115584 -160071 -176613 -157222 -119840 -91243 -71374 -22475
43824 -22475 72966 151660 122990 -3628 -104866 -89879 -6944 40170 30807 19451 27076 19571
43812 19571 -14377 -38837 -36736 -39789 -68990 -91140 -63041 10463 84756 120470 107192 65665
43800 65665 38238 53534 88933 92317 52743 22271 49937 119047 172267 179001 154169 126771
43788 126771 116204 128924 151959 154139 117155 63593 33483 34652 37908 20899 -8966 -40962
43776 -40962 -80811 -124780 -138728 -96838 -32486 -11853 -47871 -75691 -37142 38645 74806 49679
43764 49679 14603 11205 22497 23455 30202 60810 83915 57604 2077 -18079 18916 68747
43752 68747 88053 80523 66423 48842 29560 23893 37376 53544 63049 79550 109655 133235
43740 133235 131075 105865 60760 -8602 -79175 -97848 -49548 6958 15334 3996 39184 116863
43728 116863 162995 136453 71571 12179 -39300 -89332 -120485 -117978 -92408 -53070 6721 73564
43716 73564 97968 48577 -37576 -88649 -70728 -9387 44512 52706 12921 -32220 -22843 59025
43704 59025 162943 214297 178673 82284 -10264 -35143 22081 101503 120034 63099 -3373
43693 -3373 -24875 -19908 -25113 -28880 -6830 16444 2498 -28122 -23458 9773 9436 -45874 -105818
43680 -105818 -126145 -121584 -120606 -117149 -96037 -70048 -63502 -82383 -115959 -142785 -127960 -50865
43668 -50865 51153 104426 81652 28028 -8730 -30122 -48494 -49735 -33791 -47462 -123240 -211722
43656 -211722 -227375 -149714 -38033 42147 69807 60231 46585 60763 97157 105364 52014 -25392
43644 -25392 -64247 -60706 -63582 -95929 -130376 -137326 -112076 -59607 -623 13673 -50275 -144125
43632 -144125 -180632 -146703 -109995 -103053 -78899 -13995 23800 -29134 -126176 -170156 -142535 -106052
43620 -106052 -105630 -134788 -182861 -243395 -276912 -233510 -127886 -40090 -24240 -56119 -81688 -76056
43608 -76056 -41509 10995 58050 74990 70511 82504 124408 164286 171902 156999 144421 139853
43596 139853 136476 126716 93145 23371 -47996 -56586 116 32997 -26933 -120849 -128757 -27762
43584 -27762 81596 106958 58344 -2311 -43159 -60802 -45741 2657 49966 56810 25878 -9674
43572 -9674 -32146 -42646 -28447 33217 129016 196743 180468 89156 -14951 -82815 -119270 -153542
43560 -153542 -184716 -180006 -131288 -84751 -85627 -109260 -90907 -27431 1186 -58912 -145703 -149755
43548 -149755 -53388 50768 77526 34415 -21232 -61136 -93810 -128547 -166611 -208227 -238319
43537 -238319 -223804 -158731 -96544 -94899 -132355 -127106 -49787 28548 29143 -31729 -75338 -71818
43525 -71818 -65033 -90011 -123228 -135925 -148262 -190539 -241294 -251563 -216889 -176992 -145932 -92964
43513 -92964 -7060 64464 70097 16559 -50774 -103392 -133946 -128847 -79217 -12035 27528 26687
43501 26687 10160 -1758 -8289 -3253 25513 61204 58412 -1221 -79206 -125444 -130608 -113244
43489 -113244 -78274 -19433 47943 89095 89700 73221 69908 79964 78031 52652 30274 45986
43477 45986 88617 96896 31376 -64895 -109501 -78096 -20354 22450 66933 134845 198201 215809
43465 215809 191948 155615 106469 31352 -39897 -52138 -4795 33434 7910 -56856 -94653
43454 -94653 -76924 -36429 -25050 -60930 -111755 -128743 -102983 -77914 -90867 -118084 -107311 -54381
43442 -54381 -7540 5152 9847 35567 68365 79263 66606 44726 15394 -21411 -47221 -45011
43430 -45011 -28898 -28347 -48522 -67288 -68289 -60289 -65237 -97147 -147700 -185589 -179278 -128069 -61072
43417 -61072 -2253 46691 84878 99907 90331 73811 53693 6188 -70480 -121577 -92659 -6562
43405 -6562 61004 78023 82075 105006 121811 100958 69683 89593 177289 279842 331979 318898
43393 318898 275909 238086 203897 151131 77386 8743 -32240 -48523 -51045 -41216 -29083 -47141
43381 -47141 -113140 -187608 -204068 -144932 -57306 11849 63835 117897 163393 168631 123568 51640
43369 51640 -15445 -60327 -81642 -84320 -69609 -36931 -1617 116 -52184 -123154 -149219 -115901
43357 -115901 -76614 -77257 -94692 -80177 -36789 -10575 -16587 -20745 -841 15758 -5604 -55648
43345 -55648 -96260 -110431 -113611 -122075 -130585 -123352 -93507 -46226 9970 66893 111585 125229
43333 125229 97578 44842 2651 -9014 -8184 -25635 -60050 -75119 -47269 -1888 12090 -20631
43321 -20631 -63304 -69008 -31709 12676 32919 38350 60729 106500 140577 122361 50718 -32203
43309 -32203 -77555 -67242 -22008 20041 33860 20877 -3954 -29463 -44907 -31051 21841 87570
43297 87570 123473 125004 130254 152867 146595 73124 -24100 -67473 -55086 -61873 -121995 -170097
43285 -170097 -130290 -17974 86211 131233 123717 87605 43265 14895 14687 21763 11452 -542
43273 -542 19494 63082 86751 80753 79544 90259 65321 -19784 -106507 -120476 -72666 -40083
43261 -40083 -56187 -75063 -50746 -1050 31479 43466 60476 84940 92487 73959 46671 20875
43249 20875 -11958 -44238 -37081 30536 115731 151590 128699 98076 87380 60569 -11664 -82932
43237 -82932 -83481 -22387 18954 -3878 -48364 -57275 -31898 -9092 -7720 -29588 -78393 -141231
43225 -141231 -179372 -174700 -160255 -166920 -168717 -129609 -77869 -70084 -94192 -80700 -14826 36318
43213 36318 29641 8496 21810 43719 26729 -13764 -30422 -28014 -52661 -112357 -166252 -186540
43201 -186540 -178993 -145924 -81893 -10472 24395 14642 -5976 -19572 -41316 -65727 -46890 36588
43189 36588 134641 179657 163227 128364 106755 96325 86477 72760 50539 17451 -19701 -53190
43177 -53190 -80001 -89257 -64173 -15475 8075 -29561 -104069 -160864 -179463 -178184 -168347 -142588
43165 -142588 -105060 -73873 -48318 -8694 43306 77003 75614 54805 27700 -12634 -58294 -72180
43153 -72180 -38580 1968 3681 -21350 -28774 -11836 -1243 -4686 4304 32531 48617 35303
43141 35303 21530 37126 64714 66752 41790 22941 28677 42685 42389 26154 7563 -3997
43129 -3997 -11616 -24359 -43041 -54102 -47956 -44204 -77922 -147805 -198239 -176623 -95882 -14519
43117 -14519 33849 57931 62429 29212 -41146 -107751 -136267 -140148 -144621 -132643 -69137 27637
43105 27637 84960 62155 7990 8083 89808 198882 259782 238804 153198 43756 -51766 -113245
43093 -113245 -141019 -142032 -110081 -31145 81413 170114 176353 103205 15665 -28757 -31326 -26280
43081 -26280 -29736 -37280 -52691 -84989 -121196 -132163 -106970 -57995 3194 63539 86752 38786
43069 38786 -54442 -118988 -121534 -102187 -95348 -72654 -11403 31503 -12101 -105883 -144817 -105263
43057 -105263 -77299 -127316 -203647 -219323 -170101 -120376 -113050 -142857 -187544 -216241 -191724 -115747
43045 -115747 -56199 -78645 -159122 -212010 -198527 -157818 -130525 -106348 -63204 -10185 35940
43034 35940 82444 139266 189611 209582 202150 190318 189321 201636 222661 232736 201424 124562
43022 124562 44722 7912 6559 -6941 -50877 -87561 -76421 -31694 -8164 -37495 -95523 -134064
43010 -134064 -132578 -109762 -90381 -76664 -58859 -39166 -27235 -19187 -4614 5021 -18406 -76046
42998 -76046 -128323 -141704 -129124 -125296 -142244 -172304 -213449 -257931 -270441 -218383 -121939 -38207
42986 -38207 4088 18645 14545 -15931 -54371 -56049 -18033 2880 -23420 -43683 -1194 68381
42974 68381 86638 52239 35020 56494 57486 3534 -52685 -55247 -33290 -52094 -113281 -158692
42962 -158692 -154062 -120069 -89904 -78223 -88081 -112008 -126293 -114191 -94354 -100471 -135359 -169753
42950 -169753 -181428 -169733 -138143 -91692 -46789 -13614 24864 82665 128697 120666 79637 74895
42938 74895 120336 144963 99577 38261 40098 88560 97880 46329 10638 50335 116710 117409
42926 117409 39979 -34900 -36726 18795 69545 91279 109066 134335 134187 85545 28135 21568
42914 21568 60813 81964 58326 43108 93168 188905 261230 267979 210883 107954 -6198
42903 -6198 -74871 -67951 -30689 -35331 -84183 -108749 -69720 -5510 35286 58545 90671 121604
42891 121604 123753 103457 92847 102714 118039 132045 151252 168201 159104 114944 56032 12438
42879 12438 3118 29725 71238 86268 43554 -42160 -118016 -140428 -104435 -31610 48274 100771
42867 100771 99927 56460 17466 19211 48682 66995 60638 49320 49688 57267 67370 87053 111829
42854 111829 112715 71828 21322 18249 75743 139935 144914 76706 -24879 -111121 -156283 -158238
42842 -158238 -130848 -97664 -77686 -70598 -61608 -41429 -15250 7311 23353 35801 45656 46603
42830 46603 28906 -4496 -25797 -2799 56396 94542 64086 -11031 -57259 -35884 19198 53457
42818 53457 53247 38372 17329 -18490 -60383 -71684 -26563 50685 100090 84143 25325 -23228
42806 -23228 -42545 -66267 -124289 -188543 -204185 -167050 -131835 -134710 -145802 -121738 -72824 -42123
42794 -42123 -39043 -36396 -24565 -22272 -28765 -11709 36079 66661 38712 -14492 -20327 36068 88580
42781 88580 71169 -9067 -93958 -142818 -156425 -151093 -139755 -135887 -148432 -164871 -158289 -120770
42769 -120770 -75544 -48202 -40546 -41639 -47183 -53899 -52192 -44798 -58001 -108172 -166386 -185730 -160001
42756 -160001 -124151 -96868 -59793 -4271 38444 37290 4976 -24716 -43025 -62074 -79600 -77686
42744 -77686 -51845 -18225 5965 13870 8354 5278 26298 70599 105780 106180 86220 73885 69559
42731 69559 61357 62370 89970 118345 101226 43816 3136 8001 28011 36438 48877 71074
42719 71074 62985 929 -67066 -83180 -66854 -80715 -130056 -161236 -152646 -139653 -142042 -132702
42707 -132702 -98869 -72166 -64821 -34128 40558 93402 50863 -50334 -96027 -45301 18131
42696 18131 6131 -56735 -75488 -12606 71002 96826 56365 9128 10591 54865 87835 70683
42684 70683 20685 -17381 -29269 -41110 -74194 -116662 -149394 -173313 -190457 -181092 -132473 -79066
42672 -79066 -74568 -118443 -146525 -113017 -53159 -36360 -75550 -117709 -119145 -93366 -74525 -65484
42660 -65484 -45377 -8446 33350 77436 130488 179277 188728 141236 62303 -2599 -25571 -8799
42648 -8799 21278 27552 -5553 -42680 -27606 41222 97427 94798 71754 84565 110335 82430
42636 82430 7076 -33840 -6313 25303 535 -52409 -76153 -69532 -62212 -53984 -37339 -39757
42624 -39757 -82135 -128266 -135671 -121529 -111888 -66135 58067 190992 209593 112609 32954 55232
42612 55232 120488 145723 137895 133862 116485 64985 21722 30180 54528 34540 -17532 -43924
42600 -43924 -32500 -15913 -9767 -14495 -49843 -124411 -197921 -232788 -248480 -260868 -215065 -69036
42588 -69036 91678 131974 48963 -32305 -46033 -54726 -110401 -162259 -152496 -109309 -84440 -74204
42576 -74204 -61472 -67613 -100464 -110031 -59942 7059 35934 44288 77313 120523 124752 86382
42564 86382 39453 -4940 -51709 -80436 -69856 -40874 -22154 -3043 21923 570 -106735
42553 -106735 -231116 -258424 -180813 -98928 -71559 -53918 -4744 34323 10787 -53157 -97187
42542 -97187 -101461 -86681 -70138 -59394 -64083 -82523 -94193 -85238 -63907 -41853 -24671 -25252 -53100
42529 -53100 -84323 -80599 -46649 -27654 -40385 -54427 -54692 -66944 -97262 -103968 -66869 -32566
42517 -32566 -46489 -85167 -103848 -108994 -129393 -151809 -145288 -122534 -117960 -125805 -117772 -102721 -108483
42504 -108483 -119288 -93013 -30365 33728 95605 171563 229094 208887 124448 62335 62334 69666
42492 69666 32977 -23236 -61289 -93852 -131737 -128798 -44967 75123 148864 153940 126733 91672
42480 91672 51080 24816 38236 76236 99236 100449 103507 110252 95230 48579 -14246 -78427
42468 -78427 -128287 -133899 -83812 -19193 12364 24695 61489 110136 113247 64099 19266 6924
42456 6924 -4948 -30726 -33205 99 18846 -7212 -32223 -13593 13637 5996 2360 67225
42444 67225 176623 241328 229750 194630 182463 184650 182838 181168 180883 171203 154869 141207 112255
42431 112255 42640 -43744 -87580 -74406 -52813 -60376 -80439 -90381 -103833 -136023 -165459 -161507
42419 -161507 -124337 -74104 -24817 11863 22508 11860 4972 12814 16900 642 -27448 -52567
42407 -52567 -70090 -74884 -63535 -54375 -69219 -85941 -53116 30487 97214 97307 59498 33555 18300
42394 18300 -11422 -47288 -66727 -77304 -91024 -83197 -32291 23072 28191 -1365 -1154 39769
42382 39769 63290 35953 -4964 -19642 -24774 -51842 -87160 -93366 -70247 -58728 -86363 -128644
42370 -128644 -129714 -60244 44516 111349 99851 35634 -33641 -91283 -140982 -171586 -170132 -152676
42358 -152676 -140743 -119480 -64747 -3004 9481 -30868 -67756 -69856 -65625 -73009 -54436 15844
42346 15844 84633 75174 -9834 -88051 -94521 -42745 8534 16934 -20264 -79038 -130732 -158263
42334 -158263 -158547 -134952 -95506 -56777 -34982 -29027 -25568 -25043 -46555 -98195 -155957 -183325 -165311
42321 -165311 -117903 -71134 -46162 -43327 -52404 -75026 -122073 -178088 -191630 -131378 -38933 9798
42309 9798 -9268 -54584 -83389 -86988 -64609 -14827 34846 40627 7026 -6137 32317 76768
42297 76768 73617 39145 26422 42001 41051 -5796 -76358 -123987 -120199 -78545 -47818 -64831
42285 -64831 -106134 -113431 -74625 -39335 -37647 -34431 1618 34190 16438 -26266 -29628 17526
42273 17526 69428 90462 71870 4747 -99423 -176287 -166912 -105617 -81560 -111013 -121158 -74010
42261 -74010 -28678 -46298 -101001 -134610 -146970 -172828 -202782 -190912 -132802 -84434 -95311 -153788
42249 -153788 -206827 -215249 -184024 -148616 -134542 -129573 -103088 -52561 -13512 -14946 -41883 -56389
42237 -56389 -43585 -20384 -5529 1310 8267 11218 -4706 -42663 -81793 -98417 -96135 -97672 -105971
42224 -105971 -99345 -76184 -73518 -116629 -178193 -220958 -254918 -307209 -354200 -339555 -257913 -168668
42212 -168668 -121195 -112882 -124943 -147167 -155839 -120910 -55276 -8803 5771 28755 72213 82356
42200 82356 22886 -57187 -87986 -66100 -25525 32682 113208 162390 114324 -3639 -85184
42189 -85184 -75533 -26930 -8708 -19860 -19568 185 10520 -8573 -48890 -90470 -117811 -124301
42177 -124301 -111452 -84060 -48944 -21566 -18778 -28877 -5026 83843 203968 287041 303957
42166 303957 279911 244353 203287 160857 128766 105422 78042 50738 35917 14951 -46883
42155 -46883 -133321 -174893 -140739 -86728 -74944 -86792 -65571 -14351 9083 -16548 -48780 -51077
42143 -51077 -40671 -50911 -81506 -104459 -97415 -61078 -21337 -13592 -41334 -56788 -19471 29594
42131 29594 4222 -103396 -192977 -183518 -117581 -87238 -99925 -88632 -32226 15682 21276 16987
42119 16987 31078 39824 26951 29641 72920 105945 67725 -13133 -51628 -25430 5552 -2647
42107 -2647 -26661 -36969 -49829 -88318 -137482 -172982 -200615 -232428 -248908 -220840 -155263 -91514
42095 -91514 -60158 -63309 -81032 -81228 -43092 10970 30276 4391 -12299 22840 67629 44394
42083 44394 -54592 -161641 -225691 -254703 -262813 -235078 -169584 -107040 -83524 -85568 -84468 -86881
42071 -86881 -114405 -153004 -162200 -125904 -61693 11237 79304 117577 107413 75345 74250 111779
42059 111779 133639 98831 37906 6031 6564 3733 -4787 19522 83756 130952 106675 30724
42047 30724 -26419 -24027 16436 49080 49893 29250 17954 39993 85232 112705 93163 41086
42035 41086 -8830 -43922 -70225 -78173 -43974 32102 114955 167868 177241 146066 89956 41109
42023 41109 24490 21724 -10439 -74493 -117925 -102124 -54093 -26102 -31420 -46299 -50684 -37479
42011 -37479 -3719 34606 36713 -19217 -98547 -148391 -160843 -164391 -165293 -140199 -86323 -38777
41999 -38777 -28386 -50551 -82344 -106024 -112353 -104633 -101258 -110961 -108052 -61572 10383 47822 17740
41986 17740 -50778 -105097 -115847 -83545 -32395 -5285 -30125 -77551 -84487 -35604 11175 487
41974 487 -49811 -78662 -56549 -4625 36726 29652 -48258 -175611 -281357 -301793 -245241 -178598
41962 -178598 -152269 -158296 -158537 -131323 -87119 -53571 -47930 -55583 -39837 16210 83041 112697
41950 112697 89407 39818 -3099 -31104 -54137 -75280 -80736 -55466 -7379 30615 32012 7286
41938 7286 -9700 -4406 6160 3589 -13443 -48011 -114568 -209501 -291187 -314731 -279417 -223743
41926 -223743 -180759 -154676 -133209 -102348 -50020 26571 109549 162976 154913 83984 -12773 -88047
41914 -88047 -129565 -164728 -206269 -218727 -175543 -126602 -146546 -218051 -241289 -180541 -121562 -135823
41902 -135823 -164664 -115478 -14725 32931 6903 -13215 11543 28295 2982 -15547 11326
41891 11326 32149 -19743 -121471 -189527 -182799 -128679 -70621 -33115 -23125 -31247 -40657 -52565
41879 -52565 -81747 -114066 -106130 -51634 -6025 -9001 -24271 -4389 23522 980 -58172 -81411
41867 -81411 -50211 -25484 -46263 -69682 -42881 17352 56255 56169 39723 22805 5628 -748
41855 -748 23977 80993 150685 217999 276006 305252 279341 204754 132217 103531 96556 51945
41843 51945 -41769 -120954 -125488 -79622 -57387 -78606 -87445 -43484 15383 31485 9938 -756
41831 -756 14158 27101 25646 28709 43935 54191 55510 68404 98841 124778 136378 153326 182997
41818 182997 197187 176718 147734 141236 141434 111062 52019 2876 -17629 -30443 -59059 -100654
41806 -100654 -137739 -156294 -148673 -116825 -76012 -41632 -13553 13053 28955 25393 23445 58636
41794 58636 126914 172717 152015 93049 69943 115360 177668 175674 88491 -23017 -86542 -93639
41782 -93639 -89516 -100271 -101375 -63508 2914 68638 124011 167404 176129 128595 51177 6159
41770 6159 25111 77851 110547 92835 29406 -45595 -82122 -53390 7361 34529 4414 -43048
41758 -43048 -65086 -67552 -78369 -98739 -107502 -97024 -80480 -72530 -78289 -91449 -94090 -73188 -43275
41745 -43275 -29774 -23491 13846 82434 123704 99186 53556 54582 97949 123598 107416 77585
41733 77585 47267 -3477 -66581 -87788 -41334 19262 22550 -30860 -69971 -34245 66156 162631
41721 162631 189895 144176 83597 61819 69739 63456 36168 22881 36921 49809 44473 39806
41709 39806 42774 25646 -17557 -37379 5596 75756 106882 82828 30104 -38802 -118707 -171326
41697 -171326 -158114 -109185 -96844 -134170 -158233 -127097 -75680 -50899 -43676 -21403 11803 27442
41685 27442 18472 -3271 -34142 -68694 -81299 -54990 -17932 -15185 -47755 -71112 -53685 -8041
41673 -8041 37962 73048 98214 113130 116567 105286 68936 4487 -60306 -81543 -50749 -12466
41661 -12466 -11422 -35422 -33487 15155 75555 105625 108017 116708 143522 161645 147116 117119
41649 117119 108987 128743 143918 132553 115460 120855 134660 117470 67659 32262 42580 69822
41637 69822 68266 38664 16976 15023 10041 -10259 -30506 -41687 -56029 -74154 -71757 -41106
41625 -41106 -16897 -33089 -76534 -111993 -130958 -140353 -122277 -53121 39601 86749 57355 -5448
41613 -5448 -43112 -46629 -45277 -55934 -68080 -68097 -59809 -60960 -81964 -105092 -95581 -49739 -17672
41600 -17672 -46783 -110905 -137334 -105980 -73813 -86756 -117406 -120237 -105533 -115904 -156158 -188809
41588 -188809 -185689 -151775 -108986 -80537 -76900 -78543 -54077 -11245 5019 -11514 -1264 70738
41576 70738 143470 137968 69829 14258 -11259 -46059 -84019 -68338 898 45691 26868 790
41564 790 17621 36334 -2017 -73010 -104556 -77096 -30041 5058 24415 24965 6620 -11507
41552 -11507 -17391 -33725 -82678 -143317 -185317 -223122 -284827 -341446 -328087 -239929 -151955 -126156
41540 -126156 -143398 -148808 -126615 -100653 -86868 -77930 -63791 -41180 -6063 42554 88925 105166
41528 105166 76340 15881 -46513 -87447 -98985 -85645 -64616 -63952 -99181 -143511 -142388 -76981
41516 -76981 2491 31122 5274 -23463 -19094 9110 41082 67627 75788 57635 42515 73038
41504 73038 132462 145624 79364 -3706 -25199 17076 73297 114982 138808 135116 105487 83625
41492 83625 88236 83324 38387 -3693 15194 68253 79489 45893 37244 70064 73866 12885
41480 12885 -41084 -10058 73955 112239 64091 -22206 -80991 -88450 -62887 -40131 -44443 -65534
41468 -65534 -72314 -56120 -40760 -43235 -52107 -55593 -60193 -66597 -59267 -38741 -32517 -51927 -68060
41455 -68060 -52969 -15495 24687 64170 92246 79747 26423 -16818 -13962 1850 -13416 -36373
41443 -36373 -16044 33074 49272 27196 28385 76635 112813 83431 17239 -25484 -35539 -41726
41431 -41726 -47759 -34496 -12577 -23400 -80465 -143126 -162054 -131315 -84473 -53200 -42368 -39502
41419 -39502 -35787 -33324 -35585 -37342 -28617 -7852 12912 18034 3805 -14134 -10283 25635 69541
41406 69541 80436 48774 18414 41406 111938 165018 146378 66359 -23478 -87171 -120174 -125195
41394 -125195 -102803 -68399 -52181 -66642 -86650 -76211 -28755 29317 66791 66279 24203 -45562
41382 -45562 -107198 -123917 -93334 -49106 -22319 -16762 -26202 -51400 -84854 -101927 -91127 -76957
41370 -76957 -87191 -111234 -118894 -107740 -98547 -92066 -67814 -23862 19702 57485 98229 123528
41358 123528 93968 11731 -67221 -104129 -116740 -122788 -94388 -11979 77599 112656 101056 97371
41346 97371 113133 110570 81441 69464 99987 139110 147319 134903 134614 144560 129580 72996 8136
41333 8136 -6205 54989 143478 171131 101652 -2342 -48401 -18194 31211 60132 91818 155746
41321 155746 230571 268678 249596 189204 120570 81714 94592 135242 148173 109326 51900
41310 51900 14717 -2792 -10898 8366 70081 142743 179588 178181 166785 145602 90618 10423
41298 10423 -54467 -95854 -148335 -216206 -240120 -172987 -54692 30061 48108 32575 14885
41287 14885 -13592 -67373 -129854 -166587 -157688 -106497 -29524 52515 121258 163905 168312 123844
41275 123844 41858 -32615 -56027 -36953 -25955 -45121 -55110 -12175 65640 118863 120444 98371
41263 98371 88391 92493 86959 50052 -17799 -80089 -76810 15781 135870 184456 135594 62343
41251 62343 35196 35713 4219 -63658 -118922 -139169 -151113 -172487 -181169 -156852 -114916 -78324
41239 -78324 -43461 5303 66145 121309 151583 137066 64726 -44985 -134910 -158528 -126429
41228 -126429 -89983 -82927 -92136 -81817 -33710 34740 82381 77306 28001 -20001 -27314 735
41216 735 27059 31549 32108 50323 70364 54007 -1031 -42069 -21850 36835 69167 57335 49579
41203 49579 76813 96616 57594 -15646 -53552 -37969 -11724 -2133 3083 2188 -29997 -79627
41191 -79627 -89227 -48703 -27016 -65273 -98387 -51005 34118 47911 -25617 -89563 -77747 -37521
41179 -37521 -45840 -110141 -186476 -240904 -252244 -199103 -93411 637 27392 4558 -10311 -3239
41167 -3239 -12897 -62120 -121388 -149036 -139020 -116402 -102616 -95542 -76551 -36084 2681 -3542
41155 -3542 -65354 -130016 -129498 -58928 19198 54307 61956 82573 113220 113092 67961 14493 -8599
41142 -8599 -8112 -16805 -41661 -56235 -43030 -19904 -13565 -23653 -31509 -35660 -53644 -84198 -92421
41129 -92421 -52487 6990 25234 -21266 -91649 -130315 -125833 -106706 -94152 -83799 -71099 -66938
41117 -66938 -75792 -78914 -59454 -32627 -27865 -46416 -62725 -68739 -85342 -116094 -121079 -67820 10214
41104 10214 44382 16110 -26954 -45214 -55696 -84035 -104571 -70295 11443 75425 74149 24247
41092 24247 -30225 -68684 -89553 -82034 -36337 22534 41923 -3367 -75644 -109451 -81546 -33293
41080 -33293 -14837 -16401 22386 127428 239770 278548 241473 202417 204809 203455 139786 36697
41068 36697 -29092 -32321 -24599 -51414 -91253 -96600 -60118 -12896 22005 48122 77196 109688
41056 109688 127789 102057 20571 -81175 -140403 -129615 -79318 -29024 13315 43949 34716
41045 34716 -25760 -87248 -85317 -25736 24409 26491 5777 -1927 10788 43454 93142 121324
41033 121324 68613 -64522 -192729 -236478 -204534 -154758 -112633 -73159 -48677 -55433 -67353
41022 -67353 -39236 26334 81340 98540 90120 64309 16641 -29464 -29471 14464 41455 16318 -16010
41009 -16010 4120 65011 103884 91024 52781 23700 14952 25093 45629 53767 31580 -704
40997 -704 2264 53717 113439 138396 135447 141045 157476 138914 52806 -65046 -142552 -154319
40985 -154319 -142589 -145945 -141793 -90598 -9940 44979 65298 96289 154345 195580 190361 170172
40973 170172 161170 127773 41373 -39653 -33319 46914 111909 121029 107189 85933 33875 -28153
40961 -28153 -30920 21332 16097 -114462 -279930 -348945 -319424 -281439 -257186 -187344 -63238
40950 -63238 34759 48674 9511 -28879 -49398 -42760 8244 81585 115065 88762 55023 55486
40938 55486 67912 72165 101669 172081 217363 170356 68246 3105 -6704 -21426 -72766 -127855
40926 -127855 -157449 -169210 -166504 -139226 -108349 -119058 -169977 -201368 -174042 -113116 -56562 -12130
40914 -12130 10712 -20628 -112929 -215904 -277683 -300371 -307108 -288976 -229750 -159937 -135603 -166018
40902 -166018 -199053 -182715 -119004 -55168 -35419 -59668 -83866 -68595 -25990 421 -1018 -1141
40890 -1141 11839 11043 -13717 -28373 -15599 -16566 -65800 -125500 -141818 -133030 -153927 -195199 -196408
40877 -196408 -154218 -136307 -172809 -210207 -203580 -185912 -200592 -221878 -199699 -143951 -102205 -76231
40865 -76231 -23772 60741 123260 118455 59642 -11850 -71161 -106768 -104497 -62308 -6987 26674
40853 26674 29740 20587 19066 28084 31662 2959 -70081 -150606 -163236 -72636 53304 100246
40841 100246 39081 -40177 -50875 -22233 -38982 -98414 -102566 -276 132639 189633 158886
40830 158886 107550 77192 50495 9222 -25761 -20720 32175 105425 148436 118020 20113 -84268
40818 -84268 -133706 -118840 -66415 4587 80207 126780 114328 60230 10265 -22149 -60070 -108034
40806 -108034 -135741 -124871 -94781 -70639 -59113 -65963 -103093 -161103 -201489 -192607 -136502 -56916
40794 -56916 15788 49558 34454 4653 39 2831 -41577 -129090 -175270 -119221 -5974 72226
40782 72226 84445 73127 84328 126536 183159 229167 241671 219664 187922 168158 161141 165590
40770 165590 185225 200937 173013 99717 38731 34455 56828 54460 35006 36299 41181 -9019
40758 -9019 -114887 -195985 -186935 -112696 -48697 -39309 -72444 -106690 -106979 -73271 -43694 -51514 -77124
40745 -77124 -66898 -3231 70860 103822 86362 41821 -7104 -45730 -60901 -46743 -12186 23581
40733 23581 38733 16416 -40821 -105529 -148510 -165986 -172774 -178569 -188828 -215247 -256697 -278625
40721 -278625 -246073 -175837 -121275 -103568 -94766 -74835 -64801 -86615 -125534 -154348 -165680 -156872
40709 -156872 -109707 -15082 96404 172720 181812 123839 20091 -93518 -177964 -215380 -214194
40698 -214194 -184292 -127208 -60172 -21155 -27436 -50910 -58171 -54749 -63766 -81790 -89270 -89100 -95935
40685 -95935 -94054 -48094 37020 102752 101435 52837 19131 35007 76139 92757 65830 26479
40673 26479 16461 33475 32575 -12852 -75432 -116107 -135495 -150843 -144155 -82764 12509 73827
40661 73827 75767 70482 106661 153702 144649 67998 -22323 -71227 -60436 111 73839 97574
40649 97574 29946 -88399 -160353 -132862 -42821 45713 110297 154256 163170 122741 64396 48056
40637 48056 93267 154136 168823 116293 22437 -71573 -140742 -186503 -219250 -230509 -196147 -117507
40625 -117507 -39827 -6126 -7095 -5167 5396 1349 -13793 -6731 22015 20158 -42659 -118935 -135012
40612 -135012 -76511 6856 62014 70050 42700 13638 19765 60442 86790 60925 11512 -5189
40600 -5189 13426 19918 -1029 -7687 23721 47072 6958 -76161 -123515 -93300 -22925 27248
40588 27248 41443 44143 50370 48283 29039 7894 3387 13423 29477 59684 112439 165785
40576 165785 184573 167196 142546 119916 84542 52645 76559 160611 217848 162881 22581
40565 22581 -94301 -118373 -64246 22307 101479 134856 108322 62912 46160 31670 -47526
40554 -47526 -176776 -247615 -200155 -107617 -68971 -76345 -54685 8502 50857 38861 12022 15323
40542 15323 43821 71994 94350 112374 111833 81585 40017 18234 20966 22491 3768 -21248
40530 -21248 -27505 -19378 -29060 -67548 -98208 -80965 -29564 5538 7361 10630 43016 82058 87082
40517 87082 46574 -24322 -106976 -176395 -198563 -162566 -107256 -91197 -136769 -214983 -276727 -289899
40505 -289899 -261024 -233555 -249183 -296158 -312486 -256600 -158161 -81717 -59173 -78238 -114546
40494 -114546 -143328 -134623 -75968 -568 37228 19754 -22009 -54871 -76530 -94867 -98045 -65711
40482 -65711 -3930 48857 59974 41937 40434 77350 121359 132166 119151 125286 158262 175598
40470 175598 145203 84722 28638 -8182 -19963 -2610 22299 16830 -13054 -8574 56322 123604
40458 123604 129561 93088 70986 63403 32821 -9587 -16468 6549 5996 -19809 -7410 64836
40446 64836 132017 136932 100151 55769 -13575 -117024 -186175 -144827 -24011 66349 74972 52922
40434 52922 55744 67639 49113 8403 -16647 -19696 -25403 -37658 -28612 13635 56916 61899 28980
40421 28980 -10390 -36510 -53311 -64995 -68431 -70604 -85271 -103038 -93921 -57119 -39194 -74049
40409 -74049 -127960 -142028 -115596 -103406 -130211 -153975 -131319 -84624 -75329 -125792 -191891 -210844
40397 -210844 -163647 -90070 -46463 -49364 -64424 -52681 -14327 25573 58856 95565 129203 130883
40385 130883 86127 18353 -30482 -29570 25979 105978 150379 113443 15448 -70731 -96439 -81656
40373 -81656 -71951 -74386 -58921 -11723 37370 44492 -509 -58583 -74570 -32631 21016 22228
40361 22228 -39297 -103344 -102649 -34691 40298 67646 50097 27313 17715 1135 -37222 -69848
40349 -69848 -59356 -17305 4465 -12645 -23609 17577 91286 133779 108667 35114 -39310 -72494
40337 -72494 -50444 863 38141 50739 67157 95068 88667 11583 -94101 -146241 -116165 -44252
40325 -44252 22805 65510 72421 37384 -18840 -60509 -75441 -77497 -78480 -83845 -100774 -118690 -101655
40312 -101655 -37731 26963 47085 44292 61790 81268 52118 -17675 -73874 -103076 -127719 -128898
40300 -128898 -68197 16709 42009 13984 25463 91267 106208 18339 -71993 -65121 -15792 -35794
40288 -35794 -115375 -147798 -89788 -1608 50481 54200 31472 22113 68102 160993 228557 218251
40276 218251 159511 101523 41642 -27718 -59711 -18654 40851 44153 9407 5346 29906 24616
40264 24616 -12354 -25251 -5252 -3417 -37050 -67492 -77293 -91793 -117082 -128928 -127000 -127846 -104479
40251 -104479 -13768 109677 171146 143799 100140 96894 107869 96716 77736 68927 54571 32771
40239 32771 36963 71480 85322 50819 13643 22717 60877 88398 108414 141773 174987 180796
40227 180796 163639 144143 119702 73680 6413 -66987 -131271 -167061 -155475 -102804 -40438
40216 -40438 7991 38474 49115 42305 37802 44477 29487 -35303 -110100 -134452 -125944 -151145
40204 -151145 -201792 -198417 -132237 -94282 -124451 -142105 -89919 -42356 -83417 -162145 -170865 -103664
40192 -103664 -35972 1457 24582 15177 -50664 -116869 -99378 -17689 23778 -13419 -61719 -65539
40180 -65539 -51667 -64815 -108428 -167830 -226734 -248772 -208556 -152413 -161143 -239041 -306069 -311918
40168 -311918 -285550 -255182 -199557 -111212 -32882 12198 60096 130609 176660 164013 141774
40157 141774 166418 202607 174783 87372 17519 2070 3407 -13429 -35072 -41052 -35619 -23388
40145 -23388 499 20199 3053 -45432 -70652 -40912 3182 5681 -23308 -23535 29843 96978
40133 96978 129427 118460 79600 26147 -20126 -21751 35861 110120 138740 110647 71872 60326
40121 60326 65483 61125 46410 34469 24054 7537 -7534 -8472 1715 15707 43223 93695
40109 93695 141495 137816 65886 -33645 -100778 -108562 -74647 -34381 -10756 -4363 -4566 -5914 -8873
40096 -8873 -6953 12251 45425 65828 49803 2604 -52309 -98971 -132285 -148455 -147764 -136794
40084 -136794 -114255 -68957 -8930 26338 10456 -27029 -35843 -15555 -13923 -55057 -109038 -142913
40072 -142913 -163723 -189453 -206699 -186244 -127074 -62753 -31142 -49598 -106301 -161209 -170068 -127840
40060 -127840 -81255 -81961 -134028 -201196 -251985 -273800 -253551 -182315 -88451 -32431 -43827 -82392
40048 -82392 -88312 -58639 -42938 -67760 -102503 -111139 -104545 -117352 -153903 -183200 -174644 -117475
40036 -117475 -21227 76147 116666 75150 -2176 -45019 -37819 -14612 13426 69390 143609 176620
40024 176620 137437 70255 29989 14638 -1489 -11026 1109 10550 -11497 -37930 -18016 40287
40012 40287 73912 47869 -11549 -63636 -87775 -73457 -24060 25448 38791 30017 40716 64497
40000 64497 49014 -14063 -59062 -35886 18075 33292 -652 -39230 -52137 -46870 -37355 -25688
39988 -25688 -10767 10038 42904 83636 113120 124786 140280 172526 188124 141795 46334 -26475
39976 -26475 -26055 20224 45258 19679 -26760 -51154 -43666 -26094 -20824 -31170 -44655 -45198 -25468
39963 -25468 2704 12059 -14923 -64389 -104448 -116186 -95527 -30981 86467 218761 280491
39952 280491 217220 71717 -55212 -102328 -84259 -43597 -611 46619 98383 141131 151832
39941 151832 118237 63020 34711 58003 105030 132811 131672 113058 70837 -6443 -93593 -139472
39929 -139472 -123406 -73363 -30825 -25405 -73958 -163598 -235597 -228987 -151738 -77029 -61753 -98261
39917 -98261 -147104 -178071 -171304 -119213 -44883 12425 42726 67109 89438 86489 57362 37929
39905 37929 45858 54418 46807 52222 90086 115531 69457 -36226 -129205 -165324 -167251 -173368 -181720
39892 -181720 -159541 -94891 -24479 -2572 -39863 -86160 -89758 -60094 -43388 -49673 -49060 -38281
39880 -38281 -54239 -103108 -129661 -91395 -22884 10152 -11534 -62650 -119050 -161449 -161480 -108732
39868 -108732 -36127 16864 49485 77534 91203 75438 51712 53548 71657 66532 28534 -15024
39856 -15024 -46636 -71494 -86225 -75991 -46682 -23829 -13598 3319 33869 60754 75989 94779
39844 94779 122297 133482 106282 59763 39609 69239 127190 174495 197490 214417 237112 241959
39832 241959 199227 121336 49913 -3964 -66113 -137100 -171733 -145916 -98263 -67623 -31290
39821 -31290 44992 130261 162635 140747 119132 122821 129034 130203 146084 159918 110358 -17521
39809 -17521 -141706 -167503 -98259 -28818 -42924 -138358 -238215 -257384 -172915 -48455 19262
39798 19262 -8802 -83875 -135022 -147198 -158469 -192560 -218755 -186362 -88098 24623 93678
39787 93678 110304 105419 94206 61297 7081 -28233 -13664 24275 33929 2635 -41967 -78785
39775 -78785 -106247 -120009 -116907 -117786 -148411 -194568 -209900 -175114 -121305 -88238 -84551 -94888
39763 -94888 -103921 -107400 -115761 -145604 -191304 -214300 -184317 -122258 -74759 -55646 -44688 -35253
39751 -35253 -43416 -70282 -93435 -99578 -92515 -70341 -33595 -14825 -51406 -118725 -139593 -82589
39739 -82589 -10110 -1302 -59898 -126119 -151875 -133766 -91700 -46705 -14330 -177 -1377 -13636
39727 -13636 -26918 -20671 12361 40146 21461 -33600 -68171 -54006 -26792 -30363 -60712 -87043
39715 -87043 -95462 -83968 -42717 25899 84578 92258 52539 8089 -7668 3869 20038 16929
39703 16929 -18402 -77084 -128113 -138236 -94914 -12449 76232 135715 150844 138381 127424 127944
39691 127944 126458 106007 57549 -18007 -99290 -145184 -129557 -69297 1449 69307 128236 152551
39679 152551 128097 94550 103967 145165 165582 162690 185553 238531 256953 202191 113405 35303
39667 35303 -37363 -104924 -122240 -68719 -2241 16947 7492 10497 1699 -62434 -146689 -172928
39655 -172928 -140246 -124920 -157553 -179375 -140886 -76606 -46825 -51445 -40780 11481 76594 104470
39643 104470 75329 22029 2249 41976 111485 162802 175036 151758 98864 30574 -22638
39632 -22638 -42015 -41143 -31578 10469 105892 218471 283003 280005 241291 188806 116454 36423
39620 36423 -5967 14901 68185 102571 99966 80645 70454 73037 66684 27837 -36330 -88300
39608 -88300 -102662 -91070 -70306 -31925 27941 75411 78903 66061 92079 157899 209123 216044
39596 216044 203569 193764 170763 123422 78776 64435 68476 63018 44579 28930 25210 33535
39584 33535 51019 65947 63939 51636 53289 70732 69491 22713 -49302 -100989 -107006 -70051
39572 -70051 -1631 81903 154188 193107 200865 197070 193321 185577 171501 164576 182336 218614 234910
39559 234910 194686 110761 40675 21511 28051 17415 -5332 -3647 18958 12840 -42198 -99772
39547 -99772 -109613 -83148 -64918 -62797 -43844 9675 74577 120320 143678 160745 177872 180067
39535 180067 146909 80508 17857 5370 52293 117028 151129 150439 148315 163629 177200 163904
39523 163904 125319 75216 12202 -65952 -130240 -139452 -99573 -69021 -82085 -96526 -51815 40667
39511 40667 108222 108223 62661 2423 -67887 -130971 -135155 -52571 70321 159539 193381 202821 210246
39498 210246 208273 195225 192452 212522 230984 206824 129130 35121 -26016 -47097 -64024 -93451
39486 -93451 -98559 -49670 10031 18028 -2015 36313 144900 228525 219327 165019 137033 126434
39474 126434 93759 54532 38065 15895 -45214 -103149 -100282 -66344 -70520 -102626 -100440 -71568
39462 -71568 -80866 -127436 -146312 -134907 -161481 -228829 -246483 -177684 -105509 -98937 -111279 -78307
39450 -78307 -31833 -36899 -80389 -101630 -88711 -73986 -69221 -66788 -74345 -94275 -98195 -69376 -38563
39437 -38563 -34512 -37576 -27835 -34122 -79240 -120299 -110117 -81485 -96492 -139333 -139851 -88978 -46300
39424 -46300 -31562 6074 87638 149001 130050 67980 51386 108788 187019 225869 212252 161309
39412 161309 85520 5892 -30425 16873 124148 209465 214366 159554 100096 53465 8229
39401 8229 -20762 -2279 50711 86776 89268 89097 92278 55139 -39401 -133209 -159267 -119212 -61513
39388 -61513 -17960 4708 2744 -19203 -43144 -62064 -83846 -96734 -69883 -7790 39392 43219
39376 43219 29216 20297 3723 -17188 -3994 41805 52500 -368 -40201 4323 83441 104723
39364 104723 75609 70395 92242 76546 16790 -22626 -26583 -60882 -157159 -250370 -268113 -219515
39352 -219515 -162201 -132020 -133968 -158300 -178195 -163862 -116505 -63215 -18214 17197 25113 -9738
39340 -9738 -53896 -52027 -4226 35018 38137 28363 16499 -21233 -81032 -107169 -63492 13249
39328 13249 60116 53774 10936 -38876 -62715 -44143 -11234 -8499 -30162 -26772 8426 16068
39316 16068 -36524 -90584 -67325 30018 125837 158875 125654 60033 2275 -26090 -38689 -60406
39304 -60406 -78087 -48140 28721 81325 52225 -22239 -57708 -29914 3217 -19234 -93595 -164327
39292 -164327 -181694 -143838 -92326 -64932 -53814 -26065 16132 29133 -3080 -27726 15580
39281 15580 111415 182365 180604 133063 91029 63878 23508 -36430 -74145 -50421 6977 24470
39269 24470 -20016 -57391 -20101 52511 55802 -38038 -137040 -144752 -70194 4235 25174 2399
39257 2399 -34243 -72273 -115021 -166747 -220062 -250076 -230256 -162812 -84286 -34715 -28513 -52769
39245 -52769 -78234 -75455 -42659 -17593 -37950 -90726 -128152 -131859 -125192 -118849 -89311 -29239
39233 -29239 23218 36203 33457 56324 98205 115267 93189 66334 65191 72574 50099 -1577
39221 -1577 -31350 -2 58907 72363 28422 3265 59087 153615 201397 196803 208494 261526
39209 261526 301357 287061 246940 213383 170282 107162 66414 81949 114463 106419 71385 69973
39197 69973 115458 160345 169663 155719 138780 120344 106275 117720 159198 199094 201181 164917
39185 164917 121846 98069 91076 83396 68959 55648 44639 25049 -2825 -18727 -14682 -17699
39173 -17699 -54367 -107323 -136743 -132198 -109438 -69604 -5345 59026 80976 56036 19655 -5793
39161 -5793 -22533 -22581 3355 24052 -1322 -44546 -31271 40984 82249 36148 -47602 -105447
39149 -105447 -148715 -204050 -234260 -193705 -116660 -74658 -73928 -62849 -21220 19773 32348 11869
39137 11869 -45170 -130010 -196367 -195343 -135986 -76085 -56100 -68944 -85503 -85810 -75274 -83555
39125 -83555 -126061 -159824 -119104 -11075 75715 85084 57739 46502 33861 -10391 -52865 -50417
39113 -50417 -28865 -30222 -27503 21223 72634 49875 -27956 -66468 -36062 4938 25045 58743
39101 58743 118616 162198 171647 183459 208563 199033 131226 56085 26537 28686 21631 -2559
39089 -2559 -32704 -67571 -96476 -88516 -34096 31661 71437 86108 98760 128797 191068 282666
39077 282666 357940 356186 270750 157234 64504 -3218 -50343 -68311 -67860 -83322 -120606 -145111
39065 -145111 -143655 -149946 -179655 -190043 -144897 -77695 -42147 -31376 1173 57833 86142 52460
39053 52460 -13758 -58257 -59224 -36517 -19166 -14695 -8855 9258 29622 34751 23169 8304 477
39040 477 1882 10127 12520 -10460 -57617 -96847 -102473 -84191 -55626 -2549 78064 134337 112045
39027 112045 40308 5769 40966 95183 121847 134558 157466 174218 157380 112978 70004
39016 70004 50496 63503 102511 140449 153396 150891 154483 154195 126366 86778 75778 92426
39004 92426 96881 78927 66876 65859 50428 24531 18995 17952 -33113 -122245 -157858 -101616
38992 -101616 -34706 -36434 -68914 -50411 16554 67343 81601 88375 91758 66090 14341 -29197
38980 -29197 -47031 -42128 -9496 46507 82791 59928 7077 -5004 45910 112620 145882 143041
38968 143041 127297 111912 91383 49645 -20243 -93270 -125279 -102628 -56186 -11589 39136
38957 39136 93207 109718 69671 24039 26757 49191 23359 -49094 -98432 -90520 -61514 -44030
38945 -44030 -26071 -4816 -20982 -99424 -192289 -223117 -172800 -92456 -39761 -27147 -32396 -39427
38933 -39427 -53321 -76634 -89275 -73519 -54613 -84175 -168303 -239813 -227296 -134031 -25102
38922 -25102 44988 64976 47034 11744 -14018 -17129 -14316 -23736 -30733 -13975 4442 -20753
38910 -20753 -83141 -113777 -64181 33288 110972 143743 152769 154405 144795 128725 122457 117972 81516
38897 81516 11682 -31926 2452 77476 102430 49905 -14603 -31957 -19948 -11183 20803 109039
38885 109039 202421 205683 105047 -13324 -75233 -86598 -79384 -54079 -5217 44322 68359
38874 68359 66481 46705 8671 -38836 -71998 -77066 -56897 -11732 52055 97940 92519 65807
38862 65807 83887 152071 203375 197946 171413 161699 153195 128583 115731 139753 177325 197423
38850 197423 199871 179326 108554 2255 -59675 -28595 40519 69628 65437 84549 129602 149163
38838 149163 118759 60901 284 -48203 -61812 -29185 22796 58392 74012 81413 77459 62408
38826 62408 55565 58503 41274 4030 7017 87350 186586 220649 189736 158885 157983 164529 165478
38813 165478 172992 187142 194000 193696 191936 179289 153232 136391 137939 127686 85392 39727 19650
38800 19650 10531 1848 25771 91551 134473 100059 34042 14014 32363 27228 -5205 -14447
38788 -14447 13829 53630 103058 170315 213208 176878 84313 15074 2649 19921 47668 82327
38776 82327 92118 45159 -25652 -55540 -34009 5581 56493 122653 159661 120763 45690 16235
38764 16235 36071 40993 14542 1976 18550 35827 53576 95254 137734 135620 108889 115639
38752 115639 147359 147405 123376 137230 188698 215033 204977 205214 216105 195195 163365 185318
38740 185318 240594 243004 195598 185643 210794 169090 60206 29326 139225 255043 252053
38729 252053 199642 223803 301676 320257 256783 179437 127151 94593 90137 117088 137227 127661
38717 127661 127336 158133 156665 66422 -48449 -67292 34698 166812 234552 217317 158018
38706 158018 120703 138039 173768 166514 120847 101816 128989 150755 146774 169406 242643 305455
38694 305455 308126 285219 276768 256107 199089 150112 150696 168919 164871 159841 174996 169137 108752
38681 108752 38566 13217 18323 25343 59342 137312 199025 179547 105370 51473 48910 89981
38669 89981 163963 227419 208242 109744 42157 73850 120471 68908 -52391 -123319 -101533
38658 -101533 -45143 -3482 23099 38689 43366 49511 53324 25822 -22521 -23560 50196 131957
38646 131957 159434 153803 142884 97560 22406 11581 111613 215579 208665 140799 131020 172902
38634 172902 173395 128440 112949 130971 118540 77259 73282 113847 144963 160580 198558 241414
38622 241414 238090 214468 244748 317635 346595 312939 285727 295941 302103 288801 289548 296870
38610 296870 254994 164963 102699 107815 138078 154742 172719 203658 222250 213644 196977 188261
38598 188261 189286 211315 256647 286563 265461 223894 218391 245574 258225 247238 242835 253763
38586 253763 268639 295061 334528 345665 296630 224590 182095 163563 147811 161346 223465
38575 223465 283213 296884 314421 397228 505457 564740 586422 614349 613688 536257 443147 429133
38563 429133 467025 460913 414380 404266 420111 379201 283881 220086 211307 210919 221754 279112
38551 279112 331342 291902 204773 201095 288531 344253 330693 352021 459556 556070 548933 470061
38539 470061 391740 335688 310777 337532 392192 412403 385298 352973 328211 292712 271548
38528 271548 310592 386582 436568 461288 500441 534116 519222 489386 498850 507432 452194 388494
38516 388494 415071 503445 554627 574457 624481 656526 593212 526181 614245 808647 906095
38505 906095 866810 852516 951780 1105639 1309648 1628438 1971855 2115235 2010070 1844523
38495 1844523 1738151 1612842 1428496 1297127 1272098 1254969 1207055 1235420 1378123 1520494
38485 1520494 1613599 1759595 1997003 2228855 2452687 2826526 3410528 4082542 4800834 5672698
38475 5672698 6623980 7274994 7335070 6908417 6254625 5477536 4622598 3844332 3255517 2779222
38465 2779222 2332117 1990556 1816757 1699087 1528569 1364213 1274467 1193980 1082668 1037560
38455 1037560 1097986 1131870 1063249 1015267 1081194 1159258 1159997 1158995 1195463 1154580 1010902 942543
38443 942543 1028149 1083274 985563 898505 962134 1028339 939865 817884 822121 866512 828107
38432 828107 804250 902569 1000575 969781 915468 947710 954335 854704 824455 995386 1184630
38421 1184630 1200926 1163043 1232202 1303151 1262927 1272711 1466264 1648149 1629116 1577278 1686173
38410 1686173 1790512 1689266 1555878 1627429 1772186 1774353 1757894 1904383 2046128 1980488
38400 1980488 1888798 1991045 2101432 2003996 1935757 2180436 2515099 2603082 2599042 2796969
38390 2796969 3032609 3043438 3057991 3377601 3743424 3810016 3862941 4321216 4919762 5188340
38380 5188340 5343895 5845938 6477174 6803410 7133302 8005766 9134764 9948182 10742856
38371 10742856 12130262 13811509 15219431 16876683 19636503 23105880 26516806 30622250
38363 30622250 36796875 44854615 54049549 65601775 81512062 101864709 127278234
38356 127278234 162876195 212431341 265385198 296577600 286635685 241418641 186188403
38349 186188403 141849473 111794938 89845465 72368842 59361662 49765336 41455178
38342 41455178 34181359 28921690 25240230 21783207 18507148 16255993 14808289 13200748
38334 13200748 11438389 10243485 9546497 8674039 7658166 7048742 6743786 6195034 5494158
38325 5494158 5158296 5083970 4735071 4154937 3836969 3776508 3547113 3156015 2977605 2974204
38315 2974204 2779331 2437874 2315055 2375854 2262320 1985824 1864743 1870960 1698045 1397462
38305 1397462 1308664 1420389 1410347 1261277 1246646 1355109 1308962 1121777 1078663 1182594
38295 1182594 1157321 985320 921499 982980 936383 787814 779290 889766 840592 624545 539703
38284 539703 650331 689320 563725 500576 601346 678543 635419 613400 663675 643526 533926
38273 533926 508504 598004 622246 534855 504863 579370 592946 493864 442348 500105 527687
38262 527687 471282 452493 494219 453716 310639 231975 267112 263344 170035 143103 250324
38251 250324 343193 323016 281825 286702 270650 222722 240179 310392 288898 172902 142203
38240 142203 246400 314711 269554 258205 356992 412894 322282 219669 230864 261822 197838
38229 197838 111719 105087 118386 65183 6450 36802 122797 186116 232620 288488 320623 314293
38217 314293 321092 359903 387379 414957 515469 672844 789642 887283 1104419 1424877 1609749
38206 1609749 1505308 1237897 996699 804494 625047 517673 529241 568222 532575 456815
38196 456815 414310 382197 314193 242980 206509 170111 109865 72009 72437 46865 -26614 -72160
38184 -72160 -51599 -30055 -40512 -20410 45643 67822 16487 -7226 43846 65236 -9205 -77951
38172 -77951 -49112 6822 8453 15552 87152 132191 63400 -23201 8289 110841 139856 78554
38160 78554 21108 863 -16924 -30849 -25452 -39182 -89679 -98069 -7890 92120 88968 19590
38148 19590 -2427 34220 64128 84741 131156 162444 111365 12366 -44457 -53930 -76469 -117003
38136 -117003 -136717 -146208 -172101 -168154 -76461 52934 115625 98295 65218 34283 -18856 -61574
38124 -61574 -32801 37293 49759 -15588 -71415 -50208 20017 74232 79864 47910 25112 60144
38112 60144 134599 161954 102048 25949 7621 10673 -39664 -127869 -181934 -191283 -197651 -203770
38100 -203770 -183543 -154479 -150192 -143798 -82721 21812 117946 199065 286693 355263 359270 316660
38088 316660 284798 269444 233367 179277 149017 150102 149174 129836 103251 77437 61774 75217
38076 75217 108496 117806 96738 98190 136891 143433 82631 39271 96839 201156 245155 225832
38064 225832 207222 186305 120101 42611 24136 41165 15100 -36983 -21129 66506 118316
38053 118316 73805 -14625 -91842 -165893 -234140 -242489 -164482 -54865 10091 1445 -60834 -127180
38041 -127180 -142778 -101431 -61187 -58441 -41312 44765 146971 171593 130227 116898 155332
38030 155332 176489 147542 118203 125752 147877 165667 186566 189527 133331 39978 -9718 13222
38018 13222 49994 47148 18202 -4332 -12617 -1647 36047 77755 85314 60787 37796 19024
38006 19024 -22975 -87147 -142204 -175857 -190532 -167262 -97451 -29557 -11171 -4991 56851 154094
37994 154094 204136 193385 186022 204956 202360 155609 99717 54772 9120 -19812 -603 29780
37982 29780 -3237 -85794 -119771 -70980 -11935 7402 26402 73735 101326 70679 21882 3570
37970 3570 3189 -7732 -22926 -35939 -64976 -108718 -133709 -130240 -121575 -104141 -52233 2918 -12846
37957 -12846 -94508 -139885 -96139 -39616 -58111 -129613 -175547 -169191 -132272 -78106 -16225 24933
37945 24933 25489 -3412 -44167 -79712 -70370 13625 123528 167413 133821 104178 118595 115824
37933 115824 46200 -40688 -76611 -72589 -78294 -100992 -118384 -123432 -111742 -70718 -17571 498
37921 498 -25827 -52116 -56030 -68680 -107173 -142978 -161284 -178806 -179897 -120370 -24976 13695
37909 13695 -24114 -43399 14276 77924 71342 29866 10653 -19779 -108025 -199044 -206224 -143343
37897 -143343 -88157 -58745 -19648 27416 50774 58159 77500 95481 88546 82776 107317 119618
37885 119618 56905 -59302 -143757 -156086 -124594 -80794 -33484 4841 19327 12338 -7797
37874 -7797 -29698 -12066 85866 211967 236319 118593 -15442 -39481 6628 7139 -45243 -71130
37862 -71130 -58608 -66471 -96114 -84774 -27583 2534 -30172 -79976 -102719 -102903 -86020 -37710
37850 -37710 33233 89130 109845 100129 60913 4148 -22429 14626 76049 99801 86911 76017
37838 76017 63051 22248 -17936 -3941 51839 87973 88265 83050 76586 56748 55163 102562 140851
37825 140851 85204 -31330 -85379 -41402 9933 8289 1526 29596 41122 -14032 -94474 -131885
37813 -131885 -122063 -100942 -87139 -90451 -119751 -142990 -98535 11695 97518 93965 47634 43239
37801 43239 89908 128513 115916 58051 -13110 -61036 -67760 -58704 -76171 -114357 -120469 -74853
37789 -74853 -19977 12880 50873 118182 178274 185375 157095 145150 155577 145252 90652 23437
37777 23437 -6656 14216 52271 65786 53783 49209 55279 21970 -79437 -189467 -223073 -181222
37765 -181222 -138526 -130841 -126114 -107611 -108560 -144109 -175779 -168967 -128999 -61670 38802 138638
37753 138638 167441 107342 23288 -27757 -60521 -99747 -116231 -74798 -1256 47538 50077 23252
37741 23252 -6324 -6964 40073 98079 95000 17392 -59948 -67878 -18535 41185 93142 125401
37729 125401 106987 39094 -18043 -22869 -10147 -18467 -13823 47398 125386 144442 103786 67044
37717 67044 63959 73746 86495 107725 115129 84509 51965 76392 139873 159565 108140 49437
37705 49437 33270 23612 -31518 -111614 -150023 -118226 -47431 13711 34385 11344 -29232 -47087
37693 -47087 -25502 8227 12221 -21136 -55661 -55502 -33771 -41219 -93932 -130156 -75787 47557
37681 47557 127349 94758 10888 -17407 30384 89622 114487 117709 115229 95594 57496 27057
37669 27057 15783 -2553 -52460 -121074 -177167 -200943 -184121 -131086 -76906 -72100 -120711 -156881
37657 -156881 -119384 -39082 -13107 -86149 -191793 -231904 -189131 -128090 -97348 -76802 -37328
37646 -37328 -7582 -34784 -97916 -116462 -54643 30492 67440 56883 47095 54194 52221 30798
37634 30798 17553 36143 73647 101838 108989 97202 64693 9939 -49977 -82658 -72841 -46282
37622 -46282 -46726 -84585 -123020 -126327 -106208 -98279 -105115 -94701 -53788 -7730 21928 46999 81587
37609 81587 106763 90160 29698 -38458 -70834 -53637 -21397 -35013 -117643 -212966 -237444 -178703
37597 -178703 -108398 -89178 -108964 -126160 -138182 -169756 -220716 -263595 -280002 -270032 -235936 -182315
37585 -182315 -127422 -96304 -104435 -149373 -202858 -214034 -154104 -66637 -35286 -82640 -138159 -130750
37573 -130750 -76066 -41172 -58204 -110775 -174850 -229027 -246091 -218187 -177037 -153263 -132184
37562 -132184 -86630 -35542 -26596 -69361 -125098 -158419 -165242 -154002 -129732 -94797 -45423 21073
37550 21073 78633 78192 10077 -66054 -89950 -74510 -71494 -91442 -106598 -108643 -106175 -84048 -30241
37537 -30241 7912 -33450 -132393 -191919 -166556 -111263 -84255 -71050 -41646 -19317 -36791 -66318
37525 -66318 -54004 -3899 24652 -3267 -63146 -113863 -137839 -132310 -92472 -22149 52073 94790
37513 94790 92585 66196 49077 54895 70100 77131 74470 69586 64616 59295 57972 62940 70712 83515
37499 83515 108097 130864 117767 63931 22860 50267 127858 179648 163650 113197 81448 76154
37487 76154 63710 18497 -46351 -91355 -90524 -60242 -38913 -34100 -11869 47865 113921 147359
37475 147359 153238 153116 135757 86761 45402 66233 127421 144555 86857 14363 -22499 -53073
37463 -53073 -112807 -156045 -109406 10281 95128 69372 -28603 -101483 -104087 -80686 -99675 -167629
37451 -167629 -220553 -202184 -134173 -89050 -103586 -148932 -186202 -213531 -240353 -248090 -210786 -141942
37439 -141942 -88853 -79403 -95367 -99287 -68343 -25 89839 158856 150845 52086 -67189 -105734
37427 -105734 -41974 40989 64725 50498 59595 76945 34169 -58778 -98793 -36797 42153 37177
37415 37177 -37185 -98765 -117927 -117978 -103859 -72400 -60131 -96403 -131028 -93471 -8928 31960
37403 31960 10653 -4982 13896 16051 -23848 -51766 -25571 19036 38411 49103 78324 103200
37391 103200 88751 43811 -75 -25929 -18220 40482 128649 189760 207197 222475 248372 229484
37379 229484 137834 44443 29533 69541 83933 56657 35681 37715 33935 24069 48880 115492
37367 115492 169135 162094 112491 73880 70083 75596 50282 -10684 -58781 -36388 52479 134671
37355 134671 145188 92509 33614 10594 32442 91141 164920 222346 248222 252111 237994 191569
37343 191569 114883 41817 -3681 -32602 -51989 -42365 -5601 10047 -21425 -50446 -22820 28967
37331 28967 29828 -23748 -62436 -50225 -25017 -26377 -42657 -49038 -51735 -69054 -95621 -103790 -68192
37318 -68192 10375 89005 102556 28699 -73585 -119393 -85178 -13724 53172 106688 142761
37307 142761 149087 131673 121303 139787 178421 213135 224254 205482 171496 147880 135642 103335
37295 103335 38901 -15090 -15271 15578 22757 4790 8712 46047 73067 62051 36800 22314
37283 22314 10019 -6437 -6963 17588 41367 42158 33121 36006 54236 88960 143012 186961 165558
37270 165558 74136 -9225 -13055 35045 56035 37468 40707 91674 130963 100048 27188 -15999
37258 -15999 -15009 -19807 -59373 -98751 -96456 -66080 -50196 -55259 -48972 -15512 22375 41509 47398
37245 47398 53017 55251 50667 53315 73810 94074 86481 52412 21637 14195 18305 8622 -22716
37232 -22716 -56448 -64914 -38428 11409 73696 145192 202460 193524 96242 -26246 -76689 -35052
37220 -35052 26517 47132 41863 44131 43074 19598 -2111 9551 37326 44090 35286 45577 80125
37207 80125 112076 125172 121811 104010 80869 76634 97519 113067 103954 95989 103243 76665 -25366
37194 -25366 -141899 -162087 -68625 41384 82337 60927 23154 -10347 -30019 -13272 49791
37183 49791 134812 204214 225179 169084 38287 -97099 -136790 -49982 90045 184259 194527
37172 194527 147531 88730 48246 26910 3050 -33239 -58650 -51836 -34917 -42888 -63868 -55988
37160 -55988 -18446 3932 -12070 -45868 -82141 -130947 -188219 -223561 -221147 -193609 -150744 -99234
37148 -99234 -74071 -112117 -182476 -202577 -144515 -69470 -31945 -8401 42460 101986 124916 117058
37136 117058 129982 191505 275300 331934 331069 282977 227872 192173 158865 104075 51421 48054
37124 48054 90031 122262 119815 116726 138407 157205 140390 99569 66038 51566 55375 78483
37112 78483 112481 139817 153163 148809 108051 24866 -58503 -94945 -100517 -118162 -128003 -75374
37100 -75374 15098 49678 6006 -32708 -10740 30920 55036 94874 164754 199464 153047 78961
37088 78961 44308 37848 27953 36723 88539 155725 216515 290465 364193 382644 375349 466657
37076 466657 682960 910646 1167016 1707345 2616074 3433647 3524567 2816795 1887729 1274872
37066 1274872 982675 758253 548494 461227 470210 426787 301562 207224 197425 202223 164593
37055 164593 114110 92070 98442 123064 156085 167151 137553 104356 113381 146472 158668 162471
37043 162471 197878 238515 218497 149545 117037 146347 166674 136211 111118 143705 198423
37032 198423 232632 281250 377424 458712 461151 458449 579854 819808 1090645 1468122 2162124
37021 2162124 3112401 3794242 3670451 2803969 1816629 1224969 1004164 846084 621370
37012 621370 428258 332642 275341 210389 169528 170608 176913 169333 169355 171869 134663 55557 -9641
36999 -9641 -28151 -28825 -40171 -46031 -24891 14510 55139 86944 90130 50052 -1061 -7317 32387
36986 32387 58885 40206 10947 3540 -3061 -30296 -43526 3260 93874 166833 194653 208900
36974 208900 245134 289553 293966 238151 163007 125865 126327 105911 31749 -56605 -109433 -134868
36962 -134868 -161656 -171713 -130918 -64320 -33692 -49118 -66919 -70950 -89090 -124211 -133614 -91941
36950 -91941 -21923 47850 106932 141364 140861 130121 138766 142043 92998 9936 -41354 -53804
36938 -53804 -83021 -132667 -129210 -44339 45043 66690 47123 43770 51462 35024 -1203 -34131
36926 -34131 -66242 -98948 -105285 -74656 -41915 -31657 -19558 15444 56190 102215 192313 320516
36914 320516 398424 368371 293485 261634 256878 211049 134617 98868 115302 128186 116376 115651
36902 115651 139016 149835 121354 64242 -4736 -68193 -91193 -56418 -7990 -3049 -30323 -37116
36890 -37116 -23082 -34069 -66575 -58821 7976 72775 86152 76943 94228 132723 152714 137775
36878 137775 98494 45734 -8742 -43122 -44165 -27502 -22689 -41448 -67524 -74306 -51197 -15070
36866 -15070 7748 8834 -5960 -41585 -103460 -157199 -142323 -51049 44028 72676 45619 20876
36854 20876 29245 69767 138230 211104 235897 192352 135884 127136 147477 141900 114763 114080 144204
36841 144204 169260 189091 234008 288402 296054 245883 183323 133390 82604 40402 40653 66539
36829 66539 47731 -43692 -156959 -239094 -282319 -279890 -211197 -101882 -28235 -23014 -37276 -29162
36817 -29162 -24341 -48091 -66892 -52202 -40554 -66743 -89738 -56021 3744 16735 -19111 -38666
36805 -38666 -14400 12050 4464 -22277 -41852 -53791 -66162 -76164 -81005 -82636 -74490 -46875
36793 -46875 -10912 5152 -8433 -26770 -17377 24091 66751 69415 18155 -55903 -103475 -103889
36781 -103889 -73533 -30493 22807 74132 90911 58192 4054 -37022 -64364 -87041 -82779 -22873
36769 -22873 69832 131488 133182 110772 104722 102078 64937 -2355 -48799 -41675 -9845 -8100 -52355
36756 -52355 -106651 -126713 -97686 -32302 43544 96696 102933 74456 54999 71158 103090 117772
36744 117772 109845 86566 34978 -59101 -168371 -236498 -235067 -183778 -118974 -68379 -49695 -61948
36732 -61948 -78996 -78670 -73672 -86260 -103664 -95406 -65318 -42096 -23857 15913 64597 70605 24362
36719 24362 -15003 -1547 35034 41931 19765 10378 37761 96333 173285 246222 275912 237380
36707 237380 153182 72850 25574 8029 5097 3640 -4215 -14964 -17210 -9346 -2087 3124 21518
36694 21518 58978 89402 67716 -35313 -201181 -353776 -400838 -317975 -182166 -87970 -43233
36683 -43233 7970 74172 96758 48914 -17504 -52960 -75308 -114573 -148947 -146285 -125536 -121645
36671 -121645 -120857 -86524 -28913 3490 -7642 -34675 -49378 -46063 -25268 10728 48238 75686
36659 75686 103366 145680 187631 191097 135318 40603 -44270 -76683 -57672 -36089 -53465 -86376
36647 -86376 -77615 -26135 1467 -35843 -98498 -130212 -129377 -123342 -115443 -96286 -69434 -30013 38936
36634 38936 109538 101781 -8194 -119873 -123931 -54589 -42315 -126979 -206225 -183378 -89981 -27151
36622 -27151 -38289 -80960 -97763 -80110 -66160 -90225 -138281 -162333 -142456 -112847 -110799 -125817
36610 -125817 -126078 -111227 -103756 -105363 -99397 -86494 -83573 -93066 -99920 -91351 -59228 977 71750
36597 71750 114847 115408 103014 106759 117728 118380 111172 90713 36608 -26215 -16875 90738 196703
36584 196703 190132 97279 32498 32687 34973 4105 -19360 -7385 9515 7558 6821 18245 16729
36571 16729 -9168 -34482 -43106 -47801 -55038 -57802 -65199 -86399 -90022 -43329 13607 9421 -41614
36558 -41614 -51109 2204 37142 6358 -25813 8567 76959 110197 101549 77313 26554 -68652
36546 -68652 -171124 -220921 -206321 -157724 -100602 -54820 -45110 -67673 -78412 -56732 -47700 -95414
36534 -95414 -165254 -182074 -126340 -49708 -8442 -12369 -25089 4896 90155 169406 164606 86261
36522 86261 29030 40162 57778 20400 -31799 -28943 13635 31749 23974 42154 90300 114063
36510 114063 88616 49515 32498 37653 55181 76939 79980 42212 -23447 -84202 -127940 -154725
36498 -154725 -147072 -95295 -38583 -30849 -72996 -123771 -165288 -207598 -241035 -242743 -225881 -221872
36486 -221872 -212854 -146673 -32162 43275 18056 -70820 -146493 -178963 -180995 -157120 -101719 -31998
36474 -31998 15840 27011 26751 52929 112976 169598 175960 127952 67793 29736 6745 -12866
36462 -12866 -9275 32012 73090 61501 2663 -52954 -86316 -121168 -159993 -165739 -122955 -70204
36450 -70204 -49670 -58408 -66469 -53291 -14131 38859 71664 55904 9406 -24371 -42180 -82448
36438 -82448 -149264 -185709 -151440 -84742 -52425 -70821 -111064 -152261 -188905 -206230 -188804 -144416
36426 -144416 -90197 -28137 37744 76998 60992 6893 -38400 -51312 -39665 -9592 37303
36415 37303 77808 79789 47881 19671 6284 -25359 -92698 -156539 -170220 -143609 -122720 -122576
36403 -122576 -119460 -103496 -98287 -121549 -160349 -197490 -231745 -254701 -236388 -161019 -59921 16157
36391 16157 46109 41986 23475 14748 44990 113009 163434 142096 71933 28438 37270 46507
36379 46507 13086 -37017 -62662 -72219 -91883 -105617 -77272 -13591 41624 66839 75635 77485
36367 77485 67468 55415 65421 96477 114976 99599 69580 53886 50670 34315 -6535 -53370
36355 -53370 -79160 -73860 -42984 10396 83971 151647 164764 102770 9057 -53923 -74905 -83490
36343 -83490 -82283 -45019 13685 31423 -13566 -66090 -82868 -101421 -170421 -261146 -311045 -318373
36331 -318373 -324720 -328803 -291889 -220284 -171537 -172939 -193188 -203579 -212255 -223041 -209083 -150634
36319 -150634 -67966 -848 23498 -224 -51837 -90461 -88303 -60154 -40563 -41522 -53165 -67193
36307 -67193 -72055 -48505 -3991 15612 -10156 -30943 4923 65285 80073 46696 19803 17540
36295 17540 17860 33933 101275 186010 198020 116076 19227 -28065 -43091 -53796 -44118 -7215
36283 -7215 22022 29162 46933 79705 70193 -11452 -107855 -152205 -149268 -134092 -109448 -73509
36271 -73509 -52096 -50781 -28474 29800 68983 46941 5401 -676 10737 -2706 -27384 -33077
36259 -33077 -42104 -80152 -101436 -48163 46761 100657 100472 99125 113660 113449 99786 112505 155998
36246 155998 193429 216966 252614 291089 284445 223623 157782 122973 103846 74513 27996 -39453
36234 -39453 -124309 -192890 -208796 -182487 -150164 -115618 -66174 -29576 -45536 -86999 -84578 -33357
36222 -33357 -866 -18686 -41904 -34358 -18570 -13316 6539 50905 78104 59197 26766 20356
36210 20356 28873 23208 3812 -16561 -36267 -43050 -14997 27760 23693 -40102 -87707 -49291
36198 -49291 44951 110913 113135 76167 30767 -87 8228 51658 78601 51266 8745 20145
36186 20145 87167 141418 134122 86347 49177 47478 65435 64505 18367 -52719 -92356 -68270
36174 -68270 -6173 50354 87229 107496 105967 88109 81991 93645 83095 30298 -9346 23231
36162 23231 88176 89854 15585 -46191 -36817 739 10562 12809 51171 101972 102573 50927 16303
36149 16303 47619 115274 157057 150944 123225 101563 83267 52796 16082 376 15204 28414
36137 28414 -455 -66949 -122667 -133433 -117151 -114217 -136413 -158878 -152770 -113569 -63832 -36818
36125 -36818 -48567 -76872 -78785 -41891 -6879 -19944 -69857 -97580 -71257 -26479 -18691 -54863
36113 -54863 -92671 -96638 -71787 -43116 -24347 -14817 -10915 -8074 526 16798 32771 38234 28365
36100 28365 487 -46362 -98878 -124172 -92113 -7138 87066 138079 124889 76136 48108 73290
36088 73290 128421 165505 173691 187087 222989 242704 200577 112132 39185 15021 17916 18511
36076 18511 20190 41684 82302 116799 114295 62541 -12118 -54781 -35472 9181 13890 -34976
36064 -34976 -85795 -92137 -63946 -37348 -26442 -25082 -29194 -32255 -18352 15137 42050 37598 12409
36051 12409 -5723 -13853 -32603 -66334 -88815 -75185 -34214 -354 2496 -15300 -24024 -12779
36039 -12779 -2948 -14344 -31691 -29484 -23813 -62201 -148834 -213391 -183348 -71335 36775 75165
36027 75165 57925 46025 71151 101244 83153 16880 -30308 -4614 51871 38323 -77665
36016 -77665 -207749 -238990 -154861 -38623 18603 -10442 -83274 -122959 -78707 17724 71369
36005 71369 29605 -47206 -54183 31812 132317 167156 133906 84788 62301 70818 84421 68734
35993 68734 13880 -45708 -63732 -41979 -35238 -81501 -146350 -160568 -107092 -46300 -45955 -102805
35981 -102805 -154298 -163383 -160592 -185318 -216780 -206393 -165258 -162000 -221463 -280649 -275495 -224251
35969 -224251 -184082 -166193 -145429 -120977 -106332 -80485 -16640 48860 46726 -19637 -65878 -41923
35957 -41923 6602 17220 -9660 -45634 -91489 -147955 -174085 -137500 -80049 -68973 -93754 -77224
35945 -77224 4260 75278 64536 4860 -15189 25971 61005 36138 -11158 -5376 60990 115383
35933 115383 100845 45820 14990 15994 -5619 -81317 -168040 -197993 -155092 -81122 -21921 8577
35921 8577 17316 10417 -8867 -32118 -45873 -40933 -21068 -2405 -842 -16380 -29998 -18521 24358
35908 24358 78325 108495 94407 50718 12173 -6558 -26050 -67705 -114732 -124838 -79949 -8491
35896 -8491 43075 49968 21244 -15351 -38054 -47049 -54716 -58859 -40760 -1687 18954 -9986 -58410
35883 -58410 -64500 -18336 19860 -3784 -72406 -125493 -124374 -74782 -9858 28791 15765 -28495
35871 -28495 -50584 -29210 -7579 -32992 -84007 -96888 -54518 -3378 22023 44592 92928 142582
35859 142582 144862 94143 31348 -8392 -16280 14727 89851 176213 209503 167423 107836 97770
35847 97770 126359 133955 114189 124789 183440 215046 146775 16127 -69427 -61248 -5006 43457
35835 43457 77717 103651 99109 49289 -8344 -18078 21703 53750 34676 -10862 -21009 30155
35823 30155 104841 145504 133374 96046 67385 57071 59089 70457 91917 122709 161822 201657
35811 201657 218273 192221 148719 146009 200573 251906 233190 153912 76420 32864 11029 6191
35799 6191 30759 71699 90815 78182 61535 52250 25814 -29252 -84200 -109980 -109574 -96122
35787 -96122 -75028 -61753 -78181 -113279 -123828 -90561 -37166 16247 70388 105149 84039 29531
35775 29531 27161 106503 179410 158960 85956 60871 91360 96322 41631 -17764 -30234 -1045
35763 -1045 53382 125913 174718 134724 10947 -95331 -94887 -9186 68034 73153 11530 -69245
35751 -69245 -113548 -92197 -31432 11326 17727 28747 76681 127502 119786 41822 -56047 -113658
35739 -113658 -107749 -59204 -8504 24542 58200 109234 144605 112129 23327 -42550 -36164 6968
35727 6968 34704 49286 68144 63886 7521 -58340 -60605 -848 46226 40700 20623 25495 37298
35714 37298 24529 -4071 -24198 -39240 -65036 -97151 -124314 -153875 -194702 -231156 -240785 -224038
35702 -224038 -193559 -151088 -100510 -64919 -58266 -55081 -25342 11802 12066 -20966 -36701 -18746
35690 -18746 -11713 -42548 -65067 -26056 48267 84818 65618 43261 56232 79851 74807 43768
35678 43768 19254 23949 60468 114232 149373 129175 62870 8029 2185 16325 6780 -10280
35666 -10280 19815 102917 175746 179716 118667 34018 -40806 -84449 -81705 -43548 -11663 -13021
35654 -13021 -23274 -2750 43365 72551 65500 42273 15753 -30033 -96778 -142600 -128700 -75038
35642 -75038 -35087 -26802 -23845 -8385 8508 22060 45316 70833 64555 24866 6359 43370
35630 43370 83126 50490 -38011 -86334 -46017 27353 59624 47522 35954 47503 67516 73145
35618 73145 51019 7503 -20895 5323 72791 117600 104010 65876 45866 36926 22441 30740
35606 30740 91710 166066 180639 124157 53514 12893 349 6578 25431 24112 -33726 -121724
35594 -121724 -166071 -145485 -118689 -127921 -135358 -96143 -41371 -30464 -53874 -47270 5524 40547
35582 40547 -2033 -97865 -163712 -148791 -84709 -43439 -54414 -79022 -73721 -52723 -55425 -69084
35570 -69084 -38583 39530 90441 59568 -7487 -25594 20821 75703 98900 107161 130194 164917
35558 164917 182346 160284 106096 55433 39270 46039 36748 5735 -6588 20876 54173 66999
35546 66999 92386 155767 195364 129312 -9885 -93114 -61121 3238 -157 -59607 -94354 -73497
35534 -73497 -32852 -3069 19829 41090 51929 49959 43298 34079 22093 20695 45006 87968
35522 87968 129391 161811 184631 183018 144157 90437 61530 59748 47860 10841 -16003 109
35510 109 41312 73149 100554 149672 206821 222960 188023 160590 197077 273189 305734 247685
35498 247685 138397 56652 41245 66039 81694 67486 40534 24597 21890 18083 5060 -12202
35486 -12202 -28519 -46300 -67631 -86184 -89655 -66599 -16025 39704 59722 24528 -28868 -38130
35474 -38130 8890 55970 51801 16213 9627 57092 130916 193008 223631 219411 195029 179864
35462 179864 182837 170460 114788 51987 45108 88396 103185 46785 -23631 -26513 41664 114400
35450 114400 139446 119976 87932 68486 64780 56683 20424 -38497 -84204 -92138 -74697 -55235
35438 -55235 -38344 -19117 1229 23776 52222 71588 55978 13909 -8005 12302 43634 61307
35426 61307 90268 147767 187406 158196 88064 45127 37461 18801 -20089 -40271 -34711 -42884
35414 -42884 -68446 -54271 25569 105224 101430 12750 -90417 -145636 -137732 -85780 -25121 11866
35402 11866 22271 32120 58089 83876 82982 49280 1283 -26031 1713 79950 146782 139964
35390 139964 73581 17953 3853 -1373 -17102 -14867 14998 28275 898 -18541 17508 76581
35378 76581 98288 85533 81077 84769 62628 19748 -3045 2287 5029 -7933 -25407 -53391
35366 -53391 -103670 -145599 -132143 -75584 -34840 -24083 -1467 43052 65518 56731 74136 142766
35354 142766 195941 172653 114109 93035 92611 38456 -70582 -146930 -133175 -67446 -14083 14864
35342 14864 44673 86915 132126 167462 177554 143949 63503 -37771 -116368 -134965 -85080
35331 -85080 -3277 44794 23404 -31078 -50811 -16121 33757 65745 89195 118484 140802 144788
35319 144788 149072 172478 198051 196674 170192 141112 111726 65738 5994 -40959 -62485 -77119
35307 -77119 -105203 -139778 -157277 -146865 -119226 -89548 -59557 -22079 16258 29509 5816 -21797
35295 -21797 -7605 39506 55828 8399 -52261 -54825 4248 70834 109010 122750 116938 87479
35283 87479 49874 32647 36893 38739 30931 22554 4376 -32555 -46152 20657 137811 194573
35271 194573 142511 63877 48413 67291 40514 -19665 -21699 65960 170608 214415 191651
35260 191651 137428 80025 45651 63860 138657 234687 304618 317349 267409 182569 113605
35249 113605 86841 76633 54309 43826 84071 152820 184401 157787 112128 78425 54901
35238 54901 48353 71760 93725 64137 7917 15246 107084 189090 186384 147846 149255 157943 83039
35225 83039 -73251 -202758 -223812 -158454 -77790 -28938 -21713 -38186 -42296 -10333 42980 86723
35213 86723 108924 107095 68894 -584 -54414 -52327 -19814 -14498 -46474 -79000 -96712 -119261
35201 -119261 -149574 -162494 -152460 -146317 -159510 -179111 -194376 -201638 -175616 -86275 40634 125350
35189 125350 118816 52472 -11584 -44994 -52783 -47205 -45794 -66041 -99076 -110700 -84156 -39552
35177 -39552 -1492 24310 34205 23324 13899 46212 115867 156706 118907 35176 -25184 -43197
35165 -43197 -52973 -76001 -95788 -94254 -76038 -49236 -8149 51593 111840 137029 105285 38232
35153 38232 -6902 10155 69555 116674 125148 110217 86220 50789 16536 11808 29944 22446
35141 22446 -27548 -67740 -52416 -16793 -23582 -64020 -73079 -29271 23537 53049 75619 104507
35129 104507 117823 101883 79178 63536 28194 -44686 -115027 -130305 -103602 -101743 -157095 -228403
35117 -228403 -256254 -227487 -172304 -121879 -88291 -72699 -71704 -76284 -77874 -77445 -80754 -84977 -78832
35104 -78832 -56699 -23465 16406 63343 110265 136614 126248 86875 43441 16904 15742 38275
35092 38275 70541 89224 81465 57123 29330 -6262 -53510 -88733 -82050 -44262 -20860 -34047
35080 -34047 -61347 -80406 -101298 -135794 -164279 -159903 -127174 -93288 -75710 -77251 -96264 -120717
35068 -120717 -127982 -112024 -95825 -96965 -100501 -91212 -91221 -129799 -189574 -222956 -217013 -201536 -190958
35055 -190958 -161266 -100472 -46560 -47164 -97945 -145036 -144681 -105962 -73744 -76150 -93648 -85184 -43551
35042 -43551 -9307 -19632 -59003 -79097 -57147 -14628 12970 3395 -46381 -115787 -167274 -183111
35030 -183111 -191819 -230283 -281066 -278175 -181345 -20830 134209 226722 231042 155777 43008
35019 43008 -56217 -118409 -150709 -164761 -170067 -182297 -201113 -185355 -98104 19444 74446 40967
35007 40967 -3815 7318 38526 20129 -35299 -52282 -5952 48860 59813 35430 15046 20432
34995 20432 43472 52224 10562 -79143 -159376 -175685 -143338 -120534 -126281 -128948 -108402 -76543
34983 -76543 -34974 30259 98673 116085 68966 10417 -12670 -11819 -9897 7004 50992 89066
34971 89066 84687 50948 22006 5636 5353 47337 128048 172633 117955 14769 -29924 -1729
34959 -1729 11299 -39459 -96619 -96073 -57625 -38361 -53511 -81639 -100771 -87448 -27916 39924
34947 39924 48339 -4390 -38655 -12815 9217 -35293 -102635 -120461 -109773 -132602 -163531 -128108
34935 -128108 -49847 -37628 -117556 -191105 -187557 -151418 -137457 -122365 -82174 -66351 -115868 -177147
34923 -177147 -180350 -148607 -145059 -156970 -124531 -55116 -13856 -12320 1943 42702 59679 33832
34911 33832 19129 56621 109385 121498 94380 65435 46205 21464 -10442 -30128 -24998 -8484
34899 -8484 -13447 -63798 -140573 -187452 -174030 -139749 -139787 -161812 -147428 -91301 -55730 -73442 -99184
34886 -99184 -86101 -52028 -30774 -10229 30821 67268 67113 55299 76498 113909 109314 57388
34874 57388 16753 20900 36857 30252 19012 32154 55427 56906 43874 54598 98441 135002
34862 135002 119476 51281 -30638 -90906 -125022 -144011 -144577 -111409 -51782 -7410 -11307 -40829
34850 -40829 -39231 10598 55984 34446 -47282 -114598 -107741 -46975 -3349 -14704 -52889 -76335
34838 -76335 -84125 -91501 -75484 3711 120903 178150 114367 -9017 -75434 -50260 -5437 -10454
34826 -10454 -46724 -48758 3246 61062 66892 12797 -57255 -93562 -85270 -58419 -32436 5889
34814 5889 71454 138509 157931 118119 63582 45484 72954 118353 147677 136787 82178 12241
34802 12241 -31233 -39178 -44372 -67681 -79267 -42061 25283 68202 72566 79012 114346 148926
34790 148926 142208 99146 54591 24264 905 -16531 -22038 -23022 -30208 -30425 -2331 37864 40540
34777 40540 -15138 -91164 -136430 -135689 -99500 -40866 10270 3316 -76188 -162735 -172681 -107044
34765 -107044 -47343 -46344 -70710 -65233 -26329 15049 43620 56617 38700 -19931 -94761 -149335
34753 -149335 -174301 -175025 -138057 -51669 46713 89809 58071 2858 -22311 -22945 -35612 -64236
34741 -64236 -74538 -44054 8758 50202 69893 83244 101586 112879 98987 65108 38030 34009
34729 34009 43205 51375 59433 69756 71135 56797 42941 45887 52604 42017 26323 34913 56672
34716 56672 38875 -40311 -131283 -169834 -151804 -123121 -109333 -86505 -24142 65312 131366 135063
34704 135063 89084 45261 37688 43409 14337 -51996 -95962 -62315 34061 124995 157552 127280
34692 127280 58105 -20494 -77349 -91490 -74222 -61458 -70559 -78990 -60601 -29261 -22902 -48309
34680 -48309 -68689 -53868 -17614 13892 49078 112083 182510 196196 125562 29659 -7557 22932
34668 22932 46835 -2881 -110922 -198907 -201525 -119457 -12598 51974 54357 28824 14535 8819
34656 8819 -17529 -69470 -116856 -133161 -121055 -96496 -72135 -63534 -85836 -128552 -152705 -131211
34644 -131211 -81159 -41911 -29308 -21416 17187 99653 192337 226236 157593 27551 -61598
34633 -61598 -44889 48312 143374 194645 192084 134960 45331 -14532 5549 72976 101481 60008
34621 60008 8598 8667 40365 41862 1452 -30263 -9581 54854 126924 184170 224028 247277
34609 247277 248411 217680 149902 57694 -25133 -66180 -65889 -56591 -63868 -78649 -76745 -55590 -34773
34596 -34773 -23776 -9042 22435 64899 108385 153217 194053 206517 175715 129764 113540 125997
34584 125997 115013 48889 -33905 -70327 -51078 -24429 -26269 -34896 -6378 61468 118101 114859
34572 114859 60585 11059 1193 3197 -31393 -98510 -138958 -112916 -48676 -3614 -1990 -31049
34560 -31049 -74339 -118247 -139626 -121738 -81597 -53758 -44851 -29210 5373 31661 16001 -34753
34548 -34753 -70142 -39195 58620 158319 176524 92587 -21811 -72364 -36882 27530 60043
34537 60043 45926 -4409 -78846 -145714 -151260 -73191 38118 103624 95095 47616 2816 -29576
34525 -29576 -54829 -72178 -85253 -108725 -142335 -152492 -105771 -18572 50517 63767 38934 10751
34513 10751 -17565 -58770 -95066 -88337 -41191 -8942 -31355 -82192 -110475 -104396 -82098 -42659
34501 -42659 28973 115792 172159 179475 163545 149269 130218 92231 37667 -22156 -69537 -71727
34489 -71727 -10128 69359 81817 7753 -68894 -65157 -5545 24062 707 -19533 -1602 17400
34477 17400 -6588 -60034 -102242 -126393 -157100 -204162 -245965 -252510 -209377 -127100 -38758 22095
34465 22095 52602 78016 106588 105021 43036 -48284 -95220 -64517 -755 33589 32300 34930
34453 34930 56489 63122 24748 -36663 -70610 -54082 -5481 45650 81826 97473 97933 98058 103642
34440 103642 96033 54128 -10319 -60487 -76589 -68019 -47499 -23999 -20956 -60872 -120195 -141019
34428 -141019 -107844 -70589 -63776 -50341 8442 70322 65998 12187 -4412 45419 95460 89119
34416 89119 54177 41146 45696 37413 22002 22496 25226 -3341 -57371 -94764 -97135 -88697 -92937
34403 -92937 -103201 -103746 -94360 -84350 -79865 -84884 -100723 -117878 -119233 -97977 -67063 -49050 -59827
34390 -59827 -98597 -146278 -175016 -165500 -117500 -48734 7966 14233 -42406 -121461 -159983 -142533
34378 -142533 -113751 -105819 -91170 -41766 1578 -22161 -92848 -123412 -79142 -16351 15888 43161
34366 43161 94801 129087 95033 29205 15038 60968 93035 69572 30225 14090 929 -28366
34354 -28366 -34152 22354 101742 130775 102507 72077 64608 51531 21685 10327 33359 47586
34342 47586 14787 -32798 -33752 18092 68867 70686 20861 -51264 -105233 -110201 -78538 -68343
34330 -68343 -116698 -179689 -180489 -112407 -44471 -18675 1812 56590 113688 119821 91690 97454
34318 97454 153910 197724 173548 107903 66198 62650 52561 11633 -16434 23049 111119 166553
34306 166553 146218 94414 68003 50065 -12194 -103018 -138294 -81586 50 26093 -6
34295 -6 -21192 -12492 11212 40854 72422 80831 49022 10983 12584 39098 38942 13056 13079 44327
34281 44327 45929 -4858 -40750 -5380 52925 51788 -2569 -35499 -23571 -16774 -42257 -61130
34269 -61130 -43694 -25262 -48169 -93128 -116157 -125895 -169489 -247398 -294729 -263160 -182195 -112446
34257 -112446 -68192 -25265 11556 2946 -52847 -93206 -71567 -28600 -33431 -73935 -66761 20052
34245 20052 114876 135560 82759 6903 -68425 -137933 -167184 -125801 -59819 -59342 -136871 -197252
34233 -197252 -160627 -68170 -21672 -50074 -88828 -80240 -41405 -23189 -44052 -86558 -130566 -162061
34221 -162061 -165298 -134550 -88313 -48372 -8082 53403 123810 152734 107034 11311 -80164 -133409
34209 -133409 -143280 -116364 -71562 -41983 -46370 -64868 -66367 -48912 -26516 8027 66695 120444
34197 120444 118863 63241 15923 22985 66769 107659 128245 116667 54220 -47146 -132860 -165366
34185 -165366 -163516 -153752 -122521 -54811 20771 71967 111856 158531 182741 153650 102852 77602
34173 77602 62485 23259 -1889 48723 132516 133185 34684 -41728 -13274 47995 32595 -52794
34161 -52794 -118864 -120534 -79179 -23337 23942 31655 -2539 -28362 -8886 19971 9335 -19451
34149 -19451 -16058 6784 -632 -25610 -2574 78409 151195 174459 180784 199991 197879 131315
34137 131315 20509 -75329 -130328 -167900 -217106 -273537 -298611 -255716 -158879 -76529 -62111
34126 -62111 -90861 -99527 -77811 -70115 -86682 -76653 -14726 43141 36062 -10190 -22715 9020
34114 9020 21583 -23646 -81354 -82913 -23781 37663 53240 27631 -10725 -50245 -88045 -101778
34102 -101778 -66397 -1630 32084 2022 -58738 -99466 -109082 -101555 -77686 -39747 -15485 -19166
34090 -19166 -11600 43629 101723 85874 12431 -13431 53313 130737 130261 74156 39945 46118
34078 46118 58716 67711 82811 79807 28698 -32675 -28407 41751 85398 39796 -42698 -68509
34066 -68509 -25352 12670 -12437 -74013 -99034 -50450 41863 122113 162712 171021 157157 119808
34054 119808 67641 30303 31880 68335 124034 191000 253047 273480 231772 162693 125493 135630
34042 135630 156850 160108 155559 156756 146890 103913 39722 -10188 -28218 -26656 -22426 -19056 -17709
34029 -17709 -30322 -67463 -115325 -138213 -112441 -53079 678 23025 16487 -3067 -19622 -17984
34017 -17984 5740 28138 14675 -34364 -70932 -49577 18570 75934 76024 23200 -33391 -37574
34005 -37574 26535 112293 149021 114928 58445 37945 60581 94238 113900 111444 81906 33175
33993 33175 -3129 -2890 14425 8395 -30185 -76054 -109776 -131118 -137944 -124277 -98947 -76895
33981 -76895 -53119 -15677 17338 11450 -26138 -39225 8311 83177 122516 104165 59225 29039
33969 29039 27475 38828 39470 21061 -5802 -31342 -60789 -99241 -133628 -146602 -138508 -115797
33957 -115797 -70216 1367 64416 70712 19476 -36540 -53847 -40554 -29351 -35159 -49248 -52777
33945 -52777 -28564 20089 59369 57407 28082 15430 33891 55814 60045 55329 49369 36287
33933 36287 26857 46495 82819 79362 10551 -75501 -121085 -129212 -133094 -130763 -98872 -50336 -27225
33920 -27225 -40313 -54844 -38005 6037 46823 54364 22267 -21981 -43816 -48041 -69626 -102728
33908 -102728 -83207 19855 135520 168935 121130 71220 58792 53173 33332 22055 24688
33897 24688 2591 -59893 -114757 -113888 -74045 -42183 -27368 -4119 37917 81186 104864 99388
33885 99388 69987 43112 50877 89795 113316 84735 19489 -42928 -85581 -109081 -104742 -67117
33873 -67117 -19276 7673 11813 8100 -8942 -52487 -97636 -90844 -16673 76246 129792 132589
33861 132589 110823 89049 76438 70074 53930 13231 -33076 -36934 14674 58256 15265 -105118
33849 -105118 -199830 -181948 -73798 24729 43850 3184 -25324 5405 77884 136428 147449
33838 147449 130572 127231 147388 163768 155499 132003 105380 66161 7809 -44427 -57568 -34897
33826 -34897 -9336 2926 15683 38201 52818 37355 -3518 -36391 -24040 41625 120814 149693
33814 149693 99346 3273 -86348 -149088 -179330 -149980 -46962 70422 107528 47209 -28398
33803 -28398 -48217 -31366 -28646 -41024 -43967 -50157 -87398 -134240 -135413 -80029 -21237 -13303 -56635
33790 -56635 -103821 -98728 -18744 98188 178119 183576 148920 126410 122313 113649 99235 93173
33778 93173 88417 70771 54181 59357 72396 69804 68161 96218 130564 120161 71340 44418
33766 44418 60037 73223 54691 33101 30943 18877 -29341 -85355 -109591 -108352 -110646 -120841
33754 -120841 -129322 -140615 -156378 -155669 -123748 -77978 -38734 -1101 37584 52967 31019 4148
33742 4148 13171 53587 93977 126743 162557 191693 192357 170094 153264 152326 150997 132229 89171
33729 89171 20008 -63140 -129826 -159538 -164081 -161128 -142356 -94064 -32564 11297 29136 28201
33717 28201 6151 -31993 -49429 -15344 38902 45416 -15649 -93058 -126838 -98713 -22248 73539
33705 73539 140597 133729 61226 -8539 -11083 52975 125227 144522 95259 18175 -27027 -22832
33693 -22832 -7599 -11345 -1969 64846 158754 193441 135095 38137 -39761 -102403 -169151 -218323
33681 -218323 -221144 -195943 -180048 -169745 -134760 -78940 -39617 -29517 -23912 -13327 -28240 -88807
33669 -88807 -156742 -169038 -116101 -62126 -76038 -152420 -218662 -223029 -194206 -193782 -226475 -236314
33657 -236314 -195347 -151959 -162273 -204380 -203289 -130518 -37149 15437 20281 6353 -12781 -45187
33645 -45187 -91274 -135443 -164813 -178044 -176613 -164436 -157301 -173983 -209658 -232719 -219596 -181575
33633 -181575 -144585 -115252 -87373 -73072 -97562 -157360 -210241 -220908 -197498 -168831 -145011
33622 -145011 -119402 -92139 -66843 -34257 15627 69543 100377 97057 67175 18664 -37544 -74476
33610 -74476 -68654 -31980 3776 32731 71758 109513 101388 35860 -29425 -29913 27298 76814
33598 76814 74336 35168 1104 -3876 14881 32388 18909 -40283 -131394 -220168 -272473 -269002
33586 -269002 -215088 -146687 -111647 -123819 -140636 -107105 -22830 53774 71988 39878 -909
33575 -909 -31501 -64255 -103141 -125527 -115198 -92374 -88146 -98087 -87793 -46253 -6122 2378 -5518
33562 -5518 6087 42179 76387 94379 110278 138734 171941 187782 166966 107614 41818 27736
33550 27736 92874 184882 214105 155064 73099 36573 38203 28809 -2841 -22928 -9701 21377
33538 21377 46816 55995 39489 -12380 -85305 -136358 -132204 -83868 -30365 6592 37144 73044
33526 73044 100779 98935 73259 51431 38685 3441 -75018 -164443 -212745 -211410 -193432 -173718
33514 -173718 -131390 -59696 4569 22681 -724 -33187 -52600 -51780 -29468 -479 5868 -16538
33502 -16538 -31734 -7678 34266 46388 19827 -11159 -25390 -39013 -67629 -96403 -103592 -91247
33490 -91247 -73098 -46503 -756 47350 49991 -20929 -125927 -184695 -160934 -100827 -68409 -63447
33478 -63447 -38289 16832 57204 60781 67480 109786 147984 122504 46639 -4041 10330 49078
33466 49078 49638 611 -52769 -59065 -13037 34169 25092 -36134 -85158 -80864 -59440 -76273 -119942
33453 -119942 -127079 -70373 12246 72781 96013 85754 49705 8927 -10334 -7637 -7529 -19991
33441 -19991 -25285 -7419 17250 16528 -19784 -59589 -46339 42774 147239 166563 81191 -7928
33429 -7928 -6536 43685 31163 -56229 -117319 -94498 -50169 -56523 -93093 -104746 -95048 -100167 -115751
33416 -115751 -110251 -80206 -39723 18626 102550 181063 212251 191987 138302 56312 -35426 -74750
33404 -74750 -14933 99065 173019 177152 161074 158924 145979 105787 78937 108076 172994 217832
33392 217832 219867 199054 175926 154668 145238 170081 232438 291938 294045 229072 145728 92960
33380 92960 64491 26468 -13421 -8526 50349 110216 130431 136602 164172 187737 155238 67557
33368 67557 -24517 -85048 -109430 -95928 -53533 -24764 -43287 -73052 -45344 43634 127548 163288
33356 163288 169125 162926 130411 78387 55889 84779 118411 105849 53678 -9977 -84726 -166883
33344 -166883 -212273 -183607 -105810 -26365 47932 121238 150275 91636 -3679 -24460 55416
33333 55416 133848 113040 19047 -51691 -58947 -36819 -12805 24808 74724 96129 63744 12074
33321 12074 -13252 -24915 -67684 -130156 -138702 -58719 46299 93098 79147 60037 58341 54840
33309 54840 51470 70404 89081 51220 -37445 -95735 -82435 -57158 -78979 -107922 -72151 15878
33297 15878 85343 116790 148446 190416 209123 193401 166376 130176 65967 -4964 -27693 4099
33285 4099 34332 29687 15780 6316 -36433 -130237 -217497 -231445 -181602 -129358 -107200 -101384
33273 -101384 -89864 -60437 -9927 46280 83187 103302 134539 173095 173135 123815 85140 98109
33261 98109 105962 30862 -102965 -195381 -202248 -168952 -140915 -116859 -96562 -100294 -120335 -118210
33249 -118210 -95927 -109517 -179699 -245485 -247168 -206579 -178292 -162823 -122249 -52516 15768 70412
33237 70412 117725 141080 114871 59469 30212 43082 58366 51106 49183 76021 100154 83355
33225 83355 48868 50775 86531 92093 32052 -50649 -95370 -96106 -82449 -60392 -18528 22054
33213 22054 19426 -20520 -38686 -9523 11977 -31599 -109404 -140071 -101613 -48107 -19953 4160
33201 4160 49293 90697 93687 72502 66545 73558 48634 -27876 -114149 -153174 -137961 -113724
33189 -113724 -119607 -143595 -142611 -98576 -39413 -4237 -5111 -29154 -56911 -63630 -25262 50465 115312
33176 115312 131394 115056 98896 73294 15897 -36784 -16699 68513 124099 89657 10938
33165 10938 -42917 -72199 -108208 -137169 -127972 -101124 -103854 -136367 -161754 -171721 -183063 -183354 -143937
33152 -143937 -81482 -44380 -38462 -27987 -11505 -26019 -60878 -41518 63125 175256 198415
33141 198415 134290 63834 40352 46837 43610 16451 -21710 -51048 -64667 -77125 -105323 -138436
33129 -138436 -146242 -121627 -87896 -55592 -5996 64691 119748 128732 111444 102974 98891 72200
33117 72200 27876 824 6965 32904 71101 127563 187310 205113 149761 43187 -57250
33106 -57250 -108757 -112026 -100852 -108628 -137993 -158207 -135894 -71975 -7254 11066 -28463 -90455
33094 -90455 -125340 -114350 -78422 -45609 -25742 -21643 -39159 -64972 -58807 -2872 56758 60454
33082 60454 18240 -5244 12338 24649 -1780 -38886 -56895 -76630 -118815 -145526 -106000 -14837
33070 -14837 66521 110606 138898 165263 171531 145129 107440 92661 111699 138226 126637 57008
33058 57008 -33824 -89457 -106592 -132472 -176655 -178916 -103702 -17872 -14361 -86460 -140563 -122499
33046 -122499 -75612 -75975 -153926 -274132 -354471 -318585 -175556 -35787 -24 -42571 -52246
33035 -52246 24322 135856 211674 229086 194327 120986 43920 5062 9353 28794 46850 57671
33023 57671 36601 -28702 -87811 -77434 -17899 14999 11821 33512 84706 86370 8899 -68310
33011 -68310 -83940 -89270 -147194 -217491 -223666 -171402 -119546 -85625 -59136 -59610 -98736 -128151
32999 -128151 -109032 -91322 -132191 -176635 -128702 -18326 22714 -46440 -122928 -121343 -77082
32988 -77082 -47183 -9108 75357 169267 207561 189290 158326 126644 80601 43520 67816 159824
32976 159824 257901 302512 304303 323506 386175 437274 394389 249494 92867 18743 31526
32965 31526 71920 105335 135237 148966 117994 59784 38194 78596 128813 128317 76087 7473
32953 7473 -54441 -94500 -88408 -26467 64369 145233 193766 196509 145111 59855 -14561 -59514
32941 -59514 -99427 -148548 -177856 -164102 -135939 -134266 -156507 -179496 -209121 -260452 -309252 -314770
32929 -314770 -281795 -251620 -233634 -193405 -114987 -30721 27631 71955 127234 179131 179707 104277
32917 104277 -12257 -102187 -125478 -96501 -48144 12405 87241 140003 112830 6377 -100719
32906 -100719 -141541 -134270 -133979 -150902 -163074 -174134 -195127 -190224 -113660 689 57790 22820
32894 22820 -39802 -67387 -72887 -85137 -79764 -25487 44038 68006 47540 39335 66954 89578
32882 89578 64683 1969 -56035 -78364 -60809 -20767 10089 2495 -49031 -123696 -191265 -226312
32870 -226312 -215834 -168868 -116196 -86955 -84833 -92872 -93846 -77736 -42261 -1057 20324 14357
32858 14357 6570 20963 42723 41529 22901 24726 63710 115300 148885 153739 127264 70882
32846 70882 7293 -29763 -36536 -41323 -53391 -44761 -3345 32861 28624 9701 26701 78041
32834 78041 111836 97487 55461 16549 -11817 -34521 -55885 -83163 -114876 -123202 -79427 -2844
32822 -2844 48931 49908 34792 43272 66067 68576 43173 11516 -9556 -20819 -29723 -44439 -67857
32809 -67857 -82768 -58130 10783 81599 105190 77801 34389 1016 -22643 -39639 -41284 -22033
32797 -22033 7933 32448 44510 49186 55047 62606 62579 51928 46818 62876 83514 72406 24506
32784 24506 -21300 -32579 -19771 -7650 -2718 -12291 -59639 -140043 -189275 -147360 -44203 25398
32772 25398 10461 -53488 -107997 -132603 -134871 -121030 -93699 -53905 1712 63962 97519 78185
32760 78185 37675 27011 36367 5633 -73922 -127774 -96975 -17869 35204 43661 35872 20591
32748 20591 -14839 -56682 -68490 -42461 -8659 7883 8263 -661 -16427 -26749 -11155 35140
32736 35140 94367 145655 178971 191580 183579 156222 107547 36943 -39086 -90264 -105303 -107686
32724 -107686 -122053 -137101 -121185 -66596 -927 39229 33186 -14174 -72688 -106972 -109297 -101456
32712 -101456 -96195 -78927 -42193 -10608 -6537 -16365 -21508 -38208 -86912 -140939 -151678 -116110
32700 -116110 -74576 -46706 -17356 12576 12809 -23995 -60130 -64253 -51196 -50425 -64828 -81502
32688 -81502 -96817 -109373 -110529 -101265 -96680 -95201 -67409 39 69685 91393 63074 25791
32676 25791 6012 -8095 -31322 -49028 -34681 10770 51295 51448 16069 -12965 -4069 27410
32664 27410 40940 24395 9456 30726 83129 125870 121479 70566 15395 4531 42676 82364
32652 82364 79384 43619 10910 -20280 -81406 -163603 -205546 -171908 -101696 -49544 -16470 22985
32640 22985 57461 54510 24180 11919 25357 17010 -43996 -120986 -153321 -125605 -71652 -28445
32628 -28445 -8632 -7213 -14317 -23806 -39996 -70118 -103832 -114497 -93872 -69837 -68814 -74187 -51990
32615 -51990 -11026 2126 -23741 -37994 -645 53876 66206 42074 40680 78832 103995 78886
32603 78886 41157 44070 74812 78076 45159 34010 94555 201992 276595 261191 175129 91010
32591 91010 54363 37536 -6943 -65197 -84009 -72191 -107124 -207621 -273658 -217537 -98521
32580 -98521 -43932 -74971 -104643 -86109 -58858 -48910 -30412 -5738 -20632 -66800 -71546 -30912
32568 -30912 -47458 -163784 -257141 -200146 -51393 29960 9521 -7877 33963 71563 53823
32557 53823 28821 52673 95814 94804 42866 -18529 -59652 -74030 -57661 -11544 46815 90395
32545 90395 92556 36930 -56161 -123575 -120769 -85118 -90404 -138827 -155677 -101365 -25698 14806
32533 14806 32890 63687 93252 85219 44360 3577 -27915 -57042 -68524 -43593 -6284 -4210
32521 -4210 -44009 -84192 -93687 -84461 -83418 -101721 -135894 -171074 -176016 -121510 -19351 71652
32509 71652 93935 43962 -26441 -59270 -41666 -10415 -3714 -13559 127 49767 99016 111772
32497 111772 96881 82331 65720 22742 -42638 -90055 -91664 -65753 -49232 -50534 -45253 -17508
32485 -17508 7524 -12151 -75060 -121031 -100505 -46380 -38898 -98797 -160759 -166448 -133087 -99646
32473 -99646 -58051 8174 57485 34276 -37905 -78841 -64100 -44174 -46077 -33574 10207 37567
32461 37567 20444 15824 84302 187957 237115 210115 157929 108363 41581 -37088 -73968 -42694
32449 -42694 10169 26054 3242 -22235 -31199 -27726 -17411 -8133 -12445 -23979 -11415 37854
32437 37854 87329 94201 66510 45909 47407 53963 63732 98793 158549 201926 194093 146408 95611
32424 95611 65922 64938 90521 119450 110436 47291 -30480 -64680 -39980 12176 60570 94505
32412 94505 99525 51910 -41749 -123018 -128845 -57472 30204 73426 61132 21670 -14423 -29248
32400 -29248 -11248 41008 104823 140825 127602 82853 41379 19476 12396 17679 39801 71308
32388 71308 92258 98135 109887 141904 174298 174042 134064 74852 16054 -34237 -67909 -77161
32376 -77161 -67762 -53367 -34038 1628 48675 78904 72412 43824 27589 44924 89202 132286
32364 132286 140167 97466 28047 -18780 -14030 25120 60821 73161 64240 41016 13962 1373
$$ [...]
##END NTUPLES=NMR SPECTRUM
##END=
