##TITLE=1H_5-2026
 200.13MHz,CDCl3.
 8 sc
 
 19.1.2026
##JCAMPDX= 6.0         $$ Bruker NMR JCAMP-DX V2.0
##DATA TYPE= NMR FID
##DATA CLASS= NTUPLES
##ORIGIN= UXNMR, Bruker Analytische Messtechnik GmbH
##OWNER= pz
$$ XWIN-NMR		Version 3.5
$$ Mon Jan 19 13:36:23 2026 Russian Standard Time (UT+4h)  she@DPX200
##.OBSERVE FREQUENCY= 200.1313
##.OBSERVE NUCLEUS= ^1H
##.DELAY= (6, 6)
##.ACQUISITION MODE= SIMULTANEOUS
##.ACQUISITION SCHEME= undefined
##.AVERAGES= 8
##.DIGITISER RES= 18
##SPECTROMETER/DATA SYSTEM= spect
##.PULSE SEQUENCE= zg30
##.SOLVENT NAME= CDCl3
##.SHIFT REFERENCE= (INTERNAL, CDCl3, 0, 14.3821)
##AUDIT TRAIL= $$ (NUMBER, WHEN, WHO, WHERE, WHAT)
$$ ##TITLE= Audit trail, XWIN-NMR		Version 3.5
$$ ##JCAMPDX= 5.01
$$ ##ORIGIN= Bruker BioSpin GmbH
$$ ##OWNER= she
$$ F:/spectra/data/she/nmr/H-C/1/audita.txt
$$ ##AUDIT TRAIL=  $$ (NUMBER, WHEN, WHO, WHERE, WHAT)
(   1,<2026-01-19 13:34:57.57 +0400>,<she>,<DPX200>,
      <created by zg, POWCHK disabled, PULCHK disabled
       configuration hash MD5:
       00 E9 B6 7A A2 85 ED C7 34 08 36 98 17 FE 4E 26
       data hash MD5: 16K
       DF 40 B8 24 53 04 DD 42 A3 71 32 38 F4 36 0F BE>)
$$ ##END=
$$ 
$$ hash MD5
$$ 72 23 B9 39 3C 7B E8 3F 39 8B 0A 8C 67 02 16 A8
##$RELAX= 
##$RELAX= 
##$RELAX= 
##$RELAX= 
##$RELAX= 
##$RELAX= 
$$ Bruker specific parameters
$$ --------------------------
##$DU= <F:/spectra>
##$EXPNO= 1
##$NAME= <H-C>
##$PROCNO= 1
##$TYPE= <nmr>
##$USER= <she>
##$AMP= (0..31)
100 100 100 100 100 100 100 100 100 100 100 100 100 100 100 100 100 100 
100 100 100 100 100 100 100 100 100 100 100 100 100 100 
##$AQSEQ= 0
##$AQ_mod= 1
##$AUNM= <au_zg>
##$AUTOPOS= <>
##$BF1= 200.13
##$BF2= 200.13
##$BF3= 200.13
##$BF4= 200.13
##$BF5= 200.13
##$BF6= 200.13
##$BF7= 200.13
##$BF8= 200.13
##$BYTORDA= 1
##$CFDGTYP= 0
##$CFRGTYP= 5
##$CHEMSTR= <none>
##$CNST= (0..31)
1 1 145 1 1 1 1 1 1 1 1 1 1 1 1 1 1 1 1 1 1 1 1 1 1 1 1 1 1 1 1 1 
##$CPDPRG= <>
##$CPDPRG1= <>
##$CPDPRG2= <>
##$CPDPRG3= <>
##$CPDPRG4= <mlev>
##$CPDPRG5= <mlev>
##$CPDPRG6= <mlev>
##$CPDPRG7= <mlev>
##$CPDPRG8= <mlev>
##$CPDPRGB= <>
##$CPDPRGT= <>
##$D= (0..31)
0 0.7 0 0 0 0 0 0 0 0 0 0.03 0 0 0 0 0 0 0 0 0 0 0 0 0 0 0 0 0 0 0 0 
##$DATE= 1768815297
##$DBL= (0..7)
120 120 120 120 120 120 120 120 
##$DBP= (0..7)
150 150 150 150 150 150 150 150 
##$DBP07= 0
##$DBPNAM0= <>
##$DBPNAM1= <>
##$DBPNAM2= <>
##$DBPNAM3= <>
##$DBPNAM4= <>
##$DBPNAM5= <>
##$DBPNAM6= <>
##$DBPNAM7= <>
##$DBPOAL= (0..7)
0.5 0.5 0.5 0.5 0.5 0.5 0.5 0.5 
##$DBPOFFS= (0..7)
0 0 0 0 0 0 0 0 
##$DE= 6
##$DECBNUC= <off>
##$DECIM= 32
##$DECNUC= <off>
##$DECSTAT= 4
##$DIGMOD= 1
##$DIGTYP= 9
##$DL= (0..7)
0 120 120 120 120 120 120 120 
##$DP= (0..7)
150 150 150 150 150 150 150 150 
##$DP07= 0
##$DPNAME0= <>
##$DPNAME1= <>
##$DPNAME2= <>
##$DPNAME3= <>
##$DPNAME4= <>
##$DPNAME5= <>
##$DPNAME6= <>
##$DPNAME7= <>
##$DPOAL= (0..7)
0.5 0.5 0.5 0.5 0.5 0.5 0.5 0.5 
##$DPOFFS= (0..7)
0 0 0 0 0 0 0 0 
##$DQDMODE= 0
##$DR= 18
##$DS= 0
##$DSLIST= <SSSSSSSSSSSSSSS>
$$ [...]
##$SUBNAM0= <"">
##$SUBNAM1= <"">
##$SUBNAM2= <"">
##$SUBNAM3= <"">
##$SUBNAM4= <"">
##$SUBNAM5= <"">
##$SUBNAM6= <"">
##$SUBNAM7= <"">
##$SUBNAM8= <"">
##$SUBNAM9= <"">
##$SW= 18.0517328524113
##$SWIBOX= (0..15)
0 0 2 0 0 0 0 0 0 0 0 0 0 0 0 0 
##$SW_h= 3612.71676300578
##$TD= 16384
##$TD0= 1
##$TE= 0
##$TE2= 300
##$TE3= 300
##$TEG= 300
##$TL= (0..7)
0 120 120 120 120 120 120 120 
##$TP= (0..7)
150 150 150 150 150 150 150 150 
##$TP07= 0
##$TPNAME0= <>
##$TPNAME1= <>
##$TPNAME2= <>
##$TPNAME3= <>
##$TPNAME4= <>
##$TPNAME5= <>
##$TPNAME6= <>
##$TPNAME7= <>
##$TPOAL= (0..7)
0.5 0.5 0.5 0.5 0.5 0.5 0.5 0.5 
##$TPOFFS= (0..7)
0 0 0 0 0 0 0 0 
##$TUNHIN= 0
##$TUNHOUT= 0
##$TUNXOUT= 0
##$USERA1= <user>
##$USERA2= <user>
##$USERA3= <user>
##$USERA4= <user>
##$USERA5= <user>
##$V9= 5
##$VALIST= <valist>
##$VCLIST= <CCCCCCCCCCCCCCC>
##$VD= 0
##$VDLIST= <DDDDDDDDDDDDDDD>
##$VPLIST= <PPPPPPPPPPPPPPP>
##$VTLIST= <TTTTTTTTTTTTTTT>
##$WBST= 1024
##$WBSW= 4
##$XGAIN= (0..3)
0 0 0 0 
##$XL= 0
##$YL= 0
##$YMAX_a= 761081
##$YMIN_a= -849915
##$ZGOPTNS= <>
##$ZL1= 120
##$ZL2= 120
##$ZL3= 120
##$ZL4= 120
##$ABSF1= 10
##$ABSF2= 0
##$ABSG= 5
##$ABSL= 3
##$ALPHA= 0
##$AQORDER= 0
##$ASSFAC= 0
##$ASSFACI= 0
##$ASSFACX= 0
##$ASSWID= 0
##$AUNMP= <proc_1d>
##$AZFE= 0.1
##$AZFW= 0.1
##$BCFW= 1
##$BC_mod= 2
##$BYTORDP= 1
##$COROFFS= 0
##$CY= -3
##$DATMOD= 1
##$DC= 2
##$DFILT= <>
##$DTYPP= 0
##$F1P= 0
##$F2P= 0
##$FCOR= 0.5
##$FTSIZE= 0
##$FT_mod= 4
##$GAMMA= 1
##$GB= 0.15
##$INTBC= 1
##$INTSCL= 1
##$ISEN= 128
##$LB= 0.25
##$LEV0= 0
##$LPBIN= 0
##$MAXI= 10000
##$MC2= 0
##$MEAN= 0
##$ME_mod= 0
##$MI= 1.114404
##$NCOEF= 0
##$NC_proc= 0
##$NLEV= 6
##$NOISF1= 3.799351
##$NOISF2= 2.8
##$NSP= 1
##$NTH_PI= 0
##$NZP= 0
##$OFFSET= 14.38212
##$PC= 1
##$PHC0= -3702.708
##$PHC1= 13.39231
##$PH_mod= 1
##$PKNL= yes
##$PPARMOD= 0
##$PSCAL= 0
##$PSIGN= 0
##$REVERSE= no
##$SF= 200.129724274929
##$SI= 16384
##$SIGF1= 3
##$SIGF2= 2
##$SINO= 400
##$SIOLD= 16384
##$SREGLST= <1H.CDCl3>
##$SSB= 0
##$STSI= 0
##$STSR= 0
##$SW_p= 3205.1282051282
##$SYMM= 0
##$S_DEV= 0
##$TDeff= 0
##$TDoff= 0
##$TI= <>
##$TILT= no
##$TM1= 0
##$TM2= 0
##$TOPLEV= 0
##$USERP1= <user>
##$USERP2= <user>
##$USERP3= <user>
##$USERP4= <user>
##$USERP5= <user>
##$WDW= 1
##$XDIM= 8192
##$YMAX_p= 0
##$YMIN_p= 0
$$ End of Bruker specific parameters
$$ ---------------------------------
##NTUPLES= NMR FID
##VAR_NAME=  TIME,          FID/REAL,        FID/IMAG
##SYMBOL=    X,             R,               I
##VAR_TYPE=  INDEPENDENT,   DEPENDENT,       DEPENDENT
##VAR_FORM=  AFFN,          ASDF,            ASDF
##VAR_DIM=   8192,          8192,            8192
##UNITS=     SECONDS,       ARBITRARY UNITS, ARBITRARY UNITS
##FACTOR=    0.0002768,     1,               1
##FIRST=     0,             0,               0
##LAST=      2.2672688,     0,               0
##MIN=       0,             -849915,         0
##MAX=       2.2672688,     761081,          0
$$ Real data points
##PAGE= N=1
##DATA TABLE= (X++(R..R)), XYDATA
0@%%%%%%%%%%%lL%%pJ5j6J6j6J6j6J8k2K4k6K9l4L9m0M2m7N5o1O5p0P6q3R2j00
40e1J03j10J22j31J40j50J61j78J97k13K33k59K90l26L68m20M87n74O88q38J037
61E76j319J728k345L327n003Q185j5246L6143j93585o82376R96920L30458r76168
74d98705M27775Q32011p73233n97903O69442J36136m56118K70369L89655l00020
84I9409l35366K2508J96643J18820j40309P3763L13694l73432m79034N06272K97125
95C00093n13179J98848N33321n87920m47772O28286O9450m73036M35277L05452
105D48820o58871p6013M41987k78154o6270N33778j66441m08810K62037j0689
115B1374l36593L42846L19542l65674o6378K36912k83235j48457L96994N9880
$$ y = [0, 0, 0, 0, 0, 0, 0, 0, 0, 0, 0, 0, -3, 0, 0, 0, -7, 8, -8, 8, -8, 8, -8, 10, -12, 12, -14, 15, -19, 20, -20, 22, -25, 30, -31, 34, -36, 40, -43, 49, -51, 52, -58, 64, -67, 73, -77, 84, -94, 103, -110, 123, -136, 154, -172, 196, -224, 263, -311, 377, -461, 576, -743, 985, -1360, 1967, -3036, 5149, -10097, 26046, -167539, -849915, 147005, 477463, -498705, -70930, 761081, -12152, -610055, 59387, 195523, -260595, 9774, 399429, 99409, -235957, -213449, -16806, 102014, -38295, 35468, 349162, -24270, -503304, 2968, 300093, -213086, -14238, 519083, -68837, -516609, 111677, 181127, -291909, 143368, 448820, -210051, -286064, 155923, -122231, -188501, 345277, 178836, -229974, 32063, 21374, -315219, 27627, 347169, -18505, -84883, 152029, -131206, -279663, 117331, 177211]
125A77211j92349R6578o1779j91164J05824N0611Q980K14079j10595k99077J88890
136a2791Q9109l22251K19408M24486l98379k80530M50773r9470m48303M39607
146F1659L37800n15135n8629L80486k70384k25962M03984R6339k77506N9294P3065
157F5011j84771K6234J42724k2835N8141L475j99187M6173J31705j62717N9578
168c6469K60784j93116k06892K22499p109k14649K04598J72832k50153l8046J69435
179H3714j54984n9869K47377m4205j41216J49557n4963j91761J79632J03216j87576
190g1078P9332J39491k20422p6529K28149l4478j44674J64516N1770k14898K2410
201g6411J32432p8115k084R1489m7177l4904M843m5660N7758O6379q8249K798
$$ y = [177211, -15138, 81440, 19661, -171503, -65679, -15068, -6088, 207991, 97396, -201681, -12791, 76318, -245933, -26525, 397961, -418, -280948, 169825, 70355, -377948, 61659, 399459, -115676, -174305, 206181, -64203, -290165, 113819, 210158, -67348, -8054, 65011, -119760, -93526, 49198, 26363, 84504, 87979, -111208, -65035, 66670, -96047, -36469, 224315, 31199, -175693, 46806, 39697, -174952, 29646, 202478, -47675, -85721, 83714, -71270, -131139, 116238, 72033, -69183, 80374, 25411, -166350, 13282, 116498, -71078, 8254, 147745, -72677, -149206, 78943, 44465, -100209, 64307, 116077, -98821, -76411, 56021, -22094, -24178, 67311, 20134, -14770, -9927, -55587, 2171, 68550, -19699, -16901]
213a6901J03254j10393j07504J80756M9387j95982P9726J65177k11124q6134K48585
224I8847l2277j85616J45749R5709j89936k5785J64182k9362j07659P9979O3440
235G7271j01346l9638P5938K3666m7338j8383N9971J5564j09332N988J37256o2411
247A7206j08202J32879M6915j72403J9394J66383q1597j24380J49440N7154j92349
258h9560K1751J76225j00147j10572J43349L9768j49024N963J31295m1443j06921
269g9316Q1920Q1098j14236m3287J24505K509j13916L4219J08270p0656r9551
280h8441J09359O4885j45042k531J49958o4880j23360J08005P8372j30891k9205
291g3771J44952k3865j39866Q1446J07428j23022m9268J36876n176j25961M3584
$$ y = [-16901, 86353, -24040, -131544, 49212, 98599, -97383, -17657, 147520, -63604, -149738, 98847, 66570, -119046, 26703, 122412, -67524, -93309, 70873, 41511, -66148, 13831, 77271, -24075, -63713, 12225, 35891, -11447, -29830, 30141, 45705, -63627, -57639, 79617, 17206, -90996, 41883, 88798, -83605, -64211, 102172, 20575, -103805, 45635, 102789, -89560, -67809, 108416, 8269, -102303, 41046, 80814, -68210, -62247, 69048, 27605, -79316, 2604, 83702, -30534, -73821, 50684, 53193, -60723, -26504, 81766, 11110, -88441, 20918, 85803, -59239, -61770, 88188, 23308, -100052, 7953, 86325, -44566, -73771, 71181, 47316, -92550, -11104, 96324, -26698, -75966, 60910, 55734, -70227, -26643]
302b6643J06881p7498q4683J10419M2376j31926J2125J22027o1106q8928Q7716
313A0760N5113j00119k2500J11396j5678j08198O3326P9662r4521l3664R7821
324D3398m767q7400K7596P5336n1571o2648P6649L2423r0630P793Q0187l6187
336A0179n7574M9414M3239n8371k8965P5243K933q2007L5621O4851o4195l2506
348d2138O9140K327o6103J8056N8894m1642m4066O4418J0061o6691K9749M1191
360C3196m4262o059L3445j0090j4909R758P166n944k570J875m429O723k76j8947
374a5323J9558J2735m0609J4610L3992m1320j736M4251k6180k0863L4389n128
386H376k4085K3501R720l0674J4229K0368m3945J0736N0858n5757j6539Q0331
$$ y = [-26643, 80238, 2740, -81943, 28476, 70852, -61074, -48949, 73078, 11972, -76956, 10760, 65873, -34246, -56746, 54650, 38972, -69226, -5900, 73762, -20759, -54423, 43398, 38631, -48769, -21173, 54163, 2592, -60056, 16593, 49016, -41614, -33821, 46366, 10179, -47395, 2019, 45258, -13113, -42078, 33165, 36098, -45909, -10288, 54563, -9632, -42138, 27002, 29329, -36774, -18718, 40176, -1466, -45532, 18886, 28947, -37744, -7995, 33196, -11066, -17125, 16320, 6230, -8679, 1079, 8245, 2301, -269, 1606, -2823, 3900, 3624, -15323, 4235, 16970, -23639, -9029, 24963, -16357, -18093, 26158, -22, -20885, 13504, 8376, -15709, 7792, 17512, -13162, 1067, 21435, -22510, -11774, 39084, -16673, -33212, 47119]
398D7119m7785o3572R6463Q381j01585N7726P1656j02630k1228J15476l8425q7610
410f6014R5106L0081j13715L3489P4008p0669q497O0953l2923k1011K2486j9579
422a6285J3575K8124m4859O416O0780o5989m8970J22304o932j35281J06812Q7560
434A07255j93717J2291K00864j28099j19355K07426k392k17742J05823J49643
444A21997j72859l7208J92853o7497j48464J21794N4319j11192L0893O4347m0330
455H653j7941j6162R035O8400n3521o2612J31547l136j95956R7766J86257k07375
467e5045q2847K97272q2148l00869K43707J77770l33932K7770L22850k01961k12295
478a99728K73689M8666k50541R6206J73486j62050p5440J33229j5937n7077M3204
$$ y = [47119, -666, -64238, 32225, 40606, -60979, -3253, 68403, -34227, -55455, 60021, 21596, -66014, 29092, 59173, -54542, -21053, 52955, -17714, -26211, 34742, 1819, -19192, 3294, -16285, -2710, 25414, -19445, -13029, 47751, -18238, -67208, 55096, 48164, -87117, 19695, 107255, -86462, -74171, 126693, -1406, -120761, 86665, 84273, -133469, -27646, 121997, -50862, -88070, 104783, 37286, -111178, 10616, 64935, -46257, -15364, 48983, 8653, -9288, -25450, -16415, 51985, -1536, -64148, 67399, 64263, -131693, -33927, 152330, -55045, -137892, 159380, 77232, -223637, 20070, 197840, -136092, -108322, 214528, 12567, -199728, 73961, 122627, -127914, -31708, 141778, -20272, -95712, 37517, 21580, -35497, 7707]
489G707k572J5902J313j03405O3890J22714j55206l2364K21688j09710k06734
500a76777K27943R1932k79879Q5675K49485k45773j27434L05998o6803k43633
510a79266K39404Q8885k88298Q7175J91823k09390k4775K28308j12545j36089
520a14768J78120r854j64418J27792P9182j54272M0766Q6475j20832J7824R1076
531E7091r1761K6448Q4089j37820Q410J56495j41580o9915K42743p3610k40406
542a79816K25062J16981l23590Q1256L10890k62770j65087L44386n4157k98975
552b05820K26459J53381k75891J9142K07108j42416q3652J64827l1240q5339R4180
563D0739l5020o7065J16502m0075j02232J60816n69k01467J31100J22755k21102
$$ y = [7707, 5135, 21037, 22350, -81055, -17165, 105549, -49657, -82021, 139667, 29957, -176777, 51166, 143098, -136781, -51106, 198379, -47394, -174828, 131170, 64367, -179266, 60138, 149023, -139275, -52100, 139723, -69667, -94442, 133866, 21321, -114768, 63352, 53498, -110920, 16872, 96054, -58218, -17452, 69023, -51809, -33985, 57091, -34670, -8222, 75867, -61953, -53543, 102952, -38628, -108543, 134200, 60590, -179816, 45246, 162227, -161363, -80107, 230783, -31987, -197074, 147312, 93155, -205820, 20639, 174020, -101871, -82729, 124379, -18037, -101689, 63138, 31898, -53441, 40739, 5719, -61346, 55156, 15081, -87151, 73665, 73096, -128371, 2729, 125484, -95618]
574i5618K3026K20131j56273j23916K14425k7668j81724J58188O9971j93310Q1350
585a1418J11728j85337M1138J73301j76605m2850K26532j28819j68040K44293
595H3923K6883k60191J33806J80902k45875m4577K53294r7383j58580J79649K7378
606G9229j58107O3368N9742o7918L6727N391n6772P6804o797j27623J08249J06786
618A19079j99473m468K34682j47427j86380K71681M8638k98949J26341K17143
628A80867k48409p1689K62496o6038j79918J49927O7241j59933K4205J00499o6312
639g064j1808M6184m7035J9760K7983q6616N2747R2099j36540j4911J66437j01254
651a8j21815J89122K5649k03884R2075J48275j86372m3630K12492p5473j53575
$$ y = [-95618, -72592, 147539, -8734, -132650, 81775, 54107, -127617, 30571, 100542, -92768, -11418, 100310, -85027, -43889, 129412, -47193, -90043, 136489, 7670, -160370, 83923, 110806, -149385, -15579, 165323, -80552, -125129, 128165, 30782, -127798, 51851, 79229, -78878, -15510, 44232, -23686, 13041, 18432, -38340, 38464, 31667, -95956, 12293, 119079, -80394, -84862, 149820, 2393, -183987, 87694, 136332, -162617, -36276, 180867, -67542, -139231, 123265, 57227, -122691, 27236, 94477, -65456, -41251, 59248, -7064, -18872, 27312, -19723, 37, 28020, -58596, -5849, 86250, -50290, -65201, 101236, -18, -121833, 67289, 92938, -110946, -18871, 129404, -56968, -100598, 111894, 36421, -117154]
662a17154J61038L8148j75062O4722J12754j09757k3417R5351l7569n0582M7970
673F442P533j9347J7450j8986k920M2576m7338k9775J03241k9577j14499J08540
685B3340N8209j65831L7869J60225j26930r5134J75228r19j74725R3164J28446
696A12942j49105m4480J56063m2594j13863R2632N1902q7971m833N3198j1170
707A2721l0384R81L1214J1071m6034j1125O0145j0541o9671N2125O5547r6219
719c0170k7189J18920l9435r9067J02462M7212j25677J6655J01426o9120n8133
730f2116R6591J1885r6968L1422O6175o5139k2143P2761j1234m8786K3289K0907
742A6644j9784j2584J9675K2489k6025k4104L2983R225m0538Q526M8359k4928
$$ y = [-117154, 43884, 82032, -93030, -28308, 84446, -25311, -48728, 46623, 9054, -41528, 6442, 13975, -5372, 12078, -6908, -9828, 32748, -14590, -44365, 58876, 29299, -85200, 23340, 81549, -84282, -46413, 113812, -13118, -108252, 66976, 66057, -108668, -15504, 112942, -36163, -80643, 75420, 32826, -81037, 11595, 63497, -24474, -29307, 23891, 12721, -17663, -16682, 14532, 25603, -20431, -31556, 28589, 18048, -51623, 502, 66049, -30170, -57359, 61561, 22126, -76941, 25521, 72733, -52944, -36289, 65137, -3983, -62116, 34475, 46360, -50608, -19186, 46989, -18150, -40293, 32468, 21234, -27552, -4263, 16644, -3140, -15724, 3951, 26440, 415, -23689, 9294, 18519, -22019, -13493, 34866, 9938]
754I938n1342M4889L2007o9568O424P9557m5393n6714O6673J6209o7245J7463
766a7102N8750l1195m3978M0132K1629m9014J240M6782j6199l1480J5794J5496
778A0855j2346j6676J8039K1983k7668j5356L3488k949k8012J6470K2902j6669
790D061j8421J7153J1590k3487j2K3949j0342j3197P581P93N12k741n333J4819
804F925P33k0566P573J7053j0941j2834J6569J4338k5070r996L3250o089l1966
817b1021K1491K0306k4827j4112K2615J0910k8476o713L8895o216m0587K3405
829d330L2672l5292k0368M4425J1400n2790O063N7818l4841m8564O1215K0353
841C7761p0342J0928O0163l4506m6387M8987K9763n9653n853O2446j9839n1447
$$ y = [9938, -41404, 3485, 35492, -34076, -27652, 51905, 6512, -50202, 16471, 32680, -34565, -17102, 41648, 10453, -33525, 6607, 28236, -20778, -19538, 27244, 11045, -20435, -4641, 10855, -1491, -18167, -128, 21855, -5813, -21169, 12319, 9370, -18642, -2172, 20730, 4061, -14360, 2793, 14383, -9104, -9116, 14833, 4491, -8706, -1125, -332, 180, -2561, -7894, 6925, 7658, -12908, -5335, 11718, 777, -12057, 4512, 18850, -6220, -16216, 17034, 10945, -21021, 470, 20776, -4051, -18163, 4452, 15362, -13114, -19827, 19068, 12852, -27735, -4330, 28342, -6950, -27318, 17107, 28507, -24283, -18220, 39598, 4757, -43807, 17408, 37761, -32581, -21653, 38510, 4004, -42383, 6604, 36367, -23286, -29139, 33307, 13468, -37979]
853c7979L8517L3419m0853j9217M1865J2907n0607k932O0741k0801n9400M7503
865C163M2501o9019j9477Q0212j0599q1719M8081O8117q5337k9359J03896k2530
877B7930q8328O5447N1865q1860j3100P7126j8008o2716L9373M1571n1526j8103
889c0329M6233J131l4752J75L2631N012m6186N378O2059l5870n6781P3698K7397
902D9796r4386J6122R2066o1169o9480R9095K4167j18487L6091R9322r0672m5402
914f2937J09337j7005q5471N6347M1938o1383m773M7640j2535k6476J4124Q397
926G203j109m750j6767K2662K0363n6624M751P4658n6883n2311J00356m887j06534
939f9872O6817P2277j05605j1417J13889n1525q4938R6986K5304j05341M3195
$$ y = [-37979, 538, 33957, -6896, -26113, 15752, 28659, -21948, -24880, 35861, 15060, -44340, 3163, 45664, -23355, -42832, 37380, 26781, -54938, -6857, 61260, -24077, -53436, 50460, 27930, -60398, 5049, 56914, -24946, -38046, 39080, 21072, -41644, -2271, 39300, -12226, -30329, 15904, 17035, -17717, -17542, 15089, 20101, -26085, -20707, 41352, 5482, -51299, 22399, 49796, -44590, -28468, 63598, 2429, -67051, 32044, 56211, -62276, -26185, 73137, -17535, -62937, 46400, 29395, -56076, 271, 42209, -19174, -23947, 23693, 11158, -15318, -1194, 7203, 6094, 1344, -15423, 7239, 27602, -29022, -24271, 50387, -6496, -58807, 41549, 36662, -69872, -3055, 69222, -36383, -47800, 66089, 14564, -70374, 26612, 51916, -53425, -10230]
950a0230O9281q2807r624P0510m0967k3650N1225k1735k3370L9172k0583k6956
962b9734N4730q421n7020N7306K4053r2068L5629Q3060r1408k2645J11827n5534
974I775q3060J03094J4106j00388N4670N9341r0792j730P7235n1653k6486Q0075
986D4187l5229n3649P5647j8916o8045Q7806J5053j02350N9335N7992j16775J2227
998d2717J19714p7176o6147J17750j7147j19443Q6002O6092j08936K2439Q3731
1009F4162q5747k5174Q1320l5163k2794O6849l6018m4963O2003k2272n7246Q9167
1021C4124K0738j12784M9491P5663j28153l77J53426p8513r3369J35675j2199
1032D3722j42164R2932Q7673j14591O494R7437q5048n5908J00020j1309n4936
$$ y = [-10230, 59051, -23756, -33380, 37130, -3837, -27487, 23738, 2003, -21367, 17805, -2778, -29734, 24996, 16575, -40445, 16861, 40914, -51154, -15525, 67535, -23873, -46518, 65309, 9775, -73285, 29809, 43915, -56473, -1803, 57538, -33254, -34984, 42251, -9402, -35888, 44187, 8958, -44691, 30956, 12040, -56005, 31801, 46854, -55496, 3839, 61831, -54944, -42717, 76997, -179, -66326, 51424, 34277, -85166, 836, 66928, -42008, -19569, 64162, -21585, -46759, 34561, -602, -23396, 43453, 7435, -37528, 24475, 2203, -55043, 34124, 54862, -57922, -8431, 67232, -60921, -61298, 92128, 13615, -79754, 55921, 43722, -98442, -5510, 82163, -32428, -25934, 71503, -13545, -69453, 30567, 19258, -35678]
1043c5678P5840r394q6255N6162J6083p0168P4353M6373j07233J9475O8093r4947
1055d7296m673J28956m8027q5764R6706q059j25913Q7000R0984j14212J0830R7420
1067G7952j11272n2510J27952j7206o9194R0037K766j12908L4716N8582n4622
1078b5707K7302O7069p1752l3279N2866m9518o318J07296l8979p0640Q0331l3238
1090E433j08711J10316P9698j21695J8563J02875j25209p4136J60908J1828j15365
1101e5495Q7066M8814j48191k745J12646l5169j9814O5513l0193n8481Q201j124
1113b8972K5331N3393l3341l0958M4050n2235p1532J18592O1764j22248K9729
1124f427R4101j42249n8668J75915q59j19265R1738M6155j59034n924J38071l4272
$$ y = [-35678, 40162, 30768, -55487, 675, 16758, -53410, 20943, 67316, -39917, -20442, 47651, -47296, -51969, 76987, 28960, -56804, 39902, 31843, -94070, -7070, 83914, -30298, -19468, 77952, -33320, -85830, 42122, 24916, -44278, 45759, 48525, -64383, -29667, 28915, -25707, 1595, 68664, -3088, -36367, 16499, -33019, -39337, 67959, 28980, -41660, 38671, 5433, -103278, 7038, 86736, -34959, -16396, 86479, -38730, -112866, 48042, 59870, -55495, 31571, 80385, -67806, -70551, 42095, 6926, -12888, 52625, 22432, -36049, -27848, -28972, -3641, 49752, 16411, -14547, 29503, -22732, -94264, 24328, 86092, -36156, -6427, 87674, -54575, -113243, 62672, 61813, -57452, 34286, 80441, -78593, -84517, 53554, 19282]
1136A9282n1474Q8504j5294j07000K5161M8732j3448L0770J7094l9504j1882k0426
1148b9485j7901O4345L3562m9371J0187J8696q5196j1759J10161r011o1531P2911
1160D5608p164j27627M5833R8464o6111j053R1462o9368r1805P2831L5257n4194
1172b7867M5372N4568q0396m3974M9786q617r264N6788n37m0463n716k0401n38
1185c1259M7177M317j2040K2935k9032n6209L4889M8326l0207N844M7435n5074
1197b898n8734N9069J9728l8658M4993K3181o8919j0448L2549j6780J1007M4060
1209C8150j9123l4058J3887j0077k3379M7847K9346m7290J424K3990m9863q929
1221c8075O2692m45l1767J6200R42l3885k487L1807J4459r728q516j357k959j3193
$$ y = [19282, -32192, 56312, 41018, -65982, -40821, 7911, -5537, 25233, 42327, 2823, -9059, -29485, -47386, 16959, 50521, 1150, 11337, 30033, -55163, -66922, 43239, 34228, -27303, 45608, 38444, -89183, -43350, 55114, -10997, -12050, 79412, 10044, -81761, -8930, 26327, -27867, 17505, 72073, -8323, -52297, -2511, -11128, -20392, 36396, 35859, -4604, -10320, -30721, -31259, 15918, 20235, 8195, 31130, 2098, -54111, -19222, 29104, -1103, 4741, 52176, -2898, -61632, -2563, 17165, -21493, 23500, 46681, -22238, -32686, -137, -16917, -5910, 38150, 19027, -15031, -1144, -11221, -34600, 13247, 42593, -4697, -3273, 20717, -29146, -38075, 24617, 24172, -7595, 8605, 9547, -24338, -26825, 4982, 19441, 9713, 1197, -160, -3119, -16312]
1235a6312j711L8072J3410m7241J528L7837m3243k3804P1571P511o5882J7612
1247a0652M1854m9722k5611O8709J1788o1225J4621L9449m1740k1233M8794J3381
1259B8413l4347n281K3775o714l0160J6213L7074k1534k9823K6570J2225l8085
1271b1674O02M8215j0984m5048K9956K6294m9727k35N4312j9890l7197L2474J4348
1284B1446l9565J091M0114j3003l1731K4939J4339l3720J013L1051q371k2540
1296a4937J1924J8026j8277j6564L0121J0216l7482O436L5879k4619k6709L7025
1308A1039J4621m4835R4M7662k3077m1701M5844K1540n6872N009N0588k4890l5429
1321c0407L6377K2623m1499j0400M4629m404m1920K1170L2481l1290k3627L3499
$$ y = [-16312, -18023, 20049, 33459, -13782, -12254, 25583, -17660, -41464, 30107, 37618, -28264, -10652, 31202, -18520, -44131, 24578, 36366, -24859, -10238, 29211, -12529, -33762, 15032, 28413, -5934, -11215, 12560, 5846, -24314, -8101, 28973, 7439, -22384, 4186, 16411, -21674, -21072, 27143, 16159, -28889, 1067, 27361, -22366, -22601, 31711, 11821, -25376, 7098, 21446, -18119, -17028, 23086, 10083, -21648, 3291, 17630, -16090, -15077, 15974, 7603, -14937, -3013, 15013, -3264, -19828, 10293, 20509, -16973, -10537, 25342, 723, -25986, 11039, 25660, -19175, -19081, 28581, 5504, -36197, 9647, 31187, -25685, -20676, 29912, 5022, -30407, 5970, 28593, -12906, -23306, 21323, 16919, -25001, -3831, 28650, -2640, -26267, 7232]
1333G232J6429l8489p506M7732j1133n1952L4306L9840n1261j4534N7627r100
1345A9191n4617K8830M3985m4528k2887N5462l802n3927K5260L5502l3884j4928
1357b0343L1438L666k8858j685K7579j877k5386J1343K3024j9160k1032K4929
1369C638J8857l2272o981M1645j4548m2139L5766K4210m6469K947M1989k5579
1381A064k8385L3971R839l2316R103K5538k2427j0460K2999o402r056J4059n466
1394B061n133R899j1270k469J8259j0475j2563K0036q93k4358J3423J9672k4874
1407h685l632L0738j7692k1548L2839j745k8555K4777J0144l0692J1496J8237
1419A5682k5195J267K5253j8704j3997K8832q010k8058L0205R774l8802J9328
$$ y = [7232, 23661, -14828, -22334, 25398, 14265, -37687, -3381, 36459, -14802, -29336, 28291, 19191, -35426, -6596, 37389, -7139, -30026, 25436, 21634, -32293, -7033, 28469, -5415, -20343, 11095, 14761, -14097, -15782, 11797, 9920, -15466, -4123, 18901, -259, -21291, 3638, 22495, -9777, -16758, 24887, 10339, -31800, 3966, 28176, -18293, -15346, 26643, 1064, -27321, 6650, 16489, -15827, -6724, 18814, -3613, -14073, 8926, 2524, -6532, 7527, 2061, -3072, 6827, -4443, -6912, 11347, 872, -11691, 8345, 7452, -16906, -3483, 16189, -8685, -12317, 18421, 729, -20819, 12020, 10275, -18280, 6497, 16641, -14051, -2555, 15682, -9513, -8246, 17007, -1697, -15694, 13138, 5128, -22930, 7275, 17049, -21753, -2425]
1431b425K6775l9900L26L9013k4580j8606L5512m584l0312K0896J3782k7753O846
1444e010K0916k2660k133K1241k0417j938K6525k2678q421L4908k1119k4720M2861
1457A7355j000m4224L1531K9030n3542j054N7585l3937l8725O0417J235o3051
1469c8380L5596L5602n3209K176M5560k7162k2059L1099j450j9946J6028M057
1481G912j3540J1416l639j6697K5733J908l6867L0005K1913n7281J1451N7119
1493C9433m7815k8540O9053j2432o6393M8489L9889o8063K962O7247m2836m1394
1505d0400O1416J93n0348L3214K1158l9641N686J8675j7097N700R939j6634R484
1518A345J0290l1382R296L9961l5606k1141N9429j8227o1915N8577L2501p7404
$$ y = [-2425, 24350, -15550, -15224, 23789, -791, -19397, 16115, 11531, -18781, 2115, 15897, -11856, -5010, 15906, -6754, -8887, 12354, -8063, -10001, 16524, -6154, -14575, 20333, -786, -25506, 17355, 16355, -27869, 3662, 32692, -20850, -21904, 35681, 1744, -36981, 23436, 24671, -38380, -2784, 32818, -20391, -18215, 27345, 183, -21876, 9223, 7773, -12173, 3855, 7912, -5628, 5788, 2149, -14548, 11185, 13093, -23774, 6231, 28144, -29137, -17686, 39433, -8382, -36922, 32131, 19699, -46694, 1795, 41684, -26379, -23417, 43830, 994, -40400, 21016, 21209, -29139, 4075, 25233, -14408, -8722, 9953, -7144, -1444, 8495, -8139, 1345, 11635, -19747, -10451, 29510, -6096, -27237, 32192, 13965, -47950, 10627, 43128, -34276]
1530c4276J7746O7809o1406l6767P5137m676o3165M2717L5029o1051k238M9889
1542B4748k5088j8105L4585q596j8656J4680r200m99K4121j8729j2747L3794j6565
1555C743l8902M4605K2286n9298J4676N4891n6066l0219P5495j1135o1287N3258
1567A2047K5835o9703J1923N2809l7978j6449M7025j3834l6766K7852P712k6988
1579a6515K2419J0539l0008J2849J0250l0783J8970K5589l4144J855L2322l2877
1591i534j5912M5046o581l4629L3428J1168m9902J5686L9151l9520m194M6381
1603C0588l2243k8991M5498o010l4848L7356J2643m4873J2561K9273l3738l310
1615a6094M2841k0164k8177L4599l963l4452L0428J5897l4542J1558J7297k9691
$$ y = [-34276, -16530, 51279, -10127, -46894, 28243, 23567, -39598, 3119, 38148, -22903, -25141, 24748, -340, -18445, 16140, 7544, -11112, 3568, -5632, -6131, 17990, -739, -13486, 20308, 3743, -35159, 9446, 31732, -27566, -12890, 42001, -14065, -44284, 31211, 20076, -41211, 12047, 37882, -31821, -19898, 32911, -5067, -21516, 25509, 11675, -25091, 2761, 10473, -16515, 5904, 16443, -13565, -716, 9534, -21249, -2279, 23310, -10834, -8979, 23343, -9534, -25446, 19600, 13019, -21610, 11818, 22986, -26916, -11230, 27921, -11599, -15793, 30588, -1655, -30646, 14852, 8842, -26006, 11350, 23993, -20880, -8319, 20954, -12784, -16094, 26747, 6583, -21594, 13005, 9042, -25410, 5018, 20915, -13627, -2069, 15228, -14463]
1627a4463K765K5329j5901m999K1252j4791j5495K3562j721j9259K5323M580l5474
1640a9292J7434K0410l5990R025L7792l4053j7748M0401j3258l3911L7350J7268
1652B5428m4139P376L5853l3458j6083M5696o760l3963K5609J0042l0629P482
1664g546K0638j0904n055N554l483j862k99k536J1061M977k1065K961K3375k2470
1678f654j4598M2220l338m4960K8715K6385m7659p0N1317k2014l8155L6401J4776
1691B2366m5250P467M2497k3554k5084K9097M101k6041N428J9828j500j4572j955
1704g172J5176k740k0438J2966K4907k2048k1758L0177P672m0563J2386M3934
1716C2499l2652l0512M5366L147m6764K1503L8079l2262k0652L3921K295l2890
$$ y = [-14463, -11698, 13631, -2270, -7269, 13983, -808, -16303, 7259, 5538, -13721, 11602, 16182, -19292, -1858, 18552, -17438, -8413, 29379, -4674, -22422, 17979, 4721, -29190, 8160, 25428, -18711, -11335, 24518, -8940, -25023, 20673, 13913, -20050, 5559, 15601, -15028, -7546, 13092, 2188, -2867, 2687, -796, -2658, -2957, -5493, 5568, 10545, -10520, -7559, 15816, -6654, -21252, 20968, 17630, -27330, 1385, 27770, -19889, -19959, 31358, 9344, -28811, 7590, 22366, -22884, -15417, 27080, 3526, -21558, 7539, 11640, -14401, -8973, 10855, 9355, -5217, -7172, 8004, 5264, -15174, -2208, 22699, 651, -21107, 9070, 16742, -23821, -11435, 32499, -153, -30665, 14701, 17848, -28916, -7413, 30666, -1596, -22248, 11673, 13968, -18922]
1728a8922J1927K8767j7814j7960J6655N842j5093l555J6475P695k1391o734K5245
1741A1137o468k5095K3286K0242l1236r409L2027o236k9900K3716K4545l4759
1753h150r497L3874j1593k5290K5391J3070k4989l450J7002m484j3221J0156J3331
1766A2150j1011r475R031L258q069l06J2493J822j7366Q50J6695j2385r795K2755
1780A0647N74k4060P913J4308j5376m843K1311j426k0056Q375J1638j6015L72
1793f638J8065o462j0480O751L53n395K064M939J603n020l983K927P59l091K553
1808a055O817k616r539M692O103j0164L108J3840r393q603J0726k078q962Q743
1822A619N857q478j897N539n581l739R702K05o394O000j465q848P589L900o788
$$ y = [-18922, -6995, 21772, 3958, -14002, 2653, 8495, -6598, -10153, 6322, 14017, -7374, -14108, 11137, 4669, -20426, 2860, 23102, -8134, -17543, 14484, 8248, -21652, 2064, 26609, -8150, -17647, 16227, 4634, -20656, 4735, 17805, -7184, -10634, 6368, 1884, -11337, -1181, 12150, 1139, -8336, 695, 3953, -4116, -4422, 8071, 9893, -7473, -6623, 10072, -2313, -12108, 10647, 11221, -12839, -4926, 9382, -5994, -10837, 10474, 9048, -11008, -2633, 9005, -7010, -6638, 11427, 4965, -5515, 1236, 1589, -3806, -1742, 3197, 4800, -220, -4203, -1276, -517, -3608, -1055, 5762, 3146, -6393, -1701, 4402, -5762, -2654, 11186, 1793, -6810, 3916, 1838, -7124, 1619, 7476, -1002, -2899, 2640, -2941, -6680, 3022, 3227, -3167, 2833, 1368, -7480, 109, 4009, -2779]
1837b779M784M504r008j571O656j697l084N511J035p632P20L181l578K510L085
1852B637m209K943l99p996P556N185j0418M161J0425j1669p485J5324L48j6115
1866i712R932J3913k0312n725K2394q039j6339J7933O744j8417J183J3099n566
1879A088q600Q318P509q368n283P107K785o253l643R662N122j6873j078K1258
1893A2751j2366j8338K5638P784l0845O667K7211k0321j8016L0321O238l2588
1905a5864R728K6263k3872j3342K8316o69k1715Q554J2050j0542q322Q536R080
1918H201q419q761J1433O156j5941l099K1699j835k4637J4282K1347k9901q669
1931a8144L7962j0186l2236K6916J6404l6005K85L3521j4287k3632K4842R696
$$ y = [-2779, 2005, 6509, -2499, -4070, 2586, 889, -2195, 3316, 4351, -3281, -2561, 620, -2958, -448, 2637, -1572, 1371, 972, -7024, 532, 5717, -4701, -540, 9885, -1784, -9269, 6055, 6403, -9712, 220, 14133, -6179, -11904, 10490, 2451, -13888, 4045, 10789, -7628, -6445, 6654, 1088, -7512, 806, 8315, -53, -5336, 1771, 4556, -1697, -5340, 4322, 9444, -7429, -8507, 12751, 385, -17953, 7685, 15469, -15376, -8709, 18502, -1819, -19835, 10486, 16724, -15864, -6136, 20127, -3745, -17087, 11229, 10560, -11155, -2601, 9449, -1093, -9415, -879, 8201, -218, -8979, 2454, 8610, -7331, -10430, 11269, 9434, -15203, -921, 20426, -9475, -18144, 19818, 9632, -22604, 4312, 20716, -15289, -15004, 18517, 4230, -19402, 5440, 15136]
1943A5136k8639M604K2069j2479r466J3047J456p502k216L311P290n704q787J2270
1957D390M837j9497K021K2138j2174j9125K4756Q130l3539R442L0346k6288j3460
1970a8023L4009n562k8958J9239J5640k4312r64K1820r730j4180J3561K444j0674
1983e690N058K907l991M229n248k979J2858n873j1358J6891K999k1598Q451J8304
1997A4960j9208q170K5830n920k4787J9640J2088k7207O035K1880j8757p567J9617
2010H434o194j1947J3155K019j0998O704L863j0426N368P166j2338L094J2329
2023A0229j5196k779J8580j1496j0960J9961l307j7417J3764P834j7671M269J4941
2036A0752j3162n789J6982o398j1952J6119o53j5933J3563M345j7782R498J0672
$$ y = [15136, -13503, -8899, 13170, 691, -8775, 4272, 5728, -1774, -3990, -679, 6611, 907, -7880, 4390, 9227, -10270, -8249, 13889, 1715, -17410, 7346, 15476, -18063, -8621, 21725, -4563, -18023, 15986, 10424, -18534, 705, 16345, -7967, -8931, 12889, 3159, -11021, 2540, 4984, -5690, -632, 2275, -1716, 2513, -2735, -5714, 7144, 1271, -10087, 6804, 9803, -11795, -3344, 14960, -4248, -12418, 13412, 7492, -17295, 2345, 14433, -12774, -6739, 15141, -3616, -11183, 8434, 2240, -9707, 3448, 5467, -5531, 1173, 5036, -5390, -22, 7144, -5194, -2100, 10229, -4967, -7746, 10834, -662, -11622, 8339, 5032, -12385, 1379, 9213, -8458, -4189, 10752, -2410, -8199, 8783, 2385, -9567, 6552, 5899, -10034, 3529, 7874, -9908, -410, 10262]
2049A0262j7924J840J5990j2812q031J8737k790j7229J4094Q695k0165M980J7066
2062A2713j5820m379J6909p997r558J2747j335q455P136K62p536O227K014r103
2076f175O794O943j4890K922J6171j6079o650K4900q953k0720K1782O627k6533
2089a3861Q669K1884j9318j1168K3415k943k1631J4320J2961j8037m16J3379p522
2102b68n373O740O97R68j651m826O070K379j1959M428J5275j2623j2701K0038
2116G194J880k6093J3674K2984k5776q779K9171r546k3756K1877J3244k2856n90
2129g372J8982j0119j3646J4635O109j1251J041M499l792j569j922M407P991r721
2143a728n916J4016m594j4799J5165J2434j9441l197J9841j0517j7762K1723R801
$$ y = [10262, -7662, -5822, 10168, -2644, -10675, 8062, 5272, -11957, 2137, 10832, -9333, -4353, 12713, -3107, -7486, 9423, 1426, -8132, 4615, 3280, -5175, 1961, 2223, -5313, 914, 2928, -6175, 619, 7562, -7328, -4406, 11765, -4314, -10964, 13936, 4983, -15737, 6045, 12672, -13861, -5192, 16692, -2626, -13794, 9621, 6678, -14953, -633, 12328, -5709, -6125, 7254, -268, -5641, 1099, 1796, 2764, 1113, -3713, 2357, 4736, -7223, -2795, 12480, -143, -12844, 7194, 9074, -17019, -3345, 19639, -6137, -14916, 14255, 4709, -19047, 2830, 16074, -6782, -7372, 11610, 1491, -12155, 2480, 8589, -2662, -1621, 2878, -914, -2483, -4405, 2, 7993, -1728, -7644, 6372, 1778, -13021, 2144, 14578, -4863, -8060, 11781, 1264, -16498, 5225, 15026]
2156A5026k4169M838J7382j8822p603K0236n25j2118O896M335j0398k071Q758
2169A765J685k372J255j622j300j381k993P591O013j1440K96R910j3278n684J9404
2184G849l82j5373R219P442j8107j875K1156m378j3693J3896L053k0054M749J5166
2198H668p599l437Q241k915q770M22N634K451j540l36Q57k047o221J387J1029
2213E824j062r019P874K459j6347M075J6472q600o206J1826l402j4300O051J0857
2227F502o665k421Q731n258r273O651K910k351N258r30n202J685j490k189P092
2242C050K590n730l01K362n284k341Q674J409o391K528J080p059K242N223j628
2257D24J804k95m453J873J159l536M102N431o148m666O725q09q850Q015Q090j2133
$$ y = [15026, -9143, -4305, 13077, -5745, -13348, 6888, 6363, -5755, 1141, 5476, -4922, -6993, 1765, 3450, 1078, 2333, 711, -589, -1970, -4963, 2628, 8641, -2799, -2503, 7407, -5871, -11555, 7849, 7467, -7906, 1313, 8755, -9352, -11227, 9929, 5551, -8142, 5754, 8807, -11247, -6498, 8668, 1069, -2368, 5873, 2958, -5812, -5390, 244, 2695, 1155, 819, 1676, -371, -6592, -5205, 5824, 4762, -4257, 3617, 6076, -10271, -6196, 10276, 1676, -4530, 7296, 3894, -10406, -4355, 6502, -163, -2584, 6147, 889, -8384, -1733, 1177, -1174, 4084, 3154, -2048, -363, -1853, -4042, 3050, 5640, -90, -391, 1971, -3313, -5654, 3020, 4429, -1962, 566, 1646, -5413, -3171, 2052, 424, 2228, 1933, -2520, -647, 512, -3024, 1078, 6509, 361, -4305, 2420, 1611, -7239, 776, 8866, -3267]
2273c267k246J1249o643p291J0569M050r204l79P044l314n993O285M848o177j787
2288b256M328m49l725q69N788J094q824K329R081r078n077J2738k27j2213N521
2303a839J0473j0196o740J4109P32j5061P393J1257j2701m477J2677k269r813
2316f455M613P299m941o337O228M374q541j031R679n46q793K226Q377n688q737
2331h273J1688O320j5794Q59J4891j0272j0346J5091M661j5197J383J2992q287
2344b84j0345J3308O112j3648J536R898o819o250P097N661n408m689N985J754
2358C908r650J157J1305l576r240O253N645j1254k489J5341j659j4294R421Q014
2372H882j5818m09J6426m734j0986Q757M645j2391j039J2772k426q466N780K972
$$ y = [-3267, -5513, 5736, -907, -8198, 2371, 6421, -2783, -3162, 3882, 568, -5425, 860, 5708, -469, -2256, 2072, 1623, -2102, -2971, 2817, 3911, -4913, -2584, 6497, -2581, -7658, 5080, 4853, -7360, -1839, 8634, -1562, -8302, 5807, 6539, -8522, -1129, 10128, -2573, -7050, 5627, 3358, -6455, -1842, 5457, 516, -5821, 407, 4781, -3760, -4791, 4888, 4342, -4451, -2225, 6152, 464, -8273, 3415, 9735, -6059, -5200, 9691, -581, -10927, 4164, 8825, -6372, -4989, 8003, -284, -10629, 2679, 8791, -4857, -3321, 6577, -242, -6492, 605, 6266, 858, -3831, 2154, 3908, -5742, -4585, 6720, 3144, -6096, 157, 5802, -5452, -7941, 7400, 5741, -8553, 868, 8882, -6936, -7345, 9081, 4347, -6639, 2118, 6763, -5628, -6667, 6105, 3679, -4787, 993, 3965]
2386C965p982j160O408K679l975k301M822n14q275M177R745o201n934Q250M54
2401D158j1414L514J1948p085p380J0772j020j2670O810Q896p640j592O983l349
2415I31n837L892M071k427K8J929k810j488P07l32L369Q85n163K353J457o545
2431d980K444P178m279k647M814k008n342M266M733m748K00M855n861l002O835
2446B458k098k493O186k673n870M674N42m592M457L765n393k064N101k212m334
2461d546P190K338p586K437L174o184J340M950k546p44J267k321n95J346n36R54
2477f2K706k909k945M407L1o115O268N394j0411L98R802p999n237J1918j71j0629
2493e554M612O662q892l121J0898j138q856N687L925p295J68N018l39j673j209
$$ y = [3965, -4017, -5177, 1231, 3910, -65, -2366, 2456, 1942, -6333, -2156, 7589, 1388, -4546, 3704, 4158, -7256, -3742, 8206, 1121, -6259, 4513, 3493, -9177, -2367, 6529, -1111, -2703, 4280, 931, -4906, -1014, 3057, 630, 658, 2587, -223, -1711, -1004, -1336, 2033, 2918, -2245, 108, 1565, -4980, -2536, 4642, 363, -2284, 2530, 522, -4820, -554, 4179, -569, -369, 4486, -1375, -4377, 2458, 360, -2133, 4053, 1380, -4490, 184, 726, -3866, 591, 4356, -1037, -3101, 2000, -212, -4546, 2644, 4982, -2604, -167, 3007, -3177, -1837, 3113, 567, -177, 1090, -1231, -1826, -480, -1016, -62, 2644, -265, -3210, 1197, 1228, -4887, 1381, 6775, -3636, -3238, 6564, -1435, -6672, 5246, 5075, -5554, -942, 5720, -3172, -6293, 4605, 3467, -5389, 298, 4223, -3072, -2904, 2114, 1775, 102, -1107]
2508a107J981J890n422m60P866k212p879N547N882j0246k980J3893k667j3720
2522i634J0819P812j6106N25J5922p315j0459J1659M120j2854Q78J1237m699p725
2536e820P661L005p793p95N350Q77m218j542O185K89r395L715R679p987n884J1886
2552E213O94j3971N033J2645j1017p169J5766j423j6006Q757R980j2559j806J1943
2566F080l520r150N537N803o128j866O367l26n127M82L402P23l621o00O127k708
2582A475q161P066N625j0659O95J1073o554q912J0017M691j1669J814J1772q386
2596a13p637J1638P75r958N324N587o730k290M636j30k568P47J901n25k337l72
2612b052K402J664l471j65O106m274o046Q215K073q822L885O777q586k825Q524
$$ y = [-1107, 874, 2764, -2658, -3118, 4748, 2536, -5343, 204, 6086, -4160, -7140, 6753, 4086, -9634, 1185, 8997, -7109, -6584, 9338, 2023, -8436, 3223, 7343, -5511, -4633, 6604, 1905, -5820, 1841, 4846, -2947, -3742, 1608, 2485, -1733, -3275, 2910, 3199, -6196, -2481, 7198, -789, -6673, 5213, 5907, -8064, -3031, 9614, -1403, -8572, 7194, 5771, -10235, -1478, 8502, -4057, -5863, 6080, 2560, -6590, -1053, 4750, -1378, -3244, 3123, 2797, -2330, -1848, 1554, 2277, -1344, -1944, 4183, 1475, -6686, 380, 6005, -4654, -3959, 7114, 560, -8352, 1665, 6356, -5313, -3499, 8273, -113, -7750, 3888, 4663, -5295, 29, 5616, -1114, -3404, 1232, 1102, -1466, -719, 1182, 657, -1680, -2052, 350, 2014, -1457, -1622, 4484, 210, -5836, 2379, 4452, -4370, -485, 6292, -2294, -5119, 3405]
2627C405j283o498M672L919p268n69O308k942k203N027j769k554K417j049o00
2642i87L231j718j482K436r03l472K902L058m179o74M672l699l342N792P6m285
2658b574L704R98m847K309K135k686J266K419l245j161L410j921k621N140R6o005
2674c583L063L320o096J406N954m210k946M774n97l799K539L117k874j088K481
2689A461j376j517K046r7j54M71k414R67J943l436R62M455l336l529N189M21n462
2706c406L277N281o008l077P727j780p303O488M020q398K98O473l798m112N173
2721H55K592n195j162M894q70l903K488L453k097l517J806M123m180l428Q022
2736C881L14r666L517Q037p885m228J0168N45j0614K813R753p464n713J0841J051
$$ y = [3405, 2122, -4376, 296, 4215, -3053, -3622, 2686, -256, -2459, 2568, 799, -1755, 662, -387, -987, 2244, 526, -956, 1480, 577, -2895, 7, 3065, -1114, -1788, 2884, -815, -4157, 1635, 1711, -2574, 1130, 2128, -2719, -410, 1725, -961, 305, 2724, -521, -1682, 1728, -193, -2814, 2326, 2422, -3583, -520, 2800, -3296, -1890, 4064, -146, -3092, 1682, 1085, -2714, -175, 2942, 68, -1020, 1461, 85, -1432, 614, 517, 363, 834, -1580, -613, 1330, -2106, -1144, 3311, -25, -3554, 1635, 2056, -3406, -129, 5152, -856, -3933, 3794, 2014, -5289, 1199, 5219, -3179, -2881, 3592, -206, -4318, 855, 3447, -1748, -2910, 1984, 1114, -2789, -301, 3152, 1055, -2462, -656, 3467, -713, -4141, 3881, 4195, -5471, -1954, 6083, -1802, -6030, 4138, 4683, -5931, -3118, 6635, -829, -6542, 4299, 5350]
2751E350j0636K987P742n418m301O062K887o447k200O517O6o439K476N969m399
2766B16n580N240M604p268j246R615k879r368O800N900r041m31R072l277p807
2781e450N196M673o418j270P353k149o420L610L169l405n24K969R43l635j112
2796b470M185p8l690K690K895m517k518M931P46n061K603M488n613l220O954p06
2812A619n387M537L302o162p49M923j051l519L480K625m545j504L697o91k010
2827a435J989J331j716k059N47K632j673j437L855k93m424Q88L881j903j869L739
2843B053J052n548O28M139k761j287M271j168l639J402R34r35O70J151k17j262
2859e17k78J99J46J557j75q22J288j472k041K600Q89j843R84O09k176o13R84J229
$$ y = [5350, -5286, -2299, 5443, 25, -4276, 1786, 4673, -1774, -3974, 2543, 2609, -3830, -1354, 4615, 216, -5364, -124, 4480, -2788, -4034, 5581, 2702, -6666, 134, 6034, -3007, -3438, 5634, 2357, -5450, -254, 4419, -1999, -3269, 4084, 1935, -4485, -875, 2294, -1111, -1635, 1334, 2277, -1358, -2470, 1715, 1637, -2053, 637, 3532, -985, -3503, 1428, 2174, -2887, -284, 4204, -1409, -4629, 2325, 1619, -3768, 769, 4071, -2091, -2840, 2083, 1032, -2487, 993, 3618, -927, -2431, 1266, 575, -1435, 554, 1885, 169, -1890, -1343, 1289, -384, -1821, 2034, 1741, -2683, -1795, 2086, 183, -1686, 2053, 3105, -2443, -1815, 2324, -437, -1724, 2547, 1379, -2260, -858, 76, -859, -189, 962, 745, -517, -795, -596, -450, 1107, 932, 110, 1398, -74, -2115, 485, 1374, -469, 515, 1124, -1052, -1665, -681, 548]
2877E48l44j89L49n32q15l1P86K033q44j950K161k81l796K769L663m019j150L694
2895B052j496m129L012L615l659j511M559j639m437L406L024l089o69K474l84
2910A129k531j33L622l73l380J771K132l483j750M110J368m693O16M997l566m597
2926d761O360K038o708J844N467m539l681N452J970n803O52N245l032m234M230
2941E00J859m253n6L592l60l506M85M387j969l842M031K676n429o40N672j674
2957A473n140L797M598o524k028P377j979o340N107L716o178r32N633j144m938
2972c502L280L686l768j991M349l87l843J201L083j015k972J365L133l693k326
2987c400N261L67n494K541M203m642k533N738J053o197K242N272n689k499O394
$$ y = [548, 204, 15, 364, -168, -983, -1014, -228, 1805, 961, -989, 1172, 891, -2905, -136, 3527, -492, -1642, 2052, 556, -3573, -561, 3054, -605, -2116, 2443, 804, -3633, -227, 2797, -292, -961, 1513, 1129, -1402, -1535, 2087, 1714, -1666, 105, 2237, -1246, -2996, 1114, 2482, -2211, -1595, 3402, -164, -4761, 1599, 3637, -3071, -1227, 4240, -299, -3980, 1472, 3442, -2361, -1709, 3536, 504, -3730, 500, 2359, -1894, -1950, 1642, 1282, -2224, -1739, 2648, 679, -3163, 868, 3544, -1885, -2525, 3147, 1473, -3667, 130, 4728, -1796, -3824, 3553, 1574, -4766, 341, 4057, -2121, -3053, 2580, 1436, -3502, -222, 3464, -304, -2295, 2054, 1667, -2176, -975, 2108, 1093, -1879, -514, 2619, -1074, -3400, 1861, 2228, -3266, -725, 3478, -1164, -3697, 2041, 3094, -3103, -861, 4411, -1278, -3777, 2617]
3002B617l52n202L045K726l986j430L098J040k982N46K696j692j906J317J732
3017A267r16j640J848J729l816o85M983j761l597L666J464m618r4M186j526l000
3033b510L222J573m488N67L483k327m84K493r52j360Q23L6p2M84p4k44L58q31
3051c03j053J221J158j957N64J888k385j020K980p88j474K194j37j962J009N91
3067E26o63K20R68r98m62J172j320o33K310p34k153K449K08l167J889K214k538
3084g12j27K654j330k108J997J018j936L5K195j719j086J592m23k46J88l06L94
3101H0J85j522J072J458j807l11K422q44k644J914K352l493l74M242k262l421
3117b953M141N62l907J453K769k224j744K363P70k179K3K337j014j369Q07Q15
$$ y = [2617, 2265, -2937, 108, 2834, -1152, -2582, 516, 1556, -1426, -880, 1816, 124, -1782, -465, 1267, 351, -1289, 559, 2288, -1528, -2213, 2770, 1009, -2588, 1078, 2542, -2076, -2170, 2016, 490, -2510, 712, 2285, -2203, -1636, 1847, -480, -964, 1529, 577, -783, 40, 76, 4, 488, 414, 170, 528, -303, -1356, -135, 1023, -934, -370, 1518, -867, -1887, 1093, 305, -1169, 1025, 888, -1074, -65, 526, -137, 83, 1051, 53, -409, 763, -557, -1190, 1120, 386, -1767, 682, 890, -2277, -388, 1826, -712, -839, 1815, 485, -1623, 374, 1392, -544, -509, 1686, -33, -1119, 473, 50, -196, -8, -314, 80, 265, -1257, -185, 1273, -534, -845, 1577, 733, -1911, 3, 2355, -1138, -1512, 2730, 468, -2953, 1188, 1750, -2157, -704, 2065, -159, -1903, 460, 1230, -949, -926, 1411, 397, -972, -165, 650]
3133F50Nj310L47K417k347k262L909M0m193K211L475l979j817M517L4m611K204
3150g10M180m161k167N325q88m225K642K475k830j427K373J128k937j47K950m21
3166A160k971J085K209j381k544K908K350m534m31N514k515m280M700K219n748
3181b259K63M927k366l885L808K500m911j29M633k205k796K708J417k179r84K144
3197F86P16k437j12L056q91k876J911J994k424j518L417K34m209J433L767l823
3213a076j576M732q78l770K467K271l062q10L514n19k973J553J978k540l45K168
3229A134m98j635M83J095k42j543Q33J664j654j262K340J48k153P75K344j639
3245A90k169K942O73l446J233K937k855j445K812j48k128Q85J816j431j194J613
$$ y = [650, 655, -655, -308, 2109, -238, -2500, 1409, 1449, -2744, -533, 2942, -1037, -2854, 1663, 1697, -2914, -710, 3470, -691, -2858, 2467, 1579, -2646, -4, 2471, -359, -1786, 587, 1715, -1222, -1369, 1581, 1160, -1811, -726, 1483, 102, -2442, 466, 2816, -1718, -2149, 3365, 850, -3430, 1270, 3489, -2259, -1996, 2931, 565, -3320, 488, 2988, -1923, -2052, 2581, 376, -2420, 288, 1705, -474, -1458, 686, 1402, -1035, -1147, 1909, 1018, -1858, 53, 2047, -377, -1895, 1522, 1756, -2453, -1020, 2747, -1076, -2652, 2080, 1202, -2568, -101, 2170, -892, -1702, 1812, 1293, -1680, -127, 1851, -689, -1034, 1134, 636, -999, -516, 579, 337, -1206, -373, 1291, -363, -1625, 715, 863, -1290, -515, 1829, 190, -1979, 963, 1636, -1810, -577, 2360, -495, -1940, 872, 724, -1404, -519, 1297, -134, -1328, 285]
3261B85L42j250N69Q82m97m43l30N85M22r58K71J277j444j005J632j60p54M25
3279a51Q15n97r18P62N32q76N82O44j017M71j93q89J316K14j478J291L00j501
3297f93l91J703J93j898R57J510k122j282L188k69k085J447J228j900o92J361
3313B55Q75j538l36K137q47k301J212J667j321q65J938P09l200oL384j405k322
3330a964L351Q07l834K11L120j316j992K400J655l634p44L573j410k195K537J351
3346A916k627j026K084M20k044P41K878j905k498K105J222k542L98L079r49l437
3362b185J539K269k689r23M430r84l835J789K187k788p21L827J36l936R74K827
3378A917k675j189L611L7k576J59J432p77j933K250K270k686j668K715m48k542
$$ y = [285, 627, -623, -54, 828, 331, -112, -442, 143, 565, -393, -122, 1155, -289, -1294, 338, 178, -576, -151, 664, 67, -851, -89, 443, -433, 149, 793, -224, 247, 54, -835, 481, 695, -783, 508, 808, -693, -1084, 619, 812, -1086, -129, 1381, -741, -2023, 1165, 896, -1189, 258, 1486, -414, -1106, 255, 1130, -408, -744, 1393, 546, -1755, -543, 1124, -197, -1062, 876, 1585, -1615, -1621, 1763, 358, -1964, 1387, 2194, -1640, -1429, 1691, 375, -1617, 783, 2438, -1196, -1940, 1633, 223, -1972, 565, 1916, -711, -1737, 347, 767, -1277, -536, 2342, 437, -2061, 44, 1266, -1276, -878, 2201, 1252, -2185, -646, 1623, -1066, -1989, 2441, 1457, -2378, -589, 1598, -1190, -1911, 1916, 2052, -1884, -910, 1917, -758, -1947, 1664, 1701, -875, -716, 716, -61, -1994, 256, 2526, -160, -1828, 887, 439, -2103]
3394b103J878K887k231k505K701O82l559J406M117k613k637K960j43l082J125
3409a117L364j154k503J526R62l080N19L392n42k286O55J031j362j098K438J576
3425B321k672r34K524j416k320K936J831k668j001K340n99l149K735K693k798
3440a77r10K498j428k038K128J576r51j163R81l99j662N36K030k11r92K2J03o38
3458f95q69J845J473j880l40J399j611r69K270Q17j299n4O18j175q85J524P37
3475I06j153O54j76j107K23N78l6Q29J95j363Q0K83l73M50J198m88j031J20L49
3494A38j128O74J570r02p78L87o38k60R03J29O85l75r62L3N77k18K03J035k4j795
3514g46J16J425j416j74K581r53k536J811M11j914P57K122q62j682J101O03j684
$$ y = [-2103, -225, 2662, 431, -2074, 627, 1309, -2250, -844, 3273, 660, -1977, 983, 840, -2242, -1117, 2247, 1093, -1410, 116, 1078, -2002, -1483, 1909, 1367, -919, -264, 767, -595, -1693, 745, 2321, -351, -1285, 1239, -177, -2497, 439, 2270, -398, -1399, 941, 342, -2807, -72, 2621, -177, -1087, 1411, -17, -2055, 73, 1649, 698, -465, 516, 117, -1545, -1009, 1021, 810, -182, -160, -57, -695, -1564, 281, 1754, -126, -466, 933, -678, -1647, 623, 1440, 141, 87, 705, -470, -1355, 169, 906, -247, 407, 231, -876, -653, -75, -111, 718, 913, -450, -370, -87, -460, -10, 1188, 700, -331, -211, 138, -990, -316, 1254, 352, -426, -39, -677, -937, -34, 95, 780, 405, -557, -524, 53, -165, 38, 1073, 1049, -746, -630, 795, -621, -795, 1786, 833, -1703, 108, 519, -1395, -638, 1484, 622, -1060, 41, 644, -1040]
3531a040L64K064l78j561J72M46m2q30R58J453j718j310J990k01j985J423K220
3548B025k042j650K369K58l032J470L447k889j630K995n44k701J492K303j530
3563C41j557J335P20k177L43K354l90j955O86J318j104j623K188J945l389l77
3579a342L346j833k707L349J539l364k77K887j238k994K804K125l573K6K979j694
3595C3j979J957J540j581r59J699N00k398K08K500r02j895J404J295k230r56L077
3612A313P0l035J249K597l253j172M064n14l236K015K034k792j174K975J62k821
3628a518J406J996k396j080J955L42j311j1J538k81k179J128J994j699r91K098
3644I91J17k534O51K391j478j884K647O21l263Q29K383j770j094K309r2j848K81
$$ y = [-1040, -676, 1388, 1010, -551, -379, 67, 25, -805, 153, 1606, -112, -1422, 568, 367, -1618, -195, 2025, -17, -1667, 702, 960, -2072, -602, 2845, -44, -1674, 1321, 777, -1924, -432, 1871, 341, -1216, 119, 839, -1338, -995, 1359, 969, -986, -300, 1018, -86, -1709, 479, 2424, -965, -1342, 2004, 171, -2536, 813, 2352, -1012, -1289, 1598, 360, -2634, 170, 2295, -1278, -1252, 1727, 33, -1946, 11, 1551, -30, -989, 710, 1210, -1188, -980, 1520, 618, -1277, 127, 1422, -808, -1764, 1313, 1383, -1652, -403, 2194, -1059, -2231, 1833, 1319, -1917, 98, 2132, -660, -1834, 1141, 1303, -1518, -112, 1884, -512, -1592, 363, 705, -606, -617, 921, 640, -1539, -411, 1583, -116, -1107, 991, 1108, -1426, -775, 1616, 138, -1746, 901, 1522, -1741, -912, 1471, -299, -1393, 916, 824, -1024, -743]
3661g43J575p21p86J141N69j644J99Q64l46k37o2N92k40j147P62J030j039j53
3679c86R72l83j010O90O15p36o2J031k81j299J199J2q85P00L88r02K24K75n16
3698c54K29N08k85m14L16K43p97K67J167j044k72P23k4q19N46L23j78k44K29K57
3718C77n91l70R71j36r44N18N57l63r33J160O33j498j82J881r72j289J829N12
3736A160j985L27J685j054j462J331J413k413N7K138j125j551J695Q11j303o71
3752i47J585J03j758N88J929j415j262J762L64j984J70K135p72k253J854J787
3768A886k763o65L252r90k420J607J749k244r02K963k51k811J233K265k390j230
3784a711K782P5k607P22K146j257j776K006J378k730l41K685q15k201J354K215
$$ y = [-743, 832, 111, -675, 466, 1035, -609, -410, 454, 108, -129, -191, 401, 161, -986, -224, 806, -233, -386, 586, 203, -807, -117, 498, -238, -300, 731, 450, -849, 350, 362, -523, 177, 565, -337, -113, 162, -354, -125, 383, 98, -316, 0, 243, -554, -287, 880, -164, -436, 287, 263, -556, -10, 313, 135, -109, 120, 377, -214, -584, 387, 251, -693, -175, 382, 19, -914, 246, 879, -619, -801, 1080, 108, -1181, 648, 1160, -825, -498, 1187, 133, -1329, 2, 1415, -998, -941, 1197, 72, -1479, 216, 1027, -276, -947, 638, 741, -1017, -429, 1500, 85, -1177, 585, 949, -1035, -865, 1270, 498, -1755, 99, 1886, -877, -1542, 1710, 720, -1700, -93, 1656, -588, -1490, 1473, 1222, -1589, -356, 1909, -481, -1711, 1071, 1146, -1461, -739, 1407, 150, -1626, 380, 1758, -972, -1313, 1372, 557, -1644, -290, 1925]
3800A925k402j295K765O16l315J144K598k271j883K976O49k900N43K525j282k388
3816a995K377J356k774l4K658j177j815J225J633j833q85K068K56k409N98K174
3832A423j306j535J792Q87k289m03K610l47k360J951J103k519j61K426r14j219
3848h61J044J178j830q92K004Pj832J108J263j822l33J127M32q57j76J109k87
3865C82j485J080Q57j091k45J143k10j568N90J466q63p36J473j88k017J046J088
3882G22j172J69J013n94p01L81N05k47mN26k48p64L01m9J42N30n14o2J98p96M20
3903b44N81l38l0K73l65q4Q5K98l6K89op79L14L59p57K55J297j128q07J091j32
3924A36j168J090Q72j038p18J273j61j409J261J281j554n02J035l94m42K05J021
$$ y = [1925, -477, -1772, 993, 1609, -1706, -562, 2036, -235, -2118, 858, 1507, -1393, -850, 1675, 393, -1995, 382, 1738, -1036, -1070, 1588, 411, -1404, -179, 1454, -379, -1264, 804, 1060, -1349, -751, 1423, 117, -1418, 374, 1261, -1028, -1431, 1179, 832, -1528, 423, 1526, -993, -1154, 1272, 358, -861, 183, 1361, -469, -1361, 643, 650, -1182, -74, 1189, -633, -966, 161, 593, -264, -440, 669, 382, -1103, -23, 834, -257, -502, 641, 431, -1137, -547, 919, 56, -680, 793, 605, -1412, -366, 722, -450, -281, 732, 138, -563, -182, 323, 76, 72, 598, 350, -414, -113, -162, -20, 510, -4, -66, 132, -664, -244, 337, -1, -31, 242, -123, -207, -122, 176, 140, 429, 423, -356, -42, 317, -440, -185, 1112, -16, -823, 268, 136, -1032, 58, 930, -108, -826, 447, 286, -1123, 138, 1419, -135, -637, 398, 4, -438, -233, 788]
3941G88l2j327K91Q68j198l74J759L12j802j8J473j022j121K349P14k594L90J940
3959A396j834j083K538J65k325P00J505j484j015K137P47k039J60J129p11j122
3975a136J203J146j031j310J475O17k240N51K581j516k018K043P33k549M50K862
3991A861j247k569K405J008l038O15K882j515j949J938N95j586m80K300l24j979
4007a083R39J187j511q54J898O73j928n61K329n62k191J679J911k961m21K982
4023A526q66k305J992J580k593q02K946q41k426J948J432k240n99J961k20j251
4039g58J10J662p16j575J138J250j425l85J551j01j873M69K117j577j493K633
4055A027R9k793J064K108j975p09K029mj962M85J676j004o94J400k46j237N03
$$ y = [788, 756, -571, -280, 588, -610, -984, 775, 1087, -715, -733, 740, -282, -1403, 946, 1660, -934, -544, 1396, -438, -1521, 1017, 1182, -1143, -443, 1062, -422, -1437, 700, 1447, -592, -432, 697, -14, -1136, 67, 1213, 182, -1128, 347, 964, -1276, -725, 1856, 340, -1678, 365, 1098, -1451, -1001, 1861, 614, -1955, 450, 1458, -1580, -965, 1917, 402, -1547, 391, 986, -600, -1080, 1220, 896, -1083, -144, 1043, -468, -1322, 576, 1249, -679, -1240, 1089, 527, -1664, 15, 1926, -1035, -1456, 1526, 660, -1645, 347, 1927, -666, -1468, 1478, 637, -1789, 159, 1591, -649, -1248, 713, 493, -758, -648, 1014, 298, -1277, -139, 1111, -314, -699, 852, 751, -1122, -653, 1464, -113, -1606, 1027, 1126, -1667, -603, 1505, -470, -1179, 850, 846, -1116, -631, 1045, 41, -653, 747, 501, -736, -233]
4072b33N15j31l13J60N48m46q33O95N65p61k5R68n13j046O52P89q19OJ216r42
4092E2p88R73k4o88P26N52j194K99K08m61J90L83J11q53N17J23r56Q14O84p21
4112e3j57N33n00j06M50l1Q7m06qK11k92j09O63j57j39k17M11q0r76J055P75j582
4134f28K62J421j375r23J845K9j286L49J231r33j046J410M29j503N70J095j161
4151b14o47J061M44j010l3J049j71j441O55J447j368p29J608n9j650K32J891q21
4169B44j606K002O47k443L81K320j557j256J878N96j916l17K096m18k060J628
4185B19J134k193l04K065k96j602N65J666j176j512J918P28k278L90K139j387
4201G6j446J560J200j775n93K497o40k636J481J824k120o37K177o3k303Q47J871
$$ y = [-233, 282, 151, -162, -2, 546, 100, -733, -38, 527, -234, -259, 709, 196, -850, -198, 591, -228, -222, 994, 52, -736, 237, 213, -475, 251, 803, -391, -92, 116, -345, -155, 228, 339, -514, 3, 126, -830, -16, 668, -53, -210, 323, -177, -283, 167, 136, 223, -183, -191, 20, -272, -381, 282, 125, -14, -231, 180, 100, -876, 179, 954, -628, -366, 1055, -320, -1243, 602, 631, -655, -306, 925, -8, -1054, 356, 785, -718, -148, 947, -214, -861, 200, 644, -366, -399, 650, 479, -962, -307, 1140, -228, -957, 651, 592, -1058, -826, 1065, 244, -1362, 640, 1287, -1156, -775, 1545, -12, -1268, 610, 1206, -710, -1027, 1069, 651, -1409, 219, 1353, -840, -1144, 921, 625, -977, -412, 1254, 78, -1434, 484, 1212, -1066, -676, 1463, 76, -1370, 190, 1390, -385, -978, 1519, 879, -1757, -276, 1548, -572, -1209, 968, 905, -1398, -551, 1320]
4218A320j382j347K284L65k249L25J900j111j222J309J020j768n56J966k94j847
4234a287J187J324j365q63J566J93j671K95J757r65j355J704N38j936K54J822
4250A198q68j250R80J113j793l37J918n50j580J093Q88j278j54J101R7j126L00
4267b48R02n48p81Q74O15j221J40N6K61m08P2J458j632m03J594p16q59P52J095
4286A003q90p26P79k02p61N57Q92n09q88R63l11r4J60M1K77l10j8l34J55Q0K41
4307A05L18n31J8qM17l93J48K09j98q45N36N12p02M68N7j46j20J81m66O82p2m35
4329b65K72Q5o62n1Q81J04r18M13J303j754rR18n87m86Q99K95p83j37N51P1n37
4350c97M73R44j103k19N53Q94j356l33J126L7j930J038J563j498l65J365n8j612
$$ y = [1320, -62, -1409, 875, 1240, -1009, -684, 1216, 105, -1117, 192, 1212, -556, -1112, 854, 560, -1287, -100, 1224, -141, -1004, 562, 755, -916, -621, 1136, 171, -1184, 520, 1058, -878, -624, 1198, 330, -920, 60, 1173, -620, -957, 961, 411, -1169, -76, 812, -466, -620, 481, 578, -548, -248, 654, 106, -675, 199, 814, -407, -267, -211, 50, -358, -286, 1172, -460, -863, 731, 15, -844, -92, 1003, 113, -613, 166, -36, -797, -240, 652, 143, -745, 218, -93, -187, -27, 14, 291, -19, -37, -371, -216, -136, 105, 423, -108, -90, -98, 319, -74, 74, 283, 85, -760, -224, 288, -414, 54, 111, -35, -155, 26, -440, 242, 170, -265, 7, 92, -570, -621, 260, 364, -554, -141, 1162, -592, -601, 317, -270, -756, 143, 438, -345, -482, 69, 140, -397, 76, 1020, -83, -302, 251, 1145, -211, -544, 582, 619, -1311, -273, 1290, -208, -573, 792, 734, -878]
4368h78M62J483j068j083J711j32j866R72Q37p08L61L06M64j600m78K012p7j815
4386a097J439Q87j732NJ030j09r90P0K017j616j221J580N52k158J572J553j468
4403C14j423K100K96j999K04K178j172j709J327M75j175k27J595Mk012L52J519
4420F47p51n92J723N99k807N45J520o59j701J814J196k169j83K344j434k183L034
4437I43P86k014q03J700j21j736J204J255j039j263J520J08j336M46J301l56j322
4454g27L26J208j469o23K402l81j788Q62J003j570j45K078j32k017O82J148j581
4471g24Q0J502p5j293N91N1m85k11N12R43o84p01P38j23p87O84Q09n16p94N93
4491A10L66j223M21J441r29q87J118l61j086P76R15l76l00L46n74l26Q08J37m21
$$ y = [-878, -416, 1067, -1, -1084, 627, 495, -1371, -399, 438, -270, 91, 397, 861, -739, -1217, 795, 718, -1097, 342, 1229, -503, -498, 532, 423, -567, -497, 1520, -96, -1317, 263, 815, -1343, 229, 1782, 314, -1109, 991, 1287, -712, -508, 1670, 498, -1211, 116, 591, -584, -811, 784, 788, -1224, -872, 647, -104, -696, 1027, 1626, -1181, -636, 884, 225, -1476, 338, 1534, -635, -818, 1526, 92, -2091, 943, 1729, -285, -1088, 612, 491, -1245, -41, 1214, 175, -1088, 432, 540, -796, -350, 951, 595, -727, -401, 807, -662, -1285, 1117, 736, -1052, -190, 813, -757, -902, 1176, 1044, -973, -291, 857, -724, -644, 858, 783, -510, 81, 132, -353, -564, -52, 891, 207, -494, 244, 121, -666, 18, 827, 311, -483, 110, 476, -747, -326, 1115, 186, -701, 417, 56, -1030, -254, 661, 285, -15, 331, -243, -569, 239, 376, -45]
4510d5L9L81o58K14Pk98P42j41n55j7J47j58K57M58J6m82qn3j39L81M91p54M47
4533B72Q9j092N51O30p61L61N42p20n29N49J70o81P46Q83j182n68J188l76q23
4552g51J271J93r69r4N68k08l77M14O62m49n96K69J95m34M7R15O5j263N2J162
4572F72q57q64K012N0k227R51J276j299n07J628K89k080M19J572j400m79J721
4589H77q5j470J69R61n23p03R40P93j024q52J298N6j270M70J570j010j193J148
4607A52O78j726J01K333j143j667J583N89j972M44J720p42j371R72Q44j392j22
4624g19J559j62j482P59Q48j045n42R57Q51j498k30J431o74j239J291R89j394
4641c00l44J209k40j482J103J263j447n31J479k00j650R40J157q17q54R80K14
$$ y = [-45, -6, 375, -283, -69, -62, -360, 382, 241, -314, -331, -184, -342, -85, 373, 389, -93, -101, -154, -293, 88, 579, -175, 272, 361, -731, -180, 450, -311, 50, 592, -128, -657, -108, 62, -619, 127, 1010, -172, -740, 448, 72, -751, 520, 713, -256, -350, 218, 10, -367, 47, 709, 260, -336, -67, 128, -306, -259, 656, 721, -542, -490, 672, -185, -1049, 963, 1013, -1214, -263, 1013, -286, -793, 835, 1124, -956, -537, 1035, -365, -844, 877, 792, -678, -509, 452, -71, -774, 166, 959, -65, -917, 381, 437, -833, -363, 1207, 197, -996, 152, 830, -896, -795, 1538, 395, -1272, 311, 900, -1072, -628, 1092, 350, -1021, -49, 795, -597, -719, 840, 678, -804, -45, 803, -242, -784, 173, 1024, -474, -704, 727, 53, -1186, 105, 1094, -300, -644, 565, 325, -1157, -54, 1209, -238, -769, 710, 510, -1140, -200, 957, 140, -714, 266, 480]
4658D80j387L07J392o18j002J051L43r47l21J203J41j150L46J002j223m22J411
4675F06k2j024K82N42k74q80Q01P63j041j51R15m07p65O09O14n87k96Q39m19q94
4695g89P65O67q36n1N62j45n50J96L65j35l17J63M43o35K7P35k88k37O6L6j4k78
4717b50K06M47n78Q8L66m87J8J69J90l36O7L14r8k05J67j38j15M48j37m41L72
4738F7k7m67O27j37l47L46J42l20r1N41l0o21J67M60l69j75M26j69q1J53p9P8
4760I4k6j52O08k99o32L89L78o46p2P72j47q55N86O47j028k62J390l69j320J150
4780B06L34r05j84J188k41j055N77O28o04m57N82K40p11N5Q06j02r51M32J008
4799H46j114n87J371L3j198L84J203r98q49J427J73j417L43J340j209n89J335
$$ y = [480, -907, -600, 792, 174, -828, 223, 566, -381, -702, 501, 642, -508, -162, 840, -383, -805, 606, 584, -440, -158, 384, 110, -770, 31, 794, -247, -398, 517, 110, -655, -46, 568, -19, -315, 524, 105, -789, -24, 643, -193, -244, 318, 173, -377, -181, 184, 49, -268, -105, 338, -297, -270, 465, 177, -60, 6, 42, 28, -250, -44, 403, -175, -87, 279, -208, -190, -21, 169, -167, -100, 214, 116, -89, 78, -60, -175, 273, 136, -305, 67, 40, -427, 200, 63, -284, 62, 204, -116, -207, 334, 304, -317, -150, 310, -59, -234, 192, 23, -58, 95, 16, 94, 68, -84, 524, 225, -407, -18, 360, -286, -358, 414, 267, -588, -2, 645, -383, -645, 745, 376, -944, 206, 540, -365, -549, 639, 398, -657, -80, 548, -56, -513, 69, 309, -402, -347, 459, 357, -594, -162, 846, -268, -855, 516, 549, -649, -265, 938, -60, -909, 518, 691, -726, -383, 957, -252, -841, 494]
4816D94m7j054K97R37n13p98Q28O46j009n50J359j87j162M87J080n89j244J213
4834A88R28k034L40J727j199j001J627N8j313P5J590p79j231J306N65j446J31
4851d68J434q93o55N35M81p06m73J113M43j287j48J548p74j053J177O07p94q69
4869g82J517n92j174R85R70j189k73J268m19q42N06O10q84o5O50j07o90K86Q87
4888F62o16k50K87L01m09l01J88K03o30O37K84n73k59Q36j12o04M31N58q11k99
4908d77P86k18m84M99K4m81K00M08l19j38K16p8N11p41j93P33o45O30l95O75p32
4929b19o20J110j1m77L68k9k25M8J90o43K99N63p17K31J86k01k93J096n48p46
4949f38N69K39p32K14R60p70n56N35J84j89K00J94k12k55K86J07m72L3L35o1J35
$$ y = [494, 447, -607, -310, 627, 114, -684, 144, 790, -219, -769, 590, 403, -759, -272, 808, 219, -1025, 188, 1116, -918, -578, 1149, -50, -1051, 576, 634, -679, -604, 986, 207, -1024, 282, 847, -599, -468, 966, 73, -582, -47, 434, -272, -745, 368, 811, -476, -624, 924, 150, -903, 274, 881, 87, -782, 735, 143, -1031, -46, 924, -265, -538, 730, 311, -531, -25, 585, -299, -364, 286, 179, -511, -225, 662, 46, -204, 83, 384, -25, -326, -138, 65, -565, 72, 356, -217, -476, 360, 248, -356, 75, 633, -178, -477, 309, 91, -393, 106, 130, -351, -151, 257, -62, -200, 16, -62, 449, -292, -485, 248, -397, 233, -162, 513, -219, -839, 271, 260, -217, 151, 122, -103, -55, 135, -508, -209, 354, -363, -132, 54, -147, -440, 656, 108, -638, -69, 170, -562, -348, 612, -158, -714, -179, 5, -184, 16, 210, -2, -257, 29, 136, -336, -303, 32, -29, 106]
4970A06o05L65L46n56L15O70p84m91J210r7j004P68O02j075l04J017k42r97O97
4989e9O40j054q3R89m22k85M41L03n22l44K93L58n08j53J016j86r92L58N86n84
5009b08m77J224K25j504K21J443j387l69J629j41j372M62R11j080l97J333j6j093
5027e96K81O91n20l37P92J09n15m93Q70J32j057M16J083p42r82J202L44j436M07
5046c51J322o61j346J347N71j630J49J822j072r75J095K37j059O6J108k42q00
5063d19K93M92o10j07N85K99n86l35P50j52r47O42Q06r41l91J136l93p60O07Q14
5083G83j007n34J128k12q53P51N91r64n2O41j40m38J13M73o9p26N49K54m82j4
5103b08M73r8m37m4O89k91o04P38K64p77J19N82n50k38N89P6m62k2M25l34j33
$$ y = [106, -499, -134, 212, -344, -29, 641, -143, -634, 576, 479, -525, 243, 845, -230, -534, 483, 241, -756, -59, 581, -473, -556, 433, 11, -274, 167, 470, -52, -396, -103, 255, -253, -406, 610, 424, -568, -210, 376, -208, -685, 539, 764, -740, -519, 924, -463, -832, 797, 656, -716, -254, 657, -423, -820, 513, 497, -596, -315, 376, -144, -481, 311, 420, -95, -588, 282, 414, -643, -227, 856, 114, -868, 334, 678, -758, -351, 971, 310, -1036, 311, 882, -748, -599, 1223, 151, -824, 271, 508, -551, -485, 623, 381, -419, -126, 366, -244, -351, 234, 533, -53, -388, 362, 210, -737, -95, 711, -230, -621, 515, 122, -638, -31, 783, -224, -758, 370, 158, -695, 56, 647, -317, -369, 272, 132, -306, -193, 280, 211, -515, 34, 288, -194, -208, 265, 167, -270, -314, 375, 84, -520, 218, 482, -295, -176, 406, -144, -382, 207, 283, -179, -201, 224, -110, -243]
5124b43M70J8m37J64P1j41K03m3o1R5l81K74j40K26K18j40K4j27k24O7K66k27
5146f8J62K9k99M2KJ26J80j91j11K76k31q2K10K8j04k0J74p3l65L86L47l23j91
5169i6K39n5k18K49q6J42n46P67m8r49N14M10l37k55L44J67o27O0O73l6p70M86
5191B8K76o37P1N64k5o35J63N81l25p89R14K59p86L0J012o37o99P18N24p91j46
5212c30Q23m71q42P53P95j079j57J178n49n68O85P11r63k49L35Q36j458L42R34
5231G26q14Qj57N82n38k10P43L4j162O81O81q73n16J276j36j096O00R27r60n97
5251h01J222j1r86M92O55o78o72R26J93n26j09Q03j69q94N40N67o81l39P83Q6
5271D01q74O4J092o24o17R83K83j302L70R19n95p39R16K2o46n1J043n70n89P86
$$ y = [-243, 227, 245, -192, -28, 43, -98, 105, 62, 1, 96, -285, -11, -151, 75, 293, 153, 177, 50, -174, -107, 159, -68, 94, 123, -176, -134, -132, -6, 174, -17, -128, 148, -83, -165, 45, 73, -31, -51, 123, 50, -315, 71, 418, 95, -96, 143, 88, -130, 119, 33, 175, -371, 396, 348, -601, -87, 323, -14, -269, 75, 242, -385, -325, 348, 312, -458, 28, 304, -333, -262, 302, 277, -358, -195, 386, 61, -728, 186, 445, -341, -311, 701, 64, -635, 83, 607, -184, -330, 493, 22, -820, -67, 728, -351, -508, 670, 121, -447, 238, 949, -14, -263, 72, 908, -550, -208, 726, -88, -80, -237, 345, -193, -403, 340, 374, -788, -107, 574, -299, -815, 461, 325, -771, -171, 756, -204, -801, 421, 410, -576, -84, 571, -107, -779, 147, 340, -186, -295, 508, 339, -555, -15, 552, -129, -468, 315, 401, -473, -409, 683, 59, -558, 425, 708, -594, -224, 695, 100, -639, 277, 299, -347, -398, 645, 75, -514, 272]
5291B72L47r35R1M37j6m58K7N65k62o13M14M26n53M2O00j86p09M42N96p41j68
5312c82Q92m22o75O86L16q21K76L87j69m64M12K47l96J09K31k14j95J87nO5q3
5333a8J20R8j53k05K46k0k14K46J14j87l44L25J07l10K77Rj91J27o2j33J15K00
5355A47j28k30N71l81l6J75k6k17M8J1ok45K19K54k78R0J11j34j76O8L37m5k59
5378a30L57J4o39K81N13n56j19M66j2l25m2N60k54m87P09O3r74M13N17m38l69
5399d52O13K96n89j26M62j16k98K36L51m17l51L84K33m94Q5N96k03p93O11M18
5419D46q53J78Q80n22p27N62N80p36j95R95m90p10P72P8l26k94O59Ln43M2N47
5440C46k40o10O68L91o84l73P83J68j033M26J105o30n89R21m94r43O35Q44j250
$$ y = [272, 619, -316, -225, 212, 196, -262, -235, 330, 68, -545, -131, 295, -258, -216, 384, 198, -511, -69, 527, -214, -382, 510, 88, -587, 99, 415, -406, -130, 257, 88, -376, 36, 283, -113, -4, 227, 13, -182, 5, 0, 65, -18, 102, 200, 47, -158, 88, 68, -146, 100, 214, 27, -317, 8, 115, -195, 82, 91, -100, 27, -35, -168, -53, 147, 19, -211, 360, -21, -57, 118, 92, -125, -77, -66, -72, -317, -98, 156, -122, -32, 79, -55, -231, -163, 174, 129, -130, 227, 241, -398, -117, 396, -160, -279, 187, 175, -150, -192, 368, 114, -373, 336, 399, -575, -162, 355, -83, -452, 161, 457, -132, -258, 204, 88, -210, 26, 377, -40, -391, -7, 226, -268, -183, 413, 210, -583, 28, 446, -407, -229, 651, 129, -598, -36, 544, -192, -387, 608, 118, -592, 180, 258, -68, -362, 297, 300, -243, -201, 346, 106, -504, 164, 555, -129, -502, 281, 449, -584, -158, 947, 317, -272, 649, 155, -788, -153, 691, -559]
5459e59q6R24M27j257P75J16j158N42r3N94p53J159o27M08j020J43J136m48n16
5478b93K27N84j118M40J062r30p58J257m72m65j0J248q32K55j3K39n82m28R69
5497C80m39n24P71J93o21J47R6J89n46L57K20j62k41J35M88n11j82N92k55m39
5517c52K91K01m64J59M09J2n74M67K18o87K37L71l94j94M12q5k32J51K5M7k12
5538a94K19j64L46m82L29K55l0l11R2K49m96J23L04k29j66K72j90L02p75L75J35
5559c6m8Q4p7j57N19k22k74J97K20o18L27L36m98L76K46n22J76L27l64j65L03
5580A30K20m42j21K84j48o0P9L8J08j17%m4K30k95L39m2m75J20L96m7m35L02K04
5603B24l74j66O89j69m67M78l1l49k95J049o66k99O42qp06J54P15j62l29J54O7
$$ y = [-559, -645, 279, 706, -551, 224, 340, -818, -276, -369, 225, -528, 631, 4, 412, -608, -465, 671, 223, -293, -66, 518, -600, -160, 902, -28, -786, 471, -1, -466, -476, 772, -60, 195, 182, 421, -161, -589, 380, -59, -583, 188, 381, -240, -93, 3, 192, -354, 3, 223, 61, -180, -45, 443, -68, -250, 342, 87, -352, -61, 140, -324, -165, 244, 256, -318, 149, 367, -320, -83, 288, -106, -300, 112, 27, -205, -54, -29, 18, -194, 25, -139, 207, -275, 54, 309, 279, -32, 60, 309, -187, -64, 240, 11, -155, 117, -73, 229, -546, -171, -36, -84, 0, -77, -234, 285, 63, -211, -14, 206, -412, -85, 251, -247, 129, 375, -147, 29, 356, -8, -173, 130, 350, -92, -213, 71, -77, -137, -58, -20, 88, -29, -29, -73, 157, -138, 201, 159, -316, -196, 200, 153, -282, 20, 224, -150, -316, 373, 204, -263, 215, 184, -165, -460, 589, -77, -376, 266, 258, -448, -294, 421, 259, -70, 84, 151]
5624A51Kq96P53m0l39r1N75M7o63N42L09o40q5M88J48o17O6Q49o27m98Q33K07
5646D74q24J91L08k77m15O53M18q29J2Q46n03n87N38M12n28j20L74nm44K07N54
5667D55m92n58N50M05p18K30O24l56m28K61L20p00O7O24p4o49N68J78l97j93N53
5688B70Q7n75L74J17k36m23M99j3j90p7K99j02k76L05K22m41k45P08q0m62K49
5709A0L16l67j17L91l1o70L72M14m95P7M22j43l64L17J25k24j34J85O0k84O5L27
5731B52k04j72J43k3M5j54M6L02oj15M4j19r2J93k0j83j16K21kl14L86N2j36L1
5755E9J61k18R8ok07J92q2p44L59O18o33N66m06N69j84o64Q32o43n1J0M01K2j
5778D8J88j86J4p4m9j95K21P7k15L39m4j74J49l03J70K30k04k43O03L1l71p3L58
$$ y = [151, 153, -743, 10, -30, -369, -460, 115, 162, -501, 41, 350, -290, -375, 113, 261, -356, -290, 559, -68, -566, 267, 474, -350, -159, 149, -128, -543, 110, 528, -301, -289, 557, 54, -533, 5, 417, -111, -231, 143, 138, -306, -99, 455, -37, -595, -45, 360, -358, -128, 496, 140, -288, -27, 293, -407, -340, 284, 210, -439, 129, 307, -90, -283, 270, 357, -218, 156, 273, 37, -386, 113, 100, -90, -167, 132, 30, -246, 59, 281, -160, -405, 303, 223, -239, 10, 326, -41, -158, 233, 202, -468, -96, 318, -177, -100, 322, 179, -185, 132, 257, 33, -101, 84, 144, -140, -75, 252, 48, -124, 19, -4, 41, -113, -67, 235, 229, 114, 158, 39, -53, 140, 120, -63, -179, 42, 40, -274, 112, 164, 28, 59, 220, 2, 100, 94, -113, 79, -3, -747, -388, 230, -403, 163, -243, 326, 142, -522, 310, -333, -384, -374, 27, 49, 48, 236, 50, 64, -10, -59, -254, -33, 44, -171, 168, 124, -50, 99, -204, -34, 196, -8, -251, 352, 383, 12, -61, 297]
5801B97m64J3N22p3m97K44K42k87j19K32N6k20j80O53n55J06L29K56l89l02N54
5822D18l48p27M07O82l50n59Q53J7r53Q8O81n3l39N05J12n15J00M3j6o56Q30P0
5844B90l97o2M74j88l71J38O82n67j93J60J80k12o9Q3K24m89M42O32p93Q2L93
5865D39l56n37P79j73k72k42P44l01j98M16m20M31k63m8K35m45K68K84k64k35
5885a58O8M62m39l16P58k49k23L26o5l23j72J030q65N1k6L77l88n7L81o1m30L91
5907G2J93j40l50J77R1k11r5N42N8m31o8O81m74l01L19o4k84J75M02l68k6K58
5929A56J7m71L68n2p9J62o0P6j69j53J41J27p1J13j41J2j13J67J51k01n0K11q8
5952E3k28K26J85l10P3K77k56j15J63m3j02K25r9j55J79r2p7j87M77k40j93L37
$$ y = [297, -167, -154, 368, 295, -202, 42, 284, -3, -122, 110, 166, -54, -234, 419, -136, -30, 299, 555, 166, -136, 418, 70, -657, -250, 432, 82, -477, 376, 393, -560, -472, 209, 156, -183, 322, 434, -81, 19, 62, 46, -610, 220, 290, -107, -169, 305, 117, -254, -116, 566, -1, -194, -34, 146, -66, -135, -52, 172, -317, 125, 757, -36, 46, 439, 83, -454, 325, 152, -120, -362, 382, 81, -117, 299, -121, 310, 47, -1, 234, -211, 57, 341, 77, -158, -90, 372, -67, -383, 375, 126, -97, 229, 164, -159, -331, 699, -166, -115, -141, 236, -152, -209, 172, 111, -319, 72, 265, 125, -225, -48, 43, -168, -263, 279, 337, -94, -162, 519, 45, -256, 63, -1, -285, -110, 292, -76, -102, 156, 173, -298, 70, 18, -61, 101, 41, 117, -52, -205, -64, 63, -8, 105, -36, -24, -137, 30, 181, -20, -70, 141, 53, -175, 51, 236, -74, -1, 276, 20, -95, 68, 25, -77, 148, 49, -106, 73, -19, -96, -283, 194, -46, -239, 98]
5974I8j76l8J41P0r0Q0J25k00l1J58n5k48J45J07j20l0L1k52M00k2ll8Kk78K07
5999a7J96l85K32K35l08j38K29J19m97L63K38l96j14M85l67q7L01J42k92j06K94
6020A27l28n7L98M4j26n3k28L26m0k79J32K86m19J12L86k56l52N48J5m10M0L46
6042B12k10m95N77J97o68K22M34l29j60K17K26k95j05K57n4l49K87K0j05J25J88
6063A92J13n93Q6N94k99m09L70K84o55J73L63p6m05J49L46m48J20M01j20n40J36
6084b18N16l98j11L98J6m11j0N30k02m63N27M4k80L6RK58m58L91J99l99j3j38
6106a77P27q03M40K62p96K59M01j19l91j3M02j51k80K40L30l16p4J68m43J32N9
6127a43K07j16k13M86j63j83J57P6k71L2J30K38k24k2O1Qj68K88q2j56n2K19k60
$$ y = [98, -78, -116, 25, 95, 5, 85, 210, 10, -21, 137, 82, -166, -21, 86, -34, -64, -33, -285, 115, 93, 90, 52, 54, -224, -17, 179, -206, 26, 261, -47, -185, 44, 163, -334, 29, 267, -129, -243, 242, -125, -212, 89, 231, -61, -167, 127, -201, -258, 140, 184, 58, 5, -223, 103, 63, -216, -84, 202, -217, -105, 281, 25, -327, 221, 236, -174, -134, 212, 2, -493, 84, 281, -387, -165, 269, -60, -220, -3, 223, -72, -177, 80, 26, -323, -36, -16, -121, 4, 192, 305, -288, -202, 392, 93, -316, 54, 338, -317, -144, 219, 143, -262, -113, 233, -215, -95, 306, 186, -354, -218, 298, -100, -211, 187, 203, -208, -218, 312, 110, -353, 174, 218, -62, -26, -17, 241, -217, 174, 373, -26, -39, -177, 550, -253, 187, 449, -347, -88, 313, 194, -197, -210, 192, 41, -239, 1, 331, 15, -59, 109, -334, -202, -143, 64, -52, -265, 221, 58, -125, 32, 108, -163, -131, -1, 237, 13, -9, 52, 60, -108, 180, 98, -58, -110, 109, -151]
6150a51J84J33r1j31k12L12J23l19K60o7k29J14Q7P2r4j00K08J0j96J12M8m3q9
6173e9J66J0k02k06L69J1l65J34K37j93N8K3j66L12k81K3K08k3o8M3M8p6K4l8
6197a1J63l44J44J87j69j07R3J89l39J06K02j49j21J84K2j39o8L29p8j86O3M6
6219A7L0j84K41o8j11J0J81J56m51K23J51l02n8L15k4l54K43M30m69j2K79j52
6241I1j99K43J88k29k35K36Q4l82K99K06l12q8K0N2j09o1L59j56k03L31J06l28
6263h7r1K55J01p1k34L17l07j83N13O9l37q7K00j04l41M44J83l66j77L97K48n63
6285b21L28K07m50J18J74m1l58J33K95j33j94K59J19o74L25J80j64r2L18R1m21
6306b01M1L93j13k91L25r1k68J21J86J37m92R1L19k94l6J35J96l90J71K20k4l80
$$ y = [-151, 33, 166, 75, -56, -268, 44, 167, -152, 108, 41, -188, -74, 13, 85, -9, -109, 99, 109, -87, 25, 73, 30, -59, 107, 117, -85, -291, 78, 89, -276, -142, 95, -98, -40, -17, -183, 129, -152, -129, 79, 56, -12, 31, 79, 3, 27, -11, 152, -192, -48, 139, -30, -137, -44, 145, -194, -88, 114, -35, -156, 28, 50, -89, -157, 172, 94, -92, -29, 17, 47, -137, 104, 36, -75, -65, 116, 272, -179, 44, 195, -107, -165, 150, 126, -228, 15, 445, -24, -36, 243, 91, -108, 135, 323, 94, -141, 95, 179, -203, 96, 302, -10, -98, -78, -26, -135, -196, 163, 7, -196, 135, 241, -87, -178, 77, 178, 107, -127, 190, -117, -300, 213, 282, -55, -142, 58, -46, -387, 57, 240, -126, -303, 94, 342, -221, 107, 314, -136, -18, 156, 115, -243, -110, 185, 52, -142, 117, 236, -438, -113, 67, -97, -189, 129, 220, -201, -160, 233, 120, -171, 154, 63, -205, -84, 102, 239, -253, -162, 157, -137, -173, -38, 158, -232, -61, 159, 135, -245]
6328b45J10L54k97j54M68p5k89K77N4k85j2K35O2l44j9L15p7k08K06j0j38O8N2
6351D8j08n1Q1K84l18K8Q7o3k79K86O3o4j10J32J24j79K1J33N0j65J13k28J63
6374D8O1j88K95l44J8R6p1J13j21J6K26k88R6J40j53o4J23l6QN0j18P9j4j40J40
6399b8K23k32J4M1l1LO1j34j2j46O23o20l08P02J25m41J77m2K82n5o1kQ4n22Q25
6424E26m02k33J75J35j36k07N7Q0j0j7K19j12j88J66n1k40K69P9k2l40M15l8j99
6447g4N5N1N3k54K34j30Q6k2M1J24l55K03N5j52j5L4J51j85P8K1Pk5L5J03j9l26
6473b26K68L2m21J98L80l57r6L32J38l57J46K92k82k45N28k71k92J23J95J1k16
6494a20J22J53Rk70K25n2k28M8L08j19l06L45N5m34J06L79J1l61J84J8j81R0J06
$$ y = [-245, -135, 219, -78, -232, 236, 161, -128, 149, 203, -82, -94, 141, 203, -141, -160, 155, 78, -130, 76, 66, -72, -4, 48, -60, -111, -30, 254, -64, -36, 51, -12, -291, -5, 58, -6, -116, 16, 140, -39, -18, 115, 165, 0, 113, -115, 48, 109, -79, 216, -128, -110, -14, -85, 28, -93, -77, 149, -139, -43, 97, -56, -120, 3, -33, -25, 25, -93, -14, -28, -168, -28, 195, -37, -23, 18, -13, -10, 51, -83, -95, -241, 382, -238, -546, 156, 281, -160, 17, -25, 257, 202, 141, 139, 223, -299, 526, 124, -109, 66, 201, 65, -142, -85, -5, -15, -32, 187, 75, -113, 53, 2, -238, 31, 110, 88, -252, 163, 125, -74, -19, 32, 85, -169, 65, -65, 21, -1, 40, 164, -191, 12, 67, -85, -100, -66, 85, -100, -22, -1, 6, -19, 16, 119, 100, -226, 42, 74, -347, -149, 231, -126, -222, 110, 248, -109, 37, 329, 47, -198, 330, 59, -233, -110, 85, 96, -120, 2, 155, 164, -106, 119, 67, -161, -113, 195, 76, -230, 115, 170, -264, -158, 221, 232, -129, 55, 73, -108, -18, 88]
6517H8m3l32L38O2j65L7nJ20j68K41j42r2K23r8P4q4j95K89N0l84K49J44k91K1
6541f3J82j64j81J89L33k54k30M64l17j56L35j01j2j21J40K36l23O3K5J37q3j90
6563i1j28K19l6J38m4k16J44o1N3o3K34j7k41R8N1r0k35K47R2p6jJ62j79J8J38
6588A16l2K9j33M8QrJj44K5L17j63j11K14m3j30K51l49N0J50j32P2N1n8j29j56
6613b57K40p1J43q2N4J6J0j33K7K13j64j2O2ok02J21J60l20K26j8Pj55P6K99k74
6638d0j72L14k37j35L60Q9j06j9K00j27o6M0j5p6k78K58k4l1j7K45j05k98L11
6661G1J39o7j74K27j02j05M7J18k13j27J92K58k77j0Q0j54qJ94J11k48M0J23J
6684A16k67M9J43n6j29K66K8j67j78K85K7j57K13j1j77j38K48l5l04K22K17k47
$$ y = [88, 45, -287, 51, 113, -52, -15, -20, 100, -68, 173, 31, -61, 162, 64, 138, 54, -141, 148, 198, -186, 63, 207, -84, -63, 119, -45, -226, -37, 296, 42, -188, 276, -41, -197, 138, 37, 25, -96, 44, 280, -43, 20, 45, 182, 99, -91, -219, 0, -36, 102, 58, -158, -14, -75, -22, -85, 149, 132, -109, -11, 40, -50, -285, -38, 54, -22, -23, 139, -40, -22, 116, 84, 113, -20, 28, 36, 27, 28, -116, -91, 226, 63, -48, 166, 123, -7, 244, -105, -55, 95, -37, 35, 86, 28, -101, -257, -17, -88, 55, -27, 27, 43, 53, -80, -53, 160, -4, -16, 46, 40, -162, -41, 119, -201, 25, 7, 14, -141, -65, 234, -40, -212, 102, -135, -270, 90, 179, 73, 54, 254, 127, 61, 101, 86, 10, -268, -10, -34, -65, -82, 163, 58, -240, 71, 210, 143, -31, 196, 94, -11, 36, 154, -59, -186, 6, 264, -13, -23, 57, -97, -105, 89, 200, -48, -8, 115, 116, -151, -102, 41, -15, -144, 122, 150, -17, -195, 90, 117, -40, 173, 162, -15, -153, 95, 60, -244, -22, 195, -52]
6706e2M9J35o7k12J56R7j10k49K51M9k66J17O3o1l6J24J10j98N4J28K9j98J06
6729A9J17j75p2J82nk39J15K20k71M7K26m0l31J4M10k28j58K06J43l86O7K55j27
6752a1m3r5K06R4j91p9J41Lj65L36l00J06n6K72m64K98%O4k17J91Q5j85j13K86
6776A63p2k59L88k78K44j52k8j80P4R4Q9Rq2n8J4k1J68j01O9j75K05l9m7j43K94
6801A76r7K6o8O3mp8O3m6J52k49K6n1jl3M8L7N0m1J40N6l32K81j20P2r4q3L15
6828B08k92n6L12k42Jq5L12k07J28p6R0n9j80L47j60k22J26N6n6j1K79o8k88K7
6852a16M05j92k27J50R0l34K11O5O4l52K39N0k07K8L43k15lP2o5L8j66J69J21
6875A68l61J16J52J18m41L33M8k02q3L23j53j1l3J51p4q1L02j87j19RJ74q0j72
$$ y = [-52, -3, 132, 65, -147, 9, 106, -4, -253, -2, 47, -219, -102, -39, -100, -136, -12, 98, -100, -46, 82, 111, -87, 19, 136, -39, -111, 71, 66, -173, -58, 162, -109, -62, 164, 124, -207, -193, 217, -11, -169, 37, 180, -206, -139, 116, -11, -54, -149, 57, 151, -40, -119, 22, 25, -140, 196, -104, 2, -54, 218, -246, 52, 52, 116, -101, 90, 175, -10, -123, 163, 91, -168, 220, -58, 186, 34, 6, -174, -100, -6, 83, 92, 10, -48, -34, -55, 113, 12, 81, -94, 111, 72, 25, -118, 176, 79, 105, 37, 100, 96, 18, 81, 35, 187, -62, -36, -87, -88, -121, -73, -36, 14, -27, 113, 169, -163, 118, -2, 70, -24, -107, 208, -84, -140, 172, -70, -69, -154, 158, -49, 79, 3, 93, 34, -146, 201, 41, -181, -55, 1, -55, -66, 213, 145, -143, -116, 289, 97, -130, 20, 110, -224, -13, 52, 116, -236, 3, 53, -154, -126, 217, 2, -1, 71, 6, 44, -122, 47, 168, -193, -77, 75, 193, -248, 85, 133, -69, -152, 171, 18, 7, -26, 125, 51, -30, 272, 85, -34, -25, 149, 69, -103]
6898a03M18k12k74J14J88j17k99K63J06l3j6J59l4m66J09L99j61l42K32Q0k34
6919b23J4L19j42k12K84O7l17J84J47Lk00J16J09j47j04K12pj19pl5J06k79M22
6942A91J06m20j57M26k09K9P1J74k32j67M03k90m7K28k4j19KJ5j12L7N4K09k88
6965a20K14Mp4P9k23K23l0j42K37l2j13o7J64j71J78j77M1k0n7J31r0j30j5J80
6989a0o7pJ93j31m7J46j40m8J36lj90J37J07j17K9N2j40J2J39j06R2p5q5L20j25
7014G2m7j98K85k68K51L2j27m5O6J2j57J05R8k91Q2K09j28n1N2O8J7n7J39j63
7038d4J9Q9k17RJ72R0k94P8J41QK0n2j52J05qJ06P1J8j80Q0o3l9npK99l30J90
7065A04J43l89K1K14n9M2p5K81l10k53K96M4j82K74p6j31p6R2O0L1j67M94m04
$$ y = [-103, 315, 103, -171, -57, 131, 14, -285, -22, 84, 51, 35, 194, 160, -306, -197, 202, 41, -301, -69, 11, -223, -209, 110, -32, -244, 40, 107, -210, -26, 121, 124, -76, 40, 149, 2, -102, 110, 103, -16, -23, -58, 48, -231, 191, 297, -123, -280, 146, -63, -34, 37, 211, -21, -188, 215, -75, -122, 106, 82, -37, -35, -20, -132, -95, -41, 168, -120, 94, 98, 24, 103, -120, 103, 73, -69, 168, 136, 23, -44, 120, -51, 127, -50, -9, -29, -86, 45, -45, -175, -190, -10, -77, -84, 109, -22, -69, 77, -63, -111, 25, 22, -168, -31, 76, -41, -12, 40, -100, -88, 51, -55, 37, -38, -123, 197, 72, 25, -173, 112, -156, 95, 127, 0, -45, 21, 33, -124, -19, 79, -212, -130, 79, -49, -100, -48, 20, 37, -20, 119, -44, -25, 64, -153, -144, 28, 118, -176, -98, 43, 51, 71, 19, -133, -28, -36, 70, 141, 159, -21, 59, -4, -43, -48, -55, 244, -86, 104, 247, -142, -121, 93, 34, 76, 1, 282, -28, -281, 15, 59, -123, 151, 75, -56, -132, -40, 20, 51, -116, 378, -26]
7088b6j28K45k3p8j40L24j23k05J74J90j72l75M18j8l52K68J98k46r7K80Q8k61
7110e9L5K70j05j80J54J31k99J32O4p0k50R5K15k5l88K16J60k26J44Q0l5j51J77
7133H5m1j26M2K81J2o34O06k63j87K11J33j47L79j41m84L15k02P09o19K2L4J65
7155A50j21J3r7J45q9p3J37r9j21P2L21q4k68J39J6j62j09M46k83r7L31j48j05
7178h6J83Q4j87j10J88J8o4j12J16j10L8K0P1l3j04K52l4j89J7L09j75j09N3K83
7202C19k28o9J10p9q6P1K4P0k29K76k85J04r9J84%j95N5J27J45l00J34K12k87
7225b6q2P6L00j10k89K30j21p2J35R6j46q0J34p1O3o8n4J26j58j44K49J02j38
7248d8mK92k91L4J15Oj66N5K97l46p5J21J0j07J27K38l83K1L11m3k14K74r3m6
$$ y = [-26, -154, 91, 68, -10, -150, 174, 51, -154, 20, 210, 38, -337, 81, 63, -289, -21, 177, -69, -166, 114, 202, -59, -24, 246, 141, -39, 115, 246, -53, 79, 143, 73, -177, -82, 133, 108, -280, -64, 96, -130, 14, 94, 59, -92, 85, 44, -82, -40, 241, 253, -381, 225, -38, -225, -14, 119, -28, 351, 210, -274, 41, -161, 548, -71, -49, -15, 150, 29, 42, -55, 90, 1, -72, 65, -34, -155, -83, 238, 154, -114, 25, 41, -121, -230, 216, -67, -164, 167, 19, -86, 97, 181, -6, -116, 72, 90, 26, -86, 30, -80, -42, -22, 49, 16, -88, 164, 130, -59, -42, 267, 92, -17, 36, 319, 91, 22, 132, 53, -33, 38, 62, 132, -97, 179, -106, -2, -101, 83, 83, -112, -57, 70, 215, -85, 49, 261, -26, -108, -32, 268, 158, -131, 99, -22, -94, 41, 137, -9, -89, 45, -26, 37, -31, -85, 41, -117, -261, -12, 90, -48, -52, 240, -51, -17, 98, 104, -62, -7, 290, -56, -131, -10, 0, -107, 20, 258, -125, -104, 207, 164, -50, 224, 131, 85]
7272H5k46J36K67j50k34J37O1j34N2J08o2j36L19j92j66L03oj69j00K36N0r8j86
7295a25L08j50r1J66r2j29L67O1l09j70L13j40L6J23j9o5k73M01j49J6j92J97
7317H4J74p66P57R4j65p77N99K02k68L26ql21O2L53j22p03N9J26O87N6m98J97
7339A48k70P5Q2K50m25kK95n9J92m29N05n12r9L37m22O4l3K52j41K83K9q2k02
7362a64J31K4L1j56L51k94L00k38K00q7j55J25J06j18m5q7J38j01p9L10k59k02
7384b69L27j65P2pJ73q0j22K24k30j4J6J41k99K81K5o8j62O1J56P3j57O3N6k8
7408F7j13j16L19o2j42J19o7n2K04l1j69R6lj52J02N9P0j32j22J33m1J03J6q9
7432cJ40J6k20J9J20oj32J81o9l04J32K51j31nJ5O4j40k0R9J2l1N1m9M0l02K63
$$ y = [85, -161, -25, 242, 92, -142, -5, 56, -78, -26, 82, 20, -116, 203, 11, -155, 148, 142, -27, -127, 109, 159, 61, -125, 183, 33, -58, 108, 16, -113, 254, 315, 6, -164, 149, 9, 45, 168, 149, 84, -189, 212, 63, 79, -113, 84, 258, -508, 249, 343, 178, -599, 0, 202, -66, 260, 252, -69, -7, 346, 224, -479, -420, -294, 393, 449, -49, 148, -122, -47, 35, 285, -140, -142, 153, 94, 286, -143, 362, -150, -249, 88, -334, -270, -303, -51, -192, 91, 120, 38, -164, -33, -9, 22, -134, 217, -77, 223, -15, 185, 98, -57, 68, 174, 56, 11, -76, 62, -39, -118, 192, -67, -269, 58, -107, -35, -42, 131, 51, -71, 153, -77, -91, -75, 66, -233, 48, 73, 5, -157, -96, 60, 133, -24, 39, 95, 67, -46, -162, 157, 95, -47, 72, 5, -47, 157, 126, -43, 53, 50, -102, 0, 59, 129, -3, -125, 8, -33, 70, 86, -3, 137, 153, -67, -48, 72, 66, -66, 115, 46, -258, -126, 125, -6, -11, 4, 68, -72, -92, 7, 19, -12, 39, -10, 30, -272, -9]
7458inj26J67L1n3j6p1J53j14j9J49j21n4O8J33j13r7J45J5k23N8J81k04k8L40
7483A87q5j13k2k3K82l59j9K95q7q7Q4N7k58N2K63Lk40K18n3k10j4K88k72o7M24
7508B44j14m24K86R2r6k28L49J84l85J86K2l4n5k32K83j03j92N7K39k75J16J69
7530H9N5k91K00M1j45k29N54k03l34L03R4l77J38K89j16n9p0J59k41k8L75j33
7552G1Pj82K07m5j50O3J57N9j17Orj05k19M47l23r3L38l4l62L14O1j42N7k9K0
7577cn0Q0K01j37j94K66j9j68p6J32Q1p5q0J00j9n7j2N3q1K5K9j6j74J41K74l28
7603a07l0L70j22l8q6r7K7R4j53O7P2k6M5m0o6l7j0L02k98J96j22j05J79Q8J5
7628A18j65P0j2r6K76j98Q9L7r1p0K9jn8J45J3qk46K98L5o4j86J52j55N4o4J11
$$ y = [-9, -14, -140, 27, 58, 5, -11, -82, 71, -43, -62, 87, -34, -88, -20, 113, 0, -97, 48, 63, -160, -102, 79, -125, -153, 187, 102, -11, -33, -56, 226, -133, -152, 143, 56, -31, 53, 110, -148, -96, 167, 170, -70, 148, 95, -115, -129, 159, -113, -180, 244, 130, -294, -8, 84, -12, -240, 109, 293, -92, 94, 116, 82, 27, -205, 78, -25, -217, -160, 79, -196, -80, 89, 144, -147, 53, 94, -51, -280, 274, 71, -263, 40, 134, -243, -105, 184, 68, 9, -61, 98, -143, -171, 204, 71, 78, -104, 103, 58, -92, -29, 128, 187, 70, 76, 67, -38, -257, 190, -133, -226, 112, 78, -284, 30, 91, -51, 6, -23, -3, -53, 27, 228, 91, -103, 163, 144, -24, -100, 32, 113, 38, -42, 58, 39, -18, -30, 23, -58, -33, -4, -20, -194, -53, 221, -107, -137, 233, 111, 73, -13, -110, -83, 11, -142, -75, -3, -29, 16, -24, -90, -127, -137, 165, -133, 63, -59, -164, 15, 103, 118, -47, 23, 11, -85, 191, -7, 82, 119, 28, -42, -13, -14, -72, 73, 86, 78, -168, 130, 165, 101, -85, 67, -88, -34, -98, 13]
7654A3q0J01J12k2k98K04j16P1j6mQ9k51m6L53o4p1J89q6Pn4q2Qk3J55o5r0p2
7681a38J38J00l09K88rO4l52M73k73j15J07K00k82m0L26m6j03j3p0o3j21L30j7
7704G5j55l4K26m2j40M2P7j67J75J27p6l54K52J60l20J32J55K9m49K32K36k31
7726e0oK60m3l00J22J35j98k28M13L5m31L40M6j52K1J46J37k54o9N6J09l5j09
7749e5K32k00j04J35K03j60j32J247j239p0J98K89k68n95J009j84n64k2L52L6
7769A08k34L68K6k89J44K10n74J94J92l15M55L1r8N4m17M0M99l90j70J41K5j68
7791a68J53K94o30O15j40k33j44L41j36O6K2P9n6k16J88l3J53j72j39R9J15o0
7813br2J80l25K07m6N1J2J2r5J20J99l9k96q6K23r2l7J75o3j12J81n4l3p5K7K6
$$ y = [13, -67, 34, 146, 124, -174, 30, -86, -15, -31, -35, 54, -197, -243, 110, 46, -25, 164, 78, 85, 31, -51, -43, -66, 89, 24, -66, -138, 0, 100, -209, 79, 70, 134, -218, 255, -18, -133, -26, 174, -108, -148, 178, 132, 29, 16, -54, -117, -238, 92, 75, -80, -114, 112, 70, -70, -28, 49, -118, 57, 184, 108, -246, 6, 166, -154, -22, 133, 162, -287, -55, 181, -50, -56, 204, 161, -139, -17, 118, -80, -308, 105, 140, -291, 49, 95, -57, -36, 110, 247, -7, -76, -20, 89, 54, -55, 177, -23, -127, 8, 211, 51, -81, 1166, -73, -143, 55, 344, 76, -519, 490, 306, -258, -280, 72, 108, -126, 242, 268, -21, 123, 333, -241, -47, 145, -170, 285, 316, 218, 272, -145, -105, 394, 4, -166, -25, 0, -168, -15, 279, -351, 264, 124, -109, -253, 88, -48, 18, 40, 119, 63, -153, 35, 2, 155, -17, -156, -57, 58, -2, -94, 86, -239, -32, -78, -27, -15, -3, -98, 22, 221, 182, -114, -200, 23, -69, -106, 69, 6, -106, 75, 21, -12, -87, -60, -34]
7839c4R1p8N7j43J06rj25K06J6j75J6J58k21Q7j69K71M3r5K0J28k45J1J17r8m4
7864a09m4K36n6j02O4m8o0O0J77P6j66k24O6n0K50J64q9k44L18j16k97K06K38
7887B50j52l81K85j76J01K33m7k90L70k42O5K00j76L57l00k34Jr5l1J1J25L73
7909B47m63K95L68p67j34K76J43l14M65jL57q74N99l20K75k24q0K76k06j45L46
7930A19m6j90J07J09r7k08K98J18m45K44K37p1k86l16J98K63j38R7j0Q6K48j92
7952A25m47K49k0j30K99j40J89k05j2J59K1n8j77J93j70n5L31r9n3l22K80J53
7974A11k75j25M11k25j75L70j03j8p5K16j66N8J22j18J36K0l5j80o9J01J1l3J79
7997A38L20k74p5n32J069k78k71j10K24K9l29L47l04Q8PJ5k87K26J72j14k89M05
$$ y = [-34, 57, -21, 36, -107, -1, -10, -135, 71, 87, -88, -72, 86, -135, -48, -217, 54, 97, 2, 22, 150, -95, -84, 33, -65, -109, -153, 83, 27, -75, -11, -59, -119, -59, 118, 194, 28, -196, -130, -180, 70, 234, 145, -99, 219, 103, -194, 12, 250, 98, -283, 2, -174, -73, 160, 113, -177, 193, -49, 16, 216, 40, 397, 97, -137, -136, -231, -262, -251, -126, 247, -216, 79, 447, -320, -454, -178, -35, -349, 116, 115, 472, -402, 197, -123, 152, -72, -152, 124, -82, -227, 119, 73, -117, -10, 99, 2, -206, 92, 210, -235, 9, 246, 175, -111, -427, -229, 34, -104, -7, -17, 69, 317, 125, -322, -73, -93, -223, 76, -64, 125, -80, -92, 67, 88, 30, -147, 46, -124, -179, 152, 53, 0, -322, -42, 111, -164, -289, 122, -103, -278, 92, -11, -29, -104, 112, -54, 4, 126, 8, 144, 164, 129, -51, -120, -19, -8, -41, 138, 458, 184, 109, -423, 646, 368, 97, -13, 211, 240, -89, 258, -46, 42, 49, 64, -223, 3, 175, 61, -228, 177]
8019A77k55O9K4l4P1N2j32K98k03Q4l16j15K81J7Q2k5l35M08l21J45l18M19k1
8042E2k11J60n5J10J6j31O3J04L3j10J1P4j72l7J76j59J93k36L31l46J71r7P5
8065A5k13n25R36n31O96m78M91q54L17M53k17oJ03j28j4m8Q3j78L4q0K06j17l4
8088h9J69j14MK12K38m33k92N77r3l34K19J6m2QpO0j12J74on3j90J29j2j22j49
8113b42L26l3l03K16O5r8j31M08j99j77L4J77o8k42L74J03l89j0L07q9k23M22
8135B28l81j43Q8L79N9m39L13q9l8l7L02rk88L0K72j90j66P3K12l25qJ43Q4l7
8159C3m32O41l23j25J97K1k44J76J84j55j65M47k87k6m5O3R8j84J17P4k65O3L60
8182B23n64N34L78o06Q6k8k10K4M38
$$ y = [177, -78, -9, 15, -19, 52, 104, -28, 270, 67, 151, -165, -280, 1, 18, 100, 75, -260, 148, -173, -28, -346, 73, 52, -159, 1, -54, 56, 72, -59, 4, 108, 141, 31, 42, 116, -56, -93, 83, -76, 117, -119, 212, -134, 37, -60, 15, -198, -723, 213, -318, 378, -100, 391, -463, -146, 307, 90, 84, 187, 59, 45, -3, 80, -98, -64, -144, 62, -55, -89, 80, -34, -30, 182, 420, -13, -305, 272, 179, -155, 64, 80, 38, 46, 39, 99, -13, 161, 155, 102, -88, 41, 29, -93, -242, 84, 51, -252, -36, 29, -69, -200, 208, 9, -168, -134, 43, -25, -267, 107, 210, -179, -189, 118, 29, -194, 228, -153, -296, -208, 171, 230, -209, 104, 15, -23, -60, 242, 233, -55, -25, 247, 57, -109, -36, 176, -149, -157, -14, 70, 33, -399, 242, -81, -206, -9, 12, -232, -56, 128, -27, -192, 255, -32, -58, -103, -40, 58, -126, -9, 65, -200, -137, 223, -341, 193, 571, -35, 51, 23, -187, -163, 275]
8191B75
$$ Imaginary data points
##PAGE= N=2
##DATA TABLE= (X++(I..I)), XYDATA
0@%%%%%%%qJ6j6J6k4M0m8N6p2R6j21J45j76K10k51K98l54M18m90N71o60P64q80
30d70J006j147J305j481J678j891K124k382K665k977L317l687M094m538N023n552
46b913O128o760P454q213R044r962J0976j2107J3372j4790J6395j8229K0351k2836
60a2090K5792k9380L3842l9564M7209n7991P4431j02802J64872n28337L59961
71f4057Q19764j114364J51923Q51582o16332p80811P95055L54214n27528P3883
81e6671M25823l59868l55672J60651K86519P7685j31340o9348K11202k44112m17634
92d72765M57094M48113n17704n7995N20480m25199n21490O53693K92533n56112
102a79352J89181L89919o06038k06267N93455r1211k51046M40828p7399n25652
$$ y = [0, 0, 0, 0, 0, 0, 0, 0, -8, 8, -8, 8, -16, 24, -24, 32, -40, 56, -65, 80, -96, 114, -137, 161, -193, 225, -265, 306, -354, 410, -470, 536, -611, 694, -787, 891, -1000, 1124, -1258, 1407, -1570, 1747, -1940, 2154, -2384, 2639, -2913, 3215, -3545, 3909, -4304, 4740, -5222, 5754, -6353, 7019, -7771, 8624, -9605, 10746, -12090, 13702, -15678, 18164, -21400, 25809, -32182, 42249, -60553, 104319, -424018, -64057, 755707, -358657, -206734, 644848, 28516, -752295, 42760, 396974, -130554, -56671, 369152, 9284, -346388, -185737, 100782, 178467, 47127, -22221, 188981, -55131, -472765, -15671, 432442, -85262, -143257, 377223, -47976, -569466, 84227, 376760, -179352, 9829, 399748, -206290, -412557, 180898, 89687, -161359, 279469, 202070, -323582]
112c23582K19790K13327l01912K11703L52299l87376k20424L06378j16300j84197
122b30294L84753J11521l24084J2439M8449j66192J14278J52139n5645Q4680o7523
133F4521k96516J44351K22065k49468O9902L92040l28669l89328M35727J09729
143A74354m55170K95809M13458n14016k17202M59644j15995k98706L71709J60845
153B74730l65657k3176J69256j36094o612J89163l1829n0570J3525j48860J4355
164a01769J93545r6750l7553K23108j40418k58849K17462J10519k20337J19913
174H871K00737k48248j19350K18176o1597j15194K23223P303k16256R8549M4369
185D0583j82725J34964J66465j93921j5248J66042j63774j11186K39227K7405
$$ y = [-323582, -103792, 109535, -192377, 19326, 371625, -15751, -236175, 70203, -46097, -230294, 154459, 265980, -58104, -45665, 2784, -163408, -49130, 103009, 47364, 132044, 64521, -231995, -87644, 134421, -115047, -45145, 346895, 18226, -371102, 64625, 174354, -280816, 14993, 428451, -85565, -302767, 156877, 40882, -257824, 113885, 274730, -90927, -114103, 55153, -80941, -87553, 101610, 69781, 19211, 32736, -116124, -101769, 91776, -4974, -42527, 180581, 40163, -218686, -1224, 109295, -111042, 8871, 209608, -38640, -157990, 60186, -1411, -116605, 106618, 113921, -102335, -3786, 40583, -142142, -7178, 159287, -34634, -49882, 116160, -47614, -158800, 80427, 107832]
195A07832j93019J01392R6766k07056j2341J86495n3859o5102R2296l6250p1329
206e4175L4489o813K9614O9521p5679m0606R6855n6968j09390J52584Q8332j95717
218f7953Q477J85514j52949j32912K44161K8482k25955R4375J38993j78408n7333
229a15508J84808j355j34713N7626Q3810r6145m9558R3165L0628n9175j9293M5258
241A9548J7631q4155r994J29024l0688j29830R8020P9411j59191j3147J76052
252I2681m9121j47722J17170R4217j75540j7383J91623o3021j47151J25865P2287
263I3905j51202j4403J41050k4928j20174O0775R5319j00503o3609J22099K3053
274F1382j18421J7299J11260n1720j04482R0260Q6783j28868l6481J51695l3578
$$ y = [107832, -85187, 16205, 112971, -94085, -106426, 80069, 26210, -38892, 53404, 17154, -54175, -19686, -26499, 3115, 72636, -3043, -43649, 53206, -3762, -113152, 39432, 127764, -67953, -59476, 126038, -26911, -159823, 84338, 112820, -113135, -18760, 120233, -58175, -115508, 69300, 67945, -66768, -9142, 74668, -21477, -71035, 22130, 52758, -6417, -25710, 19548, 37179, -46976, -56970, 72054, 41366, -88464, 9556, 88967, -70224, -83371, 92681, 43560, -104162, 13008, 107225, -68315, -85698, 105925, 42904, -104247, 21618, 93905, -57297, -71700, 69350, 44422, -75752, -14977, 80342, -20161, -83770, 38329, 61382, -57039, -39740, 71520, 19800, -84682, 5578, 92361, -36507, -72988, 78707, 45129]
285D5129j41010Q9881J00380j21930n4170J38377L028j46155N2680J28246j05623
296a1167p8905J35207K0767j32684K7440J17556o0046r6913R4108O5976j24816
307d3477j6093J30135m0211j07850P6351P1344r4958m0025J06518N207j12755
318f5814M0150R7992q1202n6619J00195J3215r2876J8209Q0941l8726p0969O4045
330H541M8933q7281j3012Q7602k5235o9262M3720M9046n3193l6227O6540J9124
342C9296q0465J6598P7400n1679m7881O9009J6325o8026P634O1917k8824n5123
354d3819N3954K8764p0973J1164N6426m0852k3134M1270m281k3148J1761J1023
366H155p071m277M829p51K008M714j4379P844J8856l2930j704M0673l0860k0040
$$ y = [45129, -95881, -6000, 94380, -27550, -81720, 56657, 59685, -86470, -33790, 94456, -11167, -90072, 45135, 65902, -66782, -39342, 78214, 18168, -78745, 15363, 81339, -43477, -59570, 70565, 30354, -77496, -1145, 70199, -24759, -64784, 41734, 46941, -65814, -25664, 72328, -8874, -65493, 34702, 47917, -44959, -26750, 54191, 15465, -55504, 8541, 57474, -29807, -42819, 44783, 19548, -49714, -5994, 43052, -10141, -46368, 20172, 39296, -41169, -24571, 52829, 1150, -46731, 22278, 38603, -29423, -21789, 40128, 11304, -43819, 10135, 38899, -32074, -20910, 35516, -5336, -28470, 12800, 8519, -14629, -2868, 8155, 1084, -3193, 1636, 885, 2893, 7607, -6772, 1072, 19928, -13002, -14706, 25967, -4893, -24933]
380b4933M5962j4772l4296L3081P550l0072J6215J8592k7879J899K8327k8776
392i102p218N2085l3605l9335P2306j5691p8576P5981L8413j05081K4910Q9508
404F4595q3928m8423J14288p328j05562O9698O1997j10477L925J00989n6664m0940
416c7830P1443j8594m3492L2497k380n944K8072l1416j6442N4618l4423n9222
428f3113R6928K8047j35173N4271J20122j55878m1608K10256p0891j68763J75113
439D9311N8894k23015N7869J91306j44792r7043J89010k0076j79411J02490J04661
450H9204j23447n088R0827m6158l7845J7554P834M8481k4529p3627R0881L5110
462F9197j69541M7108K02322j52921j46182K57490L644l14257J67445K54630l00244
$$ y = [-24933, 21029, 6257, -28039, 5042, 12592, -17480, -1265, 17327, -10552, -8653, 19674, -9102, -16320, 35765, 2160, -37175, 35131, 19440, -59136, 16845, 55258, -49823, -24913, 64595, -19333, -67756, 46532, 39204, -66358, 3340, 65337, -45140, -41215, 59774, 3110, -37830, 33613, 15019, -28473, 4024, 1644, -4300, 23772, -7644, -24086, 30532, -3891, -63113, 33815, 61862, -73311, -19040, 101082, -54796, -96404, 113852, 42961, -125802, 49311, 108205, -114810, -56941, 134365, -10427, -107470, 81540, 61464, -117947, -15457, 89204, -34243, -39331, 51496, 5338, -32507, -14953, -7119, 41362, 16833, -56794, 34087, 69197, -100344, -53236, 149086, -3835, -150017, 107473, 111117, -203140, -35695, 218935, -81309]
473h1309p8266L41971j24550k77251K52618J33743k70757L1173K16781j41034
483C119j26019J57739K5085r7544L9969K0545k3715R948o3065K4819J26067j09097
495a2149q9296J95722l6925k25982J76345J61523k62333n759K75981j73542j99819
506a96234K91234L4354k89724J62255J73149k84427O95K54800j59667j10552K33742
517A09625n1697j93452J55630O5512j80137P8017J30093j53297j8928J29779r1405
528b0260l4611J20780o3261l8906R8907r0572m7534J60649p4411j24510K01151
539H7422K198k57238J52542J92943k84163k1246L35084j79631k52279L19613N7736
550A52981l37225J52866K34200k68746o6089K51987r1752j48778J67389K1499
$$ y = [-81309, -159575, 182396, 57846, -219405, 33213, 166956, -103801, -72628, 144153, 3119, -122900, 34839, 59924, -37620, 2349, 22894, -821, 9127, -53938, -29119, 96948, -12149, -101445, 94277, 57352, -168630, 7715, 169238, -93095, -98854, 177127, 3585, -196234, 95000, 129354, -160370, 1885, 175034, -109393, -108698, 146102, -13565, -124117, 109625, 57928, -135524, 20106, 85618, -94519, -16502, 113591, -39706, -58634, 71145, -20260, -54871, 65909, 2648, -36258, 62649, -27923, -75457, 85192, 10781, -113729, 87422, 89620, -167618, -15076, 177867, -106296, -127542, 207542, 27911, -224368, 95245, 152981, -184244, -31378, 202822, -65924, -132013, 119974, 28222, -120556, 46833, 68332]
560F8332j35554P2180K5393r2318Q6012K1526j22141J05740N9811j95391O7362
571c9048J75722j84644n3617K32897r5856j83585J95910N0008k09965J00139J33452
582A21413j90756N077J66213j44587l8149J96748j15992j18550K15636m3535k09498
593a55980J97796J04596k65149N5216K29752k00858j17747K63322l0265k16622
603a35939J49404R2084j82482K7656J14453p6029m918M2803n7797L7263L4082
614D0580j08583N6545J27862j58204o5091K25769o9735k23148K17360J26215l00492
625a30922L8902K69285j99173j47661K70007j178k29100J16974J24669j64271
635e2468j5879J37614n2092n5816O3746k5463j7353M7428n7763P201R9207r9495
$$ y = [68332, -67222, 4958, 30351, -61967, 24045, 45571, -76570, 29170, 88981, -106410, -39048, 136674, -47970, -101587, 131310, 35454, -148131, 47779, 97787, -112178, -12039, 121413, -69343, -64266, 101947, -42640, -80789, 115959, -33, -118583, 97053, 53518, -155980, 41816, 146412, -118737, -63521, 166231, -34627, -152374, 110948, 80683, -135939, 13465, 105549, -76933, -49277, 65176, -10853, -15771, 27032, -30765, 6498, 40580, -68003, -11458, 116404, -41800, -106891, 118878, 49143, -174005, 43355, 169570, -130922, -92020, 177265, -21908, -169569, 100438, 99260, -129840, -12866, 111803, -52468, -68347, 69267, 17175, -38641, 25105, -358, -17711, 29717, -28046, -20845, 78362, -21133]
647b1133o2766J60055m3052j52802J52561P9082k05943L3474J84451j44373r9306
658a19752K10542j6243j93183J25733R8994j78697J8257J50587r6152o8595J07784
669C9275j3474p5126M8517K7425l6515Q828J17j4863L4583j8146m1398P8570N499
682D3292j16176O8649R4158j43213j2278J70999q6624j34210J56266M7942j81566
693i2761M9429J56889j26865q9685J59702q93j39262P5247Q3658r5870k4546P1816
705B6859o473l8520P644K7592N190l7728j4313N2694K937o6684K9613P0017p5332
718a6504n1589J12481l171j14082P4827P6373j19765j4306J18318m4823q0628
729f2869Q7051L4344j01595R752Q3894n1125m4491P1819K454o3186J9441L3443
$$ y = [-21133, -83899, 76156, 33104, -119698, 32863, 111945, -93998, -60524, 123927, -20446, -119752, 90790, 74547, -118636, 7097, 106091, -72606, -54349, 96238, 86, -68509, 39275, 25801, -49325, -808, 26617, -9898, -1070, -953, -15816, 18767, 621, -40777, 37793, 43292, -72884, -4235, 89923, -53290, -65568, 105431, 18807, -115403, 40863, 88805, -92761, -43332, 113557, -13308, -102993, 56709, 55816, -83446, -8199, 75459, -20411, -44957, 26859, 20386, -18134, -10490, 17102, 22292, -15436, -29749, 22945, 25882, -40802, -11189, 58828, -16504, -68093, 44388, 41217, -72865, 1962, 78335, -41430, -55736, 62582, 17759, -62869, 24182, 58526, -43069, -33317, 50577, -548, -45039, 26780, 29234, -33952, -14511, 18932]
741A8932k1720j3469J9860J7129k1961k4763K9502J9337l6319J91M4016j6172
753A4563n2047L3499M3715n7983j5078P8016k7732p2253N8128L7344o8984L347
765b5465O3994k5784n2085L6469L4688m5053r110N0335j0989m0059J7284K1654
777A5879j4537j4116J3575J9285k3263k1461L1872O009l1252J1266K5764j7758
789A263j9781J7053J6400j9549o151K6021o286j9500J0491N120l938q5m600P941
803D399L038j9424L539J9148r907j4066J3599J4139k0233j3508L1232L092l3279
816a8231J5103K6808k4958j6370K3594J1767k4809j0262L3337J83m1629J4645
828a0822L7565l0210k6470M0106J6669m8158l531N7127j8891n5104M9212L6594
$$ y = [18932, -2788, -16257, 3603, 20732, -1229, -25992, 3510, 22847, -13472, -13281, 30735, 14563, -37484, -3985, 39730, -18253, -33331, 44685, 16953, -55300, 2828, 40172, -28812, -25465, 38529, 12745, -39340, -2871, 31817, -13236, -22346, 27989, 17000, -23059, -5775, 15879, 1342, -12774, 801, 20086, -3177, -24638, 7234, 13243, -18009, -6743, 19021, 1263, -18518, -1465, 14935, -4614, -10765, 15256, 8970, -10530, -39, 5081, 1143, 1058, -3542, 4399, 7437, -11987, -8448, 10700, 793, -13273, 326, 14465, -5768, -19276, 11956, 15048, -18231, -3128, 23680, -1278, -17648, 5946, 17713, -7096, -17358, 15979, 16162, -25467, -10822, 26743, -3467, -29937, 10169, 26838, -21320, -24851, 32276, 13385, -41719, 7493, 44087]
840D4087o8232m405O6839k4559n3878M2307L8105n5620j9636O2404p835n8574
852c8997L1332M2377m0700k4587M1350J5909m4451r058N6762o820o1870L4216
864d537N2077n9732l1689P4855M842q2728K7936P7022o7972n1710R8171M204r9512
877e8773M6910P1469p6696l0370Q1537l358p0359K9833N3351m7168l0236M9940
889A6080Q047m1238J286L0526K725l8041l123N5336j8410o2899N6332M5186q6673
902c4866n877R6772l8422q3240Q2162M9497j12455M350J14168o6797p5924J05267
914C4635J2461j02076L9916O4579o2803k1350N5888o251l6044J5144J6854q191
926B762l431p879J0768K2164l9487j2101O9456k9631o9312Q0656K6591j10033
$$ y = [44087, -24145, -28550, 38289, 13730, -40148, 2159, 40264, -15356, -34992, 27412, 19577, -38997, -7665, 34712, -5988, -30575, 10775, 26684, -17767, -26825, 29937, 23117, -38753, -4537, 47540, -12192, -43881, 30974, 35816, -46912, -18976, 58046, -9926, -61636, 36535, 40739, -58773, -11863, 59606, -17090, -47460, 34077, 30719, -39640, -9807, 43544, -3624, -33860, 16080, 24127, -17111, -15825, 14701, 17426, -20615, -23738, 31598, 13188, -49711, 6621, 51807, -34866, -40743, 56029, 17607, -65633, 16529, 66026, -46429, -42079, 72089, 5292, -70632, 34635, 47096, -54980, -15064, 49515, -13288, -34638, 21250, 14999, -21045, -5901, 10953, 2762, -669, -8548, 2220, 24384, -15103, -27204, 42252, 12621, -56691, 23965, 50556, -59477]
938e9477L7014R3427q9554m3811J14176k0838j03751P8507N8699j06594J0750
949c1452R2687o8174m0622Q2852j8814m9566N1050j829m1739L3981J110l6372
961b6888M0458J1314o0931L2658M5007p8142M089R5355o5435n7863J08731j7810
973C0543j03379Q5687N1603j08471K2464Q2623p8484l1863Q8962k5991n6214P0943
985B8423n394p4524O0145K1359p8088N8505M6429j03148K2321Q6511r2490k3126
997e3077J25681m7149r8941J01080K4743j25517N5438R8807j04045k3208J01589
1008E5401o0889n7060R3123o932n4706N6906q742o2806N4008J5260o3190N8919
1020A9292M2952j08372J0627R9851r1551m0804J50375m1155j33565J11885M1040
$$ y = [-59477, -22463, 70964, -18590, -62401, 51775, 30937, -72814, 5693, 64392, -42202, -31452, 61235, -6939, -47561, 35291, 16477, -33089, 17961, 16132, -25607, 8374, 9484, -26888, 13570, 24884, -36047, -3389, 41618, -36524, -32435, 62920, -2515, -60378, 48353, 30543, -72836, 12851, 64454, -44017, -21553, 61070, -17414, -49277, 39685, 13694, -42520, 28423, 23029, -51495, 8650, 30009, -48079, 10426, 56855, -46293, -23972, 62539, -29951, -53077, 72604, 25455, -73486, 27594, 52337, -73180, -17742, 81065, -22980, -46188, 55401, -5488, -62548, 30575, 23643, -31063, 25843, 17101, -45705, 8303, 23563, -39627, 19292, 62244, -46128, -35501, 64350, -27201, -68005, 82370, 41215, -92350, 19535, 60575]
1031F0575j46129N9358J22482j09419m2897J10077n0771p9775J02128K5090q2687
1042c1968M7061K2485r1923L5871N8821o8236L2198O2660j01379j7890R4414n8929
1054a6815l5957J21028k2979j16378P3058M1707j15699N3303J18879j07199m5697
1065e2749J09853o7872p8371J30584K0471j04401N5706L2740j11656J9602R4214
1076D8121m4919j4447O4457n7744n7563O9279m830l0125Q7872j6700j01810N9942
1088A533K1182r9100P9495J03420j23740l7656J13159p6799r0711J54594M9460
1099I4837j45424L7141Q0707j26819k2867J42589j5585o6046N2371j5348o8759
1110e3203K5153L2842J1153L2954l2312n3274L5543q463n7686R1478P6226j26944
$$ y = [60575, -85554, -26196, 96286, -13133, -56030, 54047, 3276, -76499, 25629, 50719, -31968, 15093, 37578, -54345, -18474, 40347, -27889, 4309, 66969, -34410, -52300, 42114, -16815, -52772, 68256, 45277, -71101, 1957, 43664, -72035, -18732, 100147, -7052, -52749, 57104, -10768, -89139, 41445, 61916, -42485, 13221, 45961, -65695, -46093, 48121, 3202, -11245, 53212, -4532, -62095, 7184, 2354, -27771, 60101, 43401, -58409, 1533, 22715, -76385, 3110, 106530, -17210, -54866, 58293, -18506, -109217, 45377, 94837, -50587, -13446, 67261, -59558, -82425, 60164, 44579, -21467, 30904, 15556, -53203, -28050, 4792, 15945, 48899, 16587, -36687, -1144, -9607, -67293, 24185, 100411, -26533]
1122b6533k5275J10582r0293p7327J73319L3965j54345M4778P9193j33540k2921
1133h8397J60790j1879r8350O1007J0609j07170K6022Q5853j8484n003J4060m6871
1145a7813j7484J3921m67M9661L2326o2615j9484L2159m8587j3245J07343O264
1157F1979r3432L6534K4647j07443L0176J25217n6287n2724P8912m2437r7298
1168i2156P8244P1098o1726P161N2603p1609n3568P0706K1751k6698L7662p9n8448
1181b5059l411J0261L668M2171M817l5146N361j1681m1621L6718N9879l0586k4079
1194h708L6732l4614n7207O2673M6179m9702J3588K9153o5873j8317N5267j522
$$ y = [-26533, -51808, 58774, -31519, -108846, 64473, 98438, -55907, -11129, 68064, -65476, -88397, 72393, 60514, -37836, 23171, 33780, -73390, -47368, 38485, 20001, 14998, 29058, -17813, -35297, -21376, -21843, 27818, 60144, -2471, -21955, 10204, -38383, -51628, 55715, 61979, -31453, 5081, 29728, -77715, -47539, 77678, 21391, -31333, 47579, 5142, -92156, -13912, 57186, -4540, 2621, 55224, -16385, -69953, 753, 22504, -4194, 33468, 33389, -25059, -28470, -18209, -14541, 27630, 32447, -2699, 2662, -9019, -50640, -13922, 45957, 15371, -8708, 28024, -6590, -63797, -1124, 45055, -4647, 8941, 38094, -27779, -46096, 9171, 7649]
$$ [...]
8191F1
##END NTUPLES=NMR FID
##END=
