##TITLE=1H_4-2026
 200.13MHz,CDCl3.
 8 sc
 
 19.1.2026
##JCAMPDX= 6.0         $$ Bruker NMR JCAMP-DX V2.0
##DATA TYPE= NMR FID
##DATA CLASS= NTUPLES
##ORIGIN= UXNMR, Bruker Analytische Messtechnik GmbH
##OWNER= pz
$$ XWIN-NMR		Version 3.5
$$ Mon Jan 19 13:42:49 2026 Russian Standard Time (UT+4h)  she@DPX200
##.OBSERVE FREQUENCY= 200.1313
##.OBSERVE NUCLEUS= ^1H
##.DELAY= (6, 6)
##.ACQUISITION MODE= SIMULTANEOUS
##.ACQUISITION SCHEME= undefined
##.AVERAGES= 8
##.DIGITISER RES= 18
##SPECTROMETER/DATA SYSTEM= spect
##.PULSE SEQUENCE= zg30
##.SOLVENT NAME= CDCl3
##.SHIFT REFERENCE= (INTERNAL, CDCl3, 0, 14.3821)
##AUDIT TRAIL= $$ (NUMBER, WHEN, WHO, WHERE, WHAT)
$$ ##TITLE= Audit trail, XWIN-NMR		Version 3.5
$$ ##JCAMPDX= 5.01
$$ ##ORIGIN= Bruker BioSpin GmbH
$$ ##OWNER= she
$$ F:/spectra/data/she/nmr/H-C/1/audita.txt
$$ ##AUDIT TRAIL=  $$ (NUMBER, WHEN, WHO, WHERE, WHAT)
(   1,<2026-01-19 13:41:41.81 +0400>,<she>,<DPX200>,
      <created by zg, POWCHK disabled, PULCHK disabled
       configuration hash MD5:
       00 E9 B6 7A A2 85 ED C7 34 08 36 98 17 FE 4E 26
       data hash MD5: 16K
       51 BF 83 8A 2F 82 62 3F B7 20 3A C8 BD 7B EB A7>)
$$ ##END=
$$ 
$$ hash MD5
$$ 6A F8 14 23 1F 73 82 E5 7C 57 D7 54 E5 B0 63 B5
##$RELAX= 
##$RELAX= 
##$RELAX= 
##$RELAX= 
##$RELAX= 
##$RELAX= 
$$ Bruker specific parameters
$$ --------------------------
##$DU= <F:/spectra>
##$EXPNO= 1
##$NAME= <H-C>
##$PROCNO= 1
##$TYPE= <nmr>
##$USER= <she>
##$AMP= (0..31)
100 100 100 100 100 100 100 100 100 100 100 100 100 100 100 100 100 100 
100 100 100 100 100 100 100 100 100 100 100 100 100 100 
##$AQSEQ= 0
##$AQ_mod= 1
##$AUNM= <au_zg>
##$AUTOPOS= <>
##$BF1= 200.13
##$BF2= 200.13
##$BF3= 200.13
##$BF4= 200.13
##$BF5= 200.13
##$BF6= 200.13
##$BF7= 200.13
##$BF8= 200.13
##$BYTORDA= 1
##$CFDGTYP= 0
##$CFRGTYP= 5
##$CHEMSTR= <none>
##$CNST= (0..31)
1 1 145 1 1 1 1 1 1 1 1 1 1 1 1 1 1 1 1 1 1 1 1 1 1 1 1 1 1 1 1 1 
##$CPDPRG= <>
##$CPDPRG1= <>
##$CPDPRG2= <>
##$CPDPRG3= <>
##$CPDPRG4= <mlev>
##$CPDPRG5= <mlev>
##$CPDPRG6= <mlev>
##$CPDPRG7= <mlev>
##$CPDPRG8= <mlev>
##$CPDPRGB= <>
##$CPDPRGT= <>
##$D= (0..31)
0 0.7 0 0 0 0 0 0 0 0 0 0.03 0 0 0 0 0 0 0 0 0 0 0 0 0 0 0 0 0 0 0 0 
##$DATE= 1768815701
##$DBL= (0..7)
120 120 120 120 120 120 120 120 
##$DBP= (0..7)
150 150 150 150 150 150 150 150 
##$DBP07= 0
##$DBPNAM0= <>
##$DBPNAM1= <>
##$DBPNAM2= <>
##$DBPNAM3= <>
##$DBPNAM4= <>
##$DBPNAM5= <>
##$DBPNAM6= <>
##$DBPNAM7= <>
##$DBPOAL= (0..7)
0.5 0.5 0.5 0.5 0.5 0.5 0.5 0.5 
##$DBPOFFS= (0..7)
0 0 0 0 0 0 0 0 
##$DE= 6
##$DECBNUC= <off>
##$DECIM= 32
##$DECNUC= <off>
##$DECSTAT= 4
##$DIGMOD= 1
##$DIGTYP= 9
##$DL= (0..7)
0 120 120 120 120 120 120 120 
##$DP= (0..7)
150 150 150 150 150 150 150 150 
##$DP07= 0
##$DPNAME0= <>
##$DPNAME1= <>
##$DPNAME2= <>
##$DPNAME3= <>
##$DPNAME4= <>
##$DPNAME5= <>
##$DPNAME6= <>
##$DPNAME7= <>
##$DPOAL= (0..7)
0.5 0.5 0.5 0.5 0.5 0.5 0.5 0.5 
##$DPOFFS= (0..7)
0 0 0 0 0 0 0 0 
##$DQDMODE= 0
##$DR= 18
##$DS= 0
##$DSLIST= <SSSSSSSSSSSSSSS>
$$ [...]
##$SUBNAM0= <"">
##$SUBNAM1= <"">
##$SUBNAM2= <"">
##$SUBNAM3= <"">
##$SUBNAM4= <"">
##$SUBNAM5= <"">
##$SUBNAM6= <"">
##$SUBNAM7= <"">
##$SUBNAM8= <"">
##$SUBNAM9= <"">
##$SW= 18.0517328524113
##$SWIBOX= (0..15)
0 0 2 0 0 0 0 0 0 0 0 0 0 0 0 0 
##$SW_h= 3612.71676300578
##$TD= 16384
##$TD0= 1
##$TE= 0
##$TE2= 300
##$TE3= 300
##$TEG= 300
##$TL= (0..7)
0 120 120 120 120 120 120 120 
##$TP= (0..7)
150 150 150 150 150 150 150 150 
##$TP07= 0
##$TPNAME0= <>
##$TPNAME1= <>
##$TPNAME2= <>
##$TPNAME3= <>
##$TPNAME4= <>
##$TPNAME5= <>
##$TPNAME6= <>
##$TPNAME7= <>
##$TPOAL= (0..7)
0.5 0.5 0.5 0.5 0.5 0.5 0.5 0.5 
##$TPOFFS= (0..7)
0 0 0 0 0 0 0 0 
##$TUNHIN= 0
##$TUNHOUT= 0
##$TUNXOUT= 0
##$USERA1= <user>
##$USERA2= <user>
##$USERA3= <user>
##$USERA4= <user>
##$USERA5= <user>
##$V9= 5
##$VALIST= <valist>
##$VCLIST= <CCCCCCCCCCCCCCC>
##$VD= 0
##$VDLIST= <DDDDDDDDDDDDDDD>
##$VPLIST= <PPPPPPPPPPPPPPP>
##$VTLIST= <TTTTTTTTTTTTTTT>
##$WBST= 1024
##$WBSW= 4
##$XGAIN= (0..3)
0 0 0 0 
##$XL= 0
##$YL= 0
##$YMAX_a= 712647
##$YMIN_a= -706014
##$ZGOPTNS= <>
##$ZL1= 120
##$ZL2= 120
##$ZL3= 120
##$ZL4= 120
##$ABSF1= 10
##$ABSF2= 0
##$ABSG= 5
##$ABSL= 3
##$ALPHA= 0
##$AQORDER= 0
##$ASSFAC= 0
##$ASSFACI= 0
##$ASSFACX= 0
##$ASSWID= 0
##$AUNMP= <proc_1d>
##$AZFE= 0.1
##$AZFW= 0.1
##$BCFW= 1
##$BC_mod= 2
##$BYTORDP= 1
##$COROFFS= 0
##$CY= -3
##$DATMOD= 1
##$DC= 2
##$DFILT= <>
##$DTYPP= 0
##$F1P= 0
##$F2P= 0
##$FCOR= 0.5
##$FTSIZE= 0
##$FT_mod= 4
##$GAMMA= 1
##$GB= 0.15
##$INTBC= 1
##$INTSCL= 1
##$ISEN= 128
##$LB= 0.25
##$LEV0= 0
##$LPBIN= 0
##$MAXI= 10000
##$MC2= 0
##$MEAN= 0
##$ME_mod= 0
##$MI= 1.114404
##$NCOEF= 0
##$NC_proc= 0
##$NLEV= 6
##$NOISF1= 3.799351
##$NOISF2= 2.8
##$NSP= 1
##$NTH_PI= 0
##$NZP= 0
##$OFFSET= 14.38212
##$PC= 1
##$PHC0= -3859.708
##$PHC1= 11.59231
##$PH_mod= 1
##$PKNL= yes
##$PPARMOD= 0
##$PSCAL= 0
##$PSIGN= 0
##$REVERSE= no
##$SF= 200.129724274929
##$SI= 16384
##$SIGF1= 3
##$SIGF2= 2
##$SINO= 400
##$SIOLD= 16384
##$SREGLST= <1H.CDCl3>
##$SSB= 0
##$STSI= 0
##$STSR= 0
##$SW_p= 3205.1282051282
##$SYMM= 0
##$S_DEV= 0
##$TDeff= 0
##$TDoff= 0
##$TI= <>
##$TILT= no
##$TM1= 0
##$TM2= 0
##$TOPLEV= 0
##$USERP1= <user>
##$USERP2= <user>
##$USERP3= <user>
##$USERP4= <user>
##$USERP5= <user>
##$WDW= 1
##$XDIM= 8192
##$YMAX_p= 0
##$YMIN_p= 0
$$ End of Bruker specific parameters
$$ ---------------------------------
##NTUPLES= NMR FID
##VAR_NAME=  TIME,          FID/REAL,        FID/IMAG
##SYMBOL=    X,             R,               I
##VAR_TYPE=  INDEPENDENT,   DEPENDENT,       DEPENDENT
##VAR_FORM=  AFFN,          ASDF,            ASDF
##VAR_DIM=   8192,          8192,            8192
##UNITS=     SECONDS,       ARBITRARY UNITS, ARBITRARY UNITS
##FACTOR=    0.0002768,     1,               1
##FIRST=     0,             0,               0
##LAST=      2.2672688,     0,               0
##MIN=       0,             -706014,         0
##MAX=       2.2672688,     712647,          0
$$ Real data points
##PAGE= N=1
##DATA TABLE= (X++(R..R)), XYDATA
$$ [...]
$$ plain form
2303 -6404 4511 5682 -7784 -3004 9698 -2849 -10180 7637 5806 -10438 356 9988 -4935
2316 -4935 -7609 7343 4551 -7540 228 8376 -3363 -7127 4572 4054 -4654 -1420 5250 400
2330 400 -7674 -802 7604 -2335 -6223 7291 3799 -10802 -963 10533 -2782 -7169 9066 4688
2344 4688 -12491 -874 11624 -4673 -6622 9976 1978 -11669 -14 7737 -3064 -4126 6417
2357 6417 3026 -8116 -2666 6583 662 -3966 3440 5256 -5255 -6921 5992 5235 -7206 1144
2371 1144 9871 -7176 -10217 8478 4553 -9387 2725 10248 -7851 -9313 8947 3661 -8416
2384 -8416 4354 8530 -7307 -6067 5902 2104 -3582 1851 4784 -2461 -6486 586 4562 -1499
2398 -1499 -1967 4545 1364 -7981 -2157 7873 -638 -5069 7475 2970 -10760 -203 8598 -3479
$$ packed form
2303f404J0915J171j3466M780J2702j2547p331J7817j831j6244J0794R632j4923
2316d935k674J4952k792j2091P768Q148j1739l764J1699n18q708L234O670m850
2330D00q074O872Q406r939l888J3514l492j4601R839J1496j3315m387J6235m378
2344D688j7179J1617J2498j6297j949J6598p998j3647J1655P751j0801j062J0543
2357F417l391j1142N450R249n921m628P406J816j0511j666J2913p57j2441Q350
2371A144Q727j7047l041J8695l925j3940J2112P523j8099j462J8260n286j2077
2384h416J2770M176j5837J240J1969l798n686N433K933p245m025P072L976o061
2398a499m68O512l181r345N824J0030q511m431J2544m505j3730J0557Q801j2077
$$ plain form
2412 -3479 -2921 8099 34 -9182 1008 4973 -3849 -147 6163 -2544 -5412 1488 210 -579 3113
2427 3113 1228 -813 -595 -2625 -279 3487 756 -410 2112 -1245 -5037 848 3840 -2085 207
2442 207 4229 -4267 -4673 4018 26 -2222 4973 1278 -5150 548 1938 -2646 1604 5294 -2260
2457 -2260 -3406 2916 -2000 -3954 5505 2597 -5405 1460 1797 -6115 -126 5594 -1037 -2068 2887
2472 2887 -700 -4074 1462 3190 -529 738 793 -2153 -379 -340 -1037 3983 820 -4914 1830 2090
2488 2090 -6644 541 8066 -3298 -5476 6574 889 -9162 3696 9049 -6464 -3417 8759
2501 8759 -2551 -8214 5623 4603 -5536 -548 4340 -1998 -4463 1391 3210 -771 -2231 1158
2515 1158 2236 -2505 -3576 5006 4210 -6619 -174 8433 -5518 -7509 9791 3245 -10660 2902
$$ packed form
2412c479N58J1020q065r216J0190L965q822L702O310q707k868O900j278p89L692
2427C113j885k041K18k030K346L766k731j166K522l357l792N885K992n925K292
2442B07M022q496m06Q691l992k248P195l695o428N698J390m584M250L690p554
2457b260j146O322m916j954R459k908q002O865L37p912N989N720o631j031M955
2472B887l587l374N536J728l719J267N5k946J774L9o97N020l163n734O744K60
2488B090q734P185P525j1364k178J2050n685j0051J2858N353j5513L047J2176
2501H759j1310n663J3837j020j0139M988M888o338k465N854J819l981j460L389
2515A158J078m741j071Q582p96j0829O445Q607j3951j991J7300o546j3905J3562
$$ plain form
2529 2902 8930 -8804 -6213 10717 737 -9937 5253 6604 -8983 -2531 8253 -1110 -4683
2542 -4683 3571 3109 -3257 -2899 2646 2978 -2756 -1996 4262 621 -6960 268 7444 -3751 -6239 8539
2558 8539 2167 -11772 3179 10388 -8055 -4315 11530 -1039 -10782 5549 7619 -8233 -1955
2571 -1955 9516 -2968 -8221 4755 3522 -5318 -208 4116 -696 -3783 -691 3781 673 -3697
2585 -3697 2103 4738 -4642 -4221 6775 2328 -7454 2532 7773 -7832 -5735 10230 -254 -9416
2599 -9416 6303 5539 -9544 -1635 8266 -2379 -4960 5753 2239 -6091 188 4334 -1528 -800
2613 -800 2242 -351 -980 -1461 -702 3008 -127 -3147 2493 1176 -5506 363 5499 -2086 -3078 4849
2629 4849 401 -6258 2793 4929 -4362 -235 4978 -3666 -3256 4362 -163 -2654 2838 281 -3939
$$ packed form
2529B902O028j7734K591J6930r980j0674J5190J351j5587O452J0784r363l573
2542d683Q254m62o366L58N545L32n734P60O258l641p581P228P176j1195k488J4778
2558H539o372j3939J4951P209j8443L740J5845j2569r743J6331K070j5852O278
2571a955J1471j2484n253J2976j233q840N110M324m812l087L092M472l108m370
2585c697N800K635r380M21J0996m447r782R986N241j5605K097J5965j0484r162
2599i416J5719p64j5083P909R901j0645k581J0713l514q330O279M146n862P28
2613h00L042k593o29m81P59L710l135l020N640j317o682N869N136p585r92P927
2629D849m448o659R051K136r291M127N213q644M10P618m525k491N492k557m220
$$ plain form
2644 -3939 582 1527 -2166 1231 3028 -2864 -1294 2989 -1884 -1190 4547 -92 -3044 1962 -7
2659 -7 -2833 1935 2015 -1868 -255 712 -2432 -701 2417 -773 -490 2389 -2190 -2221 3527 -26 -2490
2676 -2490 4120 952 -5060 1471 3355 -3539 -418 5071 -2048 -4855 3267 1419 -4806 2063 4221
2691 4221 -3926 -2118 3245 -702 -1893 2146 1735 -1002 -1466 293 1364 -291 -1085 1894 1643 -3610
2707 -3610 -2076 4536 -462 -5331 4299 3894 -7813 -1060 7954 -3014 -5451 6842 2819 -8087
2721 -8087 286 7586 -2991 -4815 6144 2114 -7027 -238 5070 -1314 -3638 1996 3291 -3428
2735 -3428 -4279 4519 3290 -5621 -363 6756 -2441 -6760 5129 5907 -6932 -2015 8941 -2912
2749 -2912 -8681 6604 5300 -8144 -563 7313 -3489 -6599 4900 4146 -5129 -1031 5257 -1620
$$ packed form
2644c939M521R45l693L397J797n892J570M283m873O94N737m639k952N006j969
2659gk826M768Q0l883J613R67l144J731L118l190K83K879m579l1N748l553k464
2676b490O610l168o012O531J884o894L121N489p119k807Q122j848o225O869K158
2691D221q147J808N363l947j191M039m11k737m64J759J071j655p94K979k51n253
2707c610J534O612m998m869R630m05j1707O753R014j0968k437J2293m023j0906
2721h087Q373P300j0577j824J0959m030r141O789N308o384k324N634J295o719
2735c428q51Q798j229q911N258P119r197m319J1889P78j2839M917J0956j1853
2749b912n769J5285j304j3444P581P876j0802l110J1499p54r275M098O288o877
$$ plain form
2763 -1620 -4876 2858 3994 -2067 -2113 2805 1374 -4538 -686 5917 -1110 -5167 3578 2266 -6463
2778 -6463 -431 6685 -1767 -5116 4477 2147 -6921 902 7302 -3020 -3685 5326 146 -5873 1700
2793 1700 4839 -2150 -2750 2759 407 -4475 -95 4136 -317 -3036 1104 1965 -3045 -2298 4732 2445
2809 2445 -4864 352 4586 -4070 -3601 6282 2208 -5759 610 4214 -4436 -3617 6006 1922 -5509
2824 -5509 840 3081 -3815 -1889 4185 1855 -2194 -699 1507 -744 -2264 1750 3282 -1016 -2611
2839 -2611 798 570 -2761 -15 4354 -472 -4123 1420 889 -3505 1201 4236 -972 -1997 1022
2854 1022 -305 -1581 1456 2613 -509 -631 -160 -1925 -96 1671 -246 612 1128 -2684 -1840 1663
2870 1663 166 -323 1949 683 -2450 -1338 1414 543 -139 1857 516 -1910 -1053 -95 913 807
$$ packed form
2763a620l256P734J136o061m6M918j431n912L852O603p027m057Q745j312q729
2778f463O032P116q452l349R593k330r068P823O400j0322o65R011n180o019P573
2793A700L139o989o00N509k352m882M380M231m453k719M140Q61n010P47P030k287
2809B445p309N216M234q656M69R883m074p967O369L604q650Q19R623m084p431
2824e509O349K241o896J926O074k330m049J495K206k251j520M014J532m298j595
2839b611L409k28l331K746M369m826l651N543n31m394M706L035n208j025L019
2854A022j327j276L037J157l122j22M71j765J829J767j917Q58N16l812Q44L503
2870A663j497m89K272j266l133J112K752q71o82J996j341k426Q57R58J008j06
$$ plain form
2886 807 -522 873 189 -3620 -625 3220 -511 -1527 2694 649 -4452 -197 4579 -1188 -2319
2901 -2319 4506 422 -5651 1131 3961 -2513 -1217 3688 -270 -4443 64 3051 -1291 -1894 2923
2916 2923 992 -3534 -955 3082 686 -2423 1345 3463 -3342 -3435 4687 1366 -5107 2011 4648
2931 4648 -4578 -3741 5279 987 -5773 2276 5258 -4958 -3283 5944 124 -5069 2852 4113 -3448
2946 -3448 -2445 3810 1087 -3999 442 4079 -1913 -3737 2505 2517 -3613 -1657 4784 404 -5385
2961 -5385 2026 5005 -4959 -2794 6848 218 -6086 3126 4862 -5498 -2806 6606 -75 -6213 3233
2976 3233 4132 -5683 -2253 5228 -106 -4126 1751 3439 -2866 -3171 3599 2549 -3617 -154 4473
2991 4473 -1333 -4794 2526 4379 -3925 -2537 6056 -679 -7366 3189 5263 -5536 -1746 6440
$$ packed form
2886H07j329J395o84l809K995L845l731j016M221k045n101M255M776n767j131
2901b319O825m084o073O782K830o474J296M905l958m173M507K987m342o03M817
2916B923j931m526K579M037k396l109L768K118o805r3Q122l321o473P118K637
2931D648r226Q37R020m292o760Q049K982j0216J675R227n820n193P921J261p561
2946c448J003O255k723n086M441L637n992j824O242J2o130J956O441m380n789
2961e385P411K979r964K165R642o630o304R212J736j0360K692R412o681o138R446
2976C233Q99r815L430P481n334m020N877J688o305l05O770j050o166L463M627
2991D473n806l461P320J853q304J388Q593o735o687J0555K074j0799L790Q186
$$ plain form
3005 6440 -1459 -6154 3197 4333 -4162 -1032 5592 -1069 -4958 2383 2762 -2291 -689 2596 274
3020 274 -3349 -1108 2978 50 -2861 2018 2456 -3635 -1967 3938 637 -3473 2185 3717 -4188
3035 -4188 -2180 4961 -734 -3681 3574 1787 -4526 -372 2845 -1503 -1515 2457 367 -2726 322
3050 322 1229 -1163 522 1528 -421 57 -301 -738 1217 343 -563 1214 -49 -1989 116 1001 -1016
3067 -1016 -49 1732 -794 -1969 1185 385 -1811 1645 1562 -2337 449 1764 -2198 -42 2747 -1087
3083 -1087 -1762 1956 -203 -2983 1266 2248 -2514 -515 2751 -1872 -2339 2686 648 -2080 1060 1460
3099 1460 -1211 -875 1033 982 -679 -395 949 198 -1582 -492 1953 -36 -2660 1435 2503 -3878
3115 -3878 -1283 4876 -1191 -3826 3855 2243 -4980 95 5064 -1998 -3690 4383 1640 -5109 601
$$ packed form
3005F440p899m695R351J136q495L130O624o661l889P341L79n053J602L285k322
3020B74l623K241M086k928k911M879M38o091J668N905l301m110N658J532p905
3035d188K008P141n695k947P255j787o313M154L217m348j2L972k090l093L048
3050C22R07k392J685J006j949M78l58m37J955q74r06J777j263j940K105Q85k017
3067a016R67J781k526j175L154q00k196L456q3l899K786J315l962K156K789l834
3083a087o75L718k159k780M249R82m762J999L266m623m67N025k038k728L140M00
3099A460k671L36J908n1j661K84J344p51j780J090K445j989k624M095J068o381
3115c878K595O159o067k635P681j612p223N075M969p062j692Q073k743o749N710
$$ plain form
3130 601 4133 -2576 -2418 2991 1024 -3085 -851 2673 89 -2824 1026 3130 -2052 -2595 3194 1902
3146 1902 -3813 -209 5029 -1838 -4812 4254 2680 -6155 376 5686 -3363 -4344 4525 1552 -5113
3161 -5113 724 4799 -2642 -3355 3860 1486 -3715 646 3399 -1062 -2502 1228 2300 -2021 -2155
3176 -2155 3124 1056 -4146 268 3790 -2181 -3056 3657 1999 -4829 229 5133 -2627 -3526 4943
3191 4943 1088 -4949 1444 3774 -2976 -2155 3459 581 -3650 327 2904 -1782 -2189 2212 1027
3206 1027 -2189 -534 2114 516 -2347 671 2897 -1992 -2414 3393 990 -3689 830 3370 -2772
3221 -2772 -2733 3542 970 -4222 1034 3479 -3155 -2033 3506 374 -2828 1297 2135 -1512 -1556 1783
3237 1783 1149 -1576 -371 1461 -342 -1850 88 1849 -493 -2018 1378 1137 -3025 -270 3065
$$ packed form
3130F01L532o709J58N409j967m109K234L524k584k913L850K104n182n43N789j292
3146A902n715L604N238o867k974R066j574q835O531N310r049r81Q869k973o665
3161e113N837M075p441p13P215k374n201M361K753m461j440L730J072m321j34
3176b155N279k068n202M414L522n971q75O713j658o828N058M904p760q99Q469
3191D943l855o037O393K330o750Q21N614k878m231L977K577m686m07M401j185
3206A027l216J655K648j598k863L018K226m889m22N807k403m679M519K540o142
3221b772L9O275k572n192N256K445o634J122N539l132l202M125Q38l647m4L339
3237A783o34k725J205J832j803j508J938J761k342j525L396k41m162K755L335
$$ plain form
3252 3065 -739 -1849 1890 839 -2276 49 2329 -395 -1280 1301 243 -1721 244 703 -386
3267 -386 165 -352 -456 192 -571 -374 1242 425 -827 -122 844 -476 -681 1660 891 -1454 121 584
3285 584 -1136 -189 959 285 -217 -893 -359 259 -667 -155 1370 502 -1255 -327 1232 -448 -955 2102
3303 2102 1336 -2387 -184 1739 -1592 -977 2312 539 -2069 -205 1157 -1212 -1235 2103 1100 -1790
3319 -1790 -41 1034 -948 -748 1330 1411 -785 -1097 1081 22 -2016 1181 2462 -1433 -1328 1540
3335 1540 -180 -2601 902 3053 -1438 -1992 2451 -302 -3393 1822 3183 -1662 -1095 2266 -425
3350 -425 -3063 934 3227 -1258 -1610 1964 -341 -3459 396 3110 -363 -1964 1211 1182 -3233 -1010
3366 -1010 4223 444 -2838 1713 1744 -3610 -1573 4149 958 -3342 1382 2348 -4192 -2103 4439 709
$$ packed form
3252C065l804j110L739j051l115K325K280k724q85K581j058j964J965M59j089
3267c86N51n17j04O48p63J97J616q17j252P05R66j320k05K341p69k345J575M63
3285E84j720R47J148o74n02o76N34O18r26N12J525q68j757R28J559j680n07L057
3303B102p66l723K203J923l331O15L289j773k608J864J362k369k3L338j003k890
3319a790J749J075j982K00K078Q1k196l12K178j059k038L197J281l895J05K868
3335A540j720k421L503K151m491n54M443k753l091N215J361m845N67L361k691
3350d25k638L997K293m485l52L574k305l118L855K714l473j601L175k9m415K223
3366a010N233l779l282M551L1n354K037N722l191m300M724R66o540K089O542l730
$$ plain form
3382 709 -3047 1533 1899 -3558 -2014 3706 1645 -2367 925 2261 -2932 -2455 2966 2002 -1937 -224
3398 -224 2185 -1795 -3720 1898 3104 -2332 -674 3050 -1689 -4178 2035 3402 -1610 -805 3131
3413 3131 -1150 -4352 1784 3380 -1682 -517 2353 -1337 -3405 636 2572 -267 -940 1651 -207
3428 -207 -3250 -173 2590 495 -770 1066 652 -2664 -1414 2875 1105 -1669 1402 898 -3343 -1164
3444 -1164 2464 583 -1077 1100 443 -2677 -1197 2185 572 -290 1450 -155 -1989 -516 733
3459 733 1046 838 105 -96 -970 -1460 279 1224 478 71 1 -755 -1709 39 1650 248 149 857 -1253
3478 -1253 -1477 847 861 310 1093 87 -1449 -726 291 -58 634 1340 -520 -1621 93 -187 -767 1677
3496 1677 1271 -1269 -532 217 -1001 67 1719 1077 -625 -632 -160 -700 -215 1129 988 -284 -963 -715
$$ packed form
3382G09l756M580L66n457J544N720k061m012L292J336n193M77N421r64l939J713
3398b24K409l980j925N618J206n436J658L724m739k489O213J367n012Q05L936
3413C131m281l202O136J596n062J165K870l690k068M041J936k839o73K591j858
3428b07l043L077K763k095j265J836m14l316J250M289j770k774L071n04m241K179
3444a164L628j881j660K177o57l120J480L382j613q62J740j605j834J473J249
3459G33L13k08p33k01q74m90J739R45p46m07p0p56r54J748J611j402r9P08k110
3478a253k24K324J4n51P83j006j536P23J017l49O92P06j860j101J714k80n80K444
3496A677m06k540P37P49j218J068J652o42j702pM72n40M85J344j41j272o79K48
$$ plain form
3514 -715 79 -548 68 2169 57 -2264 559 736 -1774 301 3048 -228 -2246 1000 875 -2510
3530 -2510 334 3408 -980 -2255 1323 155 -2281 437 2494 -122 -1875 325 782 -1538 -351
3545 -351 2465 879 -1833 -295 1264 -972 -1621 2482 2026 -3009 -754 2496 -1800 -2445 3206 1666
3561 1666 -3148 -378 2478 -1773 -2132 3220 1726 -2733 89 2121 -1806 -1564 2199 1341 -1581 -852
3577 -852 1304 -411 -2264 954 2447 -1365 -1643 1638 394 -2530 404 3332 -1131 -2429 2476
3592 2476 754 -3575 1030 3585 -1750 -1905 2388 226 -3096 496 2768 -1246 -1733 1836 289
3607 289 -2380 416 2071 -177 -1315 565 1266 -1366 -1340 2361 945 -2210 288 1879 -1721 -1865
3623 -1865 2276 1132 -2578 83 2482 -1814 -1907 2710 761 -2241 707 1574 -1483 -1161 1652 910
$$ packed form
3514g15P94o27O16K101k112k321K823J77k510K075K747l276k018L246j25l385
3530b510K844L074m388j275L578j168k436K718K057k616j753K200M57k320J187
3545c51K816j586k712J538J559k236o49M103m56n035K255L250m296o45N651j540
3561A666m814K770K856m251l59N352j494m459K822K032l927K42L763q58k922P29
3577h52K156j715j853L218J493l812k78L281j244k924K934K928m463j298M905
3592B476j722m329M605K555n335j55M293k162l322L592K272m014m87L569j547
3607B89k669K796J655k248j138J880P01k632K6L701j416l155K498J591l600j44
3623a865M141j144l710K661K399m296r3M617j949l002K948Q67l057L22K813p42
$$ plain form
3639 910 -1161 -19 915 -675 -1170 476 914 -358 -799 642 460 -1546 -240 1796 -417 -1333 1316
3656 1316 483 -1677 138 1698 -360 -1015 1083 279 -1669 203 1109 -792 -314 752 -454 -600
3672 -600 51 131 259 -12 50 -28 -89 -155 188 709 218 -460 173 166 -910 87 918 -440 -361 426 -434 -385
3694 -385 344 304 77 -114 -125 -147 -57 116 42 468 312 -663 45 687 -730 -286 1092 -245 -993 454
3714 454 191 -805 -302 940 -56 -1061 433 727 -945 34 1211 -256 -751 161 605 -266 -588 744
3732 744 576 -1202 -364 984 -373 -1054 704 794 -1092 -824 1436 99 -1635 1051 1450 -1533 -577
3749 -577 1727 -175 -1449 870 1504 -1351 -1159 1538 168 -1782 557 1481 -1191 -1091 1224 679
3765 679 -1387 -175 1810 -382 -1578 1296 1310 -1655 -410 1808 -226 -1910 777 1734 -1765 -1242
$$ packed form
3639I10k071J142R34j590m95J646M38j272m41J441j82k006J306K036k213r16K649
3656A316q33k160J815J560k058o55K098q04j948J872R06j901M78J066j206j46
3672f00O51Q0J28k71O2p8o1o6L43N21m91o78O33pj076R97Q31j358P9P87q60M9
3694c85P29m0k27j91j1k2R0J73p4M26j56r75P08O42j417M44J378j337p48J447
3714D54k63r96N03J242r96j005J494K94j672R79J177j467m95R12M44q71l22J332
3732G44j68j778Q38J348j357o81J758R0j886K68K260j337j734K686L99k983R56
3749e77K304j902j274K319O34k855J92K697j370j950K339R24k672J00K315n45
3765F79k066J212J985k192j196K874J4k965J245K218k034j684K687R57l499N23
$$ plain form
3781 -1242 2232 -56 -2469 791 1908 -1751 -1252 1955 471 -2064 450 2366 -1159 -1466 1800
3796 1800 601 -1820 236 1794 -635 -1657 992 1207 -1829 -615 2082 -263 -1978 965 1352
3811 1352 -1468 -696 2157 481 -2152 624 1853 -1529 -1057 2196 90 -2240 473 1459 -1070 -1105
3827 -1105 1714 482 -2024 92 1418 -937 -804 1436 677 -1273 -276 1140 -37 -1148 1103 1175
3843 1175 -1395 -829 1226 -102 -1366 806 1321 -1211 -1253 1350 103 -1502 1035 1448 -1323 -702
3859 -702 1046 -34 -787 605 1034 -737 -1046 449 101 -655 339 749 -346 -753 -127 518 -122 -349
3877 -349 904 299 -1224 -11 607 -257 -152 971 177 -990 -181 409 -230 -76 835 -232 -671 -197
3895 -197 -364 81 687 24 30 182 -578 -395 681 567 -174 166 280 -809 -575 818 415 -408 433 54
$$ packed form
3781a242L474k288k413L260J117l659M99L207j484k535K514J916l525l07L266
3796A800j199k421K056J558k429j022K649K15l036J214K697k345j715K943L87
3811A352k820P72K853j676k633K776J229l382M72L253k106k330K713R86k529l5
3827a105K819j232k506K116J326k355J33K240p59j950R97J416j177j111K251P2
3843A175k570N66K055j328j264K172N15k532m2K603j247j605K537M13k771O21
3859g02J748j080p53J392M29j771l09J495l48p56R94M10j095m07O26O45o40k27
3877c49J253o05j523J213O18q64J05J123p94j167Q09N90o39J54R11j067m39M74
3895a97j67M45O06o63OJ52p60J83J076j14p41L40J14j089K34J393m03q23Q41l79
$$ plain form
3915 54 -847 -350 216 374 177 -84 40 -208 -628 122 914 367 -557 202 190 -948 -227 1388 39 -967
3935 -967 667 75 -1674 -13 1434 -225 -629 661 68 -1372 175 1456 82 -511 585 33
3951 33 -967 -203 902 472 -557 -131 583 -864 -1053 1291 929 -1116 -83 1051 -1002 -1459 1590
3968 1590 1297 -1534 -2 1648 -1230 -1350 1662 869 -1361 59 953 -951 -1338 993 1096 -1159
3984 -1159 -485 979 -404 -1363 456 1602 -393 -1172 1087 513 -1906 240 2315 -787 -1528 1424
4000 1424 491 -2182 107 2211 -925 -1602 1345 474 -1994 302 1826 -617 -982 935 493 -1068
4016 -1068 -253 1461 271 -1338 389 1086 -959 -853 1349 677 -1610 -112 1631 -656 -1599 1664
4032 1664 825 -2115 135 1761 -1010 -1104 1517 677 -1373 -6 1171 -685 -827 947 422 -1080
$$ packed form
3915E4r01M97N66J58j97k61J24k48m20P50P92n47r24P59j2j138P21J615j349j006
3935i67J634n92j749J661J447j659m04J290n93j440J547J281j374n93J096n52
3951C3j000P64J105m30j029M26P14j447j89K344l62k045J033J134k053m57L049
3968A590k93k831J532J650k878j20L012p93k230J420Q94j904l87K331J03k255
3984a159O74J464j383r59J819J146j995p79K259n74k419K146K075l102p41K952
4000A424r33k673K289K104l136o77K947q71k468K296J524k443l65J917m42j561
4016a068Q15J714j190j609J727O97k045J06K202o72k287J498J743k287r43L263
4032A664q39k940K250J626k771r4K621q40k050J367J177j856j42J774n25j502
$$ plain form
4048 -1080 -346 520 -22 -562 88 827 -483 -1069 827 709 -965 162 1185 -511 -962 810 639
4065 639 -1091 9 1159 -805 -1005 960 115 -748 480 480 -652 -439 381 263 -240 250 449 -346
4083 -346 -300 -32 298 225 -198 228 199 -781 -427 743 -150 -406 561 150 -955 56 676 -148 -189 671
4103 671 55 -810 296 424 -319 323 411 -428 68 -55 -279 339 308 -122 -177 4 -316 -122 400 347 -312
4124 -312 166 352 -550 -23 599 109 48 47 40 -61 -229 40 293 -53 -293 21 139 -478 -267 587 347 -796
4146 -796 252 559 -782 -212 1136 -59 -818 442 524 -908 -398 923 141 -1039 292 652 -812
4163 -812 -507 814 281 -633 -105 736 -102 -905 764 741 -756 -235 959 -341 -1019 636 926 -861
4181 -861 -642 1222 -17 -1467 510 1162 -1001 -554 1189 196 -1090 367 1334 -707 -829 1172 404
$$ packed form
4048a080P34Q66n42n40O50P39j310n86J896j18j674J127J023j696m51J772j71
4065F39j730J100J150j964k00J965q45q63J228%j132K13Q20j18n03M90J99p95
4083c46M6K68L30p3m23M26k9r80L54J170q93k56R67m11j105J011O20q24m1Q60
4103F71o16q65J106J28p43O42Q8q39M96j23k24O18l1m30n5J81l20J94N22n3o59
4124c12M78J86r02N27O22m90o1jpj01j68K69K53l46k40L14J18o17K11Q54k40j143
4146g96J048L07j341N70J348j195p59J260Q2j432N10J321p82j180J331L60j464
4163h12L05J321n33r14N28Q41q38q03J669k3j497N21J194j300o78J655K90j787
4181h61K19J864j239j450J977O52k163M47J743r93j286J457R67k041j22K001p68
$$ plain form
4198 404 -1366 129 1155 -634 -739 818 493 -1156 -226 1390 -187 -1190 869 725 -1213 -393
4214 -393 1437 100 -1071 552 1199 -1075 -732 1277 59 -1295 519 1008 -920 -754 1130 290
4230 290 -1315 265 1168 -866 -811 1240 347 -919 309 977 -505 -871 789 605 -1027 -133 1119
4247 1119 -445 -967 650 629 -829 -399 1037 92 -1196 201 1063 -914 -443 1122 -49 -986 436
4264 436 814 -734 -605 798 125 -1149 247 703 -693 -399 509 -38 -534 11 496 53 -573 409
4282 409 408 -549 -236 685 -43 -447 207 455 -346 -428 588 75 -672 303 506 -561 -156 423 -67 -212
4302 -212 280 213 -261 -164 256 -56 -23 285 -185 -143 52 -238 -39 204 -247 -237 216 -280 -148 67 253 -56
4324 -56 -51 44 -55 -37 201 216 0 151 -266 86 79 -350 19 457 -469 -373 425 -89 -464 499 473 -606 -312
$$ packed form
4198D04j770J495J026j789j05J557l25j649R30J616j577j003K059j44j938Q20
4214c93J830j337j171J623O47k274L43K009j218j354J814M89j928J66J884q40
4230B90j605J580R03k034N5K051q93j266J228O68j482l66J660j84j632Q94J252
4247A119j564n22J617k1j458M30J436r45j288J397Q62j977M71J565j171r37J422
4264D36L78j548J29J403o73j274J396M56j396K94R08n47m96N45M85m43o26R82
4282D09jr57L13R21p28m04O54K48q01q2J016n13p47R75K03j067M05N79m90j45
4302b12M92o7m74R7M20l12L3L08m70M2J95k90J99K43m51J0M53m96J32K15J86l09
4324e6NR5r9J8K38J5k16J51m17L52pm29L69M38r26R6P98n14l75R63k6j079K94
$$ plain form
4347 -312 646 -107 -499 774 582 -631 -53 362 -276 -332 286 334 -361 -391 299 2 -476 171 624 -150
4367 -150 -654 149 395 -578 -130 1100 -12 -991 646 407 -1012 -65 1024 -264 -923 482 357 -965
4385 -965 -78 1152 -255 -804 416 274 -578 -112 785 376 -747 -153 633 -381 -671 863 546 -958
4403 -958 -197 664 -456 -887 971 926 -1226 -209 1026 -558 -849 1075 627 -935 -68 705 -297
4420 -297 -779 673 804 -602 -443 548 -191 -811 192 1013 -193 -862 417 318 -1175 52 1523 -297
4438 -297 -922 712 279 -1220 0 1382 -290 -880 632 207 -1178 142 1077 -269 -486 274 9
4455 9 -611 -194 813 374 -360 59 284 -542 -501 760 692 -472 -299 680 -510 -839 929 676 -952
4474 -952 35 507 -957 -702 832 411 -367 158 308 -662 -298 597 167 -62 110 -34 -295 -353 -12 514
$$ packed form
4347c12R58p53l92J273j92j213N78M15o38n6O18M8o95l0O90k97m78O47M53p74
4367a50n04Q03K46r73M48J230j112r79J637k39j419R47J089j288o59J405j25j322
4385i65Q87J230j407n49J220j42q52M66Q97m09j123N94P86j014k90J534l17j504
4403i58P61Q61j120m31J858m5k152J017J235j584k91J924m48j562Q67P73j002
4420b97m82J452J31j406J59R91p39o20J003Q21j206o69J279r9j493J227J471j820
4438b97o25J634m33j499J220J382j672n90J512m25j385J320R35j346k17P60k65
4455Io20M17J007m39p34M19K25q26M1J261o8j164J73R79j190l29J768k53j628
4474i52R87M72j464K55J534m21p78N25J50r70L64Q95m30k29J72j44k61n8L41N26
$$ plain form
4494 514 98 -486 8 -48 -586 26 690 130 -270 168 139 -691 164 798 -92 -130 353 -488 -427 258 150
4515 150 -7 122 -135 -455 -131 49 -15 211 375 -242 -276 153 -124 -69 705 152 -324 29 -49 -359 159
4536 159 350 102 -233 -307 -213 -160 112 189 186 196 -386 -267 339 -56 -145 814 201 -836 140 399 -511 -67
4558 -67 714 53 -812 114 281 -584 10 868 -159 -471 82 149 -94 -138 481 418 -388 -335 400 29 -462
4579 -462 372 652 -448 -697 569 67 -824 442 874 -715 -597 834 -26 -701 543 769 -533 -381
4597 -381 548 30 -704 353 739 -443 -525 343 30 -428 2 812 -2 -874 238 462 -708 -168 1061
4616 1061 115 -893 146 688 -619 -190 1159 92 -1152 210 630 -808 -268 870 27 -841 110
4633 110 613 -540 -275 856 267 -721 44 585 -279 -388 689 554 -681 -227 702 -173 -675 757
$$ packed form
4494E14m16n84M94n6n38O12O64n60m00M38k9q30Q55O34q90l8M83q41O1O85j08
4515A50j57J29k57l20L24J80o4K26J64o17l4M29k77N5P74n53m76L53p8l10N18
4536A59J91k48l35p4R4N3K72P7lJ0n82J19O06l95q9R59o13j037R76K59r10M44
4558f7P81o61q65R26J67q65N94Q58j027l12N53O7k43m4O19o3q06N3P35l71m91
4579d62Q34K80j100k49J266n02q91J266M32j589J18J431q60o75J244K26j302J52
4597c81R29n18p34J057L86j182q2Q68l13m58M30Q10q14q72J112K24j170N40J229
4616A061r46j008J039N42j307M29J349j067j244J362M20j438N40J138q43q68R51
4633A10N03j153K65J131n89r88P65N41q64j09J077j35j235M54R29q75n02J432
$$ plain form
4651 757 451 -796 -331 710 -209 -762 455 645 -674 -346 799 -186 -704 450 654 -524 -314 507
4669 507 -33 -690 246 574 -495 -453 438 24 -507 221 535 -189 -412 252 208 -430 -43 589 -175 -457
4689 -457 246 243 -358 -56 475 110 -576 208 244 -417 -89 508 104 -212 55 299 -253 -62 473 62 -120
4710 -120 90 95 -346 187 191 -13 -30 -92 -170 2 -50 75 99 -7 -188 -80 -40 107 49 93 116 -194 -132 95 -2
4735 -2 1 -29 -69 196 -160 -250 226 137 -7 89 162 -67 -201 269 248 -253 276 361 -481 -120 436 -216 -292 329
4759 329 9 -404 -263 453 3 -336 180 186 -268 -132 246 174 -223 -118 373 -70 -490 273 473 -523 -147
4780 -147 627 -139 -665 420 450 -563 -109 689 -166 -621 492 359 -571 -72 541 -97 -463 192 358
4799 358 -441 -343 446 31 -487 45 387 -153 -390 314 295 -654 -109 811 -237 -793 765 440 -801 6
$$ packed form
4651G57l06j247M65J041r19n53J217J90j319L28J145r85n18J154K04j178K10Q21
4669E07n40o57R36L28j069M2Q91m14n31P28L14p24k23O64m4o38L87O32p64k82
4689d57P03lo01L02N31l65o86P84L6o61L28N97m04l16K67K44n52J91N35m11j82
4710a20K10Nm41N33Mk04j7o2p8J72n2J25K4j06j81J08M0J47n8M4K3l10O2K27r7
4735bLl0m0K65l56r0M76q9j44R6P3k29j34M70k1n01N29Q5q42L61N56o52p6O21
4759C29l20m13J41P16m50l39N16Om54J36L78p2l97J05M91m43m20P63K00r96L76
4780a47P74p66n26J085L0j013M54P98q55m55J113j33r30M99O13o38l66O55J66
4799C58p99R8P89m15n18N32L42n40k37P04j9r49N45R20j048n56J558l25j241Q07
$$ plain form
4819 6 829 -249 -502 592 428 -775 -121 950 -365 -590 517 315 -465 -110 499 59 -502 106 537
4838 537 -263 -385 494 273 -530 -51 645 -199 -651 548 440 -814 -137 781 -268 -564 475 204 -653
4857 -653 13 517 -159 -470 446 318 -520 -229 430 -32 -202 239 388 -257 -342 378 194 -557 -128 496
4877 496 -197 -465 425 272 -466 -1 618 -257 -514 443 86 -520 109 337 -278 -171 191 10 -200 -82
4897 -82 225 -69 -210 1 228 -47 -69 141 52 -306 -198 309 14 -283 315 72 -506 95 122 29 -65 231
4919 231 -72 -282 18 134 -180 154 229 -48 -45 84 -120 85 186 -113 104 152 -189 -18 230 -14 -22 98
4941 98 -112 -213 0 123 56 -11 65 -129 2 49 -97 132 164 -279 -67 240 -284 -288 369 76 -402 2 308
4964 308 -324 -186 494 -51 -251 288 -18 -417 -20 303 78 -74 -71 193 -86 -199 198 94 -243 -274 165
$$ packed form
4819FQ23j078k53J094j64j203O54J071j315k25J107k02p80L55O09m40n61O08M31
4838E37q00j22Q79k21q03M79O96q44m52J199j08j254O77R18j049k96J039k71q57
4857f53O66N04o76l11R16j28q38K91O59m62j70M41J49o45q5P20j84p51M29O24
4877D96o93k68Q90j53p38M65O19q75k57R57l57o06O29K28o15J07L62j81k10J18
4897h2L07k94j41K11K27k75k2K10q9l58J08N07k95k97N98k43n78O01K7r3r4K96
4919B31l03k10L00J16l14L34P5k77LJ29k04K05J01k99K17M8l41J71K48k44qJ20
4941I8k10j01K13J23o7o7P6j94J31M7j46K29L2m43K12L07n24mO57k93m78M04L06
4964C08o32J38O80n45k00N39l06l99L97L23k25j52LK64k79j13L97j04l37l1M39
$$ plain form
4985 165 158 -469 104 526 -472 -397 551 -74 -567 429 606 -446 -294 498 -122 -589 454 413 -416 -159 241
5006 241 -147 -410 117 112 -49 -211 123 41 -301 -84 542 -9 -441 56 372 -407 -152 657 118 -657 225
5027 225 469 -719 -181 708 -178 -665 311 196 -463 -78 661 54 -372 180 190 -276 -64 220 201 -322
5047 -322 -161 290 -64 -446 283 492 -507 -183 424 -86 -549 239 455 -458 -265 582 -214 -562 533 459
5067 459 -368 -96 434 -147 -252 184 178 -311 -150 302 -19 -201 163 173 -122 -396 108 299 -242 -85 496
5088 496 65 -511 200 101 -471 -59 450 -118 -386 131 172 -371 -102 351 -204 -390 211 101 -151 16 136
5109 136 60 -234 29 186 -181 -127 181 24 -167 -60 88 65 -163 98 138 -253 -117 107 -42 -112 206 -1
5131 -1 -35 56 76 -44 -119 192 13 -176 -40 26 -55 178 -34 -75 -9 28 -78 76 86 -9 -22 16 -94 -122 65
$$ packed form
4985A65po27N73M22r98P5R48o25m93R96J77j052J52P92o20m67J043m1q29K57M00
5006B41l88k63N27nj61j62L34q2l42K17O26n51m32M97L16p79K55Q09n39p75Q82
5027B25K44j188N38Q89q86m87R76j15o59L85P39o07m26N52J0m66K12K84j9n23
5047c22J61M51l54l82P29K09r99L24O07n10m63P88K16r13J93Q47p96l48J095p4
5067D59q27K72N30n81j05M36om89J61M52l21j82L64J0k95k74N04J91n41J57N81
5088D96m31n76P11r9n72M12N09n68k68N17M1n43K69M53n55j86O01j10k52J67J20
5109A36p6k94K63J57l67N4L08j57j91J07J48k3k28K61M0l91J36K24j49p0L18k07
5131al4R1K0j20p5L11j79j89J36O6q1K33k12m1O6L7j06J54J0r5j3L8j10k8J87
$$ plain form
5156 65 188 111 -132 16 -114 -184 -80 71 19 -107 -91 58 -68 -67 120 51 -126 -10 -40 20 -139 214 203 -239
5180 -239 -5 240 -114 -298 217 211 -261 -152 176 -140 -275 172 233 -275 9 272 -138 -158 245 177 -224 -93
5202 -93 136 -17 -209 17 249 -203 -153 172 39 -301 -85 186 -100 -360 183 117 -378 -30 450 18 -347
5223 -347 217 256 -433 -86 514 -126 -398 269 18 -513 -98 273 -108 -266 84 153 -334 -156 331 79 -147
5244 -147 -12 315 -78 -281 287 218 -452 -107 454 -110 -446 301 204 -426 -157 320 -70 -347 252 203 -391
5265 -391 -145 338 -44 -289 193 197 -118 -82 185 -87 -180 64 225 -90 -174 157 79 -285 -19 240 -65 -327
5287 -327 297 179 -448 -96 439 -190 -173 284 -43 -319 47 245 -140 -50 209 100 -258 24 143 -82 -106
5308 -106 -30 69 -63 -184 157 94 -111 56 100 -52 -221 232 218 -174 -42 132 -44 -192 152 119 -121 6
$$ packed form
5156F5J23p7k43J48j30p0J04J51n2j26J6J49j26JJ87o9j77J16l0O0j59L53j1m42
5180b39K34K45l54j84N15om72J09L28l16j35M47O1n08K84K63m10k0M03o8m01J31
5202i3K29j53j92K26K32m52N0L25j33l40K16K71k86k60N43o6m95L48M80m32l65
5223c47N64L9o89L47O00o40k72O67k51n31M15L71l81j58L50O9m87J78M87k52k26
5244a47J35L27l93k03N68o9o70L45N61n64l36P47r7o30K69M77l90k77N99m9n94
5265c91K46M83l82k45M82Ml15L6K67k72r3K44J61l15q4L31p8l64K66K59l05k62
5287c27O24j18o27L52N35o29J7M57l27k76L66J98l85R0K59j09l58K82J19k25k4
5308a06P6R9j32j21L41o3k05J67M4j52j69M53j4l92J32J74j76j48L44l3k40J27
$$ plain form
5330 6 165 10 86 -39 79 118 -74 16 -27 -81 -74 42 27 25 12 74 15 7 20 115 -2 29 -27 -12 37 -24 72 -85
5358 -85 87 -54 -51 48 -138 -35 73 7 -146 113 -25 -202 -8 123 -309 -99 178 -73 -60 2 164 -89
5380 -89 51 170 57 -198 37 75 -38 -170 -90 101 -37 -112 171 116 -257 165 98 -161 -77 169 52 -301
5402 -301 119 188 -301 -58 259 63 -305 111 213 -208 -36 122 101 -258 30 163 -20 -149 128 45 -214
5423 -214 -164 192 6 -197 115 149 -241 -256 261 -43 -308 209 198 -310 -134 297 -1 -359 167 311 -265
5444 -265 13 297 0 -136 18 15 -101 -224 -10 122 -168 -44 295 -123 -162 80 329 -303 -74 505 -34
5465 -34 -432 137 349 -363 -62 376 -143 -361 217 140 -236 -113 222 -61 -243 43 118 -169 -1 130 97
5486 97 -61 -175 258 -98 -113 175 161 -245 -62 244 -1 -184 142 274 -334 -146 236 -133 -267 300 97
$$ packed form
5330FJ59j55P6j25J18L9j92R0m3n4PJ16j5kj3O2n9qJ3R5j17L1n6J5M9o1R6j57
5358h5J72j41LR9j86J03J08o6j53K59j38j77J94J31m32K10K77k51J3O2J62k53
5380h9J40J19j13k55K35L8j13j32Q0J91j38p5K83n5l73M22o7k59Q4K46j17l53
5402c01M20O9m89K43L17j96l68M16J02m21J72J58k1l59K88J33j83j29K77q3k59
5423b14N0L56j86k03L12L4l90j5N17l04k65N17j1n08J76M31k98l58N26J44n76
5444b65K78K84k97j36J54lj16j23K14J32k90J24L39m18l9K42K49o32K29N79n39
5465c4l98N69K12p12L01M38n19k18N78p7l76J23L35k83j82K86P5k87J68J31l3
5486I7j58j14M33l56j5K88j4m06J83L06k45j83L26J32o08J88L82l69j34N67k03
$$ plain form
5507 97 -174 64 111 -92 -41 58 45 -31 39 65 12 -142 104 99 5 -197 -33 150 -95 30 162 28 -291 110
5531 110 98 -56 79 245 -59 -118 164 -33 -193 156 100 -104 -10 66 -141 -47 124 -55 -100 66 -118 -21 99
5554 99 -72 -64 28 67 -192 117 95 -114 86 57 -148 -114 45 -125 -23 71 -177 31 72 -125 -103 53 26 -77
5578 -77 34 119 -144 -41 228 -45 -101 98 50 -126 -71 -51 -105 -159 73 40 -91 -32 67 40 -77 75 24 -41 -13
5603 -13 -62 4 40 102 237 -103 -90 134 90 -201 -40 185 -113 -247 119 231 -200 132 157 -119 -57 168 69
5626 69 -109 56 186 -2 -131 99 150 -72 50 147 -44 -180 -14 75 -108 -116 180 28 -135 62 147 -57
5648 -57 -95 198 71 -198 -48 198 -192 -145 201 146 -126 -56 283 -176 -66 102 116 -166 -45 105 -47 -136
5670 -136 99 -13 -153 -55 62 -105 -143 34 128 -126 -60 215 -1 -163 -86 106 -5 -81 102 181 -102 -64 122
$$ packed form
5507I7k71K38M7k03N1R9j3p6P0K6n3j54K46nr4k02J64J83k45J25J32j34l19M01
5531A10j2j54J35J66l04n9K82j97j60L49n6k04R4P6k07R4J71j79m5J66j84R7J20
5554I9j71QR2L9k59L09k2k09K00k9k05L4J59j70J02R4k48K08M1j97K2J56k7j03
5578g7J11Q5k63J03K69k73n6J99m8j76N5K0n4n4K32l3j31N9R9k7j17J52n1o5K8
5603a3m9O6L6O2J35l40J3K24m4k91J61K25k98j34L66J12m31L32K5k76O2K25r9
5626F9j78J65J30j88j29K30N1k22J22R7j91j36J66Q9j83qK96j52j63J97Q5k04
5648e7l8K93j27k69J50K46l90M7L46n5k72P0L39m59J10J68J4k82J21J50j52q9
5670a36K35j12j40R8J17j67l8J77R4k54O6K75k16j62P7J92j11p6J83P9k83L8J86
$$ plain form
5693 122 -175 -90 176 30 -204 33 72 -100 -72 230 55 -148 13 101 -98 -30 2 39 29 9 36 174 -166
5716 -166 41 85 48 -2 15 166 -127 -8 69 -49 -125 127 122 -117 -21 29 -114 -142 120 -53 236 418 28 -72
5740 -72 161 120 -48 -32 -73 7 -27 109 -65 -14 42 -19 -16 113 26 -318 -179 -153 -211 84 33 46 14 -34 -74 110
5766 110 42 -63 -94 145 35 -114 230 13 -65 35 -74 -68 104 7 -62 -45 84 -17 -52 16 -15 9 -112 23
5790 23 -30 0 -58 30 -83 -9 -12 199 -148 12 -151 -298 -449 215 575 114 -166 18 61 -209 21 109 -95
5813 -95 -76 20 53 -122 19 89 -125 -81 93 21 -19 51 98 -39 -67 5 54 -1 -60 48 -109 -119 67 0 -91 -105
5839 -105 111 -44 -152 -12 202 17 -43 189 -8 -43 205 114 -45 -103 100 110 -163 -46 67 -41 -127 76
5861 76 16 -49 -100 154 -120 -58 150 75 -182 3 186 -8 -101 58 60 -152 -28 123 8 -126 90 93 -27 -43
$$ packed form
5693A22k97Q5K66j46k34K37L9j72K8L02j75k03J61Q8j99O8L2L7j0k0K7J38l40
5716a66K07M4l7n0J7J51k93J19P7j18p6K52nk39R6N0j43k8K62j73K89J82l90j00
5740g2K33m1j68J6m1Q0l4J36j74N1N6o1LJ29q7l44J39K6n8K95n1J3l2m8m0J84
5766A10o8j05l1K39j10j49L44k17p8J00j09OJ72r7o9J7J29j01l5O8l1K4j21J35
5790B3n3L0n8Q8j13P4lK11l47J60j63j47j51O64L60m61k80J84M3k70K30Q8k04
5813i5J9R6L3j75J41P0k14M4J74p2m0P0M7j37k8P2M9n5n9J08j57j0J86o7r1j4
5839a05K16j55j08J40K14j85o0K32j97l5K48r1j59n8K03J0k73J17J13j08q6K03
5861G6o0o5n1K54k74O2K08p5k57J85J83j94r3J59Kk12J24J51j15j34K16Lj20j6
$$ plain form
5885 -43 53 -26 -115 82 123 -51 -78 98 160 -76 -31 110 13 83 -63 133 -140 70 10 35 -158 118 12 -19
5909 -19 116 -52 9 -110 -42 -110 7 19 79 -68 -71 -87 39 -35 -17 43 -41 -76 19 -40 -37 -18 46 -34 -154 -51 -2
5936 -2 101 -3 17 -20 -84 9 130 -9 -59 73 -3 116 32 -24 -20 -42 46 42 16 44 40 34 17 15 34 -8 -33 -5 72 -52
5966 -52 -48 177 -57 -53 38 3 3 97 4 -56 58 -72 74 102 -61 -38 -51 27 -65 5 49 82 -63 45 74 -46 40
5993 40 -28 -6 52 48 21 13 22 83 60 -23 -17 52 39 116 -34 72 -3 45 63 28 -99 -55 -54 -88 -56 21 24 -174 25 214
6023 214 -12 -27 73 17 -74 86 -10 -87 -48 9 66 13 -1 69 -56 48 23 -48 16 -78 92 -30 16 72 120 35
6049 35 -127 80 -104 13 65 106 -81 -74 100 11 -109 -60 60 -75 -36 -100 -45 47 -19 -11 -46 -54 49 -31 -52 -62 31
6076 31 91 -54 -74 129 -97 7 81 34 -57 69 7 -17 36 78 96 -127 -1 18 63 -30 57 21 -16 20 -48 -118 -7
$$ packed form
5885d3R6p9q9J97M1j74k7J76O2k36M5J41r7P0j46J96k73K10o0K5j93K76j06l1
5909a9J35j68O1j19O8o8J17J2O0j47lj6J26p4J8O0q4l5R5n9LJ9O4q0j20J03M9
5936bJ03j04K0l7o4R3J21j39n0J32p6J19q4n6Mk2Q8mk6K8moj7kJ9m2k5K8P7j24
5966e2MK25k34MR1l5%R4r3o0J14j30J46K8j63K3j3P8r2P0M4L3j45J08K9j20Q6
5993D0o8K2N8mk7qRO1k3q3OO9j3P7j50J06p5M8J8l5j27M4Jl4L2P7Lj98J99J89
6023B14k26j5J00n6r1J60r6p7L9N7N7n3j4P0j25J04k5p1O4r4J70j22M6N6M8q5
6049C5j62K07j84J17N2M1j87PJ74q9j20M9J20j35L9o4N5R2o6Ql5qJ03q0k1j0R3
6076C1O0j45k0K03k26J04P4m7r1J26o2k4N3M2J8k23J26J9M5r3Q7l6l7L6o8p0J11
$$ plain form
6103 -7 26 102 -32 52 97 12 28 -4 19 108 -44 61 28 -27 100 77 37 31 44 81 -23 -52 82 8 37 39 6 -79 3
6132 3 64 -78 -53 31 44 -10 74 -10 47 77 23 -33 -95 -69 6 16 -85 -13 46 -7 -21 33 -19 -93 -35 12 -1 27 25 77
6162 77 -66 -67 20 26 -73 -91 -63 -62 -76 -3 71 28 -92 -67 20 5 -26 57 56 39 -6 136 -115 -99 15 5 79 -35 24
6191 24 -64 62 -32 52 136 -25 -145 -95 13 27 34 -83 96 40 -20 67 -17 -1 -14 -13 90 32 -68 -101 -19 35 66
6218 66 -81 -9 -10 -63 10 57 -11 57 7 46 -58 109 -29 -40 41 12 55 -31 65 -25 -75 32 2 49 37 0 53 7
6246 7 -50 -21 57 99 -66 52 27 134 -62 5 -52 -76 17 -5 -157 1 -23 -77 5 -37 34 -25 -30 -25 55 -74 -112 -18
6274 -18 16 -3 114 -57 -67 14 -40 -137 53 44 -82 38 -106 40 -92 -49 29 -33 -32 -22 58 -50 17 19 31 56 -32
6301 -32 -114 5 -4 -51 -17 -12 13 20 -34 -3 12 36 82 -36 88 69 -100 -140 74 -37 -63 50 5 -71 -23 60 -5 -82
$$ packed form
6103gL3P6j34Q4M5q5J6l2K3Q9j52J05l3n5J27k3m0oJ3L7j04k9J34p4K9Kl3q5Q2
6132CO1j42K5Q4J3n4Q4q4N7L0n4n6o2K6P5J0j01P2N9n3j4N4n2p4N8M7j3K8kN2
6162G7j43jQ7Or9j8K8Jj4P3P4m3j20K5Q7j5l1Q3jj7m5J42k51J6J14j0P4j14N9
6191B4q8J26r4Q4Q4j61j20N0J08J4Pj17J79n6o0Q7q4J6j3JJ03n8j00l3Q2N4L1
6218F6j47P2jn3P3M7o8O8n0L9j04J67j38j1Q1k9M3q6R6r0n0J07l0M7j2l7N3m6
6246Gn7K9P8M2j65J18k5J07j96O7n7k4R3k2j52J58k4n4Q2m2P1n9nNQ0j29l8R4
6274a8L4j9J17j71j0Q1n4r7J90rj26J20j44J46j32M3P8o2JJ0Q0j08O7KJ2K5q8
6301c2q2J19rm7L4NK5Pn4L1J5K4M6j18J24j9j69m0K14j11k6J13m5p6M8Q3o5p7
$$ plain form
6329 -82 -4 65 89 64 105 35 3 54 2 -35 -43 -40 13 73 -58 126 -42 -47 -19 17 -23 -53 19 13 44 3 -102 89 26 -28
6359 -28 -27 82 1 -12 3 -54 -42 -91 -78 -50 -8 -12 6 59 -36 38 -5 35 -8 -72 -105 -39 15 6 10 30 49 45 41 86 60 98 26
6392 26 -18 11 11 -14 -105 -64 -63 -105 -8 -109 7 84 -83 -83 -40 1 -103 1 3 -37 26 -45 38 -121 29 53 -23 11 0
6421 0 126 -90 29 75 18 -53 -85 -18 76 38 -40 57 -60 -1 -35 4 -69 76 -4 76 -11 -31 -3 20 6 11 -60 -29 16
6450 16 5 -5 -99 65 64 -90 88 3 71 45 125 79 -67 40 -6 110 33 13 58 44 8 -45 72 21 104 -30 97
6477 97 -14 5 -45 -90 2 7 -60 12 -45 -67 -11 130 114 -11 21 49 38 20 8 -51 72 126 85 -47 101 79 5 -43
6505 -43 13 38 27 14 46 61 -57 42 119 -38 -57 -49 89 69 43 -15 125 -68 25 43 -52 -65 -31 78 -89 -27 69
6532 69 71 -41 -56 -6 -18 119 -19 -128 128 -85 40 -78 -59 -14 60 -32 138 64 -52 -11 15 120 40 34 137
$$ packed form
6329h2P8O9K4k5M1p0l2N1n2l7qLN3O0j31J84j68nK8L6m0l0P2oL1m1j05J91o3n4
6359b8JJ09q1j3J5n7J2m9J3K8M2mJ8N3r5P4m3M0m3o4l3O6N4rMK0J9mmM5k6L8p2
6392B6m4K9%k5r1M1Jm2R7j01J16P7j67%M3M1j04J04Km0O3p1Q3j59J50K4p6L4j1
6421@J26k16J19M6n7p1l2O7R4l8p8R7j17N9l4L9p3J45q0Q0q7k0K8K3j4Np1L1M5
6450A6j1j0r4J64jj54J78q5O8k6Q0m6j46J07m6J16p7k0M5j4l6n3J17n1Q3j34J27
6477I7j11J9n0m5R2No7P2n7k2N6J41j6j25L2K8j1j8j2n9J23N4m1j32J48k2p4m8
6505d3N6K5j1j3L2J5j18R9P7j57j9QJ38k0k6n8J40j93R3J8r5j3L4J09j67O2R6
6532F9Kj12j5N0j2J37j38j09K56k13J25j18J9M5P4r2J70p4j16M1K6J05q0oJ03
$$ plain form
6557 137 -155 -13 32 81 41 -13 -50 -15 13 36 63 -4 -69 2 -15 -36 13 -108 33 51 71 11 -67 -32 118 6 -66
6584 -66 -88 12 54 32 5 -57 -24 24 31 24 -26 84 37 35 -9 125 -14 56 -18 -14 24 6 -79 79 38 83 -4 -31 30 -46
6614 -46 26 -31 -96 -121 6 -80 -62 6 133 69 60 63 -60 -18 16 -56 -15 2 -26 -20 6 -126 38 67 19 16 -30 -76 16 153
6644 153 -141 86 25 55 60 74 1 69 -61 70 -49 -94 18 136 -18 -27 24 12 10 74 -62 52 5 -23 21 12 -38
6671 -38 77 67 -33 2 84 13 -91 112 77 48 88 -3 12 -79 146 58 -48 -23 -44 -35 -79 58 7 2 104 37 22
6698 22 -19 20 177 -20 -11 -69 40 -73 47 116 37 56 -56 15 -18 56 63 -77 -38 148 -48 -2 -8 121 -8 -80
6724 -80 37 -153 -110 70 -10 -81 -148 18 135 -18 37 134 -110 38 -1 5 -10 90 46 31 69 -106 -33 -67 -89 104
6750 104 -72 -100 -20 -15 -134 -102 63 26 -114 93 -21 -34 45 22 -18 33 -16 51 73 -27 76 48 3 -53 -107 13
$$ packed form
6557A37k92J42M5M9m0n4l7L5K8K3K7o7o5P1j7k1M9j21J41J8K0o0p8L5J50j12p2
6584f6k2J00M2k2k7o2L3M8Ppn0J10m7km4J34j39P0p4ML8j8q5J58m1M5q7k7O1p6
6614d6P2n7o5k5J27q6J8O8J27o4rLj23M2L4p2M1J7k8OK6j32J64K9m8lm6m6R2J37
6644A53k94K27o1L0NJ4p3O8j30J31j19m5J12J18j54rN1j2kO4j36J14m7k8M4rn0
6671c8J15j0j00L5Q2p1j04K03l5k9M0r1J5r1K25q8j06K5k1Rm4J37n1nJ02o7j5
6698B2m1L9J57j97Rn8J09j13J20O9p9J9j12P1l3P4Pj40L9J86j96M6oJ29j29p2
6724h0J17j90M3J80q0p1o7J66J17j53N5R7k44J48l9Oj5J00m4j5L8j75P3l4k2J93
6750A04j76k8Q0Nj19L2J65l7j40K07j14j3P9k3m0N1m9O7K2j00J03k8m5n6n4J20
$$ plain form
6776 13 45 -82 35 -88 24 115 -5 -23 -85 46 -5 -71 -18 83 50 27 -38 123 -50 -68 -116 -7 158 -87
6800 -87 139 -18 -68 30 -131 -53 -49 81 17 59 -15 -7 9 56 15 39 -25 11 61 -70 3 59 -13 27 23 62 53 81 24 -61
6830 -61 70 33 -60 24 -8 24 72 7 38 26 17 -58 -42 42 36 -77 95 9 3 -16 -70 0 -105 33 139 -4 -67 26
6858 26 47 25 -69 -44 -100 -88 45 -88 -87 84 90 -27 -70 32 57 -61 -1 48 33 -42 108 21 -158 40 38 -109 -104
6885 -104 50 121 -69 -26 48 -30 -83 -9 122 -54 10 144 112 -84 30 125 -33 44 141 63 -55 55 18 -7 -77
6910 -77 52 76 -38 84 -11 -15 -16 43 -18 42 -54 33 33 -82 35 64 -68 -34 60 -2 45 -85 77 -58 -70 20 106
6937 106 -31 33 159 -18 31 100 -84 -2 -30 104 39 -68 3 -21 37 -103 -57 -95 -27 71 0 -30 -35 112 -95 -56
6963 -56 70 51 -124 -47 139 -22 -136 -8 34 -27 18 -21 -22 -83 -67 -59 -13 -15 86 63 78 -33 16 30 57 89 111 -35
$$ packed form
6776A3L2j27J17j23J12R1j20j8o2J31n1o6N3J01l3k3o5J61j73j8m8J09J65k45
6800h7K26j57n0R8j61P8MJ30o4M2p4QJ6M7m1K4o4L6N0j31P3N6p2M0mL9rK8n7q5
6830f1J31l7r3Q4l2L2M8o5L1j2rp5J6Q4oj13J72q6oj9n4P0j05J38J06j43o3R3
6858B6K1k2r4K5n6J2J33j33JJ71Oj17m3J02K5j18O0M9j5p5J50q7j79J98kj47N
6885a04J54P1j90M3P4p8n3P4J31j76O4J34l2j96J14R5j58P7R7p8j18J10l7k5p0
6910g7J29K4j14J22r5mjN9o1O0r6Q7%j15J17K9j32L4R4o2M7j30J62j35j2R0Q6
6937A06j37O4J26j77M9O9j84Q2k8J34o5j07P1k4N8j40M6l8O8R8p1l0nJ47k07L9
6963e6J26j9j75P7J86j61j14J28M2o1M5l9jo1J6QM6kJ01k3J5j11M9J4K7L2K2j46
$$ plain form
6991 -35 -60 72 31 107 59 20 -101 -165 11 -90 -46 35 14 1 -63 77 76 -10 1 -134 15 51 24 48 -29 3 -57
7018 -57 68 -22 82 -45 -21 44 -122 22 117 4 46 18 -30 11 36 -21 18 51 17 98 -46 -22 113 48 -71 -47
7044 -47 70 -119 -51 68 66 -184 43 72 -120 -69 107 -37 -146 116 -16 -67 4 119 -147 -59 120 47 20 -48
7068 -48 66 -48 -42 -63 92 20 -153 28 114 15 -40 108 53 -33 -39 101 -61 -64 205 21 -66 118 110 -191 -43 -11
7094 -11 -110 -30 41 49 -45 -69 0 32 -34 16 11 -117 -15 48 53 -89 25 124 52 -164 -62 40 -117 -89 155 -127 -80
7121 -80 22 134 -179 102 110 -61 -138 56 25 -132 42 40 -10 -195 -14 4 -16 -22 139 -43 68 -44 -17 -30 -56
7146 -56 33 108 -56 33 115 16 -61 7 26 -124 5 128 18 -66 3 128 -32 101 62 10 -76 25 -46 29 -4 26
7172 26 87 -72 -86 86 66 -68 3 -69 -160 -86 71 7 -7 97 2 -92 -38 -22 -125 -58 39 -176 -96 47 -6 -91
$$ packed form
6991c5k5J32m1P6m8l9j21o4J76j01M4Q1k1j3o4J40jq6J1j35J49L6k7K4p7L2o0
7018e7J25r0J04j27K4O5j66J44R5j13M2k8m8M1K5n7L9L3l4Q1j44K4J35o5j19K4
7044d7J17j89O8J19kk50K27K9j92N1J76j44j09K62j32n1P1J15k66Q8J79p3k7o8
7068d8J14j14Ok1J55p2j73J81Q6r9n5J48n5q6oJ40j62lK69j84q7J84ql01J48L2
7094a1r9Q0P1Qr4k4O9L2o6N0nj28J02O3Nj42J14R9p2k16J02J02j57K8K44k82M7
7121h0J02J12l13K81Qj71p7J94l1j57J74kn0j85J81J8k0oJ61j82J11j12K7j3k6
7146e6Q9P5j64Q9Q2r9p7O8J9j50J29J23j10q4O9J25j60J33l9n2q6J01p1P5l3L0
7172B6O1j59j4J72k0j34P1p2r1P4J57o4j4J04r5r4N4J6j03O7R7k15Q0J43n3q5
$$ plain form
7198 -91 -39 99 86 7 27 -61 -75 1 -19 -41 16 41 -73 -37 -9 -23 -15 169 -79 24 50 -116 52 98 50 1 35
7225 35 44 8 -72 -12 -83 -20 80 -108 -5 -4 -43 -69 61 -41 -65 -34 4 -84 116 40 -53 -52 -64 8 -143 -52 20 -123
7253 -123 -55 -20 34 -51 -30 62 -48 -7 51 65 -50 -105 183 50 -26 75 53 -43 28 100 67 -113 93 98 -44 -100
7279 -100 -2 75 -73 37 98 28 -8 0 -53 -88 -4 153 -87 -84 14 54 -89 -3 -90 89 -49 -87 163 -46 -49 157
7305 157 8 -40 -7 62 -143 -72 -42 -2 -219 -43 47 -122 -149 47 10 -48 89 -32 -11 -55 -64 151 -47 -31 124
7330 124 31 -36 60 57 -80 -112 81 -60 -109 45 168 1 -28 92 67 -192 86 101 -105 24 0 71 -169 175
7354 175 137 -26 -101 -17 38 -129 -93 88 -67 -165 -8 60 -15 -98 29 -9 -56 100 29 46 -62 84 127 -43 84
7379 84 82 -91 14 110 -118 -40 -28 -78 -36 -144 11 -28 39 40 123 9 -81 -2 3 62 -27 130 54 -135 130 -65 -9
$$ packed form
7198i1N2J38j3p9K0q8j4P6k0k2N7K5j14L6K8j4QJ84k48J03K6j66J68M6m8m9L4
7225C5Rl6q0O0p1O3J00j88J03Jl9k6J30j02k4L1L8q8K00p6r3Jj2P2j51R1P2j43
7253a23O8L5N4q5K1R2j10M1N8J4j15n5K88j33p6J01k2r6P1P2l3j80K06Nj42n6
7279a00R8P7j48J10O1p0l6Qn3l5Q4J57k40LR8M0j43Q6q7J79j38l8K50k09lK06
7305A57j49m8L3O9k05P1L0M0k17J76R0j69k7J96l7n8J37j21K1m4rK15j98J6J55
7330A24r3o7R6lj37l2J93j41m9J54J23j67k9J20k5k59K78J5k06J29k4P1k40L44
7354A75l8j63p5Q4N5j67L6J81j55r8J57O8p5q3J27l8m7J56p1J7j08J46M3j70J27
7379H4kj73J05R6k28P8J2n0M2j08J55l9O7JQ3j14r0P9NN9q9J57p6j89K65j95N6
$$ plain form
7406 -9 -36 82 -2 -8 43 57 92 -143 97 31 -40 97 -23 35 4 -120 85 85 -31 -19 40 -51 -21 -96 -40 -23 47 71
7434 71 -72 -120 69 -7 -43 0 -50 19 -10 5 -16 101 -170 36 54 -1 -118 -38 63 30 18 95 14 -144 96 -4
7460 -4 -134 -24 164 74 -62 25 96 -106 -60 88 -10 -133 16 160 55 -15 -42 -37 -96 -16 93 25 -98 86 36
7485 36 -106 5 280 -125 -81 142 120 -63 -10 92 -280 -46 78 -53 -34 -62 -12 34 -60 -27 91 -41 15 77
7509 77 105 -36 -65 205 -3 -159 77 83 -116 -17 174 -95 -127 112 -29 -176 -35 128 0 -27 215 53 -71
7532 -71 133 45 4 -93 126 62 -65 3 116 17 -59 61 54 -43 -103 82 89 -229 -92 144 71 -96 66 -8 -143
7557 -143 50 117 -103 -126 189 46 -84 30 99 -122 -82 -74 -37 -95 -44 64 -4 -53 96 7 31 -10 13 -3 -35 159
7583 159 15 56 10 141 31 -17 -38 -12 -27 -92 6 -13 -91 -14 -11 -46 -75 88 -32 46 55 -53 44 10 -25 45 -91
$$ packed form
7406ik7J18q4oN1J4L5k35K40o6p1J37j20N8l1j24K05%j16J2N9r1L0p5N6J7P0K4
7434G1j43m8J89p6l6M3n0O9k9J5k1J17k71K06J8n5j17Q0J01l3j2P7q1j58K40j00
7460dj30J10J88r0j36Q7P1k02M6J48r8j23J49J44j05p0k7Nn9Q0J09o8j23J84n0
7485C6j42J11K75m05M4K23k2j83N3J02l72K34J24j31J9k8N0M6r4L3J18j32N6O2
7509G7K8j41k9K70k08j56K36Oj99R9J91k69l2K39j41j47J41J63j28k7K42j62j24
7532g1K04q8m1r7K19o4j27O8J13r9p6J20pr7o0J85Pl18J37K36p3j67J62p4j35
7557a43J93O7k20k3L15j43j30J14O9k21M0QL7n8N1J08o8m9J49q9K4m1K3j6l2J94
7583A59j44M1m6J31j10m8k1K6j5o5R8j9p8P7Ll5k9J63j20P8Rj08R7l4l5P0j36
$$ plain form
7610 -91 60 -41 -80 -61 -115 27 -16 42 -40 73 -24 -15 45 7 -23 -5 4 -103 -46 149 -67 -27 -16 -134 112 47 -32
7637 -32 37 71 -45 71 118 -48 84 18 48 -12 66 112 0 -176 28 -11 -72 -2 67 -11 -18 8 65 71 -3 3 38 -9
7665 -9 -103 28 11 -76 71 127 -48 -6 90 -70 -102 61 56 -21 -71 124 -50 -90 111 153 45 66 12 12 -130 48
7691 48 189 -71 -38 134 84 -61 -47 -33 -135 -162 -4 38 -88 -2 167 -29 -80 29 163 -116 -104 144 -40
7714 -40 -119 137 194 -165 -172 208 100 -81 78 7 -202 -9 99 79 -87 -49 193 72 -17 -19 -11 -51 -65 97 -76
7739 -76 -173 72 101 -2 -96 165 -18 -194 92 47 -34 -84 172 -16 -49 38 40 -114 34 36 39 34 27 59 -49 -6 -47
7766 -47 92 -157 -87 58 6 -115 103 1 -32 -13 142 -45 -188 165 187 -160 -99 15 33 -33 81 25 27 -31
7790 -31 25 -67 -24 0 35 -21 -99 0 -8 -31 -40 38 -11 -110 41 106 -194 52 84 69 -51 5 -14 29 -51 44 -123 0
$$ packed form
7610i1J51j01l9J9n4J42m3N8q2J13r7RO0l8l0J8Rj07N7J95k16M0J1j18K46o5p9
7637c2O9L4j16J16M7j66J32o6L0o0P8M6j12j76K04l9o1P0O9p8pK6N7Op4OL5m7
7665ir4J31j7q7J47N6j75M2R6j60l2J63np7n0J95j74m0K01M2j08K1n4%j42J78
7691D8J41k60L3J72n0j45J4J4j02k7J58M2j26Q6J69j96n1J09J34k79J2K48j84
7714d0p9K56N7l59pL80j08j81J59p1k09J93J08k0j66L8K42j21q9kQm0j4J62j73
7739g6r7K45K9j03r4K61j83j76K86m5q1n0K56j88l3Q7Kj54J48KLnpL2j08M3m1
7766d7J39k49P0J45n2j21K18j02l3J9J55j87j43L53K2l47O1J14J8o6J14n6Kn8
7790c1N6r2M3K4L5n6p8R9qk3rP8m9r9J51O5l00K46L2j5j20N6j9M3q0R5j67J23
$$ plain form
7818 0 -26 -20 2 36 36 -114 71 40 66 82 -76 -40 -51 -47 89 -47 6 -102 10 33 -55 -17 63 104 12 15 60 -24 -4
7847 -4 75 -27 84 -110 -8 -32 156 72 4 22 69 -72 14 36 45 26 102 11 71 124 -118 -191 -1 133 21 -36
7873 -36 27 -11 -69 -65 14 -53 -161 -33 63 68 -74 100 18 8 66 85 -101 3 120 139 -46 -7 30 -34 -89 189 103
7900 103 -172 -23 46 -55 -111 90 188 -138 -19 64 57 -51 4 33 -4 -131 74 13 -163 -61 122 -111 -164 123
7924 123 37 -155 83 36 -120 -7 8 94 -100 82 149 -36 -11 102 25 -123 -39 46 69 -71 252 39 -127
7947 -127 79 92 91 3 131 208 -137 -128 21 65 -68 13 98 -26 -182 153 22 -121 35 131 -120 -202 121 82
7971 82 -110 16 117 -135 -4 95 -17 -34 22 8 1 -45 8 44 -189 -111 136 16 -174 55 56 -137 64 153 12
7996 12 -87 37 74 -24 34 135 -17 -105 117 -12 -57 -38 -5 -55 -75 -57 26 14 8 -3 103 -72 -9 19 -62 48 67
$$ packed form
7818@k6OK2L4%j50J85l1K6J6j58L6j1MJ36j36N3j08J12K3q8L8Q0M1r2LM5q4K0
7847dP9j02J11j94J02k4J88q4o8J8M7j41Q6K2Rj9P6r1O0N3k42p3J90J34j12n7
7873c6O3l8n8MP9o7j08J28R6Nj42J74q2j0N8J9j86J04J17J9j85L9L7o4n5K78q6
7900A03k75J49O9j01n6K01R8l26J19Q3pj08N5K9l7j27K05o1j76J02J83k33n3K87
7924A23q6j92K38m7j56J13J5Q6j94J82O7j85K5J13p7j48Q4Q5K3j40L23k13j66
7947a27K06J3jq8J28P7l45RJ49M4j33Q1Q5j24j56L35j31j43J56R6k51q2L23l9
7971H2j92J26J01k52J31R9j12j7N6j4pm6N3L6k33P8K47j20j90K29Jj93K01Q9j41
7996A2r9J24L7r8N8J01j52q8K22j29m5J9L3n0k0J8Q3j2oj1J06j75O3K8q1J10J9
$$ plain form
8023 67 134 2 43 101 -38 -5 32 81 -58 -37 110 -48 55 65 -49 145 121 58 -47 -33 82 -78 81 80 -18
8048 -18 -26 160 24 -127 -19 34 -89 -2 12 39 108 -22 72 8 -22 -43 -31 -54 -21 -88 133 -110 3 -15 -149 -108
8074 -108 -3 30 -161 74 119 -19 -192 149 -61 -144 -46 38 -133 -37 203 -78 -129 39 -21 -19 70 29 -37 -85 2
8099 2 50 95 7 20 -6 4 -106 43 -4 -123 89 154 -51 106 110 -131 -144 82 25 -72 -49 77 -188 -93 66 -58
8125 -58 -46 48 107 84 17 -20 42 66 -54 107 58 -81 52 107 36 -107 59 59 -53 17 73 -42 -51 106 23 -139
8151 -139 26 88 -47 -35 21 46 -21 -72 141 -57 -94 -2 -12 -45 23 105 -11 -118 20 51 -133 2 73 -10 9
8176 9 30 181 -71 -150 76 130 -201 53 228 -63 -181 95 -6 -27 93
$$ packed form
8023F7O7j32M1N8j39L3L7M9j39K1J47j58J03J0j14J94k4o3j05J4J15j60J59jr8
8048a8qJ86j36j51J08N3j23Q7J4K7O9j30R4o4l0k1J2k3L3o7K21k43J13j8j34M1
8074a08J05L3j91K35M5j38j73L41k10q3R8Q4j71R6K40k81n1J68o0KQ9m1o6m8Q7
8099BM8M5q8J3k6J0j10J49m7j19K12O5k05J57Mk41j3K26n7r7K3J26k65R5J59j24
8125e8J2R4N9k3o7l7O2K4j20J61m9j39J33N5p1j43J66%j12P0N6j15rJ57q3j62
8151a39J65O2j35J2N6K5o7n1K13j98l7R2j0l3O8Q2j16j07J38L1j84J35P1q3J9
8176IK1J51k52p9K26N4l31K54J75k91j18K76j01k1J20
8191I3
$$ Imaginary data points
##PAGE= N=2
##DATA TABLE= (X++(I..I)), XYDATA
$$ plain form
0 0 0 0 0 0 0 0 -8 8 -8 8 -8 16 -24 24 -32 40 -48 57 -72 87 -104 121 -144 170 -201 233 -272 313 -361 412
30 412 -472 538 -611 691 -781 877 -984 1102 -1231 1375 -1529 1696 -1881 2084 -2302 2545
46 2545 -2804 3093 -3409 3755 -4138 4557 -5023 5543 -6128 6787 -7537 8401 -9406 10598
60 10598 -12029 13793 -16020 18944 -22954 28818 -38219 55678 -98760 420735 331946 -706014
72 -706014 160288 332906 -545065 -234734 677315 124948 -367430 70971 104111 -337279
82 -337279 -95120 289296 216883 -47215 -157196 -53922 24505 -180769 4768 431390
92 431390 66833 -393415 51232 146008 -348102 12727 523315 -62281 -342558 169964
102 169964 -10191 -361713 200354 361652 -179738 -67621 140519 -264347 -146459 312509
$$ packed form
0@%%%%%%qJ6j6J6j6K4m0M8n6P2q8J05j29J59j91K25k65L14l71M34n05N85o74P73
30D12q84J010j149J302j472J658j861K086k333K606k904L225l577L965m386M847
46B545n349N897o502P164p893Q695r580J0566j1671J2915j4324J5938j7807K0004
60A0598k2627K5822k9813L4964m1898N1772o7037R3897j54438N19495q8789j037960
72g06014Q66302J72618q77971L10331R12049n52367m92378M38401L3140m41390
82c37279K42159L84416p2413k64098j09981J03274P8427k05274J85537M26622
92D31390l64557m60248M44647R4776m94110L60829N10588n85596k80277N12522
102A69964j80155l51522N62067J61298n41390J12117K08140m04866J17888M58968
$$ plain form
112 312509 63135 -101860 174766 -64580 -331581 76866 209590 -82192 69153 172216
122 172216 -200001 -204154 94502 40356 23055 142180 -9557 -105935 -44914 -113126 18950
133 18950 235280 4080 -120627 124904 -57452 -302633 142262 302444 -173134 -69801
143 -69801 253882 -179091 -311457 248386 184695 -202602 67272 168234 -227914 -148001
153 -148001 177291 49256 -42953 94334 -3309 -119665 -20060 -2488 26379 128029 -6263
164 -6263 -101738 45177 -32791 -139846 118048 155983 -118124 -38002 96745 -121398 -99612
175 -99612 168600 57748 -93998 62226 11243 -150200 28864 107045 -50323 36704 83802
186 83802 -127785 -69867 105336 -31241 -46886 138541 10090 -156630 20241 71348 -86945
$$ packed form
112C12509k49374j64995K76626k39346k67001M08447J32724k91782J51345J03063
122A72216l72217m153K98656n4146j7301J19125j51737r6378O1021o8212J32076
133A8950K16330k31200j24707K45531j82356k45181M44895J60182m75578J03333
143f9801L23683m32973j32366N59843o3691l87297K69874J00962l96148P9913
153a48001L25292j28035r2209J37287r7643j16356R9605J7572K8867J01650j34292
164f263r5475J46915p7968j07055K57894L7935k74107Q0122J34747k18143K1786
175i9612K68212j10852j51746J56224n0983j61443J79064P8181j57368Q7027M7098
186H3802k11587N7918J75203j36577j5645J85427j28451j66720J76871N1107j58293
$$ plain form
197 -86945 15071 133622 -40453 -89240 37986 -3483 -37549 50646 36882 -7308 -5036
208 -5036 -48821 -20888 53917 -9070 -28068 75225 1540 -121606 22197 96126 -77696
219 -77696 -29835 134998 -33738 -135124 79474 70885 -103262 14983 113155 -57138 -86586
230 -86586 63439 33938 -63478 12263 63323 -28935 -56209 13851 31196 -11745 -22290 31539
242 31539 33002 -59504 -35179 75652 5962 -70526 51551 63247 -88413 -38264 96643
253 96643 -8768 -86232 64351 64255 -101475 -29542 96423 -25459 -75737 65002 48972
264 48972 -78228 -22230 73454 -6679 -63925 39130 57926 -54559 -36862 63252 12021
275 12021 -65617 11997 65680 -36249 -60631 57488 35336 -79411 -2799 80794 -34250
$$ packed form
197h6945J02016J18551j74075m8787J27226m1469l4066Q8195j3764m4190K272
208e036m3785K7933P4805o2987j8998J03293p3685j23146J43803P3929j73822
219g7696M7861J64833j68736j01386K14598q589j74147J18245R8172j70293k9448
230h6586J50025k9501r7416P5741N1060r2258k7274P0060J7345m2941j0545N3829
242C1539J463r2506K4325J10831o9690p6488J22077J1696j51660N0149J34907
253I6643j05411p7464J50583r6j65730P1933J25965j21882n0278J40739j6030
264D8972j27200N5998R5684q0133n7246J03055J8796j12485J7697J00114n1231
275A2021p7638P7614N3683j01929k4382J18119k2152j14747P6612Q3593j15044
$$ plain form
286 -34250 -66909 60516 42814 -73466 -10301 80991 -20737 -71684 53715 51001 -70264
297 -70264 -16869 73601 -15009 -68253 34925 51945 -54780 -32707 66524 2020 -71514 25128
309 25128 57295 -45685 -32833 59618 13554 -60414 10314 58323 -32033 -42510 52552 20054
321 20054 -58073 3618 48529 -25138 -40119 34445 25927 -44602 -10319 47557 -11179 -42644
333 -42644 28569 30328 -33472 -11775 38870 2486 -38750 11416 37346 -26967 -25583 39531
345 39531 6036 -43277 8835 31895 -25037 -23447 32810 10343 -37376 7615 32730 -24815
357 -24815 -15363 33749 -453 -21681 14589 9760 -14634 -1379 9196 -2589 -4142 2318 -3594
370 -3594 -1601 3309 -9485 -62 14062 -12718 -8601 22300 -5926 -16646 21403 4939 -20475
$$ packed form
286c4250l2659J27425j7702j16280O3165R1292j01728n0947J25399k714j21265
297g0264N3395R0470q8610n3244J03178J7020j06725K2073R9231o4504p3534R6642
309B5128L2167j02980J2852R2451m6064p3968P0728M8009r0356j0477R5062l2498
321B0054p8127O1691M4911p3667j4981P4564q518p0529L4283N7876n8736l1465
333d2644P1213J759o3800K1697N0645l6384m1236N0166K5930o4313J384O5114
345C9531l3495m9313N2112K3060n6932J590N6257k2467m7719M4991K5115n7545
357b4815R452M9112l4202k1228L6270m829k4394J3255J0575j1785j553O460n912
370c594J993M910j2794R423J4124k6780M117L0901k8226j0720L8049j6464k5414
$$ plain form
383 -20475 10689 12961 -14842 1994 14341 -13579 -6330 14924 -13999 -9026 27548 -12551 -25555
396 -25555 33014 -2569 -43438 34627 30775 -49859 6220 51073 -40805 -32767 62306 3245
408 3245 -55950 37175 32303 -63400 -1905 52246 -29322 -20219 39193 -10982 -29255 14789 1894
421 1894 -2925 17122 -9910 -6887 23377 -22054 -23927 56152 6306 -63934 41842 42005 -92837
434 -92837 2764 103319 -60059 -64910 102535 -6131 -117411 63598 83285 -95981 -13850
445 -13850 104110 -51272 -80286 81844 32169 -66648 23756 40072 -40533 -20366 12275
456 12275 14372 19842 -25935 -17602 49627 -28890 -78640 79864 68818 -117695 -454 134630
468 134630 -97418 -111892 170479 37926 -175289 77174 129159 -164357 -52667 176289
$$ packed form
383b0475L1164K272k7803J6836J2347k7920P249K1254k8923M973L6574m0099j3004
396b5555N8569l5583m0869P8065l852q0634N6079M4853r1878Q038R5073n9061
408C245n9195R3125m872r5703O1495N4151q1568R103N9412n0175j8273M4044j2895
421A894m819K0047k7032L023L0264m5431j873Q0079m9846p0240J05776J63j34842
434i2837R5601J00555j63378m851J67445j08666j11280J81009J9687j79266Q2131
445a3850J17960j55382k9014J62130m9675r8817R0404J6316q0605K0167L2641
456A2275K097N470m5777Q333O7229p8517m9750J58504j1046j86513J17241J35084
468A34630k32048j4474K82371j32553k13215K52463N1985k93516J11690K28956
$$ plain form
478 176289 -32882 -122243 101783 47600 -127423 3594 87869 -33986 -25150 37266 -7492
489 -7492 -13752 -12239 -15601 58358 17330 -78134 37627 64389 -110168 -18667 144924 -48453
501 -48453 -111545 121030 26071 -167694 61760 134855 -130422 -33215 152175 -81320 -113521
512 -113521 140215 21471 -123369 83541 67462 -130923 5185 103830 -68595 -31002
522 -31002 99756 -32928 -74808 55429 3823 -45438 46107 7711 -36035 30732 -23972
533 -23972 -41758 77792 1541 -83470 81632 46321 -146219 28368 148516 -115844 -75467
544 -75467 184340 -35289 -187144 130565 102549 -182039 18736 165814 -114592 -96356
554 -96356 138378 1123 -103974 70694 47889 -77312 7962 31244 -33172 30023 16347
$$ packed form
478A76289k09171q9361K24026n4183j75023J31017Q4275j21855Q836O2416m4758
489g492o260J513l362P3959m1028r5464J15761K6762j74557R1501J63591j93377
501d8453o3092K32575r4959j93765K29454P3095k65277R7207J85390k33495l2201
512a13521K53736j18744j44840K06910j6079j98385J36108R8645j72425L7593
522c1002J30758j32684m1880J30237n1606m9261R1545l8396m3746O6767n4704
533b3972j7786J19550p6251q5011J65102l5311j92540J74587J20148k64360M0377
544g5467K59807k19629j51855L17709k8016k84588K00775J47078k80406J8236
554i6356K34734j37255j05097J74668k2805j25201Q5274K3282o4416O3195j3676
$$ plain form
565 16347 -52338 41073 23576 -96188 34169 94433 -93498 -32654 120467 -55298 -102878
576 -102878 110963 34258 -113849 55089 72282 -107136 728 92204 -68277 -15916 97770
587 97770 -64116 -57702 104556 -32839 -91850 113622 30497 -140647 50327 99280 -123157
598 -123157 -25113 144537 -49165 -100318 96967 22578 -97631 39858 59711 -47218 -3843
609 -3843 17386 -23083 18970 680 -37068 51792 22046 -98401 21991 97639 -92252 -50925
621 -50925 147660 -27026 -146715 105668 81171 -150044 17588 145324 -89227 -84825 115792
632 115792 4118 -99521 55616 57291 -69473 -9226 39042 -26849 -2279 20196 -18458
643 -18458 19008 7519 -55115 27517 51125 -64906 -1766 86861 -54375 -66758 93365
$$ packed form
565A6347o8685R3411j7497j19764J30357O0264j87931O0844J53121j75765m7580
576a02878K13841p6705j48107J68938J7193j79418J07864R1476j60481N2361J13686
587I7770j61886O414J62258j37395n9011K05472q3125j71144J90974M8953k22437
598a23157R8044J69650j93702n1153J97285p4389j20209J37489J9853j06929M3375
609c843K1229m0469M2053j8290l7748Q8860k9746j20447J20392P5648j89891M1327
621e0925J98585j74686j19689K52383k4497k31215J67632J27736k34551M402K00617
632A15792j11674j03639J55137J675j26764O0247M8268o5891K4570K2475l8654
643a8458L7466j1489o2634Q2632K3608j16031O3140Q8627j41236j2383J60123
$$ plain form
654 93365 11089 -98431 58010 69438 -104855 -13991 101731 -53589 -61134 93004 2410
665 2410 -88014 42055 45444 -60076 2435 53552 -24913 -25835 25472 373 -8778 10014 -6092
678 -6092 6695 10213 -37222 3824 49388 -39762 -32985 71450 -11494 -81546 56394 55285
690 55285 -85965 -3232 93579 -47808 -69892 83540 26161 -86531 26635 65407 -59121
701 -59121 -30663 59414 -2259 -41416 16636 20527 -19445 -15325 10825 16798 -6275 -20232 13202
714 13202 21617 -29572 -13216 50039 -3466 -51204 33753 32469 -59338 -392 63837 -31072
726 -31072 -44487 49649 8259 -59274 20682 48879 -40012 -22115 46833 -9354 -40852 29636
738 29636 26693 -27860 -5335 23052 -5884 -20739 7832 22383 -7004 -20184 10677 11650 -23493
$$ packed form
654I3365q2276j09520J56441J1428j74293R0864J15722j55320p545J54138r0594
665B410r0424J30069L389j05520O2511N1117p8465r22N1307k5099r151J8792j6106
678f092J2787L518m7435M1046M5564q9150O777J04435q2944p0052J37940j109
690E5285j41250Q2733R6811j41387k2084J53432n7379j12692J13166L8772j24528
701e9121K8458R0077o1673l9157N8052L891l9972M120K6150N973k3073j3957L3434
714A3202Q415n1189J6356O3255n3505m7738Q4957j284r1807N8946O4229r4909
726c1072j3415R4136m1390o7533P9956K8197q8891J7897O8948n6187l1498P0488
738B9636k943n4553K2525K8387k8936j4855K8571J4551k9387j3180L0861R73l5143
$$ plain form
751 -23493 -9626 31424 4150 -34756 9393 29941 -31550 -17931 47715 2509 -41903 19880
763 19880 27838 -34010 -11881 38964 1137 -33204 10795 20946 -24902 -12998 26105 3706
775 3706 -19778 650 11840 -5075 -12847 8690 17527 -9411 -11603 14007 3892 -14892 2932
788 2932 16264 -3092 -13504 4768 7345 -11743 -4286 11688 -54 -7959 -1379 1919 2020 -4379
802 -4379 -1510 11946 1354 -12343 3663 11749 -7013 -8825 13514 8585 -18241 -3773 18888
815 18888 -7832 -17872 13988 10938 -17229 -7056 16334 1614 -19122 4700 22120 -10761
827 -10761 -17175 19757 11321 -23483 -2623 27607 -4960 -27735 16762 22222 -31732 -11367 36971
840 36971 -7184 -34891 21322 23030 -32276 -10551 36350 -2742 -32992 19224 25819 -28586
$$ packed form
751b3493J3867M1050k7274l8906M4149K0548o1491J3619O5646m5206m4412O1783
763A9880P958o1848K2129N0845l7827l4341M3999J0151m5848J1904L9103k2399
775C706k3484K0428J1190j6915p772K1537Q837k6938k192K5610j0115j8784J7824
788B932J3332j9356j0412J8272K577j9088P457J5974j1742p905O580L298J01o399
802d379K869J3456j0592j3697J6006Q086j8762j812K2339m929k6826J4468K2661
815A8888k6720j0040L1860l050k8167J0173K3390j4720k0736K3822J7420l2881
827a0761o414L6932q436l4804K0860L0230l2567k2775M4497N460n3954K0365M8338
840C6971m4155k7707N6213J708n5306K1725M6901l9092l0250N2216O595n4405
$$ plain form
852 -28586 -11152 32065 177 -26938 8283 22937 -15099 -22266 20932 16128 -30323 -6936
864 -6936 34210 -8518 -35667 22274 29940 -35411 -14810 48398 -5740 -48178 32158 35159 -48750
877 -48750 -7927 52450 -17949 -42387 34195 22373 -42996 -2932 39551 -15887 -30330 24082
889 24082 14657 -24180 -3796 20782 3461 -18469 -2765 25742 -1855 -30233 18284 29255
901 29255 -35551 -17157 46617 -5618 -50187 30315 37736 -55110 -12721 62734 -23213 -49932
913 -49932 51655 20591 -57827 13187 45516 -32365 -20399 38755 156 -29850 12655 14676
925 14676 -14348 -2753 4391 3 3598 -13626 -4280 26575 -13121 -27185 36487 9228 -49328
938 -49328 20902 43931 -45107 -16005 59419 -17881 -51666 48057 23162 -60045 15763 46212
$$ packed form
852b8586J7434M3217l1888k7115L5221J4654l8036p167M3198m804m6451K3387
864f936M1146m2728k7149N7941P666o5351K0601O3208n4138m2438Q0336L001q3909
877d8750M0823O0377p0399k4438P6582j1822o5369M0064M2483n5438j4443N4412
889B4082r425l8837K0384K4578j7321k1930J5704K8507k7597k8378M8517J0971
901B9255o4806J8394O3774n2235m4569Q0502P421r2846M2389P5455q5947k6719
913d9932J01587l1064p8418P1014L2329p7881J1966N9154l8599l0006M2505K021
925A4676k9024J1595P144m388L595j7224R346L0855l9696j4064O3672k7259n8556
938d9328P0230K3029q9038K9102P5424p7300l3785R9723k4895q3207P5808L0449
$$ plain form
950 46212 -46994 -17076 48288 -17317 -27840 33922 -669 -28580 18762 6464 -19705 19093
962 19093 8719 -26524 15642 15111 -35798 12918 37445 -38689 -11414 46914 -29182 -35356 52088
975 52088 3204 -48729 31209 22523 -52084 8429 43761 -32074 -7838 43157 -27908 -26393
987 -26393 44175 -10953 -29269 48593 -1924 -54657 33708 21097 -56840 22778 54143 -54077
999 -54077 -23447 58882 -26615 -45195 62888 16552 -58707 23508 26886 -49342 8044 43277
1011 43277 -22199 -4607 20624 -30605 -8436 30796 -18060 -3433 43363 -30672 -45014 49651
1023 49651 2813 -55701 55376 43573 -83217 -1714 67774 -53905 -27246 90172 -8629
1034 -8629 -73149 40542 19806 -65931 25435 61074 -41249 -18349 33294 -36594 -21133 49162
$$ packed form
950D6212r3206K9918O5364o5605j0523O1762l4591k7911M7342j2298k6169L8798
962A9093j0374l5243M2166n31n0909M8716K4527p6134K7275N8328p6096o174Q7444
975E2088m8884n1933P9938q686p4607O0513L5332p5835K4236N0995p1065J515
987b6393P0568n5128j8316P7862n0517n2733Q8365j2611p7937P9618L1365j08220
999e4077L0630Q2329q5497j8580J08083m6336p5259Q2215L378p6228N7386L5233
1011D3277o5476J7592K5231n1229K2169L9232m8856J4627M6796p4035j4342R4665
1023D9651m6838n8514J11077j1803j26790Q1503O9488j21679K6659J17418r8801
1034h629o4520J13691k0736q5737R1366L5639j02323K2900N1643o9888J5461P0295
$$ plain form
1046 49162 -662 -13306 29468 -26618 -37050 36550 5886 -20220 47920 6957 -67481 11359
1058 11359 34549 -46713 17191 74024 -49590 -52759 54869 -19740 -55220 77364 40262
1069 40262 -76331 5946 37993 -63160 -7626 83029 -4556 -40823 27701 -13558 -50436
1080 -50436 29642 35742 -9243 15787 -9403 -48690 9396 14387 -19076 46620 35361 -71222
1092 -71222 -21680 48393 -38364 -19627 98654 8065 -93095 21246 34237 -73059 16949
1103 16949 99308 -28014 -58149 27820 -15379 -45499 40407 47597 -10017 -11021 -19786 -29527
1115 -29527 10265 15871 8528 45231 -150 -74483 -1654 40609 -37289 14002 89634 -35196
1127 -35196 -85493 35970 14223 -58382 49248 79508 -57546 -51679 35506 -22150 -33152
$$ packed form
1046D9162m9824j2644M2774n6086j0432P3600l0664k6106O8140m0963p4438P8840
1058A1359K3190q1262O3904N6833j23614l169J07628p4609l5480J32584l7102
1069D0262j16593Q2277L2047j01153N5534R0655q7585l6267O8524m1259l6878
1080e0436Q0078O100m4985K5030k5190l9287N8086M991l3463O5696j1259j06583
1092g1222M9542P0073q6757J8737J18281r0589j01160J14341J2991j07296R0008
1103A6949Q2359j27322l0135Q5969m3199l0120Q5906P190n7614j004q765r741
1115b9527L9792N606p343L6703m5381p4333P2829M2263p7898N1291P5632j24830
1127c5196n0297J21463k1747p2605J07630L0260j37054N867Q7185n7656j1002
$$ plain form
1138 -33152 68135 40828 -41924 -13220 -4194 -32375 11302 41495 14953 3846 -19355 -42095
1150 -42095 -4050 18645 2960 31341 29364 -49596 -41424 26561 -7610 -11493 69502 18665
1162 18665 -71912 -4895 24112 -42693 13435 80185 -12312 -55447 14696 -5356 -44707 34833
1174 34833 59039 -21493 -24645 5012 -28290 -17147 33997 26741 5706 -6085 -27743 -16153
1186 -16153 7592 3919 20962 34316 -16689 -42362 3437 6323 -18029 30021 42337 -32703
1198 -32703 -33709 14198 -13514 -12846 43163 20872 -26075 -8194 -5097 -21071 12597 32215 1072
1211 1072 -3009 1759 -29516 -16539 30597 10433 -8909 20112 -4206 -42505 -1497 26540
1223 26540 -1535 1489 19304 -7931 -29129 -4027 16267 8487 4457 5826 -687 -13273 -18712
$$ packed form
1138c3152J01287k7307q2752K8704R026k8181M3677L0193k6542j1107k3201k2740
1150d2095L8045K2695j5685K8381j977p8960Q172O7985l4171l883Q0995n0837
1162A8665r0577O7017K9007o6805N6128O6750r2497m3135P0143k0052l9351P9540
1174C4833K4206q0532l152K9657l3302J1143N1144p256k1035j1791k1658J1590
1186a6153K3745l673J7043J3354n1005k5673M5799K886k4352M8050J2316p5040
1198c2703j006M7907k7712O68N6009k2291m6947J7881L097j5974L3668J9618l1143
1211A072m081M768l1275J2977M7136k0164j9342K9021k4318l8299M1008K8037
1223B6540k8075L024J7815k7235k1198K5102K0294p780m030J369o513j2586n439
$$ plain form
1236 -18712 6389 26606 -2877 -12705 17017 -7150 -37610 12115 34734 -15338 -12745 26639
1248 26639 -8231 -38572 15856 33066 -17489 -7798 26147 -10740 -29668 13611 21019 -9094
1260 -9094 -5390 12075 -3554 -20856 97 18844 -334 -10779 7261 5216 -17479 -6683
1272 -6683 21390 5058 -16890 9282 12989 -22772 -6026 26603 -3249 -18013 15450 7666
1284 7666 -24879 -1490 23481 -8015 -16669 17773 5715 -24429 2797 21456 -8740 -12637
1296 -12637 14774 8047 -17996 -3698 21417 -1110 -20578 10560 16779 -20088 -11499 24586
1308 24586 2976 -28196 6588 26084 -20538 -19900 31692 6746 -34919 9193 29844 -20674
1320 -20674 -18284 29360 8588 -30859 2595 28338 -13762 -21438 21911 12027 -25827 -6088
$$ packed form
1236a8712K5101K0217k9483r828K9722k4167l0460M9725K2619n0072K593L9384
1248B6639l4870l0341N4428J7210n0555R691L3945l6887j8928M3279P408l0113
1260i094L704J7465j5629j7302K0953J8747j9178j0445J8040k045k2695J0796
1272f683K8073j6332k1948K6172L707l5761J6746L2629k9852j4764L3463p784
1284G666l2545K3389K4971l1496q654L4442j2058l0144K7226J8659l0196l897
1296a2637K7411o727k6043J4298K5115k2527j9468L1138O219l6867Q589L6085
1308B4586k1610l1172L4784J9496m6622O38N1592k4946m1665M4112K0651n0518
1320b0674K390M7644k0772l9447L3454K5743m2100p676M3349r884l7854J9739
$$ plain form
1332 -6088 23291 -1498 -23095 9251 22905 -19354 -19410 27510 9216 -29525 6866 29583 -18653
1345 -18653 -23445 27194 12521 -31027 4077 29948 -19710 -22764 24995 7313 -24243 5132
1357 5132 19019 -11844 -14904 12092 9881 -10858 -2360 13097 -73 -13180 722 13896 -1907
1370 -1907 -12841 9735 10986 -20175 -6234 22596 -5935 -18092 16707 7773 -23130 1015
1382 1015 19782 -9801 -9958 18172 493 -17165 8533 8786 -10882 3843 8257 -8740 -844
1395 -844 4009 -6579 1990 6426 -7306 -1486 7731 -7870 -6429 13361 -5 -12049 11230
1408 11230 5892 -16862 5448 13835 -12968 -944 14917 -9690 -8528 12453 -3199 -9843 11036
1421 11036 1341 -13697 7451 5845 -15699 6357 14424 -16778 -1205 20358 -14094 -11465 24116
$$ packed form
1332f088K9379k4789k1597L2346J3654m2259n6M6920j8294l8741L6391K2717m8236
1345a8653m792N0639j4673m3548L5104K5871m9658l054M7759j7682l1556K9375
1357E132J3887l0863l060K6996k211k0739Q498J5457j3170j3107J3902J3174j5803
1370a907j0934K2576J251l1161J3941K8830k8531j2157L4799q934l0903K4145
1382A015J8767k9583j57K8130j7679j7658K5698K53j9668J4725M414j6997P896
1395h44M853j0588Q569M436j3732N820R217j5601J441J9790j3366j2044K3279
1408A1230n338k2754K2310Q387k6803J2024J5861k4607J162K0981j5652o644K0879
1421A1036r695j5038K1148j606k1544K2056Q067l1202J5573K1563l4452K629L5581
$$ plain form
1434 24116 -2302 -20282 16897 9392 -23847 3537 19634 -15885 -8508 19906 -6471 -15537
1446 -15537 13422 1702 -11422 9527 2051 -8537 8337 -1134 -9866 13481 3784 -17454 10899
1459 10899 13517 -24663 -1389 29236 -17168 -20858 32826 -559 -37711 21636 23405 -34787
1471 -34787 338 33926 -19913 -20753 28651 3612 -23908 13233 14313 -18476 -1956 11867
1483 11867 -6420 214 4535 -7672 5132 1357 -17080 11239 16047 -24177 -1182 29044 -20333
1496 -20333 -22431 37141 5567 -38899 20806 28518 -41383 -6313 45109 -18322 -28902 35060
1508 35060 3093 -37495 14200 21782 -21408 -2400 18076 -10192 -9650 8728 -772 2268 7293
1521 7293 -10693 1368 12917 -18679 -4219 32107 -11729 -26816 29393 4736 -41360 17694
$$ packed form
1434B4116k6418j7980L7179p505l3239K7384J6097l5519P377K8414k6377r066
1446a5537K8959j1720j3124K0949p476j0588J6874r471q732K3347r697k1238K8353
1459A0899K618l8180K3274L0625m6404l690N3684l3385l7152N9347J769n8192
1471c4787L5125L3588n3839q40M9404k5039k7520L7141J080l2789J6520J3823
1483A1867j8287O634M321j2207J2804l775j8437K8319M808m0224K2995L0226m9377
1496b0333k098N9572l1574m4466N9705P712o9901L5070N1422o3431j0580O3962
1508C5060l1967m0588N1695P582m3190J9008K0476k8268N42J8378r500L040N025
1521G293j7986J2061J1549l1596J4460L6326m3836j5087N6209k4657m6096N9054
$$ plain form
1533 17694 34773 -34101 -12508 39308 -16388 -34177 34555 15989 -34158 10937 22560 -27267
1545 -27267 -6248 24560 -5846 -6359 12098 -7829 -8250 7973 -6325 -592 18153 -10218 -17041
1558 -17041 19081 -2135 -25563 24532 20417 -33751 2002 29065 -27464 -13698 39977 -3514
1570 -3514 -29201 22376 7892 -33619 9552 26621 -19830 -5558 21110 -16632 -15227 20824
1582 20824 -559 -9758 16197 -3005 -17126 10439 3682 -10637 14825 8216 -20055 2324
1594 2324 11906 -18433 1221 25839 -14249 -15998 21570 -8388 -23238 25690 11742 -26423
1606 -26423 9320 16104 -26462 -2541 28950 -9283 -13729 21818 -4176 -24524 15650 11995
1618 11995 -17987 8427 12010 -21093 -2821 14160 -9726 -570 15936 -8914 -10648 10824
$$ packed form
1533A7694J7079o8874K1593N1816n5696j7789O8732j8566n0147M5095J1623m9827
1545b7267K1019L0808l0406n13J8457j9927m21J6223j4298N733J8745k8371o823
1558a7041L6122k1216k3428N0095m115n4168L5753K7063n6529J3766N3675m3491
1570c514k5687N1577j4484m1511M3171J7069m6451J4272K6668l7742J405L6051
1582B0824k1383r199K5955j9202j4121K7565o757j4319K5462o609k8271K2379
1594B324R582l0339J9654K4618m0088j749L7568k9958j4850M8928j3948l8165
1606b6423L5743O784m2566K3921L1491l8233m446L5547k5994k0348M0174l655
1618A1995k9982K6414L583l3103J8272J6981k3886R156J6506k4850j734K1472
$$ plain form
1630 10824 -3363 -8215 16260 4223 -15223 6622 4707 -16539 7795 15839 -14608 -1247
1642 -1247 13555 -17047 -8071 21530 -4439 -13802 17897 268 -25195 11127 18626 -19222 348
1655 348 24791 -16564 -18749 23314 3151 -19502 13841 12318 -20266 -5716 13630 -3253 -6300
1668 -6300 8039 2943 -7007 -4820 -57 6612 3096 -7596 5751 10159 -18093 -7050 25692
1681 25692 -3393 -21493 20584 11287 -33087 88 31435 -14623 -20351 28131 4650 -34914
1693 -34914 7829 26949 -17524 -10570 23817 -832 -22331 5082 16243 -5006 -8312 9119
1705 9119 6407 -13701 -8871 14167 7706 -14996 -781 17664 -11353 -21622 20264 15667 -24976
1718 -24976 940 26050 -17070 -21273 25542 11541 -24066 4364 21416 -17352 -16782 20984
$$ packed form
1630A0824j4187m852K4475j2037j9446K1845j915k1246K4334Q044l0447J3361
1642a247J4802l0602Q976K9601k5969r363L1699j7629k5463L6322P499l7848J9570
1655C48K4443m1355k185M2063k0163k2653L3343j523l2584J4550J9346j6883l047
1668f300J4339n096r950K187M763O669l516j0692J3347M408k8252J1043L2742
1681B5692k9085j8100M2077r297m4374L3175L1347m6058n728M8482k3481l9564
1693c4914M2743J9120m4473O954L4387k4649k1499K7413J1161k1249l306J7431
1705I119k712k0108M830K3038o461k2702J4215J8445k9017j0269M1886m597m0643
1718b4976K5916K5110m3120m203M6815j4001l5607K8430J7052l8768N70L7766
$$ plain form
1730 20984 6815 -17376 4097 11418 -11282 -10285 9032 8726 -5738 -5059 8250 855 -13631
1743 -13631 2374 16521 -3686 -11463 10241 5517 -18086 164 21165 -6877 -14956 14534
1755 14534 2347 -21181 5446 17645 -9712 -7977 12248 -1290 -14410 5737 13191 -5525
1767 -5525 -4625 7598 -1688 -8675 2153 7911 869 -5549 -156 3620 -7057 -5520 11249 4205
1781 4205 -10733 1183 7366 -9181 -5718 14195 4447 -11934 3711 8251 -11962 -3325 14883
1794 14883 -250 -9004 4845 1850 -9341 -806 8155 774 -4607 672 370 -4341 -1129 4164
1808 4164 4354 -562 -3783 1245 1232 -5264 2606 9095 -3279 -5349 4173 -1681 -6794 4309 6277
1823 6277 -4167 -2623 3048 -4127 -3876 6126 2034 -2288 3417 -1467 -5337 3566 2282 -2432 4467
$$ packed form
1730B0984j4169k4191K1473P321k2700R97J9317l06j4464O79J3309p395j4486
1743a3631J6005J4147k0207p777K1704m724k3603J8250K1001k8042q079K9490
1755A4534j2187k3528K6627J2199k7357J735K0225j3538j3120K0147P454j8716
1767e525R00J2223r286o987J0828N758p042o418N393L776j0677J537J6769p044
1781D205j4938J1916O183j6547L463J9913r748j6381J5645M540k0213Q637J8208
1794A4883j5133q754J3849k995j1191Q535Q961p381n381N279l02m711L212N293
1808D164J90m916l221N028j3o496P870O489j2374k070R522n854n113J1103J968
1823F277j0444J544N671p175K51J0002m092m322N705m884l870Q903j284m714O899
$$ plain form
1838 4467 2736 -6762 -2180 4669 -2363 -2840 6646 827 -8334 632 3466 -4292 697 5379 -667
1853 -667 -2303 -880 -209 1994 -181 -493 4818 250 -7381 858 6605 -5407 -4503 11018 -324
1868 -324 -14344 5705 9550 -12850 -1779 16182 -4899 -12492 9724 6065 -12032 835 13223
1881 13223 -4055 -9387 6605 3765 -7902 -1046 6531 1375 -6128 -3160 6720 -207 -10579 5706
1895 5706 11951 -11076 -7843 15363 74 -17211 9313 16461 -16069 -8003 20482 -4367 -19821
1908 -19821 14395 12331 -18351 -2185 15572 -7360 -12404 10028 7581 -9300 -2451 8657 -851
1921 -851 -7766 1627 8662 160 -8704 3163 9976 -10357 -8730 17282 1951 -19261 8248 14592
1935 14592 -19075 -7350 22652 -2911 -19854 14113 12049 -21486 -1236 21297 -8261 -12263
$$ packed form
1838D467j731r498M582O849p032m77R486n819r161Q966K834p758M989M682o046
1853f67j636J423O71K203k175l12N311m568p631Q239N747j2012R04J5521j1342
1868c24j4020K0049L845k2400J1071J7961k1081p593K2216l659j8097J2867J2388
1881A3223j7278n332J5992k840j1667O856P577n156p503K968R880o927j0372J6285
1895E706O245k3027L233K3206j5289j7285K6524P148l2530Q066K8485k4849j5454
1908a9821L4216k064l0682J6166J7757k2932n044K2432k447j6881O849J1108r508
1921h51o915R393P035q502q864J1867O813k0333J627K6012j5331k1212K7509O344
1935A4592l3667J1725L0002k5563j6943L3967k064l3535K0250K2533k9558m002
$$ plain form
1947 -12263 15036 3344 -14434 2302 9494 -3901 -4760 3786 2617 -4195 -4923 2919 6042 -4941
1961 -4941 -5904 10195 2132 -15485 5686 15876 -13813 -6859 20485 -4381 -19273 14164 11177
1974 11177 -18976 420 18248 -11134 -12907 15262 1898 -14589 7096 8227 -10181 -905
1986 -905 6386 -2968 -203 2746 -1526 2151 467 -5461 3290 5798 -7601 -1512 10620 -6345
2000 -6345 -10259 12301 2176 -14804 7868 9864 -14758 -915 13884 -7779 -6773 12795 -456
2013 -456 -10602 7397 4497 -9936 3694 7284 -9078 205 7759 -8461 -1859 9785 -6305
2026 -6305 -4863 10103 -3362 -8352 8991 2732 -9650 5161 7059 -9462 -74 9858 -6575
2039 -6575 -3942 9801 -4112 -6671 8448 -1733 -7373 7580 326 -8960 6278 4287 -10209
$$ packed form
1947a2263K7299j1692j7778J6736P192j3395q59Q546j169o812p28P842L123j0983
1961d941r63J6099q063j7617K1171J0190k9689O954K7344k4866j4892L3437k987
1974A1177l0153J9396J7828k9382j773K8169j3364j6487K1685J131j8408R276
1986i05P291r354K765K949m272L677j684n928Q751K508j3399O089J2132j6965
2000f345l914K2560j0125j6980K2672J996k4622J3843J4799k1663J006J9568j3251
2013d56j0146J7999k900j4433J3630L590j6362R283P554j6220O602J1644j6090
2026f305J442J4966j3465m990J7343o259j2382J4811J898j6521R388R932j6433
2039f575K633J3743j3913k559J5119j0181n640J4953p254r286J5238j991j4496
$$ plain form
2052 -10209 3139 9730 -9893 -3458 13963 -5150 -10625 13876 2666 -15343 7302 9727 -13252
2065 -13252 -1051 12267 -6353 -7744 8168 755 -7356 3630 3543 -4053 947 695 -2290 4509
2079 4509 -511 -5166 8207 1540 -12574 6261 10209 -13846 -2199 17074 -8056 -15258 15269
2092 15269 6022 -19393 5547 17370 -14937 -9219 17772 -1595 -13811 10102 8389 -10796
2104 -10796 -2579 7552 -763 -4426 1990 4168 -618 -6171 -2102 7002 -666 -9125 7687 8941
2118 8941 -15578 -4028 17941 -5993 -13671 17436 6998 -21100 2260 17569 -11657 -9154
2130 -9154 18807 596 -18685 6004 9776 -11684 -1176 12123 -2726 -8028 1686 2243 -1306
2143 -1306 -601 3346 4595 -3457 -7065 3713 5327 -6212 435 12032 -5964 -13814 9753 5380
$$ packed form
2052a0209J3348O591j9623O435J7421j9113n475K4501j1210j8009K2645K425k2979
2065a3252J2201J3318j8620j391J5912p413q111J0986q7p596N000k52k985O799
2079D509n020m655J3373o667j4114J8835L948k4055J1647J9273k5130p202L0527
2092A5269r247k5415K4940J1823l2307N718K6991j9367j2216K3913j713j9185
2104a0796Q217J0131q315l663O416K178m786n553M069R104p668q459J6812J254
2118H941k4519J1550K1969k3934p678L1107j0438k8098K3360J5309k9226K503
2130i154K7961j8211j9281K4689L772k1460J0508J3299j4849n302R714N57l549
2143a306P05L947J249q052l608J0778J614j1539O647J1597j7996p850K3567m373
$$ plain form
2157 5380 -14018 6058 14884 -13308 -9993 13098 -1225 -11423 11170 10376 -12726 -4490 9637
2170 9637 -4378 -5751 10618 4441 -7185 -2301 364 -1369 -139 1500 5224 1037 -9001 -2723
2184 -2723 6341 -2197 -3315 10815 3918 -14041 -1435 10850 -6762 -4350 16136 705 -15640
2197 -15640 3052 6461 -8882 615 12156 -1702 -9559 649 1354 -3938 2582 6542 645 -2994
2211 -2994 -4208 -1500 3753 378 486 7449 -1710 -10592 1425 5318 -4424 1516 9112 -4049 -10137
2226 -10137 2572 2892 -4771 4402 7464 -5394 -4631 1956 -2128 709 6222 735 -1591 -48 -4051
2241 -4051 -2719 4866 2718 -2147 1801 305 -7722 -1230 6596 -719 -1058 4733 -2319 -6058 1551
2256 1551 2820 445 2219 1301 -1554 -1989 -1648 213 3513 1559 -2848 627 911 -6302 -314 7875
$$ packed form
2157E380j9398K0076Q826k8192L315K3091j4323j0198K2593p94k3102Q236J4127
2170I637j4015j373J6369o177j1626M884K665j733J230J639L724m187j0038O278
2184b723R064q538j118J4130o897j7959J2606J2285j7612K412K0486j5431j6345
2197a5640J8692L409j5343R497J1541j3858p857J0208P05n292O520L960n897l639
2211b994j214K708N253l375J08O963r159q882J2017L893r742N940P596j3161o088
2226a0137J2709L20p663R173L062j2858P63O587m084K837N513n487k326J543m003
2241d051J332P585k148m865L948j496q027O492P826p315l39N791p052l739P609
2256A551J269k375J774r18k855m35L41J861L300j954m407L475K84p213N988Q189
$$ plain form
2272 7875 -2378 -4527 6231 -506 -8550 3667 7299 -4386 -2158 6909 -1526 -7642 4017 5342
2286 5342 -5287 -902 5071 -2253 -4766 1513 3114 -1246 -2947 2320 3024 -4707 -2106 6243 223
2301 223 -6125 3255 6458 -5894 -4372 8951 213 -10317 5286 8114 -9807 -2996 10124 -3316
2315 -3316 -9256 6178 6043 -7545 -2099 8115 -1899 -7690 4664 6073 -4295 -2254 4995 705
2329 705 -6343 -751 7661 -553 -7303 4504 4712 -9811 -2764 11045 -844 -8860 5862 6026
2343 6026 -11025 -2896 13032 -1251 -8917 7960 4304 -11457 -891 10073 -1452 -5859 4499
2356 4499 2849 -8062 -3335 7441 1813 -5089 1229 4178 -4606 -6181 5906 7028 -6164 -2131
2370 -2131 8896 -4360 -10544 8354 8051 -9023 -1009 9533 -6094 -10556 8485 6835 -8848
$$ packed form
2272G875j0253k149J0758o737q044J2217L632j1685K228R067q435o116J1659J325
2286E342j0629M385N973p324k513O279J601m360j701N267P04p731K601Q349o020
2301B23o348R380L203j2352J522J3323q738j0530J5603K828j7921O811J3120j3440
2315c316n940J5434j35j3588N446J0214j0014n791J2354J409j0368K041P249m290
2329G05p048N592Q412q214o750J1807K08j4523P047J3809j1889q016J4722J64
2343F026j7051Q129J5928j4283p666J6877l656j5761J0566J0964j1525m407J0358
2356D499j650j0911M727J0776n628o902O318K949q784j575J2087J122j3192M033
2370b131J1027j3256o184J8898l03j7074Q014J0542j5627m462J9041j650j5683
$$ plain form
2383 -8848 322 8287 -6583 -7545 7030 4571 -4186 526 4175 -2350 -5620 1689 6106 -585 -3146
2398 -3146 2588 1043 -6756 -2171 8084 1080 -6759 3644 3841 -9819 -1656 10567 -1179 -5485
2412 -5485 6182 1262 -9030 677 7871 -2014 -2358 5145 -1820 -6692 2027 2723 -1120 1817 591
2427 591 -2828 -1203 -1111 162 3768 1195 -1793 603 -291 -3776 1194 5360 -1114 -1881 3349 -2687
2443 -2687 -5264 4345 2487 -3540 2660 1261 -6116 -784 3748 -1558 258 4364 -2009 -4652 2791
2458 2791 1182 -3328 4570 3916 -5805 -664 3544 -4303 -1000 6317 -765 -4427 1669 -17 -3832
2473 -3832 1324 3953 -917 -1295 782 -1716 -494 1675 -76 2594 1542 -4746 150 3740 -4485
2488 -4485 -876 7692 -2330 -7498 4469 2969 -8339 1294 9616 -5238 -6558 8013 386 -8754
$$ packed form
2383h848R170P965j4870r62J4575k459q757M712L649o525l270P309M417o691k561
2398c146N734j545p799M585J0255p004p839J0403J97j3660Q163J2223j1746m306
2412e485J1667m920j0292R707P194r885l44P503o965m872Q719O96l843K937j226
2427E91l419J625R2J273L606k573k988K396q94l485M970M166o474p67N230o036
2443b687k577R609j858o027O200j399p377N332M532n306J816M106o373k643P443
2458B791j609m510P898o54r721N141M208p847L303P317p082l662O096j686l815
2473c832N156K629m870l78K077k498J222K169j751K670j052o288M896L590q225
2488d485L609Q568j0022n168J1967j500j1308R633Q322j4854j320J4571p627r140
$$ plain form
2502 -8754 4954 7012 -5541 -2321 5022 -1059 -4416 1839 3921 -1097 -2924 368 1569 -1882
2516 -1882 -3114 3560 4335 -5801 -2679 7871 -2518 -8207 8296 6043 -10316 -24 10136
2529 10136 -6092 -7765 10206 3701 -10912 2275 8291 -7916 -4832 8784 431 -6488 2631
2542 2631 3663 -3536 -2678 3213 3271 -2367 -2324 3489 1419 -5514 -175 7502 -1837 -7412 5985 4214
2558 4214 -10884 184 11599 -5929 -7781 10078 1469 -11597 3646 9788 -6745 -4508 9459
2571 9459 -543 -9120 4379 6152 -5193 -1677 4530 -793 -4128 -286 3426 623 -3875 299
2585 299 4139 -3469 -4686 5872 3727 -6943 64 8216 -5115 -6963 9554 3159 -10174 3317
2599 3317 7644 -8556 -3845 9248 -725 -6809 4063 3326 -6353 -998 5552 -846 -2197 2333
$$ packed form
2502h754J3708K058j2553L220P343o081l357O255K082n018j827L292J201l451
2516a882j232O674P75j0136L122J0550j0389n689J6503k253j6359J0292J0160
2529A0136j6228j673J7971o505j4613J3187O016j6207L084J3616q353o919R119
2542B631J032p199Q58N891N8n638M3N813k070o933N339P677r339n575J3397j771
2558D214j5098J1068J1415j7528j852J7859q609j3066J5243O142j6533K237J3967
2571I459j0002q577J3499J773j1345L516O207n323l335L842L712k803m498M174
2585B99L840p608j217J0558k145j0670P007Q152j3331j848J6517o395j3333J3491
2599C317M327j6200M711J3093r973o084J0872p37r679N355O550o398j351M530
$$ plain form
2613 2333 67 -1506 -139 154 2556 885 -3360 1130 2109 -4348 -662 5362 -1475 -4649 3337
2628 3337 1381 -6027 1346 6188 -3670 -2533 5225 -1882 -4218 4694 1902 -3310 1804 1384 -3688
2643 -3688 66 2837 -1551 -377 2493 -2366 -2718 2864 -230 -2293 3658 477 -4155 1395 1835
2658 1835 -2347 1554 2953 -1966 -1156 1411 -1221 -753 2607 -150 -1795 1364 -1198 -2897 2808
2673 2808 1406 -3336 2214 1836 -4809 285 4708 -2186 -1758 4773 -785 -5121 2737 3509 -4204 227
2689 227 4624 -3462 -3576 3598 345 -2805 1530 1592 -1811 -1651 709 1659 11 -852 1274 1414 -2634
2706 -2634 -1825 4360 1244 -5042 2189 4763 -6464 -2889 8036 -1087 -6965 4839 4001 -7891
2720 -7891 -1410 8245 -1534 -6175 4883 3676 -6735 -826 6429 -513 -4264 1626 3210 -2743
$$ packed form
2613B333k266j573J367K93K402j671m245M490R79o457L686O024o837l174P986
2628C337j956p408P373M842r858J137P758p107k336Q912k792n212N114m20n072
2643c688L754K771m388J174K870m859l52N582l094k063N951l181m632N550M40
2658A835m182L901J399m919Q10K567k632M68L360k757j645L159k562j699N705
2673B808j402m742N550l78o645N094M423o894M28O531n558m336P858P72p713M431
2689B27M397q086j14P174l253l150M335O2l403J60K360R50j648q63K126J40m048
2706b634Q09O185l116o286P231K574j1227L575J0925r123n878J1804q38j1892
2720g891O481R655r779m641J1058j207j0411N909P255o942l751N890J584n953
$$ plain form
2734 -2743 -4078 3771 3879 -5187 -2283 6026 -1248 -7114 3800 6731 -5983 -4017 8312 -248
2748 -248 -8898 5134 7546 -7528 -2970 7856 -1696 -7204 4232 5306 -5286 -2977 5035 -561
2762 -561 -5312 2404 4423 -2447 -3007 2311 1860 -3342 -788 5646 126 -5589 2357 3786 -5147 -1279
2778 -1279 6769 -785 -6422 2759 3523 -6105 -876 7493 -2126 -5915 4343 1929 -5548 1250 5790
2793 5790 -1749 -3660 2536 1646 -3561 -97 4620 -182 -3936 386 2071 -2189 -2142 3777 2430 -5150
2809 -5150 -1357 4815 -2034 -3907 5765 3329 -6096 -708 5121 -2441 -3783 5558 3000 -6073 -772
2824 -772 4109 -2737 -2602 4216 1655 -3377 -1547 1488 -57 -1737 1698 3047 -1446 -2944 1034
2839 1034 1661 -1317 -176 3748 -175 -4696 550 2462 -2827 48 4031 -1415 -3468 716 772 -1213
$$ packed form
2734b743j335P849J08r066K904Q309p274n866J0914K931j2714J966J2329q560
2748b48q650J4032K412j5074M558J0826r552n508J1436J074j0592K309Q012n596
2762e61m751P716K019o870n60N318m51n202K554O434n520n715P946J429q933L868
2778a279Q048p554n637R181P64r628N229Q369r619l789J0258k414p477O798M540
2793E790p539j911O196q90n207L464M717m802l754M322J685m260M7N919j347p580
2809e150L793O172o849j873R672k436r425N388N829p562j342R341k558r073N301
2824g72M881o846J35O818k561n032J830L035j545j680L435J349m493j498L978
2839A034O27k978J141L924l923m521N246J912n289K875L983n446k053M184N6j985
$$ plain form
2855 -1213 1220 2483 -771 -1577 325 -678 183 2376 155 -604 696 -2164 -1701 2304 953 -1098
2871 -1098 790 99 -2522 -1222 1993 1104 -796 858 337 -2102 -596 1000 1434 920 -641 -244
2887 -244 313 -2374 -478 3540 112 -2588 1271 722 -4005 -583 4676 -243 -3424 2920 1444 -5337
2903 -5337 455 5305 -1671 -2272 3255 415 -4292 126 3844 -592 -2595 1936 1071 -3710 -1146
2918 -1146 3203 789 -2589 308 2886 -2415 -3508 4306 2804 -4762 382 5138 -3417 -4208 5126
2933 5126 2521 -5759 501 5521 -3915 -4726 5455 1691 -5789 1475 4494 -3297 -3176 3736 1963
2948 1963 -3647 -27 4319 -908 -3861 2140 3085 -3080 -2190 3983 1052 -5545 380 5189 -3786
2963 -3786 -4114 6021 1639 -6730 1491 5662 -4280 -3673 6464 1735 -6464 1779 5254 -4504 -3082
$$ packed form
2855a213K433J263l254q06J902j003Q61K193k221p59J300k860M63M005j351k051
2871a098J888o91k621J300L215q89j900J654n21k439J506J596M34n14j561L97
2887b44N57k687J896M018l428k700L859n49m727L422N259m919l181O344j476o781
2903e337N792M850o976o01N527k840m707M418L718m436k003M531q65m781K564
2918a146M349k414l378K897K578n301j093P814j502p566N144M756q555p91R334
2933E126k605q280O260N020r436q11J0181l764p480P264L019p791J21O912j773
2948A963n610L620M346n227k953O001R45o165Q90O173k931o597N925M809q975
2963c786l28J0135m382q369Q221M171r942O07J0137m729q199Q243L475r758J422
$$ plain form
2978 -3082 5501 786 -4895 652 3489 -2476 -3559 3131 3044 -3585 -1438 4123 -526 -4639 2077
2993 2077 4945 -2838 -3504 5072 1134 -6802 1954 6598 -4544 -3675 5918 -371 -6774 2210 5362
3008 5362 -3789 -2832 4916 10 -5293 1934 4198 -2100 -1591 2610 505 -2849 -664 3339 795
3023 795 -3028 808 2557 -3176 -2424 3907 1437 -3911 626 3606 -3309 -3161 5005 1161 -4287 2483
3039 2483 2917 -4287 -920 3836 -536 -2115 2133 739 -2947 -257 1836 -910 -409 1312 -858
3054 -858 -991 205 -485 906 994 -682 575 489 -1683 300 1762 -450 -665 1285 -389 -2145 888
3071 888 993 -1791 502 1657 -2479 -730 2186 -1376 -729 2848 -309 -2180 1681 995 -2373 830
3087 830 2938 -1890 -1544 2697 -743 -2877 2326 1455 -2677 173 1600 -1370 -1194 1224 1073 -765
$$ packed form
2978c082Q583m715n681N547K837n965j083O690q7o629K147N561m649m113O716
2993B077K868p783o66Q576l938p936Q756M644j1142Q69R593o289o403Q984L152
3008E362r151R57P748m906n303P227K264o298N09M201k105l354K185M003k544
3023G95l823L836J749n733P52O331k470n348M537K980o915J48Q166l844n448O770
3039B483M34p204L367M756m372j579M248j394l686K690K093k746N01J721k170
3054h58j33J196o90J391Q8j676J257q6k172J983J462k212k15J950j674j756L033
3071H88J05k784K293J155m136J749K916l562O47L577l157j871L861o86l368L203
3087H30K108m828L46M241l440k134N203q71m132K850J427k970J76K418j51j838
$$ plain form
3103 -765 -464 1081 347 -1261 -182 1992 588 -2410 510 2594 -2671 -2152 4436 -114 -4679 2574
3119 2574 3059 -4658 -1129 5167 -1012 -4308 3378 2811 -4765 -443 4900 -1491 -3141 2988 1541
3134 1541 -3114 -897 2678 365 -2812 302 2902 -1672 -2995 2697 2343 -3453 -996 4503 -552
3149 -552 -4820 3212 4186 -5152 -1154 6149 -2009 -5191 4062 2745 -5044 -475 4929 -1919 -4268
3164 -4268 3270 2431 -4020 -290 3663 -781 -2775 1219 2436 -1276 -2151 2593 1851 -3696 -385 4061
3180 4061 -1210 -3670 2885 2465 -4491 -1169 5035 -1462 -4435 3998 2478 -5159 225 4763 -1984
3195 -1984 -2875 3431 1498 -3547 -218 3417 -1082 -2670 1981 1330 -2427 -842 1922 373 -2362
3210 -2362 -73 2767 -1376 -2785 3022 1923 -3605 41 3749 -1747 -3020 3294 1890 -4159 -44
$$ packed form
3103g65L01J545p34j608J079K174j404k998K920K084n265N19O588m550m565P253
3119B574M85p717L529O296o179l296P686n67p576M322N343o391j650O129j447
3134A541m655K217L575k313l177L114K600m574j323N692l54n796K457N499n055
3149e52m268Q032R74r338L998P303q158l182R253j317p789M569N404o848k349
3164d268P538q39o451L730L953m444j994L994J217l712q75M744p42n547L311M446
3180D061n271k460O555m20o956L322O204o497k973Q433j520p637N384M538o747
3195a984q91O306j933n045L329L635m499j588M651o51l757J585K764j549k735
3210b362K289K840m143j409N807j099n528L646L708n496j273O314j404o049M115
$$ plain form
3225 -44 3867 -2361 -3021 3416 938 -3393 501 2363 -1622 -1790 1845 1546 -1445 -507 1781 42
3241 42 -1526 425 1907 -200 -1957 750 1616 -2120 -930 2904 -468 -2616 1347 1202 -2130 -235
3257 -235 2425 -23 -1871 925 886 -1452 180 1528 -251 -189 -140 -651 154 -74 -424 846 246 -1211
3275 -1211 -507 757 -136 -490 1137 994 -1496 -372 1321 -443 -142 1267 290 -464 -637 -310 604
3292 604 -163 -399 1021 237 -1485 -570 1102 142 -1230 1218 1293 -2393 -772 2385 -575 -1234 2374
3309 2374 958 -2284 -475 1471 -580 -1105 1710 1095 -2259 -725 1320 -627 -754 1286 1117 -989
3325 -989 -1366 897 778 -1371 792 2450 -1309 -1901 1484 391 -2054 583 2828 -1298 -2954 1692
3341 1692 699 -3108 1165 3444 -1836 -2242 1964 321 -2531 931 3542 -962 -2568 1607 738 -2753
$$ packed form
3225d4L911o228o60O437k478m331L894J862l985j68L635k99k991R38K288j739
3241D2j568J951J482k107j757K707Q66l736J190L834l372k148L963j45l332J895
3257b35K660k448j848K796l9k338J632J348j779O2M9n11Q05k28l50J270o00j457
3275a211P04J264q93l54J627j43k490J124J693j764L01J409r77p54j73L27R14
3292F04p67k36J420p84j722R15J672r60j372K448P5l686J621L157k960o59L608
3309B374j416l242J809J946k051n25K815o15l354J534K045j947j27K040j69k106
3325i89l77K263j19k149K163J658l759n92L385j093k445K637K245m126j656M646
3341A692r93l807M273K279n280m06M206j643k852L462K611m504j606M175q69l491
$$ plain form
3357 -2753 500 3334 -381 -2652 490 1266 -2405 -998 3839 837 -3680 586 2194 -2683 -1353
3372 -1353 4420 1605 -3735 64 2739 -2901 -2184 4629 1456 -3935 199 2215 -2809 -2122 3658
3387 3658 1967 -3060 -477 2197 -2133 -2299 3322 2526 -2078 -990 1923 -952 -3028 2173 3860
3402 3860 -2059 -2294 2464 -742 -3755 2000 3915 -1718 -2323 2267 -309 -3919 1825 4266 -1601
3417 -1601 -1834 2001 -663 -2917 1284 3275 -324 -1810 543 39 -2709 -91 3090 342 -1868
3432 -1868 -65 306 -1993 -854 3120 1750 -2229 105 1248 -2444 -884 3240 1102 -1674 55
3447 55 497 -2318 -942 2524 850 -1346 198 -295 -2015 -66 1486 919 227 -455 -556 -667 -477
3464 -477 954 1732 158 -608 -541 -776 -974 420 1800 39 -942 41 -955 -1302 1347 1380 -180 376
$$ packed form
3357b753L253K834l715k271L142P76l671J407M837l002m517M266J608m877J330
3372a353N773k815n340L799K675n640P17O813l173n391M134K016n024O87N780
3387C658j691n027K583K674m330j66N621p96m604J088K913k875k076N201J687
3402C860n919k35M758l206l013N755J915n633o05M590k576l610N744K441n867
3417a601k33L835k664k254M201J991l599j486K353n04k748K618L181k748k210
3432a868J803L71k299J139L974j370l979K334J143l692J560M124k138k776J729
3447E5M42k815J376L466j674k196J544m93j720J949J552n67o92o82j01j11J90
3464d77J431P78j574p66O7k35j98J394J380j761r81R83r96l47K649L3j560N56
$$ plain form
3482 376 -152 -1393 -302 1099 734 343 738 -712 -1779 42 816 -372 979 1133 -1791 -1219 576
3499 576 -272 113 1491 548 -1154 -985 171 59 177 1336 718 -830 -1077 -363 521 186 -57 1457
3517 1457 -106 -2593 -54 1306 -1132 9 2539 -306 -2920 568 1833 -1717 3 3330 -565
3532 -565 -2960 1093 1197 -1815 401 2386 -452 -2409 -80 1131 -1061 -595 2107 529 -2222 -677
3548 -677 1587 -124 -1387 1875 2027 -2635 -1546 2856 -414 -2392 2708 2002 -3408 -1207 2669 -829
3564 -829 -2347 2663 2090 -3127 -880 2591 -1051 -1692 2315 1446 -1777 -1092 1475 294 -1685 799
3580 799 2492 -1390 -2258 1359 801 -2166 22 3034 -824 -3169 1751 1698 -3094 315 3872 -1311
3596 -1311 -2718 2164 1085 -2655 374 3134 -1045 -2449 1354 842 -2343 68 2280 -316 -1706
$$ packed form
3482C76n28j241J091J401l65l91L95j450j067J821P74j188J351J54k924N72J795
3499E76q48L85J378r43j702J69J156j12J18J159o18j548k47P14Q84l35k43J514
3517A457j563k487K539J360k438J141K530k845k614L488J265l550J720L327l895
3532e65k395M053J04l012K216J985k838j957K329J211k192M66K702j578k751J545
3548f77K264j711j263L262J52m662J089M402l270j978N100p06n410K201L876l498
3564h29j518N010n73n217K247L471l642o41M007q69l223O85K567j181j979K484
3580G99J693l882q68L617n58k967K188L012l858k345M920n3m792L409L557n183
3596a311j407M882j079l740L029K760m179j404L803n12l185K411K212k596j390
$$ plain form
3611 -1706 344 1097 -864 -1042 2033 1265 -2178 -265 2164 -945 -1665 2142 1648 -2484 -655 2380
3627 2380 -1057 -2203 2328 1317 -2671 -132 1722 -1314 -1267 1653 1056 -1256 -388 1229 -351 -1013
3643 -1013 876 1103 -389 -797 393 573 -1026 -493 1680 -130 -1735 777 842 -1655 -126 1722
3659 1722 -266 -1337 738 722 -1235 216 1660 -323 -796 717 -226 -645 232 443 -35 -219 -329
3676 -329 -85 -15 -135 81 451 93 -567 -30 492 -427 -14 1226 -290 -560 446 -196 -438 346 248 -277
3696 -277 -231 -261 -160 -79 163 72 130 287 -605 -198 940 -155 -450 1079 70 -1147 348 713 -668
3715 -668 -327 909 -88 -1357 209 790 -713 -305 1083 -144 -880 305 648 -153 -382 577 747 -994
3733 -994 -407 1135 -74 -1124 655 951 -1041 -996 1127 364 -1699 392 1518 -1426 -985 1817 336
$$ packed form
3611a706K050P53j961j78L075p68l443J913K429l109p20L807m94m132J829L035
3627B380l437j146M531j011l988K539J854l036M7K920n97k312Q68J617j580o62
3643a013J889K27j492m08J190J80j599N33K173j810j605K512O5k497J529J848
3659A722j988j071K075j6j957J451J444j983m73J513r43m19Q77K11m78j84j10
3676c29K44P0j20K16L70l58o60N37N22r19M13J240j516k70J006o42k42P84r8n25
3696b77M6l0J01Q1K42r1N8J57q92M07J138j095k95J529j009j217J495L65j381
3715f68L41J236r97j269J566N81j503M08J388j227p36J185L43q01k29R59J70j741
3733i94N87J542j209j050J779K96j992M5K123p63k063K091J126k944M41K802j481
$$ plain form
3750 336 -1519 596 1593 -1013 -1155 1698 657 -1612 195 1609 -960 -1298 1010 846 -1391 -639
3766 -639 1599 -83 -1835 906 1582 -1572 -752 1988 266 -1805 541 1977 -1152 -1489 2009 667
3782 667 -2414 476 2019 -1396 -1707 1749 745 -2201 12 2263 -810 -1870 1661 1161 -1872 -38
3798 -38 1934 -451 -1609 901 1445 -1321 -762 1929 74 -2184 450 1751 -1153 -1235 1762 562
3814 562 -2125 92 2142 -1105 -1334 2003 726 -2067 156 1891 -701 -1126 1424 905 -2014 -432
3830 -432 1731 -739 -1244 1106 695 -1361 -571 1288 127 -1014 687 1362 -1244 -988 1576 395
3846 395 -1331 423 1323 -974 -1446 1222 565 -1566 364 1429 -1367 -1196 1179 348 -821 473
3862 473 857 -643 -937 675 659 -565 231 776 -395 -790 -29 633 125 -512 488 195 -1348 -269
$$ packed form
3750C36j855K115R97k606j42K853j041k269J807J414k569l38K308j64k237P52
3766f39K238j682j752K741O76l154Q20K740j722k071K346J436l129l37L498j342
3782F67l081K890J543l415l11L456j004k946K213K251l073j060L531n00l033J834
3798c8J972k385j158K510N44k766N59K691j855k258K634J301k904q2K997j200
3814E62k687K217K050l247k29L337j277k793K223J735k592m25K550n19k919J582
3830d32K163k470n05K350m11k056P90J859j161j141J701O75k606K56K564j181
3846C95j726J754R00k297m72K668o57k131J930J065k796J71K375q31j169J294
3862D73L84j500k94J612j6j224P96N45j171l95P61O62n08o37J000k93j543J079
$$ plain form
3880 -269 1067 -29 -371 770 144 -912 -131 846 150 -51 622 -4 -787 -12 131 -8 481 -134 -384
3899 -384 -30 -391 -255 658 550 -364 -248 89 -377 -433 1054 835 -605 4 232 -761 -96 786 319 -48
3919 -48 -266 -273 -120 -433 68 693 111 -708 -186 185 -507 6 1460 383 -1128 264 528 -1167 65
3938 65 1549 -176 -1054 259 221 -1196 0 1450 -71 -1086 192 144 -757 171 1083 625 -728 -573
3956 -573 613 -303 -805 1142 1149 -1350 -683 1028 -503 -1309 1198 1477 -1596 -904 1498 -712 -1512 1681
3974 1681 1143 -1534 -244 1151 -444 -1159 1079 1326 -980 -748 975 6 -1260 402 1340 -583
3990 -583 -1446 629 903 -1483 -207 2360 -393 -1976 1277 1063 -1917 -138 2242 -556 -2056 1130
4006 1130 1122 -1801 -174 1964 -673 -1670 661 724 -1054 -353 1404 427 -1412 18 1419 -579 -947
$$ packed form
3880b69J336j096l42J141o26j056P81R77o96k01O73o26p83P75J43j39M89o15k50
3899c84L54l61J36R13j08r14J16L37m66n6J487k19j440O09K28r93O65Q82m67l67
3919d8k18pJ53l13N01O25n82q19N22L71o92N13J454j077j511J392K64j695J232
3938F5J484j725q78J313l8j417J196J450j521j015J278m8r01R28R12m58j353J55
3956e73J186r16n02J947Pk499O67J711j531q06K507K79l073O92K402k210q00L193
3974A681n38k677J290J395j595p15K238K47k306K32J723r69j266J662R38j923
3990e83q63K075K74k386J276K567k753j583L253k14k980J779K380k798j500L186
4006A130qk923J627K138k637r97K331O3j778P01J757r77j839J430J401j998l68
$$ plain form
4023 -947 1176 875 -1475 -473 1609 -332 -1676 1198 1198 -2003 -521 1797 -570 -1441 1258 713 -1588
4040 -1588 -319 1567 -71 -1015 858 567 -1037 -221 777 189 -529 -58 608 -249 -1090 493 882 -928
4058 -928 -364 1028 -370 -1052 703 943 -885 -274 1255 -444 -1082 866 492 -1105 163 633 -589
4075 -589 -521 492 266 -283 -43 302 -307 -397 224 319 273 -139 -34 237 -336 -305 862 230 -512 299 181
$$ packed form
4023i47K123l01k350J002K082j941j344K874%l201J482K318k367q71K699n45k301
4040a588J269J886j638r44J873k91j604Q16R98n88p18M71O66q57q41J583L89j810
4058i28N64J392j398o82J755K40j828O11J529j699o38J948l74j597J268M70j222
4075e89O8J013k26n49K40L45o09r0O21R5m6m12J05K71n73L1J167o32p42Q11j18
$$ [...]
8191B3
##END NTUPLES=NMR FID
##END=
