##TITLE=1H_1-2026
 200.13MHz,CDCl3.
 8 sc
 
 13.1.2026
##JCAMPDX= 6.0         $$ Bruker NMR JCAMP-DX V2.0
##DATA TYPE= NMR FID
##DATA CLASS= NTUPLES
##ORIGIN= UXNMR, Bruker Analytische Messtechnik GmbH
##OWNER= pz
$$ XWIN-NMR		Version 3.5
$$ Tue Jan 13 14:16:20 2026 Russian Standard Time (UT+4h)  she@DPX200
##.OBSERVE FREQUENCY= 200.1313
##.OBSERVE NUCLEUS= ^1H
##.DELAY= (6, 6)
##.ACQUISITION MODE= SIMULTANEOUS
##.ACQUISITION SCHEME= undefined
##.AVERAGES= 8
##.DIGITISER RES= 18
##SPECTROMETER/DATA SYSTEM= spect
##.PULSE SEQUENCE= zg30
##.SOLVENT NAME= CDCl3
##.SHIFT REFERENCE= (INTERNAL, CDCl3, 0, 14.3821)
##AUDIT TRAIL= $$ (NUMBER, WHEN, WHO, WHERE, WHAT)
$$ ##TITLE= Audit trail, XWIN-NMR		Version 3.5
$$ ##JCAMPDX= 5.01
$$ ##ORIGIN= Bruker BioSpin GmbH
$$ ##OWNER= she
$$ F:/spectra/data/she/nmr/H-C/1/audita.txt
$$ ##AUDIT TRAIL=  $$ (NUMBER, WHEN, WHO, WHERE, WHAT)
(   1,<2026-01-13 14:14:55.48 +0400>,<she>,<DPX200>,
      <created by zg, POWCHK disabled, PULCHK disabled
       configuration hash MD5:
       00 E9 B6 7A A2 85 ED C7 34 08 36 98 17 FE 4E 26
       data hash MD5: 16K
       2C 69 03 74 80 B0 10 98 DF 1A 98 C2 A9 26 B8 E4>)
$$ ##END=
$$ 
$$ hash MD5
$$ F6 43 38 48 83 CD C0 47 A9 97 4B 5D 67 95 2F 0B
##$RELAX= 
##$RELAX= 
##$RELAX= 
##$RELAX= 
##$RELAX= 
##$RELAX= 
$$ Bruker specific parameters
$$ --------------------------
##$DU= <F:/spectra>
##$EXPNO= 1
##$NAME= <H-C>
##$PROCNO= 1
##$TYPE= <nmr>
##$USER= <she>
##$AMP= (0..31)
100 100 100 100 100 100 100 100 100 100 100 100 100 100 100 100 100 100 
100 100 100 100 100 100 100 100 100 100 100 100 100 100 
##$AQSEQ= 0
##$AQ_mod= 1
##$AUNM= <au_zg>
##$AUTOPOS= <>
##$BF1= 200.13
##$BF2= 200.13
##$BF3= 200.13
##$BF4= 200.13
##$BF5= 200.13
##$BF6= 200.13
##$BF7= 200.13
##$BF8= 200.13
##$BYTORDA= 1
##$CFDGTYP= 0
##$CFRGTYP= 5
##$CHEMSTR= <none>
##$CNST= (0..31)
1 1 145 1 1 1 1 1 1 1 1 1 1 1 1 1 1 1 1 1 1 1 1 1 1 1 1 1 1 1 1 1 
##$CPDPRG= <>
##$CPDPRG1= <>
##$CPDPRG2= <>
##$CPDPRG3= <>
##$CPDPRG4= <mlev>
##$CPDPRG5= <mlev>
##$CPDPRG6= <mlev>
##$CPDPRG7= <mlev>
##$CPDPRG8= <mlev>
##$CPDPRGB= <>
##$CPDPRGT= <>
##$D= (0..31)
0 0.7 0 0 0 0 0 0 0 0 0 0.03 0 0 0 0 0 0 0 0 0 0 0 0 0 0 0 0 0 0 0 0 
##$DATE= 1768299294
##$DBL= (0..7)
120 120 120 120 120 120 120 120 
##$DBP= (0..7)
150 150 150 150 150 150 150 150 
##$DBP07= 0
##$DBPNAM0= <>
##$DBPNAM1= <>
##$DBPNAM2= <>
##$DBPNAM3= <>
##$DBPNAM4= <>
##$DBPNAM5= <>
##$DBPNAM6= <>
##$DBPNAM7= <>
##$DBPOAL= (0..7)
0.5 0.5 0.5 0.5 0.5 0.5 0.5 0.5 
##$DBPOFFS= (0..7)
0 0 0 0 0 0 0 0 
##$DE= 6
##$DECBNUC= <off>
##$DECIM= 32
##$DECNUC= <off>
##$DECSTAT= 4
##$DIGMOD= 1
##$DIGTYP= 9
##$DL= (0..7)
0 120 120 120 120 120 120 120 
##$DP= (0..7)
150 150 150 150 150 150 150 150 
##$DP07= 0
##$DPNAME0= <>
##$DPNAME1= <>
##$DPNAME2= <>
##$DPNAME3= <>
##$DPNAME4= <>
##$DPNAME5= <>
##$DPNAME6= <>
##$DPNAME7= <>
##$DPOAL= (0..7)
0.5 0.5 0.5 0.5 0.5 0.5 0.5 0.5 
##$DPOFFS= (0..7)
0 0 0 0 0 0 0 0 
##$DQDMODE= 0
##$DR= 18
##$DS= 0
##$DSLIST= <SSSSSSSSSSSSSSS>
$$ [...]
##$SUBNAM0= <"">
##$SUBNAM1= <"">
##$SUBNAM2= <"">
##$SUBNAM3= <"">
##$SUBNAM4= <"">
##$SUBNAM5= <"">
##$SUBNAM6= <"">
##$SUBNAM7= <"">
##$SUBNAM8= <"">
##$SUBNAM9= <"">
##$SW= 18.0517328524113
##$SWIBOX= (0..15)
0 0 2 0 0 0 0 0 0 0 0 0 0 0 0 0 
##$SW_h= 3612.71676300578
##$TD= 16384
##$TD0= 1
##$TE= 0
##$TE2= 300
##$TE3= 300
##$TEG= 300
##$TL= (0..7)
0 120 120 120 120 120 120 120 
##$TP= (0..7)
150 150 150 150 150 150 150 150 
##$TP07= 0
##$TPNAME0= <>
##$TPNAME1= <>
##$TPNAME2= <>
##$TPNAME3= <>
##$TPNAME4= <>
##$TPNAME5= <>
##$TPNAME6= <>
##$TPNAME7= <>
##$TPOAL= (0..7)
0.5 0.5 0.5 0.5 0.5 0.5 0.5 0.5 
##$TPOFFS= (0..7)
0 0 0 0 0 0 0 0 
##$TUNHIN= 0
##$TUNHOUT= 0
##$TUNXOUT= 0
##$USERA1= <user>
##$USERA2= <user>
##$USERA3= <user>
##$USERA4= <user>
##$USERA5= <user>
##$V9= 5
##$VALIST= <valist>
##$VCLIST= <CCCCCCCCCCCCCCC>
##$VD= 0
##$VDLIST= <DDDDDDDDDDDDDDD>
##$VPLIST= <PPPPPPPPPPPPPPP>
##$VTLIST= <TTTTTTTTTTTTTTT>
##$WBST= 1024
##$WBSW= 4
##$XGAIN= (0..3)
0 0 0 0 
##$XL= 0
##$YL= 0
##$YMAX_a= 314016
##$YMIN_a= -353369
##$ZGOPTNS= <>
##$ZL1= 120
##$ZL2= 120
##$ZL3= 120
##$ZL4= 120
##$ABSF1= 10
##$ABSF2= 0
##$ABSG= 5
##$ABSL= 3
##$ALPHA= 0
##$AQORDER= 0
##$ASSFAC= 0
##$ASSFACI= 0
##$ASSFACX= 0
##$ASSWID= 0
##$AUNMP= <proc_1d>
##$AZFE= 0.1
##$AZFW= 0.1
##$BCFW= 1
##$BC_mod= 2
##$BYTORDP= 1
##$COROFFS= 0
##$CY= -3
##$DATMOD= 1
##$DC= 2
##$DFILT= <>
##$DTYPP= 0
##$F1P= 0
##$F2P= 0
##$FCOR= 0.5
##$FTSIZE= 0
##$FT_mod= 4
##$GAMMA= 1
##$GB= 0.15
##$INTBC= 1
##$INTSCL= 1
##$ISEN= 128
##$LB= 0.25
##$LEV0= 0
##$LPBIN= 0
##$MAXI= 10000
##$MC2= 0
##$MEAN= 0
##$ME_mod= 0
##$MI= 1.114404
##$NCOEF= 0
##$NC_proc= 0
##$NLEV= 6
##$NOISF1= 3.799351
##$NOISF2= 2.8
##$NSP= 1
##$NTH_PI= 0
##$NZP= 0
##$OFFSET= 14.38212
##$PC= 1
##$PHC0= -3859.777
##$PHC1= 9.592306
##$PH_mod= 1
##$PKNL= yes
##$PPARMOD= 0
##$PSCAL= 0
##$PSIGN= 0
##$REVERSE= no
##$SF= 200.129724274929
##$SI= 16384
##$SIGF1= 3
##$SIGF2= 2
##$SINO= 400
##$SIOLD= 16384
##$SREGLST= <1H.CDCl3>
##$SSB= 0
##$STSI= 0
##$STSR= 0
##$SW_p= 3205.1282051282
##$SYMM= 0
##$S_DEV= 0
##$TDeff= 0
##$TDoff= 0
##$TI= <>
##$TILT= no
##$TM1= 0
##$TM2= 0
##$TOPLEV= 0
##$USERP1= <user>
##$USERP2= <user>
##$USERP3= <user>
##$USERP4= <user>
##$USERP5= <user>
##$WDW= 1
##$XDIM= 8192
##$YMAX_p= 0
##$YMIN_p= 0
$$ End of Bruker specific parameters
$$ ---------------------------------
##NTUPLES= NMR FID
##VAR_NAME=  TIME,          FID/REAL,        FID/IMAG
##SYMBOL=    X,             R,               I
##VAR_TYPE=  INDEPENDENT,   DEPENDENT,       DEPENDENT
##VAR_FORM=  AFFN,          ASDF,            ASDF
##VAR_DIM=   8192,          8192,            8192
##UNITS=     SECONDS,       ARBITRARY UNITS, ARBITRARY UNITS
##FACTOR=    0.0002768,     1,               1
##FIRST=     0,             0,               0
##LAST=      2.2672688,     0,               0
##MIN=       0,             -353369,         0
##MAX=       2.2672688,     314016,          0
$$ Real data points
##PAGE= N=1
##DATA TABLE= (X++(R..R)), XYDATA
$$ [...]
832d222R902k928r858J249R094J219q397k327R013L835o807l774N204N443l800
$$ -4222 5680 2752 -7106 -5857 3237 4456 -3941 -6268 2745 6580 -227 -4001 1203 6646 2846
847B846o892K410N981j587n844j226N259K713n437l545L855M345j777n929J007
$$ 2846 -4046 -1636 4345 2758 -3086 -4312 947 3660 -1777 -5322 -1467 2878 1101 -4828 -3821
862c821P637L91o772q15O884L322o621m601O108M200n477n864K628O648j746q017
$$ -3821 3816 4207 -2565 -3380 3504 6826 205 -4396 1712 5912 435 -5429 -2801 3847 2101 -5916
878e916J172Q149m4p536j170Q074K318p500j553O344J983l447k759K167L954j159
$$ -5916 -4744 3405 3361 -4175 -5345 2729 5047 -2453 -4006 2338 4321 874 -1885 282 4236 3077
894C077m872j154M014K048n607l153O008K674n188k006L580L034j236k708K46
$$ 3077 -1795 -2949 1065 3113 -2494 -5647 361 3035 -2153 -4159 -579 2455 1219 -1489 -1243
909a243K962J936l141m350M546O122n797o325N754M991o146n417N056M487m189
$$ -1243 1719 3655 514 -3836 710 6832 1035 -5290 464 5455 -691 -6108 -1052 3435 -754
924g54l092J797K019J649j676l365L799N402m287o092M658O375n383n294N833
$$ -754 -3846 -2049 -30 1619 -57 -3422 377 5779 1492 -4600 58 6433 1050 -4244 1589
939A589K683n347j460K041l65O89Q09l001j134N126P80p059J616Q803k408p299
$$ 1589 4272 -1075 -2535 -494 -859 -170 639 -2362 -3496 1630 2410 -4649 -3033 5770 3362 -3937
955c937L337N016l273k887K510J135j010O52k813l178N578K581q153n72R299j488
$$ -3937 -600 4416 1143 -1744 766 1901 891 1543 -1270 -4448 1130 3711 -4442 -5014 4285 2797
971B797r398K888Q783l128n291M816J976l980R47Q61k900K944L604n704m265O537
$$ 2797 -6601 -3713 5070 1942 -3349 1467 3443 -537 410 1271 -1629 1315 4919 -785 -5050 1487
987A487K160q457P6Q982k261o732L230K865l016J253L150k949n04N134k851p356
$$ 1487 3647 -4810 -4734 4248 1987 -4745 -1515 1350 -1666 -413 2737 -212 -716 4418 1567 -5789
1003e789O252P203q264m384Q405N59q817N26O630j784k676K955j794k731N263
$$ -5789 463 7666 -598 -4982 3423 3982 -4835 -4309 2321 537 -2139 816 -978 -3709 1554
1018A554K46o014M744P410o952o777P292L911p997n01P794k548n653L230K32l781
$$ 1554 1800 -4214 530 7940 988 -5789 1503 5414 -2583 -3084 4710 2162 -3491 -261 -29 -3810
1034c810M090L451n910j577P015k007q281N366Q532n723m267O050Q2n339K019
$$ -3810 280 3731 -2179 -3756 3259 1252 -7029 -1663 6869 1146 -3121 2929 3011 -2328 -309
1049c09K935l079Q10L355n872m276P915J746q543K835Q792n166p437N379M535
$$ -309 2626 -453 357 3712 -2160 -6436 1479 3225 -5318 -2483 6309 1143 -6294 -915 3620
1064C620m934j2N084k499k730L617j755l946N507L557p141k234O629j455p324
$$ 3620 -1314 -1326 3758 1259 -1471 2146 391 -3555 1952 5509 -1632 -3866 2763 1308 -6016
1079f016L681O321m335k577M430j607l151M536J478m753K373N402n653n627P240
$$ -6016 -2335 3986 -349 -2926 1504 -103 -3254 1282 2760 -1993 380 5782 129 -5498 1742
1094A742L129p516K22O414k853n039K764J547k458J852K239l965k61N278k676
$$ 1742 4871 -2645 -2423 3991 1138 -3901 -1137 410 -2048 -196 2043 -1922 -2183 3095 419
1109D19m898N743M397o206k384N847k48n453J915L855l325j124L044k618k575
$$ 419 -4479 1264 5661 -545 -2929 2918 2670 -2783 -868 2987 -338 -1462 1582 -1036 -3611
1124c611M386Q19m837J471N288l144m368M610K882m534N00L363k276j107J991
$$ -3611 775 1594 -3243 -1772 3516 372 -3996 614 3496 -1038 -538 2825 549 -558 1433
1139A433j154k482L126J695n085q00N374j145n669L719L714l069k209L403O18
$$ 1433 279 -2203 923 2618 -2467 -3267 2107 962 -4707 -988 2726 -343 -2552 851 1469
1154A469k609J235J252j999J002K767l321j840L973J50m824J147L789j754l546
$$ 1469 -1140 95 1347 -652 350 3117 -204 -2044 1929 2079 -2745 -1598 2191 437 -3109
1169c109K713J524k669N84K413j912m15K914j370k568K627K358l292j485L652
$$ -3109 -396 1128 -1541 -957 1456 -456 -871 2043 673 -1895 732 3090 -202 -1687 1965
1184A965p3l596P16K175j557p06Q74o14n35J604m6j943J599K525k461j825L128
$$ 1965 1892 -1704 -988 1187 -370 -1076 -202 -816 -1351 253 207 -1736 -137 2388 -73 -1898 1230
1201A230R96k922rK455o28j894P63O59j330M65O81j758j48K007q03j721J559J932
$$ 1230 2226 -696 -705 1750 1122 -772 -9 650 -680 -215 466 -1292 -1440 567 -236 -1957 -398 1534
1219A534j548q47J692N33j506L14N71o17J66N96j223j81J178K04j969K84J936
$$ 1534 -14 -861 831 1364 -142 172 743 126 292 888 -335 -516 662 866 -1103 -819 1117
1236A117j250j814J206J342q17n14P46O19j16J07j17j54N75J07j503k25J498n29
$$ 1117 -133 -1947 -741 601 -216 -730 16 635 519 626 509 355 930 1037 -466 -691 807 278
1254B78j492L76J181m74q78M87M91j68J54k0l30O61O54q68l03J126M50j126o19
$$ 278 -1214 -838 343 -131 -1009 -522 -31 -199 -45 -65 -395 266 920 52 -251 875 1325 199 -420
1273d20J090J78j286k20M47R6k51m18l3O51K87m60k48Q62P35q91n73J133M05p69
$$ -420 670 848 -438 -658 -211 -115 -366 -784 -817 -166 121 -339 -587 275 1010 119 -454 679 1084 315
1293C15m09M10L81n03n12L0J58Oj92o31N18R37p45m81N01Q87k18q22L98Q10j76
$$ 315 -94 316 697 194 -318 -288 -130 -124 -316 -947 -429 508 -237 -718 -217 670 452 -370 28 838 662
1314F62m13r0L36O30q73p25L89K96k84q68J44P78K6q40L02P60J50m10j08N14L75
$$ 662 249 159 495 1125 252 -473 -84 212 -72 -940 -796 -18 8 -832 -530 230 380 -30 -138 376 751
1335G51l60l22J27L21L3o60j76N54oo32k59L03L03l18m88M11M34P5k96M4O76L31
$$ 751 391 69 196 517 550 -110 -286 268 262 -370 -629 -326 -23 -341 -829 -418 16 91 -205 -161 515 846
1357H46n64k45N18K83n78p06M61M28o75m56K49M37q2n11N6N55O9l86j68N02N28
$$ 846 282 37 555 838 260 -446 15 443 -232 -688 -439 -2 -84 -595 -539 16 85 -301 -469 33 561
1378E61k99l73M78M24l42k83k7J96j66m24j73l0K64r1m23J59P56j48m56J96N49
$$ 561 262 -111 367 791 449 166 139 335 169 -255 -428 -458 -194 -285 -708 -549 207 59 -397 -201 348
1399C48J24n25L8N67J03k87l17n5N83k02q51N8O25k54q01%R61l18j51L66J69l0
$$ 348 472 -53 -15 552 655 368 51 -4 579 377 -474 -416 209 -45 -846 -846 115 -203 -354 12 181 151
1421A51J27j25J20K42Mm22j51M42K96p74k82P70l09n11j33M08j17k1Jj40K78O08
$$ 151 278 153 273 515 519 97 -54 388 684 -90 -372 398 89 -422 -555 -147 -264 -285 -284 -424 -146 462
1443D62k17o47P96O96q22m81P31P6p97k32N70k9l04J59k42j68M74k73n16P24O18
$$ 462 245 -402 394 1090 268 -213 518 594 -203 -435 135 106 -198 -39 -281 -449 25 -248 -764 -40 578
1464E78o91n73Q89N41q26N7R73l89o06L48k38m88M26K54o54k34Q01j52j143O33
$$ 578 -113 -686 203 744 -82 -25 948 559 -47 301 63 -425 1 255 -399 -633 168 16 -1127 -494
1484d94J062n85m54P66M3m72K47L55l29K22N18q74p57J132J05j432M59J277p34
$$ -494 568 -17 -471 295 338 -134 113 468 139 361 879 5 -752 380 485 -947 -488 789 55
1503E5j113P11O56p60q7R39k71m04P11k83o37J032N16j023l15J115l15j481N37
$$ 55 -1058 -347 309 -451 -538 401 130 -274 437 154 -483 549 1065 42 -273 842 527 -954 -417
1522d17R28q78m49R34l58n59Q55L01q14L84J244r17j250J355O59j571J66J348
$$ -417 511 -367 -816 118 -240 -799 56 357 -457 -73 1171 254 -996 359 1018 -553 -387 961
1540I61n02r60N37K63p66K97O02j053j65J291o55j299J366J116j181m49J563q8
$$ 961 459 -501 36 299 -467 -170 432 -621 -786 505 -150 -1449 -83 1033 -148 -597 966 878
1558H78j382N29R03j035j25Q99q41o98J076K58j423M84J418p53j417J310O11j479
$$ 878 -504 25 928 -107 -232 667 -174 -872 204 462 -961 -477 941 188 -1229 81 692 -787
1576g87K50J233o11l42R30j76r84Q19Q92j592m42J736n83j864J096J220j284l86
$$ -787 -537 696 85 -257 673 497 -487 332 1224 -368 -810 926 343 -1521 -425 795 -489 -875
1594h75J205j1r96O58N73j037L33J259j056q58J591J11j554L18J405q26j304J141
$$ -875 330 319 -677 -19 554 -483 -150 1109 53 -805 786 897 -657 -339 1066 240 -1064 77
1612G7L22j336N19R37j050j04J342n24j178J091J072j351n66J699j73j569Q31
$$ 77 399 -937 -418 519 -531 -635 707 183 -995 96 1168 -183 -749 950 777 -792 39
1629C9Q62j101p6Q37o53o57Q74J39j333O33J354j178q29J658K44j336L19J168
$$ 39 901 -200 -276 561 -92 -749 125 264 -1069 -436 918 -260 -1089 569 813 -523 -204 964
1647I64o80p19Q65O4j127P45O75j311m8J324n68j268Q98R01j196l59J260j71r37
$$ 964 284 -435 430 494 -633 112 787 -524 -572 752 184 -1084 -186 715 -481 -840 420 249 -688
1666f88R01L66q53M52O94q87n35J105Q4j413L41J348j046q42J179J59j036K90
$$ -688 213 579 -274 178 872 -15 -550 555 639 -774 -433 915 -131 -973 206 365 -671 -381
1684c81O53m23k21O80l1q38Q49O60j233M9J179o23r47O01N31q02k46Q38k74p11
$$ -381 272 -151 -372 308 277 -561 288 948 -285 -236 943 320 -627 -26 505 -297 -543 295 21 -690
1704f90Q42R9q89N54P57r20l53R01K02r09J89J131n79o55P31j13o07L53O1n67
$$ -690 152 251 -638 -84 673 -247 -600 301 503 -406 -217 914 335 -320 411 298 -309 44 105 -462
1724d62Q5O11m71n89Q88N45r85rJ013l61o76M88K95l42j43M43k40l39N96j9q14
$$ -462 -377 234 -237 -826 62 607 -378 -387 626 265 -411 77 372 30 -113 330 90 -249 347 328 -486
1745d86N02L88p09k85N33R5m77J54M93r7k72N02j35k33M95m3o02J46M17l26n68
$$ -486 16 404 -305 -590 -57 38 -439 -285 208 111 -161 341 206 -27 468 425 -177 -31 386 60 -508
1766e08L65N41o21k29N61o3k11J20J4m5J35j5j45l2N48n7n92L89L83n27j62K48
$$ -508 -143 398 -223 -452 109 46 -165 -45 -31 -76 59 44 -101 -133 415 358 -234 155 538 11 -151 97
1788I7O9l23j23K54j70j09L35j56k42N04P8m08J23L58Nk73p6M22k10j86P0j37
$$ 97 166 -157 -280 -26 -196 -305 30 -126 -368 136 214 -194 -71 287 292 19 -57 365 155 -31 39 -98
1810i8J46N8l54o2K87J31l18j29M62J63n58Q1M41j35j17M6J55Q4j79j0q0J8J72
$$ -98 48 106 -248 -310 -23 108 -210 -339 123 286 -272 -191 250 115 -2 44 199 283 104 94 14 32 204
1833B04k32l06L41j03k07J11J01J03mj00K21J1m4J43k82N9L06k73j90J90J51r3
$$ 204 -28 -334 7 -96 -303 -192 -91 12 8 -92 129 140 96 239 -43 16 322 49 -141 49 200 107
1855A07l55J85K79k66k26J19O3R2j25j57L75O2j47j1J44K01j12l44L07O4l28m3
$$ 107 -248 -63 216 -50 -276 -157 -94 -2 -127 -284 91 153 6 -5 139 340 228 -116 191 255 -73 -116
1877a16N5Q8m3k11J40K2NQ1k14QK81m3j35J42P6M9p3l1J16p1p7n6j82J63M3k89
$$ -116 -61 27 -16 -227 -87 -65 -60 21 -193 -185 96 53 -82 60 136 185 112 81 197 126 49 -7 -189 -26 17 -272
1903b72P6K49j1j98j07L94k2l06K25J58j18L9r0L0J66j26j07j2Q8J1l22r7M36
$$ -272 -196 53 42 -156 -263 131 109 -197 28 186 68 107 17 47 213 87 -20 -32 56 67 -255 -352 84
1926H4j87j43J42Q3l1O3K6O3n7J39N9l51P3K85k85q0K33J10k14k03K16j2k15K08
$$ 84 -103 -246 -104 -21 -52 11 37 100 43 182 241 -110 -37 248 -37 -117 116 226 12 -191 25 13 -202 6
1950FJ7k23K67p6k21K13K94j85j83J85L25m45j91M69k01k23K15p1j48N1J33j30
$$ 6 23 -200 67 -9 -230 -17 277 92 -91 94 419 -26 -217 252 51 -172 43 -28 -176 -125 8 -122
1972a22o9K69N2l62J84L44l84l6M55j53k00Q5J65k40j46L38j45l67M12P0n27K10
$$ -122 -191 78 130 -232 -48 296 -88 -124 331 178 -22 63 228 -12 -158 180 35 -332 80 150 -377 -167
1994a67L97k73k38K90K11k73j24M63k39n9L09j43k89K89Q8l86j7K80%n11K14M72
$$ -167 230 -43 -281 9 220 -53 -177 286 47 -12 297 154 -135 154 242 -144 -161 119 119 -392 -178 294
2016B94m91j15N58j74k19K03O6k39N7L91j91m33N79J04o10J59M50m30k07K74L5
$$ 294 -197 -312 246 72 -147 56 122 -117 -60 331 140 -293 286 390 -220 -61 389 -41 -248 26 61
2037F1m00J05M00l17j24N87k08m54M94J98m55k1M78k20m21L26K41m50j2M41l30
$$ 61 -339 -234 166 -151 -275 312 104 -350 144 342 -113 -134 344 124 -297 29 270 -180 -192 249 -81
2058h1j72M20p1l77Q4M29k33l78O29Q2n49J86L99l58j61L69n2m30K39K48m52q5
$$ -81 -253 167 96 -281 -197 232 -1 -379 250 332 -217 -31 368 10 -151 218 166 -264 -25 223 -229 -314
2080c14O38l02m03M02K20m20p0M46j50k55K93J52l55P6M17m96p5M92r3n16K16
$$ -314 324 22 -381 21 241 -179 -249 197 47 -208 85 237 -118 -42 375 -121 -196 296 203 -313 -97
2101i7L35l35k51N19j7n27K64K84l62J12L77k19k97K65K61m23q9O23k45n75N21
$$ -97 238 -97 -348 171 154 -373 -109 175 -187 -75 302 83 -214 51 312 -111 -200 423 178 -397 124
2122A24J4m73J88K97k18j29K79K8m56K75M70m43q5M69k16l35K30K84k45j34K87
$$ 124 138 -335 -147 150 -68 -197 82 110 -346 -71 399 -44 -129 340 124 -211 19 303 58 -76 211
2143B11k0n55K69K17l54J13L42k60k03K84J16k47k3L61j66k74L68K8l87K47J56
$$ 211 191 -364 -95 122 -232 -119 223 -37 -240 44 160 -87 -110 251 85 -189 179 207 -180 67 223
2164B23k58r5K41m6l54K06L06l44q8L53r7k38J71K16j72m3K16j13j82J95J18l28
$$ 223 -35 -130 111 65 -289 -83 223 -121 -209 144 47 -191 -20 196 24 -19 197 84 -98 97 215 -113
2186a13J07K29l07j10J81J17k20m9K82j50j96K98M4k67K14J94k92N0J42n6k35
$$ -113 -6 223 -84 -194 -13 104 -116 -165 117 -33 -229 69 113 -154 60 254 -38 12 154 98 -137
2207a37J72J20j84q4J97j65j33K49q2j14MK33j17p4J75J10l13J91J88k23k5J05
$$ -137 35 155 -29 -113 84 -81 -214 35 -47 -161 -157 76 -41 -115 60 170 -143 48 236 13 -12 93
2229I3L8r1r4P4m6j26J81Nj56J14O9k35Q1J53Kr5K0J83j82p0K20j00p2R8mj67
$$ 93 131 40 -54 20 -26 -152 29 34 -122 -8 61 -174 -93 60 62 -33 -13 170 -12 -82 138 38 -34 64 60 -107
2255a07R7L4o6o0O1P4k05M3J47r2J28K2l5M8m1M9k5l0P2kk30R3P3j53k4J30l7
$$ -107 -10 24 -42 -102 -41 33 -172 -129 18 -74 54 76 41 89 48 97 72 42 114 112 -118 -25 48 -105 -129 1 -36
2282c6l5k8R1Jq1J62l2j02J29m5m4J04j3p8M0MPr3J2rm3K3N0l0ON0n0J3mJ36K1
$$ -36 -71 -99 -8 -7 -88 74 42 -60 69 24 -20 84 71 -7 33 37 44 -49 -37 -46 -89 -66 -16 -46 -40 10 -40 -27 -31 105 126
2313A26j47P7L2p1M4k1k7L5n3m7j4QN6J4j23J30o0l7P4M1L8n5L1J0k9m0J01Mp2
$$ 126 -21 56 88 17 61 40 13 48 -5 -52 -66 -58 -2 12 -111 19 -41 -78 -4 37 75 20 51 61 32 -8 93 97 25
2342B5L1n4l5ql2P8o6L6k9Qj5M1j6P1L1n0O9j9k7N3q2Q6p3p1K9M5l9l7l8L3O6
$$ 25 56 2 -33 -41 -73 5 -61 -25 -54 -46 -61 -20 -36 35 66 16 85 66 39 92 10 96 23 -48 -19 26 -13 -50 -88 -55 11
2373A1n4J1J7j5Q9m0kJ03l7p4N4jr3N0o3R7j20j2O8n4j5M3Kl7QN7L0M0m8L1l3
$$ 11 -43 -32 -15 -30 59 19 17 120 83 9 63 62 -31 19 -44 53 -67 -79 -11 -65 -80 -37 -35 -72 -64 -7 23 63 15 46 13
2404A3P8M0j63N0J5l8L3l4n9jmk6K8nP3m9N3L0m5L8M2o2J7J9Jk2l2L1n1l2j1N9
$$ 13 91 131 -32 18 33 -5 28 -6 -65 -66 -70 -96 -68 -73 0 -49 4 34 -11 27 69 7 24 43 44 22 -10 21 -30 -62 -73 -14
2436a4l9n4O6rK7p3N4N9q7J47n5M5l2N4Nr2LO1l5j5m6l0J1km4L6l8J19o5J5K0
$$ -14 -53 -107 -41 -50 -23 -96 -42 17 -70 77 22 67 35 89 94 2 5 66 31 16 -30 -60 -49 -51 -95 -59 -97 22 -43 -28 -8
2467hQ2k8O3m4n3nRO3q6j3qL6j7k1N5o5L5J3r2J50o6l6R6Rj6jK8K4m7pk1q1j2
$$ -8 74 46 109 65 12 7 16 79 -7 -20 -28 8 -9 -30 25 -40 -5 8 -84 66 0 -36 60 69 53 52 80 104 57 50 29 -52 -64
2500f4R7j12N7n1N1m6K8MO0mn9J57j04M0Rk2K1j6J6J7j03J9np8QO5J0m2l5nM8
$$ -64 33 -79 -22 -73 -22 -68 -40 -36 24 20 -39 118 14 54 63 41 62 46 62 79 -24 -5 -10 -88 -80 -15 -5 -47 -82 -87 -39
2531c9J4N1n2kQ4NJ6J2o6K8j7l1o8J9KkJ6j06J53r0R7J1m4M2n7J4O8j1K7J3r5
$$ -39 -25 26 -26 -28 56 61 77 89 23 51 34 3 -65 -46 -44 -46 -30 -136 17 -73 24 35 -9 33 -24 -10 58 47 74 87 -8
2562hJN9n8mL2l4J4k2m2K9k2%L3lJ0L7m5Q3n4N2m4K1QK4l9kp7m3J06p1J7l1lN3
$$ -8 -7 52 -6 -10 22 -12 2 -20 -62 -33 -55 -55 -22 -25 -15 22 -23 60 6 58 14 35 43 67 28 26 -51 -94 12 -59 -42 -73 -76 -23
2596b3m7j4J05j1o4J17j10R4QN8k7o1%k5j6pRN3j7p4j0J9M7m2QKN3j%k2L1q7J06
$$ -23 -70 -84 21 10 -54 63 -47 47 55 113 86 25 25 0 -16 -23 -14 39 22 -52 -62 -43 4 -38 -30 -28 25 24 24 2 33 -54 52
2629E2j8nj4L6l1k6j4n1N2m8P2l8Qk9M5j9M6N7n0Q9m5k8ol2M7p8M4qo0L6mm7N0
$$ 52 34 29 15 51 20 -6 -20 -71 -19 -67 5 -33 -25 -54 -9 -28 18 75 25 114 69 41 35 3 50 -28 16 8 -52 -16 -20 -67 -17
2662a7m8Q2rn3PN2k1K3K7l3M8o1M8jm2j5LNK3l4n4l1O4L2l9KL3m2Q9kO6n9K9l
$$ -17 -65 17 8 -45 -38 14 -7 16 43 10 58 -3 45 44 2 -13 -10 -5 18 -16 -70 -101 -37 -5 -44 -42 -9 -51 38 36 102 43 72 69
2696F9l3k5J1J1Qj11J06j32L0ol8R2jk8M5KOJ9NoL3o1J6O4j22J6K0K8K5j09j8
$$ 69 36 11 22 33 41 -70 36 -96 -66 -72 -110 -18 -19 -47 -2 0 6 25 30 24 57 -4 12 76 -46 -30 -10 18 43 -66 -84
2727h4l2M4L1K4kL3rM8o4M1kM1n2l9O0l2L9m1j3M4n7o9RN1J5k4jN8jm7L4mL3k9
$$ -84 -116 -72 -41 -17 -19 14 5 53 -11 30 28 69 17 -22 38 6 45 4 -9 35 -22 -91 -82 -31 -16 -40 -41 17 16 -31 3 -1 32 3
2761CmQ1l6n8RK2qm3m2P5m8mLN6k7l2N2O4o2L6Kpk1Q1m6L4j06mM9m4J6j4k1M9
$$ 3 -1 80 44 -14 -5 17 9 -34 -76 -1 -49 -53 -50 6 -21 -53 -1 63 1 37 39 32 11 92 46 80 -26 -30 19 -25 -9 -23 -44 5
2795EPq1pJ3J2P0m7J8P3j8J3Lq4Q8m0l0mn6O9K7r0Kn6M8J0N4j2L8k6m3O2k0O1
$$ 5 12 -69 -76 -63 -51 19 -28 -10 63 45 58 61 -23 65 25 -5 -9 -65 4 31 -59 -57 -113 -65 -55 -1 -13 25 -1 -44 18 -2 59
2828E9l4P2o4lj2Jl7O%m0K2o9K3P5m1M3J3m%M4n7P3n1j9M6p4P8Lm5M7o3m8L0n4
$$ 59 25 97 33 30 18 19 -18 -12 -12 -52 -30 -99 -76 -1 -42 1 14 10 10 54 -3 70 19 0 46 -28 50 53 8 55 -8 -56 -26 -80
2862h0L5PJ1l8J03n6N4L6q2O7l0PK9j7M6p5k1M3m5l4O5j21K6N4n1K9oL1OK7j8
$$ -80 -45 -38 -27 -65 38 -18 36 72 -10 57 27 34 63 46 92 17 -4 39 -6 -40 25 -96 -70 -16 -67 -38 -44 -13 -7 20 2
2893BO6n5RM5p9Q2q3MM2q0J4K2o5L3QJ3j2j4M4%l8O6J7k2N8k7m3L6J1k4m0k2M1
$$ 2 68 13 22 67 -12 70 -13 -9 33 -47 -33 -11 -76 -43 -35 -22 -34 -48 -4 -4 -42 24 41 19 77 50 7 43 54 30 -10 -32 9
2926In0l6J00n1k0nj9Q0rj0P0k1j7M9n2qN9j3k8j3m7O0p3M0Lp5M3P5j00J06o8
$$ 9 -41 -77 23 -28 -48 -53 -72 8 -1 -11 59 38 21 70 18 10 69 56 28 15 -32 28 -45 -5 -2 -77 -34 41 -59 47 -21
2957b1L4K6k0P8o0k6QM3r4R8m1l8J6j0k5M1j1jm7J5L9k3M0Nj6N1j6K2j3K3q8L8
$$ -21 13 39 19 97 37 11 19 62 -32 66 25 -13 3 -7 -32 9 -2 -3 -50 -35 4 -19 21 26 10 61 45 67 54 77 -11 27
2989B7k0J6l4J1Op6J8K2N4j5j6k1KL2k3NP5J6l7p7N1Mj9L1k7p9K3J2k2N1q4L8
$$ 27 7 23 -11 0 6 -70 -52 -30 24 9 -7 -28 -26 6 -17 -12 63 79 42 -35 16 20 1 32 5 -74 -51 -39 -61 -10 -94 -56
3021e6P3l9ML0l5J08r6N5K0r2O2k2k0M4l8m3R7n6o2Q7r6L5K7J9k8k7J6R5om1J2
$$ -56 17 -22 -18 12 -23 85 -11 44 64 -28 34 12 -8 36 -2 -45 52 -4 -66 21 -75 -40 -13 6 -22 -49 -33 62 56 15 27
3052B7n5J28n1n2K6p5nO4n8P0l3m7M3Kj04J07j8k3J24q5L3L2m1L2qn6J13j44K8
$$ 27 -28 100 49 -3 23 -52 -57 7 -51 19 -14 -61 -18 -16 -120 -13 -31 -54 70 -15 18 50 9 41 33 -23 90 -54 -26
3081b6M9q0O1kRk5o7QO0j8L5P2r1J1K2L2l1J7l3%k2M3Kp6K1J7k4O4j13O0M0o3
$$ -26 23 -57 4 2 11 -14 -81 -73 -13 -31 4 76 -15 -4 18 50 19 36 3 3 -19 24 26 -50 -29 -12 -36 28 -85 -25 15 -48
3113d8Q7mp8J08l6k9J7J3%J5o3O5p3m3P9m6k8QJ0K2OlJ7rJ9NK2M4K8j19N9J4m8
$$ -48 39 35 -43 65 29 0 17 30 30 45 -18 47 -26 -69 10 -36 -64 -56 -46 -24 -18 -21 -4 -13 6 11 33 77 105 -14 45 59 11
3146A1K2n0K5j4k6nk6J8M2%n4P0l0%O8o2j5P5p7J17r6L8K8l7K2o1j5L5p6L0M5
$$ 11 33 -17 8 -6 -32 -37 -63 -45 -3 -3 -57 13 -17 -17 51 -11 -26 49 -28 89 -7 31 59 22 44 -17 -32 3 -73 -43 2
3177Bk0l7R3j31N6K8n8J02K5mMn6N1n4KLll6K0q0N1N0j03O2R9j14Q4n9J7R2p7
$$ 2 -18 -55 38 -93 -37 -9 -67 35 60 56 60 4 55 1 3 6 3 -33 -13 -93 -42 8 -95 -33 66 -48 36 -23 -6 86 9
3208IJ2J4L6J0n3%L4r4nK8q4M0J0m9J16m3j5O6n2N0J7l4kM3j06J39m9m4M3r4P0
$$ 9 21 35 71 81 28 28 62 -32 -37 -9 -93 -53 -43 -92 24 -19 -34 32 -20 30 47 13 11 54 -52 87 38 -6 37 -57 13
3239A3pj2Lj4l5M6j6rM5k5O6k0k9R6j42P0L2o9Rkj6K4k0l2K5j2m0K2j7N8K2j5
$$ 13 6 -6 -3 -17 -52 -6 -22 -31 14 -11 55 35 6 102 -40 30 62 -7 2 0 -16 8 -12 -44 -19 -31 -71 -49 -66 -8 14 -1
3271aJ3l0QO8l3M6j6o8qQ0j16P8l8NO1p4K1J6l0j0L7n1N0lrJ05j37M3N5m0K2n0
$$ -1 12 -18 -10 58 25 71 55 -13 -21 59 -57 21 -17 -12 49 -25 -4 12 -18 -28 9 -42 8 5 -4 101 -36 7 62 22 44 -6
3303fL1k1n1N4on8J8J2m3M7K9l2M2m1L1P1o4J7L2p6J06j23L2P7q9K4l8J0M0n3
$$ -6 25 4 -47 7 1 -57 -39 -27 -70 -23 6 -26 16 -25 6 77 13 30 62 -14 92 -31 1 78 -11 13 -25 -15 25 -28
3333b8M0L2l2J1pj2j1N8n5Q5j09O4K8q8M9J8m4J7o8L7J7mp5P5m6R1p8k0J20p3
$$ -28 12 44 12 23 16 4 -7 51 -4 81 -28 36 64 -24 25 43 -1 16 -52 -15 2 -2 -77 -2 -48 43 -35 -55 65 -8
3363hM1K2j00Q5Ll4N2o0j4K8p9K5O6r8K4oL1M3p0K3J6m1K8om8R3K0q5N7j0l5N2
$$ -8 33 55 -45 40 43 9 61 1 -13 15 -64 -39 27 -71 -47 -53 -22 21 -49 -26 -10 -51 -23 -29 -77 16 36 -49 8 -2 -37 15
3395A5k5K6k2m6j6K9J5J3k4N3k0j9J7K5prL1o2Q8n8j1P0j04P7o2K9j3n3N9N9o4
$$ 15 -10 16 -6 -52 -68 -39 -24 -11 -35 18 -2 -21 -4 21 14 5 36 -26 62 4 -7 63 -41 36 -26 3 -10 -63 -4 55 -9
3426iJM0m4M7l6kM8n3jM8n6M1po3Q2n4J8Mo9J01J9r7K0M9p6Q6j4j0m8P1qpk7R4
$$ -9 -8 32 -12 35 -1 -3 45 -8 -9 39 -17 24 17 -46 36 -18 0 4 -65 36 55 -42 -22 27 -49 37 23 13 -35 36 28 21 -6 88
3460H8j02M5k5k9l5O5p0N9on0Q9r4J36l2q2Q6k5k6N3rk7M6j20P2K2q5M2Oj0N4
$$ 88 -14 31 6 -23 -58 7 -63 -4 -10 -60 29 -65 71 39 -43 43 18 -8 45 36 9 55 -65 7 29 -56 -14 -8 -18 36
3490C6q0j0K3M8l3P6j32P1R1p3L2l1m5O0o0ON1p5O5lm9N4r3M6J8p8R9k3mN0o3
$$ 36 -44 -54 -31 17 -16 60 -72 -1 90 17 49 18 -27 33 -27 -21 30 -45 20 17 -32 22 -71 -25 -7 -85 14 -9 -13 37 -26
3521b6O0K5n3j8M5n0J3K6n9J39j69O5l3j6L3k2nN8q8P7M7p6P4K3m0j2q4K0O7r
$$ -26 34 59 6 -12 33 -17 -4 22 -37 102 -67 -2 -35 -51 -18 -40 -45 13 -75 2 49 -27 47 70 30 18 -66 -46 21 12
3551A2L3q8j4O0l4PL0j7j1K7q0R3K1j00J27p4l3K8N7l7KJ9k8j5rJ5o0K1R1p2N
$$ 12 45 -43 -57 3 -31 -24 6 -11 -22 5 -75 18 39 -61 66 -8 -41 -13 44 7 9 28 0 -15 -24 -9 -69 -48 43 -29 -24
3582b4N3n6J8K8J3j7J7J5j8o8K8L2k6mk0K7on0M8k6K1M7j2o5Q2p5j6M1O4Lm4J3
$$ -24 29 -27 -9 19 32 15 32 47 29 -39 -11 21 -5 -9 -29 -2 -8 -58 -10 -36 -15 32 20 -45 37 -38 -54 -13 51 54 10 23
3614B3L1k7k2P1r7M1k8j9l0J7K9M0n4M4Mn6J6O5n1L9L8p4l0O6J3o2pP4j3j48J32
$$ 23 54 27 5 76 -21 20 -8 -27 -57 -40 -11 29 -25 19 23 -33 -17 48 -3 36 74 0 -30 36 49 -13 -20 54 41 -107 25
3645B5l9o9Q6j3l6N4NN1o5o2O5J2j8Q3n5l8Q0o8Q4n0p1M6r0N6O5r4mP9l0nK8m7
$$ 25 -14 -83 3 -10 -46 8 13 64 -1 -63 2 14 -4 79 24 -14 66 -2 82 32 -39 7 -83 -27 38 -56 -60 19 -11 -16 12 -35
3677c5L8kJ13j10L6mJr3N1J4o9P5l7M4p5J9J8J4j2M8lm1M2m8mK6k1J01p3OK8r5
$$ -35 3 1 114 4 40 36 37 -56 -5 9 -60 15 -22 22 -53 -34 -16 -2 -14 34 31 -10 32 -16 -20 6 -15 86 13 19 47 -48
3709d8j1J6J1j9L9m8M9%j8O5p2O5l9l8J01l8k5m0M0L5j6l1M3o9MR9o4J8k7l9P
$$ -48 -59 -43 -32 -51 -12 -60 -11 -11 -29 36 -36 29 -10 -48 53 15 -10 -50 -10 25 9 -22 21 -48 -44 55 -9 9 -18 -57 -50
3740e0M3K1Oq0J07m6PP3l9l6Pmm4O6o7M2%q0P3k1q4J14qo8Q4nkKn0J07j6l2LL7
$$ -50 -7 14 20 -60 47 1 8 81 42 6 13 9 -35 31 -36 6 6 -74 -1 -22 -106 8 0 -68 16 11 9 11 -39 68 52 20 23 60
3774F0j08R4q1K8O5j18O5L4o0L0j4L4n1MO0n4j3O1m0K2K6l6kk2m1Q4m0J0m8J1
$$ 60 -48 46 -35 -7 58 -60 5 39 -21 9 -5 29 -22 -18 42 -12 -25 36 -4 18 44 8 6 -16 -57 27 -13 -3 -51 -40
3804d0K0N2l0k4K5n5O7M0j2l4l7O5p0P7K5n0k2n5O7m3M6k6LL8l4K3rnJ0j4J5K9
$$ -40 -20 32 2 -22 3 -52 15 55 43 9 -28 37 -33 44 69 19 -3 -58 9 -34 12 -14 -11 27 -7 16 7 2 12 -2 13 42
3836D2j1M4K4p7oMm3J9L9j17P2l4K4K9n4L7l0K9K7Lk0N0o2L9J9Qq1K5OK9m3J4
$$ 42 31 75 99 22 16 20 -23 -4 35 -82 -10 -44 -20 9 -45 -8 -38 -9 18 21 1 51 -11 28 47 55 -26 -1 5 34 -9 5
3868EQm3L7ln5O3npl5L0L2rMP0r3L1k3MK5l6K5n6J1o9J07k9N2r1J2O9j03P8J6
$$ 5 13 -30 7 4 -51 12 7 0 -35 -5 27 18 22 92 -1 30 7 11 36 0 25 -31 -20 -89 18 -11 41 -50 -38 31 -72 6 22
3901B2k1L3K0o9M9Ll4J6l3Ojk7O5k4o2J7R3o2j2K0L8%m9JM1o8JN0r7R3L6n5N1
$$ 22 1 34 54 -15 34 37 3 19 -14 -8 -9 -36 29 5 -57 -40 53 -9 -21 -1 37 37 -12 -11 30 -38 -37 13 -84 9 45 -10 41
3934D1n1l7O6m2L5pl4L3mjO3m4L4k6k6P7j14M3J8K5m1Rk5j5M4l3L5l0J1Lj9M7
$$ 41 -10 -47 19 -23 12 5 -29 4 0 -1 62 18 52 26 0 77 -37 6 24 49 8 17 -8 -23 21 -12 23 -7 4 7 -12 35
3966C5Kl7J7j3K9J7n6N6j7qK3L3o6p4J4N7K8l8n9M0j8O6k2L9J5p4M7jj4J8L0n0
$$ 35 37 0 17 4 33 50 -6 50 33 25 48 81 15 -59 -45 12 40 2 -57 -17 -35 31 9 48 63 -11 36 35 21 39 69 19
3998A9n1K0JN5j4m8M0j9qoJ1L0l2OJ0L1j6n2qQ8r7J5M4k0J6pKo7J2K9j5lM4J3
$$ 19 -32 -12 -11 44 30 -18 22 3 -5 -11 0 30 -2 4 14 45 29 -23 -31 57 -40 -25 19 -1 15 8 10 -57 -45 -16 -31 -34 10 23
4032B3l5nK6oP6k5l4lj6Pj9J5j5nK6j5J5p1M5j8N7m4J8j7j2J5oN6m2J1N2n5j0
$$ 23 -12 -17 9 3 79 54 20 17 1 8 -11 4 -11 -16 10 -5 10 -61 -16 -34 23 -21 -3 -20 -32 -17 -23 33 -9 2 54 -1 -11
4065a1J6K4Rll3o6M7NJ1k0N4m0k1L3m0M3PL4m3n7O8m4QN6ko7R6j10P7o3MJJ0k3
$$ -11 5 29 38 35 2 -64 -17 -12 -1 -21 33 -7 -28 5 -35 8 15 49 6 -51 17 -27 -19 37 35 -32 64 -46 31 -32 -28 -27 -17 -40
4099d0M1L6m6M8r1R1o1P0l0j9K0M0j27M7M9qo4N4q1P1K2l6K5k9M8j1n8P1j8k1
$$ -40 1 37 -9 39 -52 39 -22 48 18 -1 19 59 -68 -21 28 20 -44 10 -71 0 22 -14 11 -18 30 19 -39 32 14 -7
4129gJ1PPl5l6R8q5O8Ko1m4N8k0QM0j0L5l9k7O5j17R2Lk3K4L0l4j8J5qM3o1N9
$$ -7 4 11 18 -17 -53 45 -40 28 30 -31 -75 -17 -37 -29 11 1 36 -3 -30 35 -82 10 13 -10 14 44 10 -8 7 -1 42 -19 40
4162D0m3N5o9j7J0K1L2p5J5O2k1L1Kk6Rk1j2O9j30O7m4M9Nm7rNM5no5K9N5K9Q
$$ 40 -3 52 -17 -34 -24 -3 29 -46 -31 31 10 41 43 17 26 5 -7 62 -68 -1 -45 4 9 -38 -47 -42 3 -2 -67 -38 17 46 54
4195E4n9J4l0K4o7P2j2nM3q4K6J8KkJ3MK9k6j6MJ6K8j6p2Q4J1l5k7M3l1K5J8l7
$$ 54 -5 9 -21 3 -64 8 -4 -9 34 -50 -24 -6 -4 -6 7 11 40 14 -2 2 18 46 30 -42 42 53 18 -9 34 3 28 46 9
4228Io4l4N5K6J1l9L4kK3J2Pprj1J3l4OmoKp1P0O9n2l4J9J8Mm5M3k5JO3%l5%J0
$$ 9 -55 -89 -34 -8 3 -36 -2 -4 19 31 38 31 22 11 24 -10 -4 -8 -14 -12 -83 -13 56 4 -30 -11 7 11 -34 9 -16 -15 48 48 13 13 23
4265B3J4o8RL2n5L2m%L5n1L3m6LM9k7K1l8%L3j1M0j3l1O3km3n1LP5p4qM1J3k4
$$ 23 37 -31 -22 10 -45 -13 -17 -17 18 -33 0 -46 -43 6 -21 0 -38 -38 -5 -16 24 11 -20 43 41 -2 -53 -50 25 -49 -57 -16 -3 -27
4299b7K8K0m5L3m1L3%mk1K1J9k2QO0q0j9M7n0P6m1lJ9J0m9M8n6j9Q7k9K2L8q0
$$ -27 1 21 -24 9 -32 1 1 -3 -24 -3 16 -6 2 62 -18 -37 10 -40 36 -5 -8 11 21 -28 20 -36 -55 32 3 25 63 -17
4331a7K9k5m0M8Kl9N6p6P0j2l5N0pl2k9j8M7J5M2J2M3k8q4O7Jm6j5L2j8K3j6q2
$$ -17 12 -13 -53 -5 -3 -42 14 -62 8 -4 -39 11 4 -28 -57 -75 -28 -13 29 41 84 56 -28 39 40 -6 -21 11 -7 16 0 -82
4363h2PQ1j8PK4N7o2k2K5J3O3q5L7k5k9J5j0QN4k7l9J5L7n4mM1p8Q1q2mL9J6k7
$$ -82 -75 6 -12 -5 19 76 14 -8 17 30 93 8 45 20 -9 6 -4 4 58 31 -8 7 44 -10 -14 27 -51 30 -52 -56 -17 -1 -28
4396b8J0J6J3pj9J1k4O2o3J1n1K6jL8J1%l9J4oO2n5K8l8NkJ8P4k4m0j6K3n9j3
$$ -28 -18 -2 11 4 -15 -4 -28 34 -29 -18 -69 -43 -44 -6 5 5 -34 -20 -26 36 -19 9 -29 -24 -26 -8 66 42 2 -14 9 -50 -63
4429f3O3M3o8J9%jL0J9o2M4LJ9l4Oj0L2l4K1n8J4N5n3j0N2k6l2J9k4K1L4k7J5
$$ -63 0 43 -25 -6 -6 -7 23 42 -20 24 27 46 12 18 8 40 6 27 -31 -17 38 -15 -25 27 1 -31 -12 -36 -15 19 -8 7
4461GlN7n1l5Q1q1P2k4k9Pj9j1J2kpN7m7K2k8j3k2M0m4J04o4k3Q8j9k5PpJ6m0
$$ 7 4 61 10 -25 56 -25 47 23 -6 1 -18 -29 -17 -19 -26 31 -16 6 -22 -35 -57 -17 -61 43 -21 -44 44 25 0 7 0 16 -24
4494b4k8L6j7JJM2N%k5qN0Qn0K9NNl0Rm3j2J16j7p6j0M1l3l5L2j0O0Oqn7j0O8
$$ -24 -52 -16 -33 -32 -31 11 16 16 -9 -17 33 41 -9 20 25 30 0 9 -34 -46 70 53 -23 -33 8 -25 -60 -28 -38 22 28 20 -37 -47 21
4529B1j1O9r2rK9k8j3R2n6l5K1%j3LJ0j5m7R0k6QO3m9K0l7L6l3M9k4kj0Nnp9L7
$$ 21 10 79 -13 -22 7 -21 -34 58 2 -33 -12 -12 -25 -22 -12 -27 -74 16 -10 -2 61 12 32 -5 31 -2 47 23 21 11 16 11 -68 -31
4563c1J5Ll1L8Ql7J6NOn7P0P3j01Q8k6m8m4Q5n2K0lL5j7n7Q4o5n0O1j5j5N5jJ7
$$ -31 -16 -13 -44 -6 2 -35 -19 -14 -8 -65 5 78 -23 65 39 -9 -53 32 -20 0 -3 32 15 -42 42 -23 -73 -12 -27 -42 13 12 29
4596B9J3J0l2k3L6l7K7n4N2JLJk6j5%K9lm1Ml3L1O6o9M2J8n7P0J6n9K%k0k2N1
$$ 29 42 52 20 -3 33 -4 23 -31 21 22 25 26 0 -15 -15 14 11 -30 -26 -59 -28 38 -31 11 29 -28 42 58 -1 1 1 -19 -41 10
4630A0ml2M4j2k8RL9M3j09L1L3m4O7p8L3jL7o7O7l2M8j09N5L7l8l9O7p2J9L1N
$$ 10 6 -26 18 6 -22 -13 26 69 -40 -9 24 -20 47 -31 2 1 38 -29 38 6 54 -55 0 37 -1 -40 27 -45 -26 5 10
4661A0L5j08M4K2K5K2n3j9N7r7P3L6l9n3L9P3l6o0O2%l5kJ7j9K2n6M3l6L5J4j9
$$ 10 45 -63 -19 3 28 50 -3 -22 35 -62 11 47 8 -45 -6 67 31 -29 33 33 -2 -4 13 -6 16 -40 3 -33 2 16 -3
4692co3P0l0m3P7mo0L0K0nJ1o0N2J5n1P0n7K6O5o4L7k3L9k8Nn4J6K6n5J2J0J0
$$ -3 -66 4 -26 -69 8 4 -56 -26 -6 -11 0 -60 -8 7 -44 26 -31 -5 60 -4 33 10 49 21 26 -28 -12 14 -41 -29 -19 -9
4724iK2Lo4O7m9J1K9o1O5n1L0J4j1JN4n1j2p0oP8j3jL5pl2j0j2N7mN5n0rK3n0
$$ -9 13 16 -48 19 -30 -19 10 -51 14 -37 -7 7 -4 -3 51 0 -12 -82 -88 -10 -23 -24 11 4 -28 -38 -50 7 3 58 8 -1 22 -28
4758b8K5J7J8o7L9m0J29j20L8O6n8l8lPk3M3m8M2L1p1L8N2o8M7o2j4O4r8J25l6
$$ -28 -3 14 32 -35 4 -36 93 -27 11 77 19 -19 -22 -15 -38 5 -43 -1 30 -41 -3 49 -19 28 -34 -48 16 -82 43 7
4788GK6Qq2P6m4J7m2K0Rj8J9pQL1l7N4ml4p8O0J7l5K0L4m0N1j3K6n6j7l8Q6m1
$$ 7 33 41 -41 35 -9 8 -34 -14 -5 -23 -4 -11 -3 28 -9 45 41 7 -71 -11 6 -29 -9 25 -15 36 23 49 -7 -24 -62 24 -17
4821a7J3OrN1qo0J2Ljl6K5N6j5k7j1k0Q6m2J8nl9l9O0L2n9P3o4l3R2m1l8L7l0
$$ -17 -4 2 -7 44 36 -24 -12 -9 -10 -46 -21 35 20 -7 -18 -38 48 6 24 19 -20 -59 1 33 -26 47 -17 -50 42 1 -37 0 -30
4854c0K2j0l9L7P4j01R8o3L0k6j0O8m8m2J05l1j4Pk3K9J4l3l3j4M1koj7qJN8p
$$ -30 -8 -18 -57 -20 54 -47 51 -12 18 -8 -18 50 2 -40 65 34 20 27 4 33 47 14 -19 -33 8 6 0 -17 -25 -24 34 27
4886B7j9m8K6JL7j5lj7rM3j3j03L2M1M7o8K9j1L2j0OJ4k7L8J3o1J1l7M7k2N7l0
$$ 27 8 -40 -14 -13 24 9 6 -11 -20 23 10 -93 -61 -20 27 -41 -12 -23 9 -1 5 19 -8 30 43 -18 -7 -44 3 -19 38 8
4918Hl9L0M4m0j4M1Opk1j1L6p6L6j73N1K63k10J16l2Lj7O9n8J7m1J8J7Ok8K9q8
$$ 8 -31 -1 43 3 -11 30 36 29 8 -3 33 -43 -7 -180 -129 134 -76 40 8 11 -6 63 5 22 -19 -1 16 22 -6 23 -65
4949f5RM2pK9Kj9J0l4Q9j4pll1K1J6j9l9klOJ0j8Lm6P3jk8kj6K9J6M0p9QJ6k8
$$ -65 -56 -14 -21 8 10 -9 1 -33 56 42 35 32 1 22 38 19 -20 -22 -25 -19 -9 -27 -24 -70 3 2 -26 -28 -44 -15 1 41 -38 -30 -14 -42
4985d2K2k8J1L7j7QM5m9Jm7M9J8l1N1n4N2k2L5j9m0K7j0L2j01O7N1l3p8P9k1J4
$$ -42 -20 -48 -37 0 -17 -9 36 -13 -12 -59 -10 8 -23 28 -26 26 4 39 20 -20 7 -3 29 -72 -5 46 13 -65 14 -7 7
5016GK1rk5k9%N2J3rmKm5JOnj2N6p6M9l1L2rrK3kj2KO5r3rR9p7K6L2p6P5l8KK3
$$ 7 28 19 -6 -35 -35 17 30 21 17 19 -26 -25 -19 -24 -36 20 -56 -7 -38 -6 -15 -24 -1 -3 -15 -13 52 -41 -50 49 -28 -2 30 -46 29 -9 -7 16
5054A6Pln1qL6m8L2K3J0m0N2m8M6pj0k3l9L7O0p5O4rJ6l5m6O2l4N3q1O7l0RK8
$$ 16 23 20 -31 -39 -3 -51 -19 4 14 -26 26 -22 24 17 7 -16 -55 -18 42 -33 31 22 38 3 -43 19 -15 38 -43 24 -6 3 31
5087C1m6l0O2l4Q2j6l7o8%R6k9p6P1knq2K3L8n3N4L2K5k2J7L6j11R2J2q2Rj7m1
$$ 31 -15 -45 17 -17 65 49 12 -56 -56 40 11 -65 6 4 -1 -83 -60 -22 -75 -21 11 36 14 31 67 -44 48 60 -22 -13 -30 -71
5119g1M5K3J0J7nlj7K2nM2m5n4O1k6K2l4O5j12N9O0q0L6R%k0Qk8j5M8p4K1L5m9
$$ -71 -26 -3 7 24 19 16 -1 21 16 58 13 -41 20 -6 16 -18 47 -65 -6 54 -26 10 19 19 -1 7 -21 -36 12 -62 -41 -6 -55
5152e5Q2l0N5n6K3jk0oJ5j8M6m2pL4lP1j00l0M5j2QJ7pn2O0rm9M1J02r4l7K3K2
$$ -55 27 -3 52 -4 19 18 -2 -8 7 -11 35 -7 -14 20 17 88 -12 -42 3 -9 -1 16 9 -43 17 8 -41 0 102 8 -29 -6 16
5185A6RNJ5p1K9J1j3j7%j9K1k1N9LL6mp7L3qn5P8Qo5M5k7m2O8j5qL4l6K7J2j5
$$ 16 25 30 45 -26 3 14 1 -16 -16 -35 -14 -35 24 27 63 59 -18 15 7 -48 30 38 -27 18 -9 -51 17 2 -6 28 -8 19 31 16
5219A6m3R0o5oJ5J2K5k9Pl2l1K4L3o7MP5p3P5m3J0J6o8P4j3m3L2j9pN8l3Nk9L4
$$ 16 -27 63 -2 -8 7 19 44 15 22 -10 -41 -17 16 -51 -47 28 -45 30 -13 -3 13 -55 19 6 -37 -5 -24 -31 27 -6 -1 -30 4
5252DK8j8j6LJ0j9Ok6M1l4RJ4jj5K4k4P2j2j9Ql6j0M7j7k5Ql7K0q0N6M0m7PN1
$$ 4 32 14 -2 1 11 -8 -2 -28 13 -21 -12 2 1 -14 10 -14 58 46 27 35 -1 -11 36 19 -6 2 -35 -15 -95 -39 1 -46 -39 12
5286A2m6M4m2QO8m1k3M7Nl0K0oL4m3k2l0L8J4M9j25J5L8Qk8L2J0J9n4L3m2K1J8
$$ 12 -34 10 -32 -24 44 3 -20 27 32 2 22 16 50 7 -15 -45 -7 7 56 -69 -54 -16 -8 -36 -4 6 25 -29 4 -38 -17 1
5318Ak6PM3o3K9L0n0N5l0l4L4l7qL4l5M2%L3n9L8L9J3q3K3Kk0M0K4o2L8k7MJl2
$$ 1 -25 -18 25 -38 -9 21 -29 26 -4 -38 -4 -41 -49 -15 -50 -8 -8 25 -34 4 43 56 -27 -4 -2 -22 18 42 -20 18 -9 -5 -4 -36
5352c6N5k3k3O7k4o5M0l9rJ02n3qK4J1MPo1J3j0L8j5k7M8K2n4P6p1j3N3j6K1j0
$$ -36 19 -4 -27 40 16 -49 -9 -48 -57 45 -8 -16 8 19 23 30 -31 -18 -28 10 -5 -32 16 38 -16 60 -11 -24 29 13 34 24
5384B4N5n7K0o9N1M4r4nJ2N4K6m4l2J2k7O5m2O3pj09L9k1K2J6mmM5m0kj9K7k6
$$ 24 79 22 42 -27 24 68 -26 -31 -19 35 61 17 -15 -3 -30 35 -7 56 49 -60 -21 -42 -20 -4 -8 -12 33 -7 -9 -28 -1 -27
5416b7J7Ok9J7L7m8Rj0K3QL8k9m2K5qK6l7K1J2l6KjL7M2Rr6L1J8J3j2J4ll1K5
$$ -27 -10 -4 -33 -16 21 -27 -18 -28 -5 3 41 12 -30 -5 -13 13 -24 -3 9 -27 -25 -26 11 53 62 -34 -3 15 28 16 30 27 -4 21
5450B1q4J07om8J2J1NK3l7j8pMN7p8N6l2nM9l9l4K4J9l1kO7k21L74j01m6p4J29
$$ 21 -63 44 38 -10 2 13 18 41 4 -14 -21 -17 40 -38 18 -14 -19 30 -9 -43 -19 0 -31 -33 34 -187 187 86 40 -34 95
5481I5j44K7K07k90L60j33j43O5j32K03m1j18N8j5n9O1K1p0O2p0M9PN4j2k2Qq
$$ 95 -49 -22 185 -105 255 122 -21 44 -88 115 74 -44 14 -1 -60 1 22 -48 14 -56 -7 0 54 42 20 28 20
5508B0k3k6M1j5N7n3m1M0L7o7M7Qo1K1l9Q6m2k2jj7N5k0P4p4rL5J0m8L1K6k5n
$$ 20 -3 -29 12 -3 54 1 -40 0 37 -30 17 25 -36 -15 -54 32 -10 -32 -33 -50 5 -15 59 -15 -24 11 21 -27 4 30 5 0
5540@P0o8l0O1p2R3l1Ln6KK1kj6N7Ll2KmJ9n1N7nj1J4%q3M4j2K0lK9k6L3k6k6
$$ 0 70 2 -28 33 -39 54 23 26 -30 -28 -7 -9 -25 32 35 3 5 1 20 -31 26 21 10 24 24 -59 -15 -27 -7 -10 19 -7 26 0 -26
5575b6L9qpK2l1kL7p0P7m6J5j0N5j8j9l5J6J9m5M6N3n3MKQm0J3n1M7K5k2L6m5
$$ -26 13 5 -2 20 -11 -13 24 -46 31 -15 0 -10 45 27 8 -27 -11 8 -37 9 62 9 13 15 23 -17 -4 -55 -8 17 -5 31 -14
5608a4jN7l2j9J9K2q2N0pq3O7J6N5l0l6k3LL5pL3np%L7n0nPqJ8k2L6J4j5l2J9
$$ -14 -15 42 10 -9 10 32 -50 0 -7 -90 -23 -7 48 18 -18 -41 -38 -3 -10 23 18 11 11 48 -2 -7 0 -8 10 -12 24 38 23 -9 10
5643A0n3O7k2l4N4m0O5%m5L6K3n7K2J2qk3mrn9N8J8k4K8jk7Q1p0mL6l1l5O3K1
$$ 10 -43 24 2 -32 22 -18 47 47 2 38 61 4 26 38 30 7 3 -6 -65 -7 11 -13 15 14 -13 68 -2 -6 30 -1 -36 27 48
5676D8o1qM5l7q9R1N8p0L6K6j1Kl6n0P3k8K1qK7k6j7L5Ql3J0L6kl0J8j7J5n5n5
$$ 48 -13 -21 24 -13 -102 -11 47 -23 13 39 28 30 -6 -56 17 -11 10 2 29 3 -14 21 29 -4 6 42 40 10 28 11 26 -29 -84
5709h4M9L7K0k8K7K1jj2mj0J0K8o6M6n0M6rm2l5Q9l1L5Ll6l1L5j0lj5L6J0K4m5
$$ -84 -35 2 22 -6 21 42 41 29 25 15 25 53 -13 33 -17 29 20 -22 -57 32 1 36 39 3 -28 7 -3 -6 -21 15 25 49 4
5742Dk4M2m2l3O4%l9j1M6J4q2L8lJ3N6o8nM1O2m6k5K5m2jK9j6n4K5P4m0j5l6N
$$ 4 -20 22 -20 -53 11 11 -28 -39 7 21 -61 -23 -26 -13 43 -25 -30 11 73 27 2 27 -15 -16 13 -3 -57 -32 42 2 -13 -49 -44
5775d4M1j08J01j6J5M8Qk1k2L2l2oj3j7O4j7K9lqn6P3n7j1K8k0J4M5m3K7l2M2
$$ -44 -3 -111 -10 -26 -11 37 45 24 2 34 2 -4 -17 -34 30 13 42 39 31 -25 48 -9 -20 8 -12 2 47 4 31 -1 41
5806D1l5M3l9J6qk6M1nl0L1l1j0N0n3l7L1kJ4j5M5%J2l8N8l9nM4k5k3l7K9J9n2
$$ 41 6 49 10 26 18 -8 33 28 -2 29 -2 -12 38 -15 -52 -21 -23 -9 -24 21 21 33 -5 53 14 9 53 28 5 -32 -3 16 -36
5839c6O2j4r3R3n4M4K2m3L7k7L4Ql9L5l1k0K0o2M5M6o8J05q2j4K5L1n7K7L3on1
$$ -36 26 12 -81 12 -42 2 24 -19 18 -9 25 33 -6 29 -2 -22 -2 -64 -19 27 -41 64 -18 -32 -7 24 -33 -6 27 21 -30
5870c0K9mL1l6%jM5m7N9l3n1L1L0m5lO9o8P2m4k8l4R0j5k8m3N2qK5k0jMj7j6k
$$ -30 -1 -5 26 -10 -10 -11 34 -13 46 13 -38 -7 23 -22 -25 44 -24 48 4 -24 -58 32 17 -11 -54 -2 -10 15 -5 -6 -2 -19 -35 -37
5904c7N5n4m6Q4j3m7M0N1k9NK2n5lJ7n4O0P1o3K9m2L6K0n2M2M3p9mJ5rJ8m7L3
$$ -37 18 -36 -82 2 -11 -58 -18 33 4 9 31 -24 -27 -10 -64 -4 67 4 33 -9 27 47 -5 37 80 1 -3 12 3 21 -26 7
5936Gk2OJ3l9Q1l1k4J5P7l2m9kl8M5l7N4j9m2J14p4Rj8K6j3m1K8k5N9o9N5j1j1
$$ 7 -15 -9 4 -35 46 15 -9 6 83 51 2 0 -38 7 -30 24 5 -37 77 3 12 -6 20 7 -34 -6 -31 28 -41 14 3 -8
5968hN5l7ml6j5J06n9K9qRj3L1k6j0Qn3j6L8JN0o0J7On9J0R3m5jrKK2k3L0p2J00
$$ -8 47 10 6 -30 -45 61 2 31 23 32 19 50 24 14 22 -31 -47 -9 -8 42 -18 -1 5 -54 -44 49 4 3 -6 -4 18 -5 25 -47 53
6003E3o8j2N2Jn3Q7r0k8P5k1J01j66O8p8Q7j3m6O4Ork8K4m6P3m8l8N0J0k6m7K2
$$ 53 -15 -27 25 26 -27 60 -30 -58 17 -4 97 -69 -1 -79 8 -5 -51 13 19 10 -18 6 -40 33 -15 -53 -3 7 -19 -66 -44
6034d4K4k4O2Mk1j2J2J0k1L9l5M7j4m2L9Kk2L4l9J2J3M4q6l7N6Mqn1Q8m0qRNL1
$$ -44 -20 -44 18 22 1 -11 1 11 -10 29 -6 41 27 -15 24 26 4 38 -1 11 24 68 -18 -55 1 5 -3 -54 34 -6 -14 -5 0 31
6068C1k6k9J8j7N6o2K1K7j4m2K6K3k2j4K8Jl9M8pj4lno4M7J5RM0o5L6qK0nJ1m2
$$ 31 5 -24 -6 -23 33 -29 -8 19 5 -37 -11 12 -10 -24 4 5 -34 14 7 -7 -10 -15 -79 -32 -17 -8 32 -33 3 -5 15 10 21 -21
6102b1J0L9l0K8m7rN2l2j1K7j1O8q2J2J5j0O8q3M7l1m6K0K1K6k9N1q3P8m0J9J8
$$ -21 -11 28 -2 26 -21 -30 22 -10 -21 6 -5 63 -19 -7 8 -2 66 -17 30 -1 -47 -27 -6 20 -9 42 -41 37 -3 16 34
6133C4m9K9K1m9m5R1J9l7K5kn7K9l1K6po3Q2j5K4Lj3k1k4j0K4J7km4K7K9K1m0
$$ 34 -15 14 35 -14 -59 32 51 14 39 37 -20 9 -22 4 -3 -66 16 1 25 28 15 -6 -30 -40 -16 1 -1 -45 -18 11 32 -8
6165hJ4l7Q7p6j7Q6k6m5j7j0O9n7kJ9K8n1O0Ql8J9j9L8j1j8k0M4k6L7l0N0j19
$$ -8 6 -31 56 -20 -37 49 23 -22 -39 -49 20 -37 -39 -20 8 -43 17 25 -13 6 -13 25 14 -4 -24 20 -6 31 1 51 -68
6196f8M7J0k8Q7q5jRM0Pmk3J2J6j01J37o1J1L8m4J8n1J8M0k3qN4j4k8K2J2m0m
$$ -68 -21 -11 -39 48 -37 -38 -29 11 18 14 -9 3 19 -82 55 -6 5 43 -1 17 -34 -16 24 1 -7 47 33 5 27 39 -1 -5
6228eJ3k3Kj6MK2RNn7P3l0K6j8k6P3m3j1OLm0J4J2L3n4O8ql1m6K6M3J5o8J25L15
$$ -5 8 -15 -13 -29 -25 -3 6 11 -46 27 -3 23 5 -21 52 9 -2 4 7 -33 -19 -7 26 -28 40 32 1 -45 -19 24 39 -29 96 411
6262D11m59j44j26L10J13j77R1M9M9l56L40k24J34J9O9J78j96%j39J12k83J83
$$ 411 -48 -192 -318 -8 105 -72 19 68 117 -239 101 -123 11 30 99 277 81 81 -58 54 -229 -46
6284d6o1jJ28K2k12L16j74M5p4N9l2L2mj6Rk2k7M1l0N4K%lL1m1OO6j06M2k0L2
$$ -46 -107 -108 20 42 -170 146 -28 17 -57 2 -30 2 -2 -18 -9 -31 -58 -17 -47 7 9 9 6 37 -4 2 68 -38 4 -16 16
6315A6n7K2K1m3M0K5l2L2k5Jp6L8O1l9K3k1mk4R1l7n4J1M8rk7M3k3oP7n3K0p5
$$ 16 -41 -19 2 -41 -1 24 -8 24 -1 0 -76 -38 23 -16 7 -14 -18 -42 49 12 -42 -31 17 8 -19 24 1 -5 72 19 39 -36
6347c6M3N4o6L6m6j2L6j0J0L8j13Q8n2OnPNM2j4m1L8K1Ql8N1n2MK1Lm7L6mJ7n0
$$ -36 7 61 -5 31 -15 -27 9 -1 9 47 -66 22 -30 -24 -29 -22 -17 25 11 -30 8 29 37 -1 50 -2 2 23 26 -21 15 11 28 -22
6381b2N1Jk3m4J7L2m2qP1m4JOK6qk1k2J3l9P6N0j12P5m3N7m9Mk1jK3J6mp2Q0J8
$$ -22 29 30 7 -37 -20 12 -30 -38 33 -11 -10 -4 22 14 -7 -29 -16 -55 21 71 -41 34 -9 48 -1 3 -18 -19 4 20 16 -56 24 42
6415D2n0N9k9l0J4K0n8P1l2k3j0lR4n8l7L6J5JJ8k2o0R0j2l7M4p5J6L0Qj8JPJ5
$$ 42 -8 51 22 -8 6 26 -32 39 7 -16 -26 -29 65 7 -30 6 21 22 40 18 -42 48 36 -1 43 -32 -16 14 22 4 5 12 27
6448B7j01O7j7K0k2J0Kn6P5m3K2K1k4o4N5N3m8nPo5Q9pj5L4J3Nnq3J07l6L5n3
$$ 27 -74 -7 -24 -4 -26 -16 -14 -70 5 -38 -16 5 -19 -83 -28 25 -23 -28 -21 -86 3 -4 -19 15 28 33 28 -55 52 16 51 -2
6480b%k1M5l1o9L5L7k1k5J0L7m4Q4o1LK1j3n5P7o8O6mJ4L1n1%J4o2N5m0P4o8K2
$$ -2 -2 -23 22 -9 -78 -43 -6 -27 -52 -42 -5 -49 35 -26 -23 -2 -15 -70 7 -61 5 1 15 46 -5 -5 9 -53 2 -38 36 -32 -10
6513a0K8j9Pk4N7k7jq3J11l7M4m8rk2J9K8j5N3p7O2l1Kj7Nl4M8J9m3O5o9RQL9
$$ -10 18 -1 6 -18 39 12 11 -72 39 2 46 -2 -11 -33 -14 14 -1 52 -25 37 6 8 -9 -4 -38 10 29 -14 51 -18 -9 -1 38
6546C8o4M7l5k2K7J9K8j9RJ6kN9n1o0n5Q0j9J8K1J5m4rRlj2k6M8k7J1J3kqL3o0
$$ 38 -26 21 -14 -36 -9 10 38 19 28 44 42 101 50 -10 -65 15 -4 14 35 50 6 -3 6 3 -9 -35 13 -14 -3 10 8 0 33 -27
6580b7lN5j8ok9L4k3M2J1n7J8k2O0JMrj3j8jk8O8k7j6L7l8Nj6LM9m4jqK8l0OP0
$$ -27 -30 25 7 1 -28 6 -17 25 36 -21 -3 -25 35 36 40 31 18 0 -1 -29 39 12 -4 33 -5 0 -16 -13 36 -8 -9 -17 11 -19 -13 57
6616E7o0RoL3l8k0L0o5P3lk8m2N2m1L6J5k3L9k2l5KJ9kOrL3K9o4O5k7j9M2j6k3
$$ 57 -3 6 0 33 -5 -25 5 -60 13 10 -18 -60 -8 -49 -13 2 -21 18 -4 -39 -37 -18 -20 -14 -23 10 39 -25 40 13 -6 36 20 -3
6650cmnM4k6n0L6j9L2K3j6m5L4jk1L2m2J0lM2k6N%m4OL0K2j9L5k8L1L1o5J1qL2
$$ -3 -7 -12 32 6 -44 -8 -27 5 28 12 -33 1 0 -21 11 -31 -21 -24 18 -8 -3 -3 -47 -41 -11 11 -8 27 -1 30 61 -4 7 -1 31
6685C1o9M6J9j7m5rK2j1N8k0j3k2J8kJ3l1P0k6p0Q3o0J7K4M7o0N3n3K3n1O7Nr
$$ 31 -38 8 27 10 -35 -44 -22 -33 25 5 -8 -30 -12 -14 -1 -32 38 12 -58 25 -35 -18 6 53 -7 46 -7 16 -35 32 37 28
6717B8l5K2p5P9J2o4R7q9K2K8K2o8M0k2M1l5n6O3Ml1k3N2n2L9no7J5L6j1L0L5
$$ 28 -7 15 -60 19 31 -33 64 -25 -3 25 47 -21 19 -3 38 3 -53 10 14 -17 -40 12 -40 -1 -6 -73 -58 -22 -33 -3 32
6748C2n3K6m6QK2k2J7K8Oo3L1L0RJ2m9j3M8p2P4j5n4O9n0M8l4MK6p3P9l4L3n3
$$ 32 -21 5 -41 -33 -11 -33 -16 12 18 -45 -14 16 25 37 -12 -25 23 -49 25 10 -44 25 -25 23 -11 -7 19 -54 25 -9 24 -29
6780b9L7No4N2j4J2L0K3Jp3L1p6N2l7O4o9O0M0m8j4k9R4J7k4o9L8j1J8j4rM3%
$$ -29 8 13 -51 1 -13 -1 29 52 53 -20 11 -65 -13 -50 14 -55 5 45 -3 -17 -46 48 65 41 -28 10 -1 17 3 -6 37 37
6812C7j5J8J1n2K4q2Q8o8j5Q0l2J5M0j02kR0r0P8q7O1Q7q3k6K1j7K5L2m7L5l2
$$ 37 22 40 51 -1 23 -59 29 -39 -54 26 -6 9 49 -53 -55 35 -55 23 -64 -3 84 1 -25 -4 -21 4 36 -11 24 -8
6842hJ3ok7J6N1Mp8J9J6L2j9J4lk2Rp9P8M8l1Pp5L5qL7k6N4p7l0Q9l6m0N5l1N9
$$ -8 5 -1 -28 -12 39 43 -35 -16 0 32 13 27 24 2 11 -68 10 58 27 34 -41 -6 -14 23 -3 51 -26 -56 33 -3 -43 12 -19 40
6876D0l6o2R6r1j4R0m1N7o8kK9L9lo1N4OKk1k5m0K9K6J3j5k7L5n6L1Kj5L7o5O4
$$ 40 4 -58 38 -53 -67 23 -18 39 -29 -31 -2 37 34 -27 27 33 35 14 -11 -51 -22 4 17 2 -25 10 -46 -15 -13 -28 9 -56 8
6909Hn3M9L9o3PO9l9J2n4PJ3j9K7K7n5JN2k4l6J7K6J1j9Kn5L7K4N9n2nj2J1l1
$$ 8 -45 4 43 -20 -13 56 17 29 -25 -18 -5 -24 3 30 -25 -24 28 4 -32 -15 11 22 3 5 -50 -13 11 70 18 13 1 12 -19
6942a9K2j6J6J9nK2j9k1J6j1P3j40QO5OJ4l9nL9L2o2n3N9o6L2JJ4N6p4O1l3K4
$$ -19 3 -13 3 22 17 39 20 -1 15 4 77 -63 -55 10 16 30 -9 -14 25 57 -5 -58 1 -65 -33 -32 -18 38 -36 25 -8 16
6974A6PKn3LQ1o0o3O8l7O4K4p1M3Nn4K6kl6KL0NK4l8J8M2l7mjM6n5qL3L5j5K2
$$ 16 23 25 -28 -25 56 -4 -67 1 -36 28 52 -19 24 29 -25 1 -1 -37 -35 -5 0 24 -14 4 46 9 5 4 50 -5 -13 20 55 40 62
7009F2q9K9oK9l6J8J9L9j11L1l5N2qk5%J4J4J0k4LJ9J6j0m7M5Rom1J4l1L6n0N3
$$ 62 -27 2 -4 25 -11 7 26 65 -46 -15 -50 2 -6 -31 -31 -17 -3 7 -17 -14 5 21 11 -36 9 18 12 -29 -15 -46 -10 -60 -7
7042gK7j5pK9l9l0M5j2k7M0MrlJ5Pj9mk7O1l0lkK5j9L3l3L5o0l3M8l4j2L5KRl3
$$ -7 20 5 -2 27 -12 -42 3 -9 -36 4 8 -1 -4 11 18 -1 -5 -32 29 -1 -4 -6 19 0 33 0 35 -25 -58 -10 -44 -56 -21 -19 -10 -43
7078d3N9qJ7k9k0P5j24O7QNK8m0nmmJ6J6J4k2L9p3JNL7r0J00Jmrj5j4jO6k8m0
$$ -43 16 8 25 -4 -24 51 -73 -6 2 7 35 -5 -10 -14 -18 -2 14 28 6 45 -28 -27 -22 15 -75 25 26 22 13 -2 -16 -17 49 21 -19
7113a9M8m4Mm0M2j3L0l3k7O0L2n2K6j5m9M9l5K8J4k5m7J26l6l9j3K1L8JP%Jm7
$$ -19 29 -15 -11 -51 -9 -22 8 -25 -52 8 40 -12 14 -1 -50 -1 -36 -8 6 -19 -66 60 24 -15 -28 -7 31 32 39 39 40 -7
7145gM6n5OL1k1M3K0q7L3n1M8nk0K0Pm2MrL6Rn3N2J3J4l0L1n5l6N2m2N8k5oM4
$$ -7 39 -16 -10 21 0 43 63 -24 9 -42 6 1 -19 1 8 -34 -30 -39 -3 6 -47 5 18 32 2 33 -22 -58 -6 -48 10 -15 -21 23
7179B3m6J0M8l1K0n0L1L2m2j9K1K7n4m0M8M2n6R9l0Lj3n7O8ll4J8l3kk6N3J5r
$$ 23 -23 -13 35 4 24 -26 5 37 -5 -24 -3 24 -30 -70 -22 20 -36 63 33 36 23 -34 34 31 -3 15 -18 -20 -46 7 22 13
7211A3k6r1R9J65j72R9J10l58L10o8m2K8m8j23P9k17K39J94k02K60K7k75J18o8
$$ 13 -13 -104 -5 160 -12 87 197 -161 149 81 39 67 19 -104 -25 -242 -3 191 -11 249 276 1 119 51
7235E1j47J52P2K5j39n0O5n75L35J28P6j33k29L84O8r2L3r9R8k0k7N2Mp6NO9L
$$ 51 -96 56 128 153 14 -36 29 -546 -211 -83 -7 -140 -369 15 83 -9 24 -75 23 3 -24 28 32 -44 -39 30 33
7262C3l8PJ3n2j1N4k7ML0k8j1%J9LNL0k1j5%L6o8j5O5jk1l4K1QMJ6J8%p2j0L1
$$ 33 -5 2 15 -37 -48 6 -21 -17 13 -15 -26 -26 -7 -4 1 31 10 -5 -5 31 -37 -52 13 12 -9 -43 -22 -14 -10 6 24 24 -48 -58 -27
7297b7j3K6J3l0L0L3jp9N3Pjl6MjJ7O3o9jrN5p7N7J3q0L0OK2j4l1J3J6oJ2L8n6
$$ -27 -40 -14 -1 -31 -1 32 31 -48 5 12 11 -25 -21 -22 -5 58 -11 -12 -21 34 -43 14 27 -53 -23 -17 5 -9 -40 -27 -11 -17 -5 33 -23
7332b3m6R7n0N9nnm7l0L8KOJ5k1k6O5k4LJ7m5M6N1p0l2KM9m5j1nP5q3M8L0l8N6
$$ -23 -69 28 -22 37 32 27 -20 -50 -12 -10 -4 11 -10 -36 29 5 8 25 -20 26 77 7 -25 -23 26 -19 -30 -35 40 -43 5 35 -3 53
7366E3r2M2k7K9k2L2J4qj3k8jM8j5L7n6k2lj3P2m9P2k8J7o5K9J2K6m7L7m0N0l
$$ 53 -39 3 -24 5 -17 15 29 21 8 -20 -21 27 12 49 -7 -29 -32 -45 27 -22 50 22 39 -26 3 15 41 -6 31 -9 41 38
7398C8l7l2K1j2n5Q5m1L6k7J3l3L3mj7N0j8kK9l0mL8m9j5K6N0L1o4Okj8LrnJ8
$$ 38 1 -31 -10 -22 -77 8 -33 3 -24 -11 -44 -11 -15 -32 18 0 -2 27 -3 -7 31 -18 -33 -7 43 74 10 16 14 -4 -1 -10 -15 3
7432CL2rj8Om7NL4J9%m1K0JL5p2m4J05l5L9q1J2KP2q5mL2M5k3j7J6j2J9Ol9J0
$$ 3 35 26 8 14 -33 -28 6 25 25 -16 4 5 40 -32 -76 29 -6 33 -48 -36 -34 38 -47 -51 -19 26 3 -14 2 -10 9 15 -24 -14
7466a4l1N8kJ4kj8j1mj1j4K5J5J3nn3K4rL6j9J4n2N4k6QK9jn7Q6m1M8No0M1l5
$$ -14 -45 13 11 25 23 5 -6 -10 -21 -35 -10 5 18 13 -40 -16 -25 11 -8 6 -46 8 -18 -10 19 18 -39 47 6 54 59 -1 40 5
7500El3O7n6JMj6J9m9J13j8m3L0j3k0J0M8l4K9Noj0k1m7N4k8J0n8P5jp3R0n3J0
$$ 5 -28 39 -17 -16 -12 -28 -9 -58 55 37 -6 24 11 -9 1 49 15 44 49 43 33 12 -35 19 -9 1 -57 18 17 -56 34 -19 -9
7533in1KN9K2rj3j3N8p7rN6km2p0R4j4j4l8O9l8L7m2M4kK3n7J9RQ2p5n8J13r4
$$ -9 -60 -58 1 23 14 1 -12 46 -31 -40 16 14 -28 -98 -4 -18 -32 -70 -1 -39 -2 -44 0 -2 21 -36 -17 -8 74 -1 -59 54 -40
7566d0M6n7K6N7l3m5P8J5j7j4rpj3j4JP1o3L4k0L5qn6J6N4p5J2RK8L9n4J4njj5
$$ -40 6 -51 -25 32 -1 -46 32 47 30 16 7 0 -13 -27 -26 45 -18 16 -4 31 23 -33 -17 37 -38 -26 -17 11 50 -4 10 5 4 -11
7600a1lj7J5J3L5r0N7M9Mm0k9J0L1k5n3N5j2l0M1m6J8m9N3J5K2k8m1N1k0N0l7
$$ -11 -14 -31 -16 -3 32 -58 -1 48 52 12 -17 -7 24 -1 -54 1 -11 -41 0 -46 -28 -77 -24 -9 13 -15 -56 -5 -25 25 -12
7631a2L1n9O2K0m9K8j5J0l7LN6k5rL1q6Q1m7J4L1%l7K3o9L7K6o2N1l6mM7j1K4
$$ -12 19 -40 22 42 -7 21 6 16 -21 -18 38 13 4 35 -51 30 -17 -3 28 28 -9 14 -55 -18 8 -54 -3 -39 -43 4 -7 17
7663A7p7N2K6k6j1MM0o7%KJ6L1Pj5l3m2P6J6o4R8j1q3M3l3L8j0L3k1m2M1m2K1
$$ 17 -60 -8 18 -8 -19 -15 25 -42 -42 -40 -24 7 14 -1 -34 -76 0 16 -48 50 39 -44 -1 -34 4 -6 27 6 -36 5 -37 -16
7695a6j7K4M2om6L9k4Mk5L4Jo4P8l9l9Q2n3K3oO8o5l2J0L3k2L6o6O5o6J2k6Q8
$$ -16 -33 -9 33 27 -19 20 -4 0 -25 9 10 -54 24 -15 -54 28 -25 -2 -8 60 -5 -37 -27 6 -16 20 -46 19 -47 -35 -61 27
7727B7n6L0l6O5k9k8Mk6Q0j8m9O9l4NK0l6omQ4j42QQ1m5N1j0Opk7O9p5K7lJ0l7
$$ 27 -29 1 -35 30 1 -27 -23 -49 31 13 -36 33 -1 4 24 -12 -18 -22 62 -80 -72 9 -36 15 5 11 4 -23 46 -29 -2 -5 5 -32
7761c2N7l8N3q5O0p3M7j0%p7J13j7k8P6rl6l3kLM9o0N9l2jk3P1m0j1n7L7qM9o5
$$ -32 25 -13 40 -45 15 -58 -11 -21 -21 -98 15 -2 -30 46 37 1 -32 -34 -31 18 -42 17 -15 -16 -39 32 -8 -19 -76 -39 -47 2 -63
7794f3P5lK2m9%K2l9O4o8j0O4Kn3N4k7Rrj5O9j1l1k4N1l7n3J34r2OL5n0m1P4k1
$$ -63 12 9 31 -18 -18 4 -35 29 -39 -49 15 17 -36 18 -9 0 -9 -24 45 34 3 -21 30 -7 -60 74 -18 -12 23 -27 -68 6 -15
7827a5k7N5K3n6J1l5K1M5m1K3k4K2j5K6k9O2r4P8j1k5rL9Rn0J2K7Jj3k3J7k9M0
$$ -15 -42 13 36 -20 -9 -44 -23 22 -19 4 -20 2 -13 13 -16 46 -48 30 19 -6 -15 24 33 -17 -5 22 23 10 -13 4 -25 15
7859A5l8k7O2k0l8oO1m%j3J4j0j0j4L0o7L0j2M2l7mK3qJ12j28Q7q2Q5no7M1p4
$$ 15 -23 -50 12 -8 -46 -52 9 5 5 -8 6 -4 -14 -28 2 -65 -35 -47 -5 -42 -46 -23 -31 81 -47 40 -42 43 38 -29 12 -62
7891f2Q5m9P4Mp5qO9p3O3j9j3J0Mk3K8JJrm9N8j7Rj1rP5n9J4n9N2l3J8K%M1m9
$$ -62 23 -26 48 52 -23 -31 38 -35 28 9 -4 6 10 -13 15 16 17 8 -41 17 0 9 -2 -11 64 5 19 -40 12 -21 -3 -1 -1 40 -9
7926ij6j6j1O7MQM7r0l6K3L8k2lj3L6K2l6J8j4l4K0m0N6j3K1M3m3j4k5N7j2L7
$$ -9 -25 -41 -52 15 19 27 74 -16 -52 -29 9 -13 -16 -29 7 29 -7 11 -3 -37 -17 -57 -1 -14 7 50 7 -7 -32 25 13 50
7958E0j23J07n2J2l7J02j41K12l67O53k89J18k19j49J49J36J79l16L5qpj55K26
$$ 50 -73 34 -18 -6 -43 59 -82 130 -237 416 127 245 26 -123 26 162 341 25 60 52 45 -110 116
7981A16j01L2j14M5J03P8j90n9K9Q6j07J28p5K8nj85J77J49l77L7jk06O18o26
$$ 116 15 47 -67 -22 81 159 -31 -90 -61 25 -82 46 -29 -1 -6 -191 -14 135 -242 -205 -206 -412 206 -420
8005d20M59J25qL2m18M90k44L29k36l40K67n9Q9j48N7Q4PJ19l58J19O6mj19ql8
$$ -420 39 164 156 188 -230 260 16 345 109 -231 36 -23 66 -82 -25 59 66 185 -173 -54 12 8 -111 -119 -157
8030a57J06J44l5k02L7L9Q3p0J0K52k54Rm7l3K96j91p4J15J11j5P9l29M24m89
$$ -157 -51 93 58 -144 -107 -68 15 -55 -45 207 -47 -38 -85 -118 178 -13 -87 28 139 124 203 -126 298 -191
8054a91L49j49k77O80o34L26j32K9n0R6j20P3qK7j0L3p6L2k3M6oj8j6k5PK3Jn3
$$ -191 158 9 -268 412 -222 104 -28 1 -49 47 -73 0 -8 19 9 42 -34 -2 -25 21 15 -3 -19 -44 -37 -14 -13 -66
8082f6J7J28j06L5j7J4k6M5m7K3l0O0n8N8l1L9l5J3m3J10k3j45M3J47J27j51J0
$$ -66 -49 79 -27 8 -9 5 -21 24 -23 0 -30 30 -28 30 -1 38 3 16 -27 83 60 -85 -42 105 232 81 91
8109I1k68J32K24k40J40j14K55J8m09K83j44Q1j37J30q2M8j2N5r3L8o4M7J3L1
$$ 91 -177 -45 179 -61 79 -35 220 238 -171 112 -32 49 -88 42 -40 8 -4 51 -42 -4 -68 -21 -8 23
8133B3ql7MM7k4K2m0J8M3n9j0J9RO5m1L5q4R6q4P4k2K6N3n1J8J38j88j43P9k10
$$ 23 15 -22 -18 29 5 27 -13 5 48 -11 -21 -2 7 72 31 66 -18 78 -6 68 46 72 125 74 92 230 42 -101 -22 -232
8163b32K79K30R5l10j53O1R6l82K97J2Q3j42L3J48j93J96Nn8q3J70N2o9M4k93
$$ -232 47 277 372 62 -91 -30 66 -316 -19 -7 76 -66 -33 115 -78 118 123 65 -18 152 204 135 179 -114
8187a14j8J29Q5p1
$$ -114 -132 -3 82 11
8191A1
$$ Imaginary data points
##PAGE= N=2
##DATA TABLE= (X++(I..I)), XYDATA
0@%%%%%%%%%Qj6J6j6K4l2M0m8N6p2Q8j04J22j46J76k08K40k80L28l76M31m95N62
$$ 0 0 0 0 0 0 0 0 0 0 8 -8 8 -8 16 -16 24 -24 32 -40 48 -56 66 -80 96 -112 128 -152 176 -200 231 -264 298
32B98o36P22q16R20j034J156j292J444j612J796j992K202k438K698k977L283l620
$$ 298 -338 384 -432 488 -546 610 -682 762 -850 946 -1046 1156 -1282 1416 -1561 1722 -1898
49a898L989m392M837n332N881o495P186p969Q866r906J1126j2581J4352j6564
$$ -1898 2091 -2301 2536 -2796 3085 -3410 3776 -4193 4673 -5233 5893 -6688 7664 -8900
63h900J9420k3264K8738l7215N2204q6383L01561K8522n63105K57759J12938l13966
$$ -8900 10520 -12744 15994 -21221 30983 -55400 246161 274683 -288422 -30663 82275 -231691
75b31691m516L95241l9507j53309R1455o2989k09561K45751K25670k44849q7684
$$ -231691 -236207 159034 119527 -33782 57673 -5316 -214877 30874 256544 11695 -75989
86g5989K60923j65617l72686J72218L39716j04006o3759J83891r0553k20949J26214
$$ -75989 184934 19317 -353369 -181151 158565 54559 -9200 174691 84138 -136811 -10597
97a0597N6548j71030J53534K33780l10012k68266L09313J44453l02941P3944L83648
$$ -10597 45951 -125079 28455 262235 -47777 -316043 -6730 137723 -165218 -91274 292374
108B92374j14934l19952P4704R0297j02960P1690J08960j12441J517J24454j79566
$$ 292374 177440 -142512 -67808 22489 -80471 -8781 100179 -12262 -10745 113709 -65857
119f5857j69838K95666J81929k94850p3899K67374q5660k77992J36664K21067
$$ -65857 -235695 59971 241900 -52950 -126849 140525 54865 -223127 -86463 134604
129A34604j04148m5507J14737j07907j20767J64764K9826j84895J11825K09304
$$ 134604 30456 -15051 99686 -8221 -128988 35776 65602 -119293 -7468 201836
139B01836j96881j97584K03945J17633j80560l401J56723o7804j03527N0122l9326
$$ 201836 4955 -192629 11316 128949 -51611 -55012 101711 33907 -69620 -19498 -58824
150e8824l6773J70334L5731j98934M4127K18270j34388k25176J90033J86224k13600
$$ -58824 -95597 74737 110468 -88466 -44339 173931 39543 -185633 4400 190624 -22976
161b2976j24953J74317K6834j31759L7871Q6514k7884K1955K9311j20575k9764
$$ -22976 -147929 26388 53222 -78537 -40666 45848 17964 39919 69230 -51345 -81109
172h1109J53084l4280j72981R6694J60929j27037j08654J43060O5482j03026R731
$$ -81109 71975 37695 -135286 -38592 122337 -4700 -113354 29706 95188 -7838 1893
183A893N7453p5702j4227P2390q5187p2835J55789N8058j73774o961J88964k4156
$$ 1893 59346 -16356 -30583 41807 -43380 -116215 39574 97632 -76142 -83103 105861 81705
195H1705j70535M9118J25131o5049p9673L2685J9320J5663K7934n1658k5005J09998
$$ 81705 -88830 -39712 85419 20370 -59303 -26618 -7298 8365 36299 -15359 -40364 69634
207F9634K3350j57580k3497J62977j8493j69167M4283J42977m8891q5842N6053
$$ 69634 92984 -64596 -88093 74884 56391 -112776 -68493 74484 25593 -60249 -4196
218d196N3359k7028j1481q087l5730K8016M3534p2252m3171J08618M5932r6696
$$ -4196 49163 22135 10654 2567 -33163 -5147 38387 -33865 -77036 31582 77514 -19182
230a9182j8185Q9251O461p5768j9388K2480L399M001k2875l4466O5651Q0523o7106
$$ -19182 -37367 51884 58345 -17423 -36811 -14331 -10932 -6931 -29806 -64272 1379 81902 14796
243A4796o8395R5056O8315j13718q4649Q8299N3845r0270m7389P1803N8742j9665
$$ 14796 -53599 41457 109772 -3946 -88595 -296 53549 -36721 -84110 -12307 46435 26770
255B6770m1569R510N6622P376p6307m5867N7263L7445p3855m0490Q3213N5194
$$ 26770 -14799 -5289 51333 58709 -17598 -63465 -6202 31243 -42612 -83102 111 55305
267E5305m5429k5168M4157L1075k6793m2269j5553J3914J6567k6758m2509L4239
$$ 55305 9876 -15292 28865 59940 33147 -9122 -24675 -10761 5806 -20952 -63461 -29222
279b9222O9834j4535n5519K2673O6447j2388p7712j2996N9745J1754o1042k9025
$$ -29222 40612 26077 -29442 -6769 59678 47290 -30422 -43418 16327 28081 -32961 -61986
291f1986O1640N8755m4016n7670M8404O7375m2508q2312J9367P4495k1477p9445
$$ -61986 -346 58409 14393 -43277 5127 72502 29994 -52318 -32951 41544 20067 -59378
303e9378J1801P5716P993n9060j4260N8335K6274m9529l3541L2950L7601j9518
$$ -59378 -47577 28139 36132 -22928 -37188 21147 47421 -2108 -35649 -2699 34902 15384
315A5384m3201J0390M5560N79m1529j7292L1157K6220l1664l7985K4821M6397
$$ 15384 -27817 -17427 28133 28712 -12817 -30109 1048 27268 -4396 -42381 -17560 28837
327B8837o731m6352j20N7679J0144o2582k4222N2348K9966n2422m2103N4196N6563
$$ 28837 22106 -24246 -24366 33313 43457 -19125 -43347 9001 38967 -13455 -55558 -1362 55201
340E5201l9818n1311L4206N7111k6448p1796N539O0438q175o2442k618O4480K5373
$$ 55201 15383 -35928 -1722 55389 28941 -42855 -37316 23122 14947 -47495 -50113 14367 39740
353C9740m7035j7081N1667K4720m0199l5160J4236K6409j5147l6262J419L6792
$$ 39740 -7295 -24376 27291 52011 11812 -23348 -9112 17297 2150 -34112 -32693 4099
365D099K0704k2968k1903L1737L3277l0767m3248J0474L3021j0188m1943k69M7227
$$ 4099 24803 1835 -20068 11669 44946 14179 -29069 -18595 14426 4238 -37705 -37974 9253
378I253K2174k9616k3137L8421M3210m1053o0047K9698N0232l9297o0971L1993
$$ 9253 31427 1811 -21326 17095 60305 19252 -40795 -11097 39135 -162 -61133 -29140
390b9140O3123k0742m7462K3067M5393m800l6373j4956K5356K0336l0053l5560
$$ -29140 33983 13241 -34221 -11154 34239 29439 -6934 -21890 3466 23802 -6251 -41811
402d1811K7086M9097j7874m3859K7301M3495k7512l6934J2856J6034p805j0211
$$ -41811 -14725 34372 16498 -27361 -60 43435 15923 -21011 -8155 7879 74 -10137
414a0137r597k068K7352J8088l5790j2001N8129R724o8996j1441N8202K744n0227
$$ -10137 -19734 -21802 5550 23638 -12152 -24153 33976 43700 -25296 -36737 21465 24209 -26018
427b6018J670M2628M415k2144j1346K565K7721J1517n0033k2731N6668J0817p1886
$$ -26018 -24348 18280 22695 551 -10795 -8230 19491 31008 -19025 -41756 14912 25729 -46157
440d6157k784Q6347Q074o9445R843N2570k3728l5447J6409R281m554R279j5697
$$ -46157 -48941 37406 45480 -23965 -14122 38448 14720 -20727 -4318 4963 409 9688 -6009
453f009k9660L1139M2995l8075k8113N8861J1645p3635j1861M8410l137j9169
$$ -6009 -35669 -4530 38465 390 -27723 31138 42783 -30852 -42713 5697 2560 -16609
465a6609K0860L287j6300K2869M250m6561K3377P1126m5063p8883M7702M8596
$$ -16609 4251 7538 -8762 14107 18357 -28204 -4827 66299 21236 -57647 -9945 38651
477C8651o6771k8784P8366K6364n4882q419K0266j5092O983J7701k7628N105M7866
$$ 38651 -28120 -56904 21462 47826 -7056 -15475 4791 -10301 -3318 14383 -13245 -8140 39726
490C9726l4387o8298M8930P2667m9964m2330O5958J0400p9235j531N0500j2742
$$ 39726 5339 -62959 -14029 58638 8674 -33656 32302 42702 -36533 -38064 12436 -306
502c06o046L4063k3196m0527L8930J9780n9176J3735Q3122l1675q0622L5882M6535
$$ -306 -6352 27711 4515 -36012 2918 22698 -36478 -22743 60379 28704 -51918 -16036 30499
515C0499m2272q147N1224m368k9843J2642j9998l9304N1647M3581o8503j6529
$$ 30499 -11773 -19920 31304 26936 -2907 9735 -10263 -49567 2080 45661 -22842 -39371
527c9371Q3924j6218r3108L7208Q9057l8640n4384M2937R487n1401R992K8200
$$ -39371 44553 28335 -64773 -27565 61492 22852 -31532 11405 20892 -30509 -20517 7683
539G683j8505K0820L8236m9442m1677O0531J8648p3351R425P6073l5918o7664
$$ 7683 -10822 9998 48234 -1208 -42885 17646 36294 -37057 -27632 48441 12523 -55141
551e5141L9247L1488l4693J7553M1301l3526j8245M3633k4591o1871N2914N9276
$$ -55141 -15894 15594 -19099 -1546 39755 6229 -12016 31617 7026 -54845 -1931 57345
563E7345o9766l6924P3213M965o8538J9435N7688k1716k3410K0303k1812k3646
$$ 57345 -12421 -49345 23868 28833 -39705 -20270 37418 15702 -7708 12595 -9217 -32863
575c2863M2527J319n0537L8531N9057o1130n1076P2704L2419p1964k472O3848
$$ -32863 9664 10983 -39554 -1023 58034 -3096 -54172 18532 50951 -21013 -23485 40363
587D0363k6551n1334K9771J2408k7922K8092K5509m5578o583N3680k1881n6654
$$ 40363 13812 -37522 -7751 4657 -23265 4827 30336 -15242 -21825 31855 9974 -46680
599d6680M6577M9514n6746k7303N0868l090l7726K6427K0880k8677R083K5108
$$ -46680 -103 49411 -7335 -34638 16230 13140 -24586 1841 22721 -5956 3127 28235
611B8235m4603k3035O2150M572o7515K2255O3063m2120n0134M8122L1626l9715
$$ 28235 -16368 -39403 22747 27319 -40196 -17941 45122 3002 -47132 990 32616 -7099
623g099m097K9572j7745j2814K4473j5362k0367M4649J2590n8472P32N5986k2142
$$ -7099 -11196 18376 631 -12183 12290 -3072 -23439 21210 33800 -24672 -23940 32046 9904
636I904n1199L7053L7837m2099j5800L5250q749j8765K8688K958l0993J8546K6380
$$ 9904 -41295 -4242 33595 -8504 -24304 10946 2197 -16568 12120 15078 -15915 2631 29011
649B9011m0649k1614N0953R241m8962R008L9693k1519k5694K1481O813j4901J0518
$$ 29011 -11638 -33252 17701 26942 -22020 -13012 26681 5162 -20532 949 7762 -7139 3379
662C379K781k6143J0340L1271k6275k4134M5590J8178m9525o844M3756o694l6304
$$ 3379 6160 -19983 -9643 21628 -4647 -28781 16809 34987 -14538 -21382 22374 15680 -20624
675b0624J4308K2243j7925o004J2218j1061o37K2743j0921k4588K1774J9662l1976
$$ -20624 -6316 15927 -1998 -8002 4216 -6845 -7482 15261 4340 -20248 1526 21188 -10788
688a0788j4369L5739O742k9491O219K0734j1739o580J1085q017p031J7402j841
$$ -10788 -25157 10582 17324 -12167 -5948 14786 3047 -3533 7552 -465 -7496 9906 8065
701H065k7259Q959K9680j7677k5465K5321J8945k4978j1081J8682M311j0871L50
$$ 8065 -19194 -10235 19445 1768 -23697 1624 20569 -4409 -15490 3192 7503 -3368 -3018
714c018K527p03R704J0j8370O118K2790j3875k4127J6165J8473j9269j5065J8595
$$ -3018 -491 -1194 8510 8520 -9850 -3732 19058 5183 -18944 -2779 15694 -3575 -18640 -45
728d5R539j3524r08P832k547K202K560j0641j012J5180j181j7701M356J9519o527
$$ -45 9494 -4030 -4938 2894 347 2549 5109 -5532 -6544 8636 7455 -10246 -5890 13629 7102
743G102j6656Q180J0596o888o575m84J035M652K67r227o56J5974L133j8768J82
$$ 7102 -9554 -1374 9222 2334 -4241 -4725 -3690 962 1229 -7998 -8654 7320 10453 -8315 -8133
758h133K1206k251j9349K261J4884j811j2656o96R110K770m484n891P90R764m22
$$ -8133 13073 10822 -8527 -6266 8618 6807 -5849 -6545 2565 5335 851 -5040 -4250 5514 5092
773E092j3423K2J3378J60j2154n00J2094K195q509r33N555K780j567o333k040
$$ 5092 -8331 -8309 5069 5229 -6925 -7425 4669 6864 -1645 -2578 2977 5757 4190 -2143 -4183
788d183P445K415r142n158Q858O695r384p231R372P479o576p699L955R617j548
$$ -4183 3262 5677 -3465 -8623 235 6930 -2454 -9685 -313 7166 590 -7109 -3154 6463 4915
803D915r857K67J0273K635j0068m919J0337N665j0656o557P812O289o427q143
$$ 4915 -4942 -4675 5598 8233 -1835 -6754 3583 9248 -1408 -7965 -153 6136 -291 -8434
817h434M661Q369k927p053J162P208K260o622k927O444L858m333n094K326O397
$$ -8434 -3773 4596 1669 -5384 -4222 2986 5246 -1376 -4303 2141 5999 1666 -3428 -1102 5295
832E295j402p407j75O060J670o479m663O127N633n611n911M422P899j864q626
$$ 5295 3893 -3514 -3689 2371 4041 -2438 -7101 -974 4659 -952 -6863 -2441 5458 3594 -5032
847e032J780R668o02q909j259Q320K932q651m318P574M375o339n829M004O742
$$ -5032 -3252 6416 5814 -3095 -4354 3966 6898 -1753 -6071 1503 5878 -461 -6290 -2286 4456
862D456l594p517K715O985m26n709l92O520K072n025k022L028L041j339n334k38
$$ 4456 862 -6655 -3940 3045 2619 -3090 -3482 3038 5110 85 -1937 1091 4132 2793 -2541 -2779
878b779N364M22n596k254N438L508n926l929N160L584k932l896J450O081M79o298
$$ -2779 2585 3007 -2589 -4843 595 4103 -1823 -5752 -592 2992 60 -3836 -2386 3695 4174 -2124
894b124r29O785K825p302m254P693L286q701l337O550K921m700l175L244L249
$$ -2124 -3053 3732 6557 -745 -4999 2694 5980 -2721 -6058 492 3413 -1287 -4462 -1218 2031
909B031j577k827n86L967L414m707l807N868L706n314l059M806K559m472k261
$$ 2031 454 -2373 -2959 1008 4422 -285 -4092 1776 5482 168 -2891 1915 4474 2 -2259
924b259J674l5P30M8l792R93N906k239o898L309Q138l253p171M589N780m449l536
$$ -2259 -585 -620 110 158 -3634 -2641 3265 1026 -5872 -2563 5575 2322 -4849 -260 5520 1071 -2465
941b465K753K082J60j535l170L07M313j049o904K055Q648l775q503N114O637m841
$$ -2465 288 2370 2530 995 -2175 -1868 2445 1396 -5508 -3453 5195 1420 -7083 -1969 4668 -173
957a73l700N113K351l519k9J104k278K441L322n534k684O860l47q342J323P718
$$ -173 -3873 1240 3591 72 43 1147 -1131 1310 4632 -902 -3586 3274 2927 -5415 -4092 3626
973C626k270n736L274K557l433J268J969k954K457M707n469n165P398M304q898
$$ 3626 1356 -4380 -1106 1451 -1982 -714 1255 -1699 758 5465 -4 -5169 2229 6533 -2365
988b365k136R998j049r858J898O010k862k044K743o53j479K796j126m655N209
$$ -2365 -4501 5497 4448 -5410 -3512 2498 -364 -2408 335 -318 -1797 999 -127 -4782 427
1003D27O556p328m481Q530J056q637J481P620k723m820L161m63m809L989K869
$$ 427 6983 -345 -4826 3704 4760 -3877 -2396 5224 2501 -2319 842 379 -4430 -441 2428
1018B428o327J315P584m693p642O626O769o372k830P223m54o450J978K272k629
$$ 2428 -3899 -2584 5000 307 -7335 -709 6060 -312 -3142 4081 3627 -2823 -845 1427 -1202
1033a202K815K604n976j969O684j387q403M726R021o937o924P242K643o368J646
$$ -1202 1613 4217 -1759 -3728 2956 1569 -6834 -2108 6913 -24 -6948 294 2937 -3431 -1785
1048a785N933k210k141L191k630m421N791L142p565L5P563m222p429N124N281
$$ -1785 4148 1938 -203 2988 358 -4063 1728 4870 -2695 -2660 4903 681 -6748 -1624 3657
1063C657m655j294M637k272l666M247K55m236M829M855p048l703P576Q89p945
$$ 3657 -998 -2292 2345 73 -3593 654 909 -3327 1502 6357 -691 -4394 3182 4071 -3874
1078c874J951P490m018n857L780R29l556K647K316l758P86M525m112m637P002
$$ -3874 -1923 5567 1549 -4308 -528 401 -3155 -508 1808 -1950 -1164 3361 -751 -5388 1614
1093A614M084p452o40P170k668n978L671L187l610Q9K900l535k454M874l77n442
$$ 1614 5698 -1754 -2394 4776 2108 -3870 -199 2988 -622 -533 2367 -1168 -3622 1252 875 -4567
1109d567L811N250n250l681N628J714m807R60M435k336k066K682j423k541L950
$$ -4567 -756 4494 -756 -4437 1191 2905 -1902 -942 3493 1157 -909 1773 350 -2191 1759
1124A759Q81n299O39N267l241n250M540M132n152j238M884r20l085K666R43k398
$$ 1759 2640 -2659 -2020 3247 6 -5244 -704 3428 -1724 -2962 1922 1002 -2083 583 1526 -872
1140h72J691K135l484j623M865o47n570K484M420m025k249K905Q77k453M91K200
$$ -872 819 2954 -530 -2153 2712 2065 -3505 -1021 3399 -626 -2875 30 907 -1546 -1055 1145
1156A145k112J19K965j876k606L960J626m214l81M507j204l985J583K157k266
$$ 1145 -967 -848 2117 241 -2365 1595 3221 -993 -1374 3133 1929 -2056 -473 1684 -582
1171e82r27K094j161j297K338n69k347K512K155k870j398L683N19l612J014L094
$$ -582 -1509 585 -576 -1873 465 -104 -2451 61 2216 -654 -2052 1631 2150 -1462 -448 2646
1187B646j770j572J553l76j515J032N10j986K82K400j542k427K646J904k665n15
$$ 2646 876 -696 857 481 -1034 -2 508 -1478 -1196 1204 -338 -2765 -119 1785 -880 -1395
1203a395K500J2j704N28J121o57K45O63j548l59J978j036k349J457J767k038j468
$$ -1395 1105 1117 -587 -59 1062 405 650 1313 -235 -594 1384 348 -2001 -544 1223 -815 -2283
1220b283K084J031j686R5J426j21j64R5l17k83R69O25j683j02J672n45j931Q89
$$ -2283 -199 832 -854 -759 667 546 382 477 160 -123 846 1471 -212 -314 1358 813 -1118 -229
1238b29J220j574p47Q23J7k9K05j9j77R11P14j334k72J959Mj981K48J419m48j534
$$ -229 991 -583 -1330 -507 -490 -519 -314 -333 -510 401 1115 -219 -491 1468 1472 -509 -261 1158 710 -824
1258h24K76R60l08o45qj0L87K30q88j20J253K15q82l7J262K31j025N9Q20l24l97
$$ -824 -548 412 104 -541 -549 -559 -172 58 -830 -950 303 518 -364 -401 861 1092 67 126 946 622 225
1279B25k52j51J22K9m29l85L08P87n78p29Q54Q39o09m41N34O77j07p07K36N61
$$ 225 -27 -178 -56 -27 -456 -841 -533 254 -324 -1053 -199 640 31 -410 124 801 694 -13 223 784
1299G84N2o22n59L25P33r73p76R18L83m70p38L06P86j31m62J36Q29j4k47q6J55
$$ 784 836 214 -345 -20 713 -260 -1036 -118 265 -205 -943 -637 149 18 -444 -308 521 507 260 174 329
1320C29N05l60l71j49M38j72q09q7N80L0m58k67M24N09j55l55K20N33K51o63j65
$$ 329 834 474 103 -46 392 220 -589 -676 -96 -66 -524 -791 -367 142 -13 -368 -148 385 636 -27 -192
1341a92Q79J70q19j98N78K65o48o65M87K53n09m73K11N09Q0m96J08P42J88l22
$$ -192 687 857 38 -160 418 683 35 -630 -143 110 -399 -872 -661 -152 -72 -568 -460 282 470 148
1361A48k05N25L47m90l24K56J33j86l48j40K80J00m13k85J69M81k26o03M29O65
$$ 148 -57 468 815 325 1 257 390 204 -144 -284 -4 96 -317 -602 -433 48 -178 -781 -352 313
1381C13j66k73J59N75J26m77j50L00J78l82p42K76N79m46o51K97N57k23n03K00
$$ 313 147 -126 33 608 734 257 107 407 585 203 -539 -263 316 -130 -781 -484 73 -150 -653 -453
1401d53N87j31j44K4J82L69J46m68P5N43k06o11k2L37j2r29L56N48p11P9j18J18
$$ -453 134 3 -141 -117 65 434 580 112 187 730 524 -87 -109 228 216 -713 -357 191 -520 -441 -559 -441
1423d41O82O1m25l34O72N15p81j49R63k25o95m1J141n97o32J19k38J60j05j32
$$ -441 241 302 -123 -457 215 730 -51 -200 763 538 -157 -198 943 346 -286 -167 -405 -245 -350 -482
1443d82l81O39O64o20k31Q37J42o86L8O48l6m46J81k9m99M59R3q14L41O78p00
$$ -482 -863 -224 440 -180 -411 426 568 -118 -80 568 532 86 267 238 -261 198 291 -523 -182 496 -204
1464b04q41N79P80o54l10R66J22o49L50K03k65M42K11p15j59O52k52j102N02J152
$$ -204 -1045 -466 314 -340 -650 316 438 -211 139 342 77 519 730 15 -144 508 256 -846 -344 808
1484H08r91p83Q48J91p97K24P48k12r8N03k69o99R54N90j245J11J174o62j199
$$ 808 -183 -966 -118 73 -724 -500 248 36 -62 441 172 -527 427 1017 -228 -117 1057 395 -804
1503h04N55P54o39l39P24l66o33O91j10p25R07Q67j136m33J352J69j309L41J408
$$ -804 -249 505 -134 -473 251 -115 -748 -57 -167 -892 15 882 -254 -687 665 834 -475 -134 1274
1522A274p36j054P26kq55L22N00o68O1R61n93j025J205P79j463k0J477n07j158
$$ 1274 538 -516 210 208 -647 -325 175 -493 -432 529 -64 -1089 116 895 -568 -588 889 382 -776
1541g76Q24O51q10J55R09p23p97J235k58j661Q82J201j311q23J349L56j165K65
$$ -776 48 699 -111 44 953 230 -567 668 410 -1251 -369 832 -479 -1302 47 403 -762 -497
1559d97J300n02m99R15n04p47R77K91j368K29J473p96j494J188J019j597k49J441
$$ -497 803 301 -198 717 213 -534 443 734 -634 -405 1068 272 -1222 -34 985 -612 -861 580
1577E80n61r26Q46K78q75N99J028q09p50J488J52j910P84J221j227o40J018r5
$$ 580 19 -907 -61 217 -658 -59 969 160 -590 898 1050 -860 -76 1145 -82 -722 296 201
1595B01r96N36P02j027J6J343q26j198J592N57j617J93J672m68j469Q82R64j304
$$ 201 -795 -259 443 -584 -568 775 -51 -1249 343 900 -717 -524 1148 680 -789 93 1057 -247
1613b47p1J016q26n26R34k44j127Q95J017j176p00J608Q1j666P79J282j061l87
$$ -247 -318 698 -128 -654 280 36 -1091 -196 821 -355 -1055 553 634 -1032 -253 1029 -32 -419
1631d19J190l62q72P99M66j241m6J257q02j339J289O56j253k8J259l08q02O83
$$ -419 771 409 -463 336 802 -439 -485 772 -30 -1369 -80 576 -677 -705 554 246 -556 127
1649A27M02r16M28Q61j187k13J330l02j432Q94J089j264p30J266R1j358M37Q95
$$ 127 529 -387 41 902 -285 -498 832 530 -902 -8 1081 -183 -913 353 444 -914 -477 418
1667D18q14n9R08m22m98Q34M29j113P3J232p10j027J038L64j120K24P18n83m73
$$ 418 -396 -455 453 31 -467 367 796 -317 -244 988 278 -749 289 653 -467 -243 475 -108 -581
1686e81P17j01q71N54R62j113k42J325j17j087N70Q95p29n35O65K9p13L56L65
$$ -581 136 35 -836 -282 680 -433 -675 650 533 -554 16 911 182 -353 312 341 -372 -16 349
1705C49p82L35O57r15l15Q99J08r99J40J146m87q32Q79M21o58K19M48n07j76M49
$$ 349 -433 -98 559 -356 -671 228 336 -663 -523 623 136 -696 183 604 -54 165 613 106 -70 379
1725C79k19p49M19O40q14l56R10j14o15M69K97k89p4K29j12l42O21J18p65L60
$$ 379 160 -589 -170 470 -344 -700 210 96 -519 -50 247 -42 -116 113 1 -341 280 398 -367 -7
1745gP65p26m32O49J85o94k90O46j47n15L66K26k61L79O3m10K92M56k88m80M01
$$ -7 758 32 -400 249 434 -260 -550 96 -51 -566 -200 26 -235 144 207 -203 89 545 257 -223 178
1766A78L08n62k71N66j01m06K82N1k33R1M6j36j72L94J85o11J92N74k88j89K87
$$ 178 486 -76 -347 219 118 -288 -6 45 -188 -97 -51 -187 -359 35 220 -391 -199 375 87 -102 185
1787A85J87j86j51J20oj70R5k11k02L48M4m94K07L90j36k43O3M22q6l33L28P2
$$ 185 372 186 35 155 149 -21 74 -137 -339 9 53 -441 -234 156 20 -223 -160 262 176 -157 171 243
1809B43q8N0j64n5J93q7j99m2J67J74m81K8L34j03j45P0LJ92q0j08J79N2J95j68
$$ 243 155 205 41 -14 179 92 -107 -149 18 192 -289 -261 73 -30 -175 -105 -102 90 10 -98 81 133 328 160
1833A60k77L70P2m05p1J48j5j72j99K74J87k33P5Q4K0J95j83j41K49J6r6r3M5
$$ 160 -117 253 325 -80 -151 -3 -18 -190 -389 -115 72 -161 -86 -2 18 213 30 -111 138 154 58 -35 10
1856A0L01k22j99L03j62r6kj59J31J7j26k2K4K53O4k28R9L42k37q9J09QJ31k54
$$ 10 311 89 -110 193 31 -65 -67 -226 -95 -78 -204 -226 -202 51 115 -113 -14 328 91 2 111 119 250 -4
1880dj04J74On3j84K8K27j72k71K29J38n9n1L8K56j23j9J00j09P6P1j92n1K27
$$ -4 -108 66 72 19 -165 -137 90 -82 -353 -124 14 -45 -96 -58 198 75 56 156 47 123 194 2 -49 178
1904A78j76j27k1J65M9k56O4J86j91J9P8p8J80N3q7j8P3K56l18j58L94k2m56N7
$$ 178 2 -125 -146 19 68 -188 -124 62 -129 -110 -32 -110 70 123 36 18 91 347 29 -129 265 243 -213 -156
1928a56J43n5r5l6J69J5n5Q2j44R0K47k31o4L40n6k78L1L01p8l50K63J08l62R4
$$ -156 -13 -68 -163 -199 -30 -15 -70 12 -132 -42 205 -26 -90 250 194 -84 -53 248 170 -180 83 191 -171 -77
1952g7J48l04M8K32j46j06J12K66j45j93M00Q1l66J71N8j75O8K5j06q8J47O1m64
$$ -77 71 -233 -185 47 -99 -205 -93 173 28 -165 235 316 -50 121 179 4 72 97 -9 -97 50 111 -353
1975c53J61M07l18k92N19k7l43J47J48N6k46K50J66l59J97J95m97R3M25l63l19
$$ -353 -192 215 -103 -395 124 97 -246 -99 49 105 -141 109 275 -84 113 308 -189 -96 329 -34 -353
1996c53L10J81l36p8M68j76k89L66N7l84L27K44l29q0L27N2m96K7M95l40k38M06
$$ -353 -43 138 -198 -276 192 16 -273 93 150 -234 93 337 8 -72 255 307 -189 -162 333 -7 -245 161
2018A61p3l43K06N9j29k8L06j41l53M30K64o61J87N89k81m06M09J57m48j50M55
$$ 161 88 -255 -49 10 -119 -147 159 18 -335 95 359 -302 -115 474 193 -213 196 353 -95 -245 210
2039B10j81l98M99p9m57L02L33l58p2M24l3m27J88M00m01j03M92k77k71L62M8
$$ 210 29 -369 130 51 -406 -104 229 -129 -201 223 190 -237 -49 351 -50 -153 339 62 -209 153 201
2060B01m40R6L65j52n43M56L43o84L4N93k56j94L63N4l89J71L01l58j78N12q1
$$ 201 -239 -143 222 70 -473 -17 326 -358 -324 269 13 -181 182 236 -153 18 319 -39 -217 295 214
2081B14o12M59K67o28J9M89j23m79L04K96m18q9O69l30k52M10J5l61Q7M27k12
$$ 214 -398 61 328 -300 -281 208 85 -394 -90 206 -212 -301 368 38 -214 196 211 -150 -63 364 152
2102A52l96L49J73n91J66L92m03o2M06k13l11L13K25k98j19O03j20o09M13K12
$$ 152 -244 105 278 -313 -147 245 -158 -220 186 -27 -338 -25 200 -98 -217 386 266 -343 70 282
2122B82l78P1L15j39k90J45P5l26K3M91l40k75M67r0l65L04K67j72j76K90K3m36
$$ 282 -96 -25 290 151 -139 6 81 -245 -222 269 -71 -346 121 31 -334 -30 237 65 -111 179 202 -234
2144b34K28L79m10q9M08k92l33K81K13k95j34L99j9m55L86J50l22J71K46l10p6
$$ -234 -6 373 -37 -126 282 -10 -343 -62 151 -144 -278 121 102 -353 33 183 -139 32 278 -32 -108
2165a08K70Ll41J53L20l24k07L58l9l67J69K25j98j29K38K7k10J86K47k70q9L17
$$ -108 162 165 -176 -23 297 -27 -234 124 85 -282 -113 112 -86 -215 23 50 -160 26 273 3 -86 231
2187B31k02j19K65k1j61l6J44j55k00K40J42l51J26J94k51l9K61N0j87K2K99k23
$$ 231 29 -90 175 154 -7 -43 101 -54 -254 -14 128 -223 -97 97 -154 -193 68 118 -69 -47 252 29
2209B9j39L06n5k56J70J0j89O5P4qj39J12J35l30P4K55j44r9K34K9j45p0J89J5
$$ 29 -110 196 141 -115 55 65 -124 -59 15 7 -132 -20 115 -215 -141 114 -30 -129 105 134 -11 -81 108 123
2233A23j38J24L3k51J21L6j85K9J39o5m3k2J37j06j10L02m9j43J87K2j88Q6Q1
$$ 123 -15 109 142 -109 12 48 -137 -108 31 -34 -77 -99 38 -68 -178 124 75 -68 119 141 -47 39 120
2256A20l9l7j8J05k69N7J59j24o4K3N4o3l5N6R6p6J43n2r0J48Nj05PJ45p5j31
$$ 120 81 44 26 131 -138 -81 78 -46 -110 -87 -33 -96 -131 -75 21 -55 88 36 -54 94 99 -6 1 146 71 -60
2282f0M3L1k6q6M1O5q6O4j7o2J03K3j6OJ5J18l6j52J40Qj58O9n3l8N3p5J5M2p3
$$ -60 -17 14 -12 -98 -57 8 -78 -14 -31 -93 10 33 17 23 38 156 120 -32 108 116 -42 27 -26 -64 -11 -86 -71 -29 -102
2311a02N8l4jJ41j30O0J13j2r6K4N6Qm8l9L1q8N6K5j05N6m3M0l6K6J6kl6P0j3
$$ -102 -44 -78 -79 62 -68 -8 105 93 -3 21 77 85 37 -2 29 -59 -3 22 -83 -27 -70 -30 -66 -40 -24 -26 -62 8 -5
2340eO3Rl7Q5m3j0m7k3m6N3K3n9ll2J4N2m0k2L6K4J2KnN4J9lor8Q7L0r9K6k6l8
$$ -5 58 67 30 115 72 62 15 -8 -54 -1 22 -37 -40 -72 -58 -6 -46 -68 -32 -8 4 6 1 55 74 71 65 -33 54 84 -15 11 -15 -53
2374e3K7k8l4O3j2N9n9L5L4l6J4L5K4K3r7L1J6qn0L6m0nj1J7Mk1lk1o2J05M7k3
$$ -53 -26 -54 -88 -25 -37 22 -37 -2 32 -4 10 45 69 92 -5 26 42 34 -16 20 -20 -25 -36 -19 -15 -36 -39 -60 -122 -17 30 7
2406GK9M4l9M1K7n5L9l0j32P0o2P5Mk2r5L8Pj0J8K4K9L5J5q1O0Q4r6j8R8n5p7
$$ 7 36 80 41 82 109 54 93 63 -69 1 -61 14 18 -4 -99 -61 -54 -64 -46 -22 7 42 57 -24 36 120 24 6 104 49 -28
2437b8J6L3qq1K5J6o5L5j1J5k1k6Q7kO0N2k0Ql1o0N5n1Ll8K9M7p9k2N0k5l0O9
$$ -28 -12 21 13 -68 -43 -27 -92 -57 -68 -53 -74 -100 -13 -15 45 97 77 85 54 -6 49 -2 1 -37 -8 39 -40 -62 -12 -37 -67 2
2469BP0n5oMN5m7O8m4Rl2n2M4K2n4K5q7O9p1k1J9J7rJ9oJ02K6q0M2K4pjKoJ8m7
$$ 2 72 17 11 15 70 23 91 47 56 24 -28 16 38 -16 9 -78 -9 -80 -101 -82 -65 -74 -55 -61 41 67 -13 29 53 46 45 47 41 59 12
2504A2J7m7J1Nq5OM6j8K3M9j9n0M8L7k2nP3k4k0J1j6l6j6J4j8n7J2L2n8O1k5J7
$$ 12 29 -18 -7 -2 -87 -81 -35 -53 -30 19 0 -50 -2 35 13 8 81 57 37 48 32 -4 -20 -6 -24 -81 -69 -37 -95 -34 -59 -42
2536d2J3J5k9L9O8Mj04R4lM5o1nL1r5K3n9LrkN5m9k1Q0k0qN7J4j9M5K0k2j9L6
$$ -42 -29 -14 -43 -4 64 68 -36 58 55 100 39 34 65 -30 -7 -66 -63 -72 -74 -19 -68 -89 -9 -29 -37 20 34 15 60 80 58 39 75
2569G5k3p6L2J2m4k3OJ5k3n2R4o1M8J5L0j2K8L0m6nPK4n4j6N3l6l9J1L0n1M9m0
$$ 75 52 -24 8 20 -24 -47 -41 -26 -49 -101 -7 -68 -20 -5 25 13 41 71 25 20 27 51 -3 -19 34 -2 -41 -30 0 -51 -2 -42
2601d2l8L0M5o8P3jJ3L7j8n3L4RnqN7m9q5L1l5j4N3j6Ql9J11r3R9L8o1K2K0J7
$$ -42 -80 -50 -5 -73 0 -1 12 49 31 -22 12 21 16 8 65 16 -69 -38 -73 -87 -34 -50 -42 -81 30 -63 36 74 13 35 55 72
2633G2J2o6Jn2K6L3n1J0l2L2m3Rj6Q5l2m5N9J9m5P9LPl0J5k5K5o0R9q5l5K6k4
$$ 72 84 18 19 -33 -7 26 -25 -15 -47 -15 -58 -49 -65 20 -12 -57 2 21 -24 55 58 65 35 50 25 50 -10 89 4 -31 -5 -29
2665b9k5Mk9rK2M2L6j0N9J3o0N6J2l4j4K7l3N6j59M6Km7K4k3o6Q8L4o2O3l6R0
$$ -29 -54 -50 -79 -88 -66 -24 12 2 61 74 14 70 82 48 34 61 28 84 -75 -29 -27 -74 -50 -73 -139 -51 -17 -79 -16 -52 38
2696C8j2%JK4l4j7K8L4q1J1k5K6o1oL4k5N4J5n8R2n5L2M0mN2p3MK0l3ON3p8m9
$$ 38 26 26 27 51 17 0 28 62 -19 -8 -33 -7 -68 -74 -40 -65 -11 4 -54 38 -17 15 55 51 103 30 34 54 21 27 80 2 -47
2729d7N0q7J5K7jK1j1L5j0J6k2J0jM2j2RL6m6J0J3J1l3j12K4M5qk1n4L9M5M0l3
$$ -47 3 -84 -69 -42 -43 -22 -33 2 -8 8 -14 -4 -5 37 25 34 70 24 34 47 58 25 -87 -63 -18 -26 -47 -101 -62 -17 23 -10
2761a0j8Q3k9k4k5K3O0q0Q6m0k2N0k4q1K4j3o3K6K2m3KQ2K3p0J08j3j5K0rm2N7
$$ -10 -28 55 26 2 -23 0 60 -20 66 26 4 54 30 -51 -27 -40 -103 -77 -55 -98 -96 -14 9 -61 47 34 19 39 30 -12 45
2792D5n5j0K3l2J4J9l4L0m3m7R6m6P7o9K7K2K2J2k0K0oj0jo4Q9p7n7L8JJ9jp1
$$ 45 -10 -20 3 -29 -15 4 -30 0 -43 -90 6 -40 37 -32 -5 17 39 51 31 51 45 35 34 -30 59 -18 -75 -37 -36 -17 -18 -89
2824h9P1Kj2O1o0J3mK8J6q2M8M7j7N4j25rR5m3n6R6p7pL3r2Q0nM0mP5n4K8n2O
$$ -89 -18 -16 -28 33 -27 -14 -18 10 26 -56 -8 39 22 76 -49 -58 37 -6 -62 34 -43 -50 -17 -109 -29 -34 6 2 77 23 51 -1 5
2857ENj3P1l4n5L1m3j4Nn5L7j7OM6J8K6Q2n2m1M6J6o2N1k4L7n2j9Pl1P7j7k9l0
$$ 5 10 -3 68 34 -21 10 -33 -47 -42 -97 -60 -77 -71 -25 -7 19 101 49 8 54 70 8 59 35 72 20 1 8 -23 54 37 8 -22
2890b2p3L6K8qJ6k9J7M1O6m5K1k6k5L7no2J2m8J00k3o1M0k9n9J62q8M5K8l1K1
$$ -22 -95 -59 -31 -39 -23 -52 -35 6 72 27 48 22 -3 34 29 -33 -21 -69 31 8 -53 -13 -42 -101 61 -27 18 46 15 36
2920C6lmM0k6mM6q1L0Mk8N7k3q4R5q4J7K3l8O7k7n8k7R3j3K0l5P1m0J7m9J8j6
$$ 36 33 29 69 43 39 85 4 34 38 10 67 44 -40 55 -29 -12 11 -27 40 13 -45 -72 21 8 28 -7 64 24 41 -8 10 -6
2952fJ8n2j5J10j45J00p4L7J1M6o0R3j31J03O4r6J13n9r5Q4J8m6K9j08R1k3n0
$$ -6 12 -40 -55 55 -90 10 -64 -27 -16 30 -30 63 -68 35 99 3 116 57 -38 46 64 18 47 -61 30 7 -43
2979d3pJ0Kj1l0N5O0o6kM9p4J22l6J8qo4L1Ql5O4q1k0O2m2K0kQL9Kp9P5K5o2N9
$$ -43 -50 -40 -38 -49 -79 -24 36 -30 -32 17 -57 65 29 47 39 -25 6 14 -21 43 -38 -58 4 -38 -18 -20 -12 27 29 -50 25 50 -12 47
3013D7k1O3p3k2M6l6j8Nj2j0j0k3N9m1j6L6Rk6J6pQ4Mo0J29r3L2j3n2k9O9q3K8
$$ 47 26 89 16 -6 40 4 -14 -9 -21 -31 -41 -64 -5 -46 -62 -26 -17 -43 -27 -34 50 54 -6 123 30 62 49 -3 -32 37 -46 -18
3045a8j0j9K0k2L2LL0m9O6l9L3N0j49J71o4m8O7r6N3Rp6P5k8k0Nk7jL6n4L7M5
$$ -18 -28 -47 -27 -49 -17 -14 16 -33 33 -6 27 77 -72 99 35 -13 54 -42 11 20 -56 19 -9 -29 -24 -51 -52 -16 -70 -33 12
3076A2l2K7j4m1J08m4K2nn2L8n3K7N2r3L5M3p4K2O0q3M0N4l9L8k2j4L3k4N2j8
$$ 12 -20 7 -7 -48 60 16 38 33 -19 19 -34 -7 45 -48 -13 30 -44 -22 38 -45 -5 49 10 48 26 12 45 21 73 55
3106E5p4O3or2L2j7J3lm1N7k4pL2M3k9L8m7K6J4q1L9LLO4r1J3oo1P1L0k7k5Qm5
$$ 55 -19 44 38 -54 -22 -39 -26 -29 -70 -13 -37 -44 -12 31 2 40 -7 19 33 -48 -9 -6 -3 61 -30 -17 -23 -84 -13 17 -10 -35 -27 -72
3140g2O5m5J7L4jM8j0l7P5p2l3J34j08J3nj24J00l4k7Q7q8R4j4k8L6K4j07J43
$$ -72 -7 -52 -35 -1 -2 46 36 -1 74 2 -31 103 -5 8 3 -121 -21 -55 -82 5 -83 11 -3 -31 5 29 -78 65
3168F5j7p7N6n3M2Kk3J4Rn0P2j18NO9m1M9N0q3J7k3J4Q4r3N1N1p5M5n5m5P7r3
$$ 65 48 -29 27 -26 16 18 -5 9 18 -32 40 -78 -73 -4 -45 4 54 -29 -12 -35 -21 63 -30 21 72 -3 42 -13 -58 19 -74
3199g4L6M3j13J17o7j5Q6j03L6J08r1L7K8j0M1rm3K6kk5M5n8KRj2J5o5L7Qm1K4
$$ -74 -38 5 -108 9 -58 -73 13 -90 -54 54 -37 0 28 18 59 50 7 33 31 6 51 -7 -5 4 -8 7 -58 -21 -13 -54 -30
3230c0O2n8P0mq2J00J8l3K8q1kR7j29R2o2roj2M4Lp6N4m8L4O0j4J0M5q1R0K0o8
$$ -30 32 -26 44 40 -42 58 76 43 71 -10 -12 85 -44 48 -14 -23 -29 -41 3 6 -70 -16 -64 -30 30 16 26 71 -10 80 100 32
3262C2Oqj1j0Po0P9j01P4j2j02J03n8L9O3o8K6L9l9N0k0m1R8j28k3O1L5j8m2J0
$$ 32 38 30 19 9 16 -44 35 -66 8 -4 -106 -3 -61 -22 41 -27 -1 38 -1 49 29 -12 86 -42 -65 -4 31 13 -29 -19
3292a9J2j7n0Q4m0oN2l3jO5n6N9j7k1j9P1n7J7j9M4o8l7J02q7K3K7n9L6P4m5N7
$$ -19 -7 -24 -74 10 -30 -36 16 -17 -18 47 -9 50 33 12 -7 64 7 24 5 49 -19 -56 46 -41 -18 9 -50 -14 60 15 72
3323G2n9J6K4Nl7lNqLn7P1k8NK0j17P4K2j30J02l7P1QqO7n1kK3l9j3M8j8p8L0
$$ 72 13 29 53 58 21 18 23 15 18 -39 32 4 9 29 -88 -14 8 -122 -20 -57 14 22 14 81 30 28 51 12 -1 47 29 -49 -19
3356a9KL7l5p3M4O0m9P2o4PL5o7M1NK6Q2m7n5Q1j03O2P5j24j4L4n0J5pk2O6o6
$$ -19 -17 20 -15 -88 -44 16 -33 39 -25 -18 17 -50 -9 -4 22 104 57 2 83 -20 42 117 -7 -21 13 -37 -22 -29 -51 15 -51
3387e1OO3j2RKRL4K8o7Lk3N0j3n8M4l0M0l3j12P3K9o4O5%J1KK7n1P0n0M0l3l9
$$ -51 -45 18 6 15 17 26 60 88 21 24 1 51 38 -20 24 -6 34 1 -111 -38 -9 -73 -8 -8 3 5 32 -19 51 1 41 8 -31
3420c1N2L1o9J7l0M6J9j15J23o4L7M4r7jM6OrJ23q5kk4JLl2N3k9l5K4Pj04P2p
$$ -31 21 52 -17 0 -30 16 35 -80 43 -21 16 60 -37 -38 8 14 5 128 43 41 17 18 21 -11 42 13 -22 2 9 -95 -23 -30
3452c0L6J3j14P5L2n1P2o5O3m5O0qJ8r9K0rj2j2P6l8J4qk0M0m3L4pK4K7rJ4j1
$$ -30 6 19 -95 -20 12 -39 33 -32 31 -14 46 38 56 -43 -23 -32 -44 -56 20 -18 -4 -12 -32 8 -35 -1 -8 16 43 34 48 37
3484C7l3ML1r9J28n1r2J14q8L4L4p6N2qm9J52r8j2O5%m3N5Pp8L6RL9l9o8J28n4
$$ 37 4 8 39 -60 68 17 -75 39 -49 -15 19 -57 -5 -13 -62 90 -8 -20 45 45 2 57 64 -14 22 31 70 31 -37 91 37
3515C7m2Ro3O4l1jJ3j0M4Nl0QP9r8K5NJ6K9n1j7J1r3J5K1k9P8k1k1N6l8J1P3n7
$$ 37 -5 4 -59 5 -26 -27 -14 -24 20 25 -5 3 82 -16 9 14 30 59 8 -9 2 -91 -76 -55 -84 -6 -27 -48 8 -30 -19 54 -3
3548cO7l7k5R2p9J9O0m6n2N0n9N2o9l5K7J0L7O4o1M9k6pJ4j2j0N0n2mL1p3R6M
$$ -3 64 27 2 94 15 34 94 48 -4 46 -13 39 -30 -65 -38 -28 9 73 12 61 35 28 42 30 20 70 18 14 45 -28 68 72
3580G2j40Q2j3p9M9l5K5O5m3rKJ5L4O%P2r1M0j6o1P5q2M2K2r0N7N8j22M2L3p1
$$ 72 -68 14 1 -78 -29 -64 -39 26 -17 -26 -24 -9 25 31 31 103 12 52 36 -25 50 -32 10 32 -58 -1 57 -65 -23 10 -61
3611f1O3k8L0L1p5M8L3J5m8NJ3Pl5K7Nj5J8k3m8L9l9M6M1k8nJ3l7JL8n6N2l0O7
$$ -61 2 -26 4 35 -40 8 41 56 8 13 26 33 -2 25 30 15 33 10 -38 1 -38 8 49 21 16 29 -8 -7 31 -25 27 -3 64
3644F4J3q9oJ2j2P7q1K4K7o1RK2m4N9Np8J11m6l1L3O0no5k2L1k4jJ16j43PJ9m4
$$ 64 77 -12 -18 -6 -18 59 -22 2 29 -32 -23 -1 -45 14 19 -59 52 6 -25 8 68 63 -2 -24 7 -17 -18 98 -45 -38 -19 -63
3676f3M9j4MO7j7j3M7r1RK4K2K8j2o9J0mMJ8pN2n2l6O0p6k4R7j3J2q1Q2O2q6j2
$$ -63 -14 -28 -24 43 26 13 60 -31 -22 2 24 52 40 -29 -19 -23 -19 -1 -8 44 -8 -44 16 -60 -84 13 0 12 -69 13 75 -11 -23
3709b3J13m2m0L4j3p9M5Pj3j5m0J31j00K9M4l1k0Q2j02N8j9N3J1o9N8o2j3J1J4
$$ -23 90 48 8 42 29 -50 -5 2 -11 -26 -66 65 -35 -6 38 7 -13 69 -33 25 6 59 70 1 59 -3 -16 -5 9
3738Ik9K0l0j5Q5r3M2j0m7J01p4J3O6k0K5k0p3P7l7NJk2J5L3p2M8N8r1J11m9j0
$$ 9 -20 0 -30 -45 40 -53 -11 -21 -68 33 -41 -28 38 18 43 23 -50 27 -10 -5 -4 -26 -11 22 -50 -2 56 -35 76 27 17
3769A7j5m7N8oo9J49j10QoM3M1j03L8L8m7q2J17q5L9m0RqQ2qj3K2k3km0M1O4p0
$$ 17 2 -45 13 7 -62 87 -23 -15 -21 22 63 -40 -2 36 -11 -93 24 -61 -22 -62 -53 -61 21 13 0 22 -1 -3 -43 -2 62 -8
3801hK9n5O8o5J3K5K7j10O0Kj7K6J3j3rPj0M5M9q5M1j7J5o1N6M3j26J8K2m9j1
$$ -8 21 -34 34 -31 -18 7 34 -76 -16 -14 -31 -5 8 -5 -14 -7 -17 28 77 -8 33 16 31 -30 26 69 -57 -39 -17 -66 -77
3832g7Q6l9NJk2O0L4j4kj5L0l3m9O6k1M6Jo0m6N8k2K7k6m6J12j30L8M9p3J5M8
$$ -77 9 -30 -25 -24 -46 14 48 34 32 17 47 14 -35 31 10 56 57 -3 -49 9 -13 14 -12 -58 54 -76 -38 11 -62 -47 1
3863Al5N1n6N7k6KK2J0k7on1L7N8q5J6nnO9q8J1M2%M9j7k8M5m8rL4L0q4P0o0L8
$$ 1 -34 17 -39 18 -8 -6 16 26 -1 -7 -58 -21 37 -48 -32 -37 -42 27 -61 -50 -8 -8 41 24 -4 41 -7 -16 18 48 -36 34 -26 12
3897A2o7Q4qJ3j3jmp9O5j0J7L7k1l6k1n1R9l5JRk1lM0l3O6n6K2j6k8M8Mj8M0j3
$$ 12 -55 29 21 34 21 20 16 -63 2 -8 9 46 25 -11 -32 -83 16 -19 -18 -9 -30 -33 7 -26 40 -16 6 -10 -38 10 14 -4 36 23
3931B3lM8k2nl9k4L9k3o7M1O1q4L9Nj9K4RL3j1j5jj1n0O0J4j5J1nJ1o7O9n5L2
$$ 23 20 68 46 41 2 -22 17 -6 -73 -32 29 -55 -16 -11 -30 -6 3 36 25 10 9 -2 -52 8 22 7 18 13 24 -43 26 -29 3
3964Cjl7l9M0J4K4lj8P9p3Kj6K9J9M7l6m9J2J0j3L9j2k1K3o5KJK2K3j0L1k8l9
$$ 3 2 -35 -74 -34 -20 4 1 -17 62 -11 -9 -25 4 23 70 34 -15 -3 7 -6 33 21 0 23 -42 -40 -39 -17 6 -4 27 -1 -40
3997d0J7P4q2RN0p6M0LJ6J2k8k1L5klj4rmJ8K3k0J3K6l9qL5kL1k2j4L0p9j9N4
$$ -40 -23 51 -31 -22 28 -48 -8 -5 11 23 -5 -26 9 7 4 -10 -19 -23 -5 18 -2 11 37 -2 -10 25 23 54 32 18 48 -31 -50 4
4031Dj5k2L0j9j6K2M1k1n8L8l0L9kK1l3J6K2o1N0k4K5n0J4n4L8jL6K3j11R0N1
$$ 4 -11 -33 -3 -22 -38 -16 25 4 -54 -16 -46 -7 -9 12 -21 -5 17 -44 6 -18 7 -43 -29 -83 -45 -46 -10 13 -98 -8 43
4062D3k6j4NL0l7K7J9p2O2pp6J3O5m2qK5rrl7l6J01nKm4J6Pj4O6j9j6J7k3Nl6
$$ 43 17 3 8 38 1 28 47 -25 37 30 -46 -33 32 -10 -18 7 -2 -11 -48 -84 17 12 14 -30 -14 -7 -21 45 26 10 27 4 9 -27
4096b7K5N4m7o6M8kkL6J7k8L4k9M5m8Lmj2J5j9J12o9l3P8j21O0m5J4m2PJ3k1O3
$$ -27 -2 52 5 -61 -13 -15 -17 19 36 8 42 13 58 10 13 9 -3 12 -7 105 36 3 81 -40 20 -25 -11 -53 -46 -33 -54 9
4128Ik6PON8m3j4L8k1O5l7j00R2k9j2N6o7j3j0N0%Rn0j1%L7K6N8n9MK6m3m3N9
$$ 9 -17 -10 -4 54 11 -3 35 14 79 42 -58 34 5 -7 49 -18 -31 -41 9 9 18 -32 -43 -43 -6 20 78 19 23 49 6 -37 22
4161B2k1l9N7l4J0K5m7J2PK1KJ0k9kN1l2Mj6K8l6L5o9N5k3L0k9k0N9n2MK4Jm2
$$ 22 1 -38 19 -15 -5 20 -27 -15 -8 13 15 25 -4 -6 45 13 17 1 29 -7 28 -41 14 -9 21 -8 -28 31 -21 -17 7 8 -34
4194c4L1k5M6o0Q3l7l8J5j6P7n0j5k3pO5m2J9L0l6N7m3k7J3K9M0jm7rO1n3M6j6
$$ -34 -3 -28 18 -42 41 4 -34 -19 -35 42 -8 -23 -46 -53 12 -30 -11 19 -17 40 -3 -30 -17 12 52 51 4 -5 56 3 49 33
4226C3j4K5m6nmrM8o7N4j9jQlmNL0n9NLk5Q5Lq4J16m1m5k7NpM8j12J41n0J6M7
$$ 33 19 44 -2 -7 -11 -20 28 -39 15 -4 -5 3 0 -4 1 31 -28 -23 -20 -45 40 43 -41 75 34 -11 -38 -33 -40 8 -104 37 -13 3 50
4261E0o8j2L3L4Oo0K2K1k4j7OJ2J9ql6M2ln6Jn7N7l2O6J2M4m3MJ2J7p1N3J3p3
$$ 50 -18 -30 3 37 43 -17 5 26 2 -15 -9 3 22 14 -22 20 17 -39 -38 -95 -38 -70 -4 8 52 9 13 25 42 -29 24 37 -36
4294c6N5j8K6l0j3kL1pmo7K7Q4j5o3K9J5l0J5L4nK1Om3k2j5J8k7L9j8N9k2l9j8
$$ -36 19 1 27 -3 -16 -18 13 6 2 -65 -38 46 31 -32 -3 12 -18 -3 31 26 47 53 10 -12 -27 -9 -36 3 -15 44 22 -17 -35
4327c5M6J1j5k6L4p5O2j4k8O2n3lJ5Rmj0MkP5ol7j8k9O7j4kq7J53n7Jk2J6K2p
$$ -35 11 22 7 -19 15 -60 2 -12 -40 22 -31 -34 -19 -10 -14 -24 -20 -22 53 47 10 -8 -37 30 16 14 -73 80 23 24 2 18 40 33
4361C3l2l1K8J%k3L0K2m0j7j4L7kL9p3O0m3K4K0m4O9m1L4l5K7k9j7Mn8M1N4Nk8
$$ 33 1 -30 -2 -1 -1 -24 6 28 -12 -29 -43 -6 -8 31 -42 18 -25 -1 19 -25 44 3 37 2 29 0 -17 -13 -71 -30 24 29 1
4394Al7N3Jm9M0L1pk8J6L3l1n4K2J5J4l1M8o8K1m6K4K4Jj1J8JnJ9n7J5M3n9L1
$$ 1 -36 17 18 -31 9 40 33 5 21 54 23 -31 -9 6 20 -11 37 -31 -10 -56 -32 -8 -7 -18 0 1 -4 15 -42 -27 16 -43 -12
4427a2j9K5j6l0RL7K5k8J4p3Q4m2N5p3M0J8k2j6N2m3L7J6q3L4j8L5N9q4N1k9j1
$$ -12 -31 -6 -22 -52 -43 -6 19 -9 5 -68 16 -26 29 -44 -4 14 -8 -24 28 -15 22 38 -45 -11 -29 6 65 -19 32 3 -8
4458hk1L1K7n3M7m6O3j8k8L5k6P5o6l6M2L3l1p4J05l2qK6qk1M6j8q3K7N8l6N5
$$ -8 -29 2 29 -24 23 -23 40 22 -6 29 3 78 12 -24 18 51 20 -54 51 19 11 37 29 8 54 36 -47 -20 38 2 57
4489E7j9m2J0J0l3K3k5J9J0L0m5N2n0koJ1M7n7k1N7o4N1N4j06Q1n4M5Lnk2K6o8
$$ 57 38 -4 6 16 -17 6 -19 0 10 40 -5 47 -3 -5 -11 0 47 -10 -31 26 -38 13 67 -39 42 -12 33 36 31 9 35 -33
4521c3O3J9j00J6QO3j01N2k7O6l1J3k7rN8l5QN5p3j3P5l4J4o0j8MO3k4J8o9L8
$$ -33 30 49 -51 -35 -27 36 -65 -13 -40 26 -5 8 -19 -28 30 -5 3 58 -15 -28 47 13 27 -33 -51 -47 16 -8 10 -59 -21
4552b1j9KOL0pJ3L9o9K9N1Ol2r3J33k6l1M3m3j2L8j35R3K8l5M4m1K7Rp2L5K8m7
$$ -21 -40 -38 -32 -2 -9 4 43 -26 3 54 60 28 -65 68 42 11 54 11 -1 37 -98 -5 23 -12 32 -9 18 27 -45 -10 18 -29
4584b9K7k8OM4j4lJ9o0K1jmk6M4L6Jj00R1Klj5j9j2L2k4L4Rk5MJ7k6k4OM0k2j5
$$ -29 -2 -30 -24 20 6 3 22 -38 -17 -18 -22 -48 -4 32 33 -67 24 26 23 8 -11 -23 9 -15 19 28 3 7 24 -2 -26 -20 20 -2 -17
4619a7j8Q5o2MMo3N3k4L1J1pk5j0Q6K0j2j13j9N3j6M%M3l3O3J2j5j9qJK0Rn1J9
$$ -17 -35 50 -12 -8 -4 -67 -14 -38 -7 4 -3 -28 -38 48 68 56 -57 -76 -23 -39 -35 -35 8 -25 38 50 35 16 8 9 29 38 -13 6
4653FO5l7j8l4R0p7j1N3p2M0K0n5M7l1K4Ok1m6L7J5K9ln9j2M9k6L6l3J9j0k%k9
$$ 6 71 34 16 -18 72 -5 -16 37 -35 5 25 -30 17 -14 10 16 -5 -51 -14 1 30 27 -32 -44 5 -21 15 -18 1 -9 -11 -11 -40
4686d0L9kP5q5rJ0J7P3m5Ro0J4jK7n0J8o1J3M4l3Q2n9K5m7%Q1k4J0k5l6l7J32
$$ -40 -1 -3 72 -13 -22 -12 5 78 33 42 -18 -4 -5 22 -28 -10 -71 -58 -14 -47 35 -24 1 -46 -46 35 11 21 -4 -40 -77 55
4718E5n7Ll2j9J9J3QJ4K3k3J2k3oM5J1p4K9j8P9l4M2o4L4jqn8J15r4Nl5N3p0O9
$$ 55 -2 1 -31 -50 -31 -18 -10 4 27 4 16 -7 -13 32 43 -31 -2 -20 59 25 67 3 37 36 28 -30 85 -9 -4 -39 14 -56 13
4751A3j6K2n0kQ2l9m8Q1k6L5j5l9N2j5k5Q2m7j01J02j4m2n9K2lN1mo4J22o5K2
$$ 13 -3 19 -31 -33 49 10 -38 43 17 52 37 -2 50 35 10 92 45 -56 46 32 -10 -69 -47 -50 1 -3 -67 55 -10 12
4781A2N8n7jm9L2K7ML6o1k5nK5qn0K8L1L1p5O3l5K4J4K0j2n4N9j6Lk8M7j4Kq3
$$ 12 70 13 12 -37 -5 22 26 62 1 -24 -29 -4 -12 -62 -34 -3 28 -47 16 -19 5 19 39 27 -27 32 16 19 -9 38 24 26 -57
4814e7L3K0K2L5n3lMJ4p3L2P4n6J9j3j1j4M2mm8K1K3Lm1k9O1o1N7j6%M6m4J7J5
$$ -57 -24 -4 18 53 0 -3 1 15 -58 -26 48 -8 11 -2 -13 -27 15 11 -37 -16 7 10 -31 -60 1 -60 -3 -19 -19 27 -17 0 15
4847A5n0P3l9l4N8j9RM6j15R2k2K6k1k4k7N5Jl7N1J1k5L2Jr0M1N5m1J6n4M4m5
$$ 15 -35 38 -1 -35 23 4 13 59 -56 36 14 40 19 -5 -32 23 24 -13 38 49 24 56 57 -33 8 63 22 38 -16 28 -17
4878a7K2J2n4Q0p4k9J7K5J1j2OL6j6l9Kk0P7n6O4nK6k7rm4M8l2j6K1M7j02O2p
$$ -17 5 17 -37 43 -31 -60 -43 -18 -7 -19 -13 23 7 -32 -30 -50 27 -29 35 30 56 29 20 -24 24 -8 -24 -3 44 -58 4 -3
4910cl2PN2jnm3%J5kk0J8Q1j1l5M4q1L1rOm8j2L2l1L7k0J8RL3J0m1JO3n0M6r6
$$ -3 -35 -28 24 23 18 -25 -25 -10 -12 -32 -14 67 56 21 65 -16 15 6 12 -36 -48 -16 -47 -10 -30 -12 -3 30 40 -1 0 63 13 59 -37
4945c7L7Lj2l7N2k2n0j0N3L3o7N9o4M5J7k7MjN4m8P7j2Po4k7K1N5o3N1n4K6Kn
$$ -37 0 3 -9 -46 6 -16 -66 -76 -23 10 -57 2 -62 -17 0 -27 -23 -24 30 -18 59 47 54 -10 -37 -16 39 -24 27 -27 -1 1 -4
4978dk6N8o3M6L1o7L0k1rL8m6J4M9m5L0Lj8k2M4l5K7J3k3k7L0L0j8m0J3J2LrL6
$$ -4 -30 28 -35 11 42 -25 5 -16 -25 13 -33 -19 30 -15 15 18 0 -22 22 -13 14 27 4 -23 7 37 19 -21 -8 4 7 -2 34
5011C4p4J8J5%N0l1k2Kk5L7m2J1OnM1l5M9Jp7O3j0k5R3q1Mo2O4n3M8joJ4M2m4
$$ 34 -40 -22 -7 -7 43 12 -10 -8 -33 4 -38 -27 -21 -26 15 -20 29 30 -47 16 6 -19 74 -7 -3 -65 -1 -54 -6 -7 -13 1 43 -1
5045ak4O1r0O2oj6J4j4j6K3k0K0k0J06o2p3Q0m0L6o7P1Nk5n9O1k3J6L1LM7q1N7
$$ -1 -25 36 -54 8 2 -14 0 -14 -30 -7 -27 -7 -27 79 17 -56 24 -16 20 -47 24 29 4 -55 6 -17 -1 30 33 80 -1 56
5077E6l7k5j3Km1Q1m0k3N2m3l9M0K7l0M5k9K3L8o9L8qJ3pj6J9L2n1lK2OJL0j8
$$ 56 19 -6 -19 -17 -58 23 -17 -40 12 -31 -70 -30 -3 -33 12 -17 6 44 -25 13 5 18 11 -5 14 46 -5 -8 14 20 21 51 33
5110C3l1j4K0QM1j5p0M2nk8J4Nj5J11p7m9L5k1Kk1K5N3o6l0Q9o8L8qn1K0M4J0
$$ 33 2 -12 8 16 57 42 -28 14 9 -19 -5 0 -15 96 19 -30 5 -16 -14 -35 -10 43 -23 -53 36 -32 6 -2 -53 -33 11 21
5142B1%o0M3M3j5j8n0K1K8J8j00M9Pj0J8J9J3j10N3jM8Lj8M0o9R7o6M6p2l2J03
$$ 21 21 -39 4 47 32 14 -36 -15 13 31 -69 -20 -13 -23 -5 14 27 -83 -30 -31 17 20 2 42 -27 70 4 50 -22 -54 49
5173D9k4k1%k4KL5m9M2l8j3P9j8l0NK5J5Rk1J6p5J17r6k4j5j1Q8m6mj0j9R1m6
$$ 49 25 4 4 -20 -18 17 -32 10 -28 -41 38 20 -10 -5 20 35 44 23 39 -36 81 -15 -39 -54 -65 23 -23 -27 -37 -56 35 -11
5205a1J7l0M4o4P3k4j2l4M6lk0O1o2K6j1q2O5n9O3J2k0M7m5P0l1J9j4K0K0j8o3
$$ -11 6 -24 20 -44 29 5 -7 -41 5 2 -18 43 -19 7 -4 -86 -21 -80 -17 -5 -25 22 -23 47 16 35 21 41 61 43 -20
5236b0J7K3J0m3J9J9k1m9J1L4pM6k2Ln3j0L0n6M7L9m6L6o2P8n2J3M9l0l0j9PL8
$$ -20 -3 20 30 -13 6 25 4 -45 -34 0 -7 39 17 20 -33 -43 -13 -69 -22 17 -29 7 -55 23 -29 -16 33 3 -27 -46 -39 -1
5268aK3mo1K4Qj2P6pj6o0M1K8qK8q3L7J3pm3L9j1M3n7J9L6p4jN9M0OO2q6m1m1
$$ -1 22 18 -43 -19 -11 -23 53 46 30 -30 11 39 31 59 -24 13 26 19 -24 15 4 47 -10 9 45 -29 -30 29 69 75 137 51 10 -31
5302c1rM1j8KJ1pm4N0m2P9l6k3L3l3qj8J7M7M3r3N5K3m1K0J3m6J8l9R8m1n4L8
$$ -31 -40 1 -17 -15 -4 -11 -55 -5 -47 32 -4 -27 6 -27 -35 -53 -36 11 54 -39 16 39 -2 18 31 -15 3 -36 62 21 -33 5
5334El3M7k0K9l7N2oMl4l4L3MJ7j0m3J2L3m0lJ3JK4M6l0j3j0oj2J6L5m4nJ0Kj5
$$ 5 -28 19 -1 28 -9 43 37 41 7 -27 6 10 27 17 -26 -14 19 -21 -24 -11 -10 14 60 30 17 7 1 -11 5 40 -4 -9 1 3 -12
5369a2J9q0N1O3k9j1l2rJ8OK1J1l2J6j7M1k8l1K1k9M2K8p0J0M6n5J7K1K5Qk3m
$$ -12 7 -73 -22 41 12 1 -31 -40 -22 -16 5 16 -16 0 -17 24 -4 -35 -14 -43 -1 27 -43 -33 13 -42 -25 -4 21 29 6 2
5401Bl5N0l6n0K7N5J2o8Q4lnJ3l1k4J8J1p5M1NJ1L8l4j2o2O6N5o1K3n0M9l4QJ5
$$ 2 -33 17 -19 -69 -42 13 25 -43 41 38 33 46 15 -9 9 20 -55 -14 -9 2 40 6 -6 -68 -2 53 -8 15 -35 14 -20 -12 3
5434CkrP1k9J3L1r5n0J02o8M1l2M4L5j02K8j9O0L4j14P5K1k9nJ2j0Lj6K6p6L1
$$ 3 1 -8 63 34 47 78 -17 -67 35 -33 8 -24 20 55 -47 -19 -38 22 56 -58 17 38 9 4 16 6 9 -7 19 -57 -26
5465b6J1j9PMJ5p4J49p6m3K3k5R9J01k65K97j49M2k41N9J52m0Q5k38M20k55r5
$$ -26 -15 -34 -27 -23 -8 -82 67 -9 -52 -29 -54 45 146 -119 178 29 71 -170 -111 41 1 86 -152 268 13 -82
5491h2P2k4j8M8RRJ1k4l6M8k8PmN8k3j07P7L2K3q5j3O2k4j5k2O5j8N9n3j9J3M0
$$ -82 -10 -34 -52 -4 5 14 25 1 -35 13 -15 -8 -12 46 23 -84 -7 25 48 -37 -50 12 -12 -27 -49 16 -2 57 4 -15 -2 38
5523C8j4Pl0JJ0k7J4M7o1OL6l7j4pN6K5j04M7nRL8o7J15q5J3k0MJ0rr6J48L6p5
$$ 38 24 31 1 2 12 -15 -1 46 -15 -9 27 -10 -24 -31 25 50 -54 -7 -12 -3 35 -32 83 -2 11 -9 -5 5 -4 -100 48 84 9
5556Ij3k0J4j2L5QK8m2mJ4m1L4L9o6LL7j7J3m5N1o1K9Lk5jK0Lj4mj4Q4p1N3O0
$$ 9 -4 -24 -10 -22 13 21 49 7 3 17 -24 10 49 -17 -14 23 6 19 -26 25 -36 -7 -4 -29 -30 -10 -7 -21 -25 -39 45 -26 27 87
5590H7j09k0J11j07M6k6jj2j4qM5l2mK5lL2K3q0Q0j7p6O0K3M0q6N1m5L4Oj0L8
$$ 87 -22 -42 69 -38 8 -18 -19 -31 -45 -53 -8 -40 -44 -19 -22 10 33 -47 33 16 -60 0 23 63 -23 28 -17 17 23 13 51
5621E1o1oLJ7Ok3k7J9J8l0Nrj0M1n8O1J4l3K0j0N2k7j5J5p4N8J3q2R7j5n8Q8l7
$$ 51 -10 -16 -13 4 10 -13 -40 -21 -3 -33 -28 -37 -47 -6 -64 -3 11 -22 -2 -12 40 13 -2 13 -61 -3 10 -72 25 10 -48 40 3
5654Cj9Q5k0j0l9n0Q2mk1J8n3O8rn7j1J1M7o9N9Qk4j7N7m2m1J02j37J26o0LN5
$$ 3 -16 69 49 39 0 -50 32 28 7 25 -28 40 31 -26 -37 -26 21 -48 11 19 -5 -22 35 -7 -48 54 -83 43 -17 -14 41
5685D1l6m3O1p6J6M0l2M2l8l1M4J2k9pP5k1l5N5mOm4P5n8K7m9l2K8qmj1M2k1k2
$$ 41 5 -38 23 -53 -37 3 -29 13 -25 -56 -12 0 -29 -36 39 18 -17 38 34 40 -4 71 13 40 -9 -41 -13 -21 -25 -36 6 -15 -37
5718c7R4n7Rm6O4ql1R4j04N8n5N0k2j1RjJ8k6n5J16p2K8lN4o3k1J6j4j1L8k4j5
$$ -37 57 0 9 -37 27 19 -12 82 -22 36 -19 31 9 -2 7 6 24 -2 -57 59 -13 15 12 66 3 -18 -2 -16 -27 11 -13 -28
5750b8N1J5j3o8JLk7O4QnnK7j9K6m3k0rO5o1J5K5l2N6n3N0l5L4rj1Mj8mJO0n5
$$ -28 23 38 25 -43 -42 -39 -66 -2 6 1 -4 23 4 30 -13 -33 -42 23 -38 -23 2 -30 26 -27 23 -12 22 13 2 6 -12 -16 -15 45 -10
5785a0L9l6pm0J4O8j8kQJ0n5k8M7RK2J9k0m8J0k5m1J03n2O9J0r8J06j9J3ko0J
$$ -10 29 -7 -14 -54 -40 28 10 8 16 26 -29 -57 -10 -1 21 40 20 -28 -18 -43 -84 19 -33 36 46 -52 54 35 48 46 -14 -13
5817a3N9k2J6j2rk6Lj6J0M6q2O8r1J66j08K0K0j6L8n0k1L7JJ6l6J6k0J8K6m3L1
$$ -13 46 24 40 28 19 -7 -4 -20 -10 36 -46 22 -69 97 -11 9 29 13 51 1 -20 17 18 34 -2 14 -6 12 38 -5 26
5848B6l1RML2n6M4l3N5m0k4K2J2k8lJ5J4l1N5m7j8oM3k7J0l2qK6J7K2J4k6l2R3
$$ 26 -5 4 8 40 -16 28 -5 50 10 -14 8 20 -8 -11 4 18 -13 42 -5 -23 -29 14 -13 -3 -35 -43 -17 0 22 36 10 -22 71
5881G1o3Nkqjl2NK3RK4j7l1oM3m5M3k8L4Oj5k5j9k6L1M8j3p0J06q2N7%M1n0k8
$$ 71 8 13 11 3 2 -30 -25 -2 7 31 14 -17 -23 20 -25 18 -10 24 30 15 -10 -29 -55 -24 24 11 -59 47 -35 22 22 63 13 -15
5915a5N9k6J1q6P9o0k1J3M0L9k8p3J19m5k5QJ5k5J6m5K6oJK8n4J00j7l5n%Oj4
$$ -15 44 18 29 -57 22 -38 -59 -46 -6 33 5 -68 51 6 -19 -11 4 -21 -5 -50 -24 -30 -29 -1 -55 45 28 -7 -12 -12 -6 -20
5947b0qJ5L2q0Q1p1pQ0k1K0rj6J4jn2M6L5mp3N2m5J0n6Q1N6r5Q0m9l7O0k3j9M2
$$ -20 -28 -13 19 -61 20 -51 -58 22 1 21 12 -4 10 9 -43 3 38 34 -39 13 -32 -22 -78 3 59 -36 44 -5 -42 18 -5 -24 18
5980A8m5j1QlM4K7l1K3j05J02k5o3M2K8k2L6K3m5J5k5K1l4m6L8N3p5O5Rk1L2l5
$$ 18 -27 -38 -30 -33 11 38 7 30 -75 27 2 -61 -19 9 -13 23 46 1 16 -9 12 -22 -68 -30 23 -52 13 22 1 33 -2
6011bJ6L4q4N4l2N2p3qL8K9n3O5o9J4JJ2o6M2Nk2L9oP1m9P8r4j2OOn%Km5R4K8
$$ -2 14 48 -36 18 -14 38 -35 -43 -5 24 -29 36 -33 -19 -18 -6 -72 -30 -25 -47 -8 -14 57 8 86 -8 -20 -14 -8 -13 -13 -11 -56 38 66
6046F6q0%L2p2L4KqN2k8l3k0J7O0j9j5N6o2l7N0rO5k3k4k4JP4j1j9m4L%l9K6P3
$$ 66 -14 -14 18 -54 -20 -18 -26 26 -2 -35 -55 -38 22 3 -12 44 -18 -55 -5 -14 51 28 4 -20 -19 55 44 25 -19 -16 -16 -55 -29 44
6080D4o4j6%qNQ5l7J0k6m1N8lJ1J1p8M5j5O3m0Oj7J6m0jN1k5K7%j7J6L4q5M0J5
$$ 44 -20 -36 -36 -44 -39 46 9 19 -7 -48 10 7 18 29 -49 -4 -19 44 4 10 -7 9 -31 -32 19 -6 21 21 4 20 54 -31 9 24
6114B4n8N7J5k9oj1n1J00l5j1PL4j6n5Q2o9J2L6Pl5m2K0JM0m6L0l1K4k6Q8p3%
$$ 24 -34 23 38 9 3 -8 -59 41 6 -5 2 36 20 -35 47 -22 -10 26 33 -2 -44 -24 -23 17 -29 1 -30 -6 -32 56 -17 -17
6146a7RM4m4p6J23k5kkom1M8n6O3Rpj0l5JJ4m6N8k8%j8PM8l2J9nMj5rLJ6j3L9
$$ -17 -8 36 -8 -84 39 14 12 10 4 -37 11 -45 18 27 20 10 -25 -24 -10 -56 2 -26 -26 -44 -37 11 -21 -2 -7 -3 -18 -27 -24 -8 -21 18
6182A8n6K0OL1Ko1L0Kj1N5kpMm5RN9p9%j3M6j7J9k8J6k7L9l1P9o6K9o4O2k0L0
$$ 18 -38 -18 -12 19 21 -40 -10 -8 -19 36 34 27 31 -14 -5 54 -25 -25 -38 8 -9 10 -18 -2 -29 10 -21 58 -8 21 -43 19 -1 29
6216B9jj05P9J7m8P3o1pL3k7Nrn2L5L5k3oL6n5P6l7k8R3on6K8kKl8J2k6M1j2l8
$$ 29 28 -77 2 19 -29 44 -17 -24 9 -18 -13 -22 -74 -39 -4 -27 -33 3 -52 24 -13 -41 52 46 -10 18 16 18 -20 -8 -34 7 -5 -43
6250d3J1J2K3M6m1mn1N5j8M5m7j44J29L0l19q8L98J42k43J94j24o2J47m2j8j30
$$ -43 -32 -20 3 49 8 4 -47 8 -10 35 -12 -156 -27 3 -316 -404 -6 136 -107 87 -37 -99 48 6 -12 -142
6276a42N8P3j7J5J73k17Q0N8k23L38j66K48l89M5P3j17J38p8R5m1k8PN9j07Q3
$$ -142 -84 -11 -28 -13 160 -57 23 81 -142 196 30 278 -111 -66 7 -110 28 -50 45 4 -24 -17 42 -65 18
6301A8o5M4J3l2k0O4r2Q8l5N0n5L3Qrl6NJ2L7m4L7jk9KL4n3N8ok3j7J7j7Q2m9
$$ 18 -47 -3 10 -22 -42 22 -70 18 -17 33 -22 11 19 10 -26 -21 -9 28 -16 21 20 -9 -7 27 -26 32 26 3 -14 3 -14 68 19
6334A9J0Nm1l0N5p7N6K8n2j6L0L6o5N3M1m6l4M7l2K3k8j0K6K7n6MO0n4j3M8J5
$$ 19 29 34 -7 -37 18 -59 -3 25 -27 -43 -13 23 -42 11 52 6 -28 19 -13 10 -18 -28 -2 25 -31 -27 33 -21 -34 14 29
6365B9k5kk5NQ1p1O7J2o8Pk5j7M1l3kj9rO0M7q1RK6KJ1k5J4k2j4Q4l0jn3j9N1
$$ 29 4 2 -23 -18 63 -8 59 71 3 10 -15 -32 9 -24 -26 -45 -54 6 53 -28 -19 7 9 20 -5 9 -13 -27 57 27 26 -27 -46 5
6399Ej6j7k1PL2K4J6o3P0q5R2o1R2n5k6KmL5q6O7m8O0K5r5O1Ml6J2M2j02N8j4
$$ 5 -11 -28 -49 -42 -10 14 30 -33 37 -48 44 -17 75 20 -6 -4 -8 27 -59 8 -40 20 45 -50 11 15 -21 -9 33 -69 -11 -25
6431b5P2l7oq1P6n1j0L4M4l4m4L4Rj6J4L0l2j0K6l9P7l6j7P0j5k1L6j7q4N5j6
$$ -25 47 10 4 -77 -1 -52 -62 -28 16 -18 -62 -28 -19 -35 -21 9 -23 -33 -7 -46 31 -5 -22 48 33 12 48 31 -53 2 -14
6462a4LQQl9LM4n1N0J0Qml2M7o7K0K3m8k6J00o6L6j6n4L0k2K2N6o3kK6J5J6n3
$$ -14 -11 -3 5 -34 -31 13 -38 12 22 30 26 -6 41 -26 -6 17 -31 -57 43 -23 13 -3 -57 -27 -49 -27 29 -34 -36 -10 5 21 -32
6495c2RPOj1L4J0K4pm0L0m2K2MN2r3M3n5K2p0R6l3k4R4j2p2l5R2j1Rl2N4%l8p0
$$ -32 -23 -16 -10 -21 13 23 47 40 0 30 -12 10 14 66 -27 16 -39 -17 -87 9 -24 -48 46 34 -38 -73 19 8 17 -15 39 39 1 -69
6529f9P9j4j1M5m3M5q5K7N3k3K3K5n1n6N6n9Q9o4L9M1p0JP9q6J7M7n1J7npN7l0
$$ -69 10 -4 -15 30 -13 32 -53 -26 27 4 27 52 1 -55 1 -58 31 -33 6 47 -23 -22 57 -29 -12 35 -16 1 -4 -11 46 16
6561A6o4L6k0P7o7L2K1j3m1LM4k3pJ4r5M1K8L5Rj1K3l5NL4k8l2PJ9j2k0M6o0K
$$ 16 -48 -12 -32 45 -22 10 31 18 -23 -20 24 1 -6 8 -87 -46 -18 17 26 15 38 3 8 42 14 -18 -11 8 -4 -24 22 -38 -36
6594c6N0Lj7M1n6RLl6M7l1K2J5k8j3P7r8R8o1J9pnL7J7m8J7Kl9R8n6l6Rm3M9j5
$$ -36 14 17 0 41 -15 -6 -3 -39 8 -23 -1 14 -14 -27 50 -48 50 -11 8 1 -4 33 50 2 19 21 -18 80 24 -12 -3 -46 3 -12
6628a2M1J4j3q9N7K4J5n0Q3m8j4nkKk4pJ0k3qL0K8l5J8l8N0k6l3N7J7O2k0l8j2
$$ -12 29 43 30 -59 -2 22 37 -13 70 22 8 3 1 3 -21 -28 -18 -41 -49 -19 9 -26 -8 -46 4 -22 -55 2 19 81 61 23 11
6661A1JMjml1P0q7K7MJ3J1l5N8m2j2k7K8N3n3NPqN2k7k4M8mk5k2M7p3J41j11l7
$$ 11 12 16 15 11 -20 50 -37 -10 -6 7 18 -17 41 -1 -13 -40 -12 41 -12 -7 0 -8 44 17 -7 41 37 12 -10 37 -36 105 -6 -43
6695d3J04p9K5Pk1rO6q2K9K6J3o1kRK6J8M9q4jK3j8m2O4Mjk9n2J02p3J6k6M8K4
$$ -43 61 -18 7 14 -7 -16 50 -32 -3 23 36 -25 -27 -18 8 26 75 -9 -10 13 -5 -47 17 21 20 -9 -61 41 -32 -16 -42 6 30
6728C0n6K1J3K4l5k8J3K3k8K3L3l4L2l1K7l9OM9n4K4j2kl0M3o3Q0j2J6l5J2k2
$$ 30 -26 -5 8 32 -3 -31 -18 5 -23 0 33 -1 31 0 27 -12 -6 43 -11 13 1 -1 -31 12 -51 29 17 33 -2 10 -12
6759a2k2R4j08O8jp9j2k2J10l7j5j5J6k3Q0n8M0M4n9Pj4K0j9K6K0n2qN4L9j5r8
$$ -12 -34 60 -48 20 19 -60 -72 -94 16 -21 -36 -51 -35 -58 22 -36 4 48 -11 -4 -18 2 -17 9 29 -23 -31 23 62 47 -51
$$ [...]
8191h1
##END NTUPLES=NMR FID
##END=
