##TITLE=abcd
##JCAMPDX= 6.0         $$ Bruker NMR JCAMP-DX V2.0
##DATA TYPE= NMR SPECTRUM
##DATA CLASS= NTUPLES
##ORIGIN= UXNMR, Bruker Analytische Messtechnik GmbH
##OWNER= root
$$ XWIN-NMR		Version 3.5
$$ Sun Dec  7 15:50:12 2025 Russian Standard Time (UT+4h)  servis@DPX200
##.OBSERVE FREQUENCY= 200.131235884673
##.OBSERVE NUCLEUS= ^1H
##.ACQUISITION MODE= SIMULTANEOUS
##.ACQUISITION SCHEME= undefined
##.AVERAGES= 32
##.DIGITISER RES= 18
##SPECTROMETER/DATA SYSTEM= spect
##.PULSE SEQUENCE= zg
##.SOLVENT NAME= CDCl3
##.SHIFT REFERENCE= (INTERNAL, CDCl3, 0, 16.4885)
##AUDIT TRAIL= $$ (NUMBER, WHEN, WHO, WHERE, WHAT)
$$ ##TITLE= Audit trail, XWIN-NMR		Version 3.5
$$ ##JCAMPDX= 5.01
$$ ##ORIGIN= Bruker BioSpin GmbH
$$ ##OWNER= servis
$$ F:\spectra/data/av/nmr/H1/1/pdata/1/auditp.txt
$$ ##AUDIT TRAIL=  $$ (NUMBER, WHEN, WHO, WHERE, WHAT)
(   1,<2025-12-07 15:49:49.28 +0400>,<servis>,<DPX200>,
      <created by zg, POWCHK disabled, PULCHK disabled
       configuration hash MD5:
       00 E9 B6 7A A2 85 ED C7 34 08 36 98 17 FE 4E 26
       data hash MD5: 32K
       B6 A9 4E D9 48 13 48 03 AA E1 1B EE 7C C4 7F 63>)
(   2,<2025-12-07 15:49:51.40 +0400>,<servis>,<DPX200>,
      <Start of raw data processing
       efp BC_mod = 2 LB = 0.05 FT_mod = 6 PKNL = 1 PHC0 = -184.383 PHC1 = 6.301564 SI = 16K 
       data hash MD5: 16K
       65 4B E2 BE 17 A0 94 F8 D5 51 4D 8B 23 25 ED 8E>)
$$ ##END=
$$ 
$$ hash MD5
$$ D3 B4 46 C0 9D 51 B2 42 A9 00 59 8B DB B8 F5 27
##$RELAX= 
##$RELAX= 
##$RELAX= 
##$RELAX= 
##$RELAX= 
##$RELAX= 
##$RELAX= 
##$RELAX= 
$$ Bruker specific parameters
$$ --------------------------
##$DU= <F:\spectra>
##$EXPNO= 1
##$NAME= <H1>
##$PROCNO= 1
##$TYPE= <nmr>
##$USER= <av>
##$AMP= (0..31)
100 100 100 100 100 100 100 100 100 100 100 100 100 100 100 100 100 100 
100 100 100 100 100 100 100 100 100 100 100 100 100 100 
##$AQSEQ= 0
##$AQ_mod= 1
##$AUNM= <au_zg>
##$AUTOPOS= <>
##$BF1= 200.13
##$BF2= 200.13
##$BF3= 200.13
##$BF4= 200.13
##$BF5= 500.13
##$BF6= 500.13
##$BF7= 500.13
##$BF8= 500.13
##$BYTORDA= 1
##$CFDGTYP= 0
##$CFRGTYP= 5
##$CHEMSTR= <none>
##$CNST= (0..31)
1 1 145 1 1 1 1 1 1 1 1 1 1 1 1 1 1 1 1 1 1 1 1 1 1 1 1 1 1 1 1 1 
##$CPDPRG= <>
##$CPDPRG1= <>
##$CPDPRG2= <>
##$CPDPRG3= <>
##$CPDPRG4= <mlev>
##$CPDPRG5= <mlev>
##$CPDPRG6= <mlev>
##$CPDPRG7= <mlev>
##$CPDPRG8= <mlev>
##$CPDPRGB= <>
##$CPDPRGT= <>
##$D= (0..31)
0 2 0 0 0 0 0 0 0 0.06 0 0 0 0 0 0 0.0002 0 0 0 0 0 0 0 0 0 0 0 0 0 0 
0 
##$DATE= 1765108188
##$DBL= (0..7)
120 120 120 120 120 120 120 120 
##$DBP= (0..7)
150 150 150 150 150 150 150 150 
##$DBP07= 0
##$DBPNAM0= <>
##$DBPNAM1= <>
##$DBPNAM2= <>
##$DBPNAM3= <>
##$DBPNAM4= <>
##$DBPNAM5= <>
##$DBPNAM6= <>
##$DBPNAM7= <>
##$DBPOAL= (0..7)
0.5 0.5 0.5 0.5 0.5 0.5 0.5 0.5 
##$DBPOFFS= (0..7)
0 0 0 0 0 0 0 0 
##$DE= 6
##$DECBNUC= <off>
##$DECIM= 32
##$DECNUC= <off>
##$DECSTAT= 4
##$DIGMOD= 1
##$DIGTYP= 9
##$DL= (0..7)
0 120 120 120 120 120 120 120 
##$DP= (0..7)
150 150 150 150 150 150 150 150 
##$DP07= 0
##$DPNAME0= <>
$$ [...]
##$SUBNAM4= <"">
##$SUBNAM5= <"">
##$SUBNAM6= <"">
##$SUBNAM7= <"">
##$SUBNAM8= <"">
##$SUBNAM9= <"">
##$SW= 20.6817932712277
##$SWIBOX= (0..15)
0 0 3 0 0 0 0 0 0 0 0 0 0 0 0 0 
##$SW_h= 4139.07284768212
##$TD= 32768
##$TD0= 1
##$TE= 0
##$TE2= 300
##$TE3= 300
##$TEG= 300
##$TL= (0..7)
0 120 120 120 120 120 120 120 
##$TP= (0..7)
150 150 150 150 150 150 150 150 
##$TP07= 0
##$TPNAME0= <>
##$TPNAME1= <>
##$TPNAME2= <>
##$TPNAME3= <>
##$TPNAME4= <>
##$TPNAME5= <>
##$TPNAME6= <>
##$TPNAME7= <>
##$TPOAL= (0..7)
0.5 0.5 0.5 0.5 0.5 0.5 0.5 0.5 
##$TPOFFS= (0..7)
0 0 0 0 0 0 0 0 
##$TUNHIN= 0
##$TUNHOUT= 0
##$TUNXOUT= 0
##$USERA1= <user>
##$USERA2= <user>
##$USERA3= <user>
##$USERA4= <user>
##$USERA5= <user>
##$V9= 5
##$VALIST= <valist>
##$VCLIST= <CCCCCCCCCCCCCCC>
##$VD= 0
##$VDLIST= <DDDDDDDDDDDDDDD>
##$VPLIST= <PPPPPPPPPPPPPPP>
##$VTLIST= <TTTTTTTTTTTTTTT>
##$WBST= 1024
##$WBSW= 30
##$XGAIN= (0..3)
0 0 0 0 
##$XL= 0
##$YL= 0
##$YMAX_a= 1702105
##$YMIN_a= -1296832
##$ZGOPTNS= <>
##$ZL1= 120
##$ZL2= 120
##$ZL3= 120
##$ZL4= 120
##$ABSF1= 0
##$ABSF2= 0
##$ABSG= 0
##$ABSL= 0
##$ALPHA= 0
##$AQORDER= 0
##$ASSFAC= 0
##$ASSFACI= 0
##$ASSFACX= 0
##$ASSWID= 0
##$AUNMP= <proc_1d>
##$AZFE= 0.1
##$AZFW= 0.1
##$BCFW= 0
##$BC_mod= 2
##$BYTORDP= 0
##$COROFFS= 0
##$CY= 18.4799938201904
##$DATMOD= 1
##$DC= 0
##$DFILT= <>
##$DTYPP= 0
##$F1P= 9.9274215381318
##$F2P= -0.165520771350173
##$FCOR= 1
##$FTSIZE= 16384
##$FT_mod= 6
##$GAMMA= 0
##$GB= 0
##$INTBC= 1
##$INTSCL= 4.127829e-11
##$ISEN= 128
##$LB= 0.05
##$LEV0= 0
##$LPBIN= 0
##$MAXI= 10000
##$MC2= 0
##$MEAN= 0
##$ME_mod= 0
##$MI= 50
##$NCOEF= 0
##$NC_proc= -3
##$NLEV= 6
##$NOISF1= 3.799351
##$NOISF2= 2.8
##$NSP= 0
##$NTH_PI= 0
##$NZP= 0
##$OFFSET= 16.48848
##$PC= 4
##$PHC0= -184.383
##$PHC1= 6.301564
##$PH_mod= 1
##$PKNL= yes
##$PPARMOD= 0
##$PSCAL= 4
##$PSIGN= 0
##$REVERSE= no
##$SF= 200.130005582386
##$SI= 16384
##$SIGF1= 3
##$SIGF2= 2
##$SINO= 400
##$SIOLD= 16384
##$SREGLST= <1H.CDCl3>
##$SSB= 0
##$STSI= 16384
##$STSR= 0
##$SW_p= 4139.07284768211
##$SYMM= 0
##$S_DEV= 0
##$TDeff= 32768
##$TDoff= 0
##$TI= <>
##$TILT= no
##$TM1= 0
##$TM2= 0
##$TOPLEV= 0
##$USERP1= <user>
##$USERP2= <user>
##$USERP3= <user>
##$USERP4= <user>
##$USERP5= <user>
##$WDW= 1
##$XDIM= 16384
##$YMAX_p= 299151072
##$YMIN_p= -426457
$$ End of Bruker specific parameters
$$ ---------------------------------
##NTUPLES= NMR SPECTRUM
##VAR_NAME=  FREQUENCY,     SPECTRUM/REAL,   SPECTRUM/IMAG
##SYMBOL=    X,             R,               I
##VAR_TYPE=  INDEPENDENT,   DEPENDENT,       DEPENDENT
##VAR_FORM=  AFFN,          ASDF,            ASDF
##VAR_DIM=   16384,         16384,           16384
##UNITS=     HZ,            ARBITRARY UNITS, ARBITRARY UNITS
##FACTOR=    0.252644378177508, 1,           1
##FIRST=     3299.83951724647, 0,            0
##LAST=      -839.233330435636, 0,           0
##MIN=       -839.233330435636, -426457,     0
##MAX=       3299.83951724647, 299151072,    0
$$ Real data points
##PAGE= N=1
##DATA TABLE= (X++(R..R)), XYDATA
$$ [...]
8143 -176991 -171795 -184799 -173122 -177617 -166749 -168951 -174865 -172765 -171755 -170182 -169650 -173615 -172971 -175895
8129 -175895 -174197 -172989 -173801 -170780 -166425 -170722 -174069 -172901 -187846 -169374 -166209 -172679 -167210 -169504
8115 -169504 -176575 -177390 -176151 -179321 -181042 -175532 -182349 -175489 -176609 -170517 -167686 -168196 -173715 -175503 -175674
8100 -175674 -178769 -174825 -168018 -169549 -171375 -178629 -165713 -171997 -169694 -170841 -172591 -169030 -170406 -173639
8086 -173639 -169570 -170228 -171326 -166826 -171258 -172659 -165830 -172437 -165181 -171412 -172457 -170823 -172783 -183802
8072 -183802 -176547 -172015 -173033 -168732 -175794 -171060 -174461 -169889 -173182 -175448 -170080 -162686 -169115 -173708
8058 -173708 -168805 -169554 -175485 -168864 -173105 -172451 -169587 -170591 -169066 -174487 -172161 -170381 -175080 -176350 -174327
8043 -174327 -172455 -170823 -168589 -166138 -173074 -172408 -174147 -166521 -170368 -169952 -168202 -174663 -172458 -172615 -169658
8028 -169658 -173409 -172774 -165777 -172705 -167156 -170393 -169328 -164510 -165050 -173462 -174010 -170216 -168222 -169976 -168198
8013 -168198 -168938 -174448 -167200 -172705 -171257 -169125 -168962 -166256 -168147 -168781 -165415 -169886 -163364 -163458 -170828 -172791
7997 -172791 -171092 -167079 -171572 -175458 -166457 -167736 -176112 -173024 -173579 -167151 -167147 -167937 -169850 -172549 -170655 -171074
7981 -171074 -169887 -168092 -169025 -169494 -168613 -166958 -172895 -171440 -163005 -173214 -171413 -170344 -174002 -169073 -168541
7966 -168541 -173094 -172255 -169500 -175741 -164598 -172674 -168672 -172123 -167956 -170175 -168484 -172950 -173012 -171621 -171139
7951 -171139 -168882 -170574 -174800 -171655 -168486 -173765 -166401 -171704 -170244 -167690 -176793 -170559 -171990 -162643
7937 -162643 -168337 -165299 -170351 -168928 -170316 -169041 -170376 -172182 -176834 -173656 -171228 -171233 -169926 -167352 -170385
7922 -170385 -164723 -165833 -164538 -166664 -167358 -167612 -168124 -167505 -169073 -170758 -172539 -166027 -171327 -164464 -167325
7907 -167325 -165272 -170043 -173259 -171442 -170092 -163756 -164242 -166640 -164696 -168775 -168091 -171609 -174070 -162551 -166798
7892 -166798 -162018 -164951 -165423 -168213 -167791 -165419 -168327 -170774 -166012 -164442 -163840 -165666 -168324 -173804 -165352
7877 -165352 -169022 -168088 -164925 -165739 -164081 -161889 -166611 -163569 -166418 -167439 -170786 -172338 -168343 -165864 -163373
7862 -163373 -170582 -173628 -171861 -170201 -200046 -180906 -162024 -163339 -166198 -169068 -162475 -168569 -166497 -169814
7848 -169814 -169043 -166510 -165936 -167280 -165788 -163621 -159959 -166869 -162402 -160135 -157392 -163669 -160170 -161261 -160965
7833 -160965 -161194 -158703 -160457 -153740 -156091 -147487 -142930 -128400 -108445 -80823 -67457 -59597 -76945
7820 -76945 -94429 -115370 -127947 -142215 -147312 -149987 -155491 -156849 -158581 -164125 -162444 -164388 -165806 -163534
7806 -163534 -173208 -169408 -166813 -167586 -165856 -164808 -163794 -161972 -165965 -165366 -161308 -162014 -158705 -165725 -163218
7791 -163218 -163174 -164335 -163507 -163915 -159546 -159079 -167816 -162209 -162774 -165879 -168270 -165097 -162096 -161704 -160732 -162353
7775 -162353 -166239 -161731 -163914 -164354 -167014 -167768 -167779 -167072 -167103 -168428 -167647 -166861 -167123 -164854 -164825 -166444 -165315
7758 -165315 -163943 -171122 -166156 -166031 -158141 -160043 -165294 -160611 -158749 -160875 -159237 -165592 -164393 -161181 -160092
7743 -160092 -162645 -168174 -164071 -166453 -163468 -164965 -160046 -163647 -160902 -165689 -161938 -159277 -165291 -163933
7729 -163933 -163160 -160090 -155594 -157984 -161093 -161208 -164125 -156620 -164805 -164404 -163224 -157758 -160848 -162634 -163563
7714 -163563 -165502 -166021 -164882 -161790 -164243 -159743 -159573 -163128 -162434 -161199 -162709 -160951 -161300 -158532 -158911 -151796
7698 -151796 -159992 -157306 -161576 -155698 -157237 -160090 -156650 -154766 -156390 -160209 -158175 -165573 -159303 -163629
7684 -163629 -159112 -156161 -158358 -156279 -155478 -156009 -151313 -146478 -144586 -135664 -130939 -118218 -107876 -95407
7670 -95407 -93735 -83223 -81288 -75983 -80071 -90887 -102155 -110492 -122484 -131867 -143268 -141458 -148026
7657 -148026 -146117 -150129 -148453 -147738 -151621 -149287 -150446 -143346 -150619 -149138 -151119 -154339 -153130 -154705 -156158
7642 -156158 -159164 -149878 -154229 -155855 -156646 -164022 -157536 -158786 -163457 -160225 -160042 -163452 -161125 -160034 -164616
7627 -164616 -162875 -164545 -164195 -167056 -160855 -161695 -164738 -155111 -158330 -159879 -157746 -161618 -157393 -158886 -159915
7612 -159915 -153678 -159908 -154177 -159043 -154650 -157468 -162173 -161037 -159742 -158869 -151506 -154306 -157190 -137503
7598 -137503 -191181 -168867 -169641 -167181 -165078 -163995 -162343 -157001 -160933 -162126 -162196 -162127 -166008 -162041 -166038
7583 -166038 -162012 -165305 -167548 -159543 -161225 -164022 -163442 -167489 -163962 -164273 -163174 -164292 -162507 -165113 -161344
7568 -161344 -161940 -164573 -165282 -163445 -158430 -159575 -161434 -160622 -165874 -160248 -157995 -160582 -157302 -159174 -159347
7553 -159347 -154819 -156134 -156420 -163692 -160258 -159640 -164285 -163326 -163278 -162538 -162224 -166155 -167325 -163037 -164144 -163314
7537 -163314 -160693 -157856 -159789 -161511 -156165 -162714 -161230 -159298 -164170 -159505 -163763 -162988 -160858 -162809 -163696
7522 -163696 -164929 -160397 -158747 -155816 -160017 -157295 -157199 -163055 -159945 -159650 -159931 -157492 -160794 -160254 -163834 -156177
7506 -156177 -157524 -160564 -163368 -160030 -162280 -165525 -162593 -160685 -160374 -164116 -160288 -160446 -163357 -163829 -161741
7491 -161741 -164134 -158715 -160025 -160231 -162585 -162058 -164148 -162526 -156644 -159718 -155108 -156301 -157996 -152872 -159495
7476 -159495 -157926 -156716 -160380 -158829 -158392 -153981 -161181 -163488 -155023 -160387 -162037 -158866 -160357 -162416 -155646
7461 -155646 -155816 -156202 -159088 -157040 -161034 -161244 -159912 -162102 -161512 -160729 -162494 -160560 -158964 -160285 -161759 -158702
7445 -158702 -159480 -159594 -157180 -159171 -153550 -158545 -154852 -158517 -155400 -158569 -153604 -156898 -153845 -157750 -157824
7430 -157824 -155045 -159129 -155943 -158620 -156889 -156169 -157465 -153304 -156175 -154818 -160186 -157007 -158503 -158511 -159571
7415 -159571 -159736 -160267 -153958 -157653 -154232 -155530 -159419 -153597 -159425 -155792 -160967 -157579 -159036 -157795 -154469
7400 -154469 -155987 -155020 -156511 -157649 -156620 -159296 -154211 -158641 -158555 -156065 -152992 -157727 -154512 -156361 -153730
7385 -153730 -156343 -151974 -153883 -160430 -156131 -156598 -155790 -157748 -157156 -157024 -155189 -157029 -151349 -155339 -158310
7370 -158310 -157676 -156905 -157249 -154697 -154541 -152742 -155452 -152977 -157035 -162845 -159022 -156316 -158209 -156043 -160357
7355 -160357 -156894 -157268 -156434 -159283 -158858 -159493 -155195 -157358 -157378 -155604 -156378 -153448 -153047 -156939 -150548 -151668
7339 -151668 -152103 -149753 -150686 -151740 -148518 -149761 -149937 -151992 -150340 -152983 -149835 -155645 -155097 -149641 -154056
7324 -154056 -157771 -154571 -154044 -156702 -156451 -151528 -156417 -156245 -156655 -157501 -152792 -156107 -151500 -154791 -155504 -155792
7308 -155792 -148693 -151556 -151002 -152767 -151661 -159968 -154471 -151376 -151923 -157885 -156794 -151396 -152384 -154429 -157411
7293 -157411 -153652 -151508 -154627 -154736 -150147 -150988 -156543 -153864 -154868 -153185 -154318 -153493 -154077 -155832 -155134 -154278
7277 -154278 -152772 -153850 -156825 -157800 -159430 -156295 -161534 -154903 -155245 -160122 -158173 -161306 -159371 -155026 -161199
7262 -161199 -152909 -155394 -152129 -151878 -155197 -151006 -157327 -156040 -155162 -161232 -158440 -156879 -157114 -151316 -155145
7247 -155145 -157229 -154306 -155554 -157450 -154720 -159966 -155284 -157622 -154885 -152214 -152361 -147770 -152383 -153397 -157016
7232 -157016 -162241 -156015 -160706 -155765 -152874 -158435 -155364 -154217 -152449 -155717 -155347 -154633 -154548 -153212 -150619
7217 -150619 -158313 -155594 -156626 -155004 -155352 -155287 -158142 -158153 -156674 -157300 -160426 -156960 -152553 -161059 -180509 -140237
7201 -140237 -143374 -147879 -152574 -151973 -149111 -153767 -145232 -154280 -149954 -155057 -152811 -150723 -156914 -154339 -152844
7186 -152844 -155497 -151226 -151393 -151668 -152777 -149493 -150291 -150045 -150559 -146129 -154382 -156690 -157044 -155760 -155864 -151593
7170 -151593 -153552 -148461 -154944 -155919 -150639 -154977 -151763 -153640 -151840 -153603 -151306 -152678 -150313 -150692 -152765
7155 -152765 -156111 -150806 -154898 -151118 -152119 -154350 -149152 -144697 -144229 -146303 -152474 -146456 -144668 -148648 -146095
7140 -146095 -144044 -135878 -139202 -146583 -149184 -154057 -153652 -152434 -155386 -155840 -155409 -152536 -159992 -153595 -157069
7125 -157069 -151782 -146790 -144970 -152783 -150233 -156693 -159159 -162173 -160716 -155352 -155261 -149614 -150606 -155004 -158789
7110 -158789 -154977 -155377 -156630 -158022 -154460 -145568 -152566 -150620 -153168 -154531 -154251 -152454 -152456 -153590 -154466 -155638
7094 -155638 -162419 -159257 -157490 -155833 -151585 -147244 -150615 -148041 -147800 -147638 -149187 -144842 -144942 -146524 -140454
7079 -140454 -148682 -149919 -152412 -148061 -144275 -145514 -144205 -144195 -143745 -149554 -145795 -147408 -141783 -133599 -139376
7064 -139376 -137003 -139502 -147343 -149259 -153321 -151542 -149637 -148568 -147401 -150140 -154245 -149625 -150155 -147975 -145947
7049 -145947 -144259 -145719 -143290 -146337 -147336 -148346 -146858 -147300 -148607 -147972 -152458 -152105 -154631 -157023 -156406 -155898
7033 -155898 -155361 -151368 -146683 -148162 -146645 -142474 -143819 -147079 -142596 -143222 -146237 -150129 -145099 -146549 -147240
7018 -147240 -148794 -147586 -150059 -148305 -155508 -150944 -147439 -149214 -146722 -146738 -148024 -147919 -143190 -146357 -144754
7003 -144754 -146961 -145380 -152733 -150914 -145623 -147994 -149334 -153760 -150403 -155649 -151748 -153042 -153789 -151797 -142415
6988 -142415 -142519 -142000 -137563 -141334 -143459 -146347 -147320 -149986 -147858 -147130 -146981 -147847 -146797 -154578 -146963 -150936
6972 -150936 -150493 -147263 -149827 -150739 -147629 -145611 -142188 -142882 -147287 -144980 -143857 -146773 -145746 -143762 -145941
6957 -145941 -145091 -147586 -144592 -149886 -147542 -144777 -144058 -139141 -139308 -144102 -146651 -147096 -147236 -143875 -144819 -141548
6941 -141548 -147778 -143020 -144701 -141123 -146511 -143550 -147434 -146705 -144696 -145151 -145930 -145491 -144109 -137712 -145232
6926 -145232 -147859 -147493 -144240 -141584 -142753 -140673 -141408 -144929 -144023 -141114 -142342 -142051 -137722 -140123 -136889
6911 -136889 -139841 -135821 -138724 -143611 -139706 -144470 -143801 -148085 -144773 -143314 -143142 -143476 -145981 -143058 -140910
6896 -140910 -139890 -141310 -141503 -142206 -141029 -139014 -140241 -138045 -138711 -139062 -141266 -136536 -137562 -137522 -139579 -141446
6880 -141446 -141704 -140516 -144708 -144187 -141857 -142849 -141363 -145182 -144407 -144211 -140466 -142775 -142837 -140441 -139570 -141052
6864 -141052 -136764 -140846 -140490 -139215 -141799 -142824 -139385 -140135 -143558 -144262 -137711 -143113 -139180 -141211 -141000
6849 -141000 -140207 -144230 -140140 -143660 -141243 -139486 -143134 -138534 -141311 -133301 -138951 -137274 -140466 -142807 -143873
6834 -143873 -142564 -141223 -145639 -141995 -136030 -140041 -135398 -138132 -138314 -136843 -135141 -137581 -138020 -141838 -140738
6819 -140738 -139432 -145430 -139933 -144039 -137543 -140608 -136041 -137732 -135451 -133697 -135070 -135046 -134940 -130348 -135965
6804 -135965 -136022 -135498 -139085 -136884 -133952 -138288 -140259 -138474 -138933 -139285 -140359 -141145 -137995 -140286 -142880 -137382
6788 -137382 -144130 -140838 -142597 -139437 -140639 -136421 -135186 -135884 -134711 -131994 -131232 -134016 -135116 -135096 -133044
6773 -133044 -136934 -136038 -133177 -138442 -137055 -138298 -135154 -135141 -137493 -137678 -139039 -138920 -138957 -135690 -138358 -138850
6757 -138850 -141097 -136179 -133578 -139107 -137195 -134886 -137022 -137224 -132321 -130000 -129592 -126749 -133247 -134161 -136034
6742 -136034 -127737 -133078 -131736 -134416 -134332 -126895 -132137 -134566 -134468 -129772 -132090 -135602 -131575 -136018 -129829
6727 -129829 -135262 -133382 -133578 -136686 -133535 -137249 -130241 -135928 -137772 -139300 -141202 -138292 -140072 -135962 -135290
6712 -135290 -139379 -140198 -140091 -141112 -142447 -136566 -138761 -138063 -138759 -135023 -133271 -131934 -135819 -135057 -131493 -130787
6696 -130787 -135124 -132776 -137215 -134239 -133036 -133651 -128384 -136818 -136829 -134334 -134214 -134186 -132046 -136279 -133896 -130321
6680 -130321 -134772 -131673 -135928 -138276 -143737 -137673 -133387 -130307 -131372 -133599 -138416 -133998 -135107 -134687 -133171
6665 -133171 -134322 -133679 -135798 -135662 -137460 -133605 -139087 -142770 -134576 -137098 -140107 -136087 -138384 -133056 -135931
6650 -135931 -137241 -135097 -136422 -136287 -132921 -127997 -125509 -127872 -132901 -134372 -136006 -132306 -130124 -132223 -132459
6635 -132459 -125926 -132224 -136147 -134931 -133309 -135022 -132977 -130763 -135065 -131787 -132886 -128105 -131109 -135382
6621 -135382 -130290 -131874 -133635 -131277 -129381 -129611 -133458 -132202 -132034 -132327 -128438 -129950 -129245 -132725 -134677
6606 -134677 -128420 -133160 -136837 -131508 -129983 -132538 -124526 -126848 -128971 -131841 -128897 -130001 -135016 -132113
6592 -132113 -132670 -129624 -125398 -126794 -131768 -130757 -130311 -131907 -131657 -127006 -128405 -127924 -129243 -129625 -134034 -129525
6576 -129525 -136808 -131454 -128652 -127721 -126016 -120847 -128328 -127161 -123683 -127967 -133908 -130401 -125645 -129872 -130468
6561 -130468 -135257 -129642 -130728 -129086 -132526 -134128 -129559 -125065 -127690 -128333 -126975 -128187 -123521 -128276 -129687
6546 -129687 -126685 -125543 -121405 -121073 -126499 -123878 -122775 -130994 -131310 -129283 -130211 -127115 -127757 -128308 -125740 -130534
6530 -130534 -128236 -132799 -129756 -129257 -127216 -119454 -123690 -121271 -126121 -123946 -128415 -124276 -128708 -129412 -126338
6515 -126338 -123266 -119754 -118264 -123564 -125423 -129221 -129311 -129662 -131370 -126707 -127446 -121930 -117759 -119859 -127015
6500 -127015 -121536 -119893 -123666 -122568 -126235 -122874 -121186 -125305 -125266 -127236 -118536 -123997 -125427 -121103 -118083
6485 -118083 -119884 -120119 -121279 -127543 -119557 -122887 -118026 -122177 -122433 -124742 -120512 -124625 -119190 -120998 -122004
6470 -122004 -120614 -122944 -127000 -122254 -124823 -123828 -122329 -116465 -116605 -120139 -119404 -119751 -123286 -123413 -125190 -121362
6454 -121362 -118953 -117341 -115654 -122033 -120816 -121280 -126249 -121147 -118356 -118522 -117801 -117659 -121699 -119582 -123149
6439 -123149 -118693 -123902 -121041 -120872 -123880 -123839 -122058 -124364 -126603 -127266 -122707 -123720 -125028 -117597 -119815
6424 -119815 -117423 -119416 -115193 -116863 -117401 -119880 -121837 -122672 -121900 -117988 -122008 -118011 -115212 -97706 -126974
6409 -126974 -122594 -119968 -124740 -122977 -122732 -118772 -114920 -119690 -121673 -117650 -123215 -119461 -120365 -123304 -121368
6394 -121368 -119713 -119115 -121348 -120749 -118643 -120206 -117742 -115560 -115693 -113959 -117164 -115289 -113476 -117830 -115239
6379 -115239 -115065 -116227 -116104 -114735 -118753 -118259 -119848 -120478 -117649 -119962 -118484 -114185 -116622 -119699 -116348
6364 -116348 -115715 -122747 -121217 -119207 -117637 -115665 -109506 -110764 -116670 -115778 -116411 -118339 -118916 -113495 -110780
6349 -110780 -116603 -112135 -113827 -116306 -116269 -114072 -114404 -113962 -111736 -113394 -110925 -110376 -112298 -112988 -111853 -114531
6333 -114531 -106529 -112098 -110260 -115830 -112427 -114603 -116934 -118026 -114163 -118959 -113013 -116276 -117220 -115858 -117613
6318 -117613 -116817 -110827 -112281 -113494 -112574 -110029 -110860 -106061 -113496 -109745 -116345 -114666 -112919 -110153 -108512
6303 -108512 -106318 -103765 -110875 -114808 -110717 -108330 -106358 -105019 -103621 -109789 -108686 -114087 -109609 -110860
6289 -110860 -112986 -113806 -111800 -117313 -113038 -114997 -116565 -118839 -121908 -113732 -108778 -107243 -107234 -109446 -110084 -106323
6273 -106323 -105984 -104574 -102452 -109194 -100201 -98746 -99888 -103811 -105388 -107584 -104514 -107513 -110284 -111386 -113744
6258 -113744 -112721 -116875 -116728 -116729 -114532 -115026 -110109 -105359 -110968 -108475 -109620 -104193 -99797 -99185 -105815 -101652
6242 -101652 -101388 -104819 -99388 -105134 -102403 -98923 -100805 -100811 -99332 -103204 -101453 -104149 -102642 -105114 -101347
6227 -101347 -96862 -101055 -99310 -103699 -105194 -105364 -106871 -104326 -101444 -100309 -104899 -107290 -104392 -101569 -107245
6212 -107245 -107020 -104277 -103310 -105431 -100570 -104521 -104192 -106391 -106129 -104872 -99294 -95370 -99670 -99001 -100470 -105661
6196 -105661 -103819 -100462 -102153 -96398 -100060 -101757 -100791 -104649 -107098 -107976 -105729 -105230 -106723 -102859 -103890
6181 -103890 -103485 -103888 -108724 -104747 -106978 -104595 -102521 -106397 -103675 -97940 -99735 -101567 -99119 -100429 -97913
6166 -97913 -95466 -99919 -104304 -101458 -105317 -103440 -101466 -105784 -105131 -107072 -106907 -102292 -100503 -102272 -103288
6151 -103288 -100512 -102601 -100273 -103013 -102829 -108724 -102540 -101131 -101576 -100361 -103460 -98836 -98503 -98986 -104349
6136 -104349 -101164 -102848 -102347 -101440 -101454 -100735 -100080 -100548 -104881 -100807 -96383 -101201 -97851 -100880 -98467 -103074
6120 -103074 -99366 -94671 -100476 -94529 -103341 -101501 -98432 -103968 -96697 -102350 -103056 -99187 -97930 -100465 -95922
6105 -95922 -97003 -93222 -96877 -94688 -94927 -98215 -98806 -98170 -98134 -99855 -99513 -98060 -97229 -90393 -92580 -95368
6089 -95368 -92550 -92604 -94980 -95427 -97533 -98155 -96290 -98381 -99393 -102182 -96782 -94693 -99785 -99950 -95668 -95224
6073 -95224 -96168 -98319 -95217 -97985 -95581 -97674 -99071 -97578 -96386 -95565 -99040 -99474 -92161 -95717 -97633
6058 -97633 -95207 -98243 -96288 -90445 -94555 -98385 -99459 -97221 -96119 -96614 -97014 -96475 -101613 -100396 -97485
6043 -97485 -97163 -99761 -100925 -91643 -98608 -96828 -98146 -95837 -96176 -92871 -96232 -95156 -94542 -97542 -95232
6028 -95232 -99726 -96624 -102589 -97032 -98727 -99292 -96512 -96002 -93949 -94514 -94489 -101173 -98970 -83105 -100256
6013 -100256 -98362 -95676 -94927 -89394 -96742 -94695 -95302 -91589 -91984 -92560 -91869 -90568 -90353 -88676 -93449 -94104
5997 -94104 -90908 -96289 -93885 -94278 -91133 -89611 -89514 -94484 -97698 -92499 -98934 -96625 -95723 -94533 -93556 -96137
5981 -96137 -94657 -96230 -94612 -95685 -95256 -95501 -90386 -90382 -90444 -89261 -92229 -93197 -92633 -93797 -93306 -96214 -92705
5964 -92705 -88492 -93821 -89815 -88827 -90366 -92842 -98571 -97546 -91556 -95386 -92645 -92574 -92834 -90481 -92251 -96359
5948 -96359 -91463 -86485 -82850 -78845 -78920 -80313 -81213 -80705 -80191 -79747 -78348 -79878 -72495 -79697 -76564 -74801
5932 -74801 -78394 -81645 -82440 -77024 -82377 -80755 -77955 -75811 -76773 -80343 -76472 -80942 -82692 -85255 -79022
5917 -79022 -82443 -77136 -75254 -78888 -75249 -83221 -80740 -87292 -86060 -86757 -87855 -82343 -89270 -85599 -86176
5902 -86176 -88517 -90265 -90709 -85419 -83521 -86605 -82681 -87762 -84933 -85978 -91246 -91342 -90921 -88306 -82115 -85004
5886 -85004 -86775 -87819 -88710 -90893 -93239 -92295 -85339 -83908 -87850 -88606 -84141 -91900 -90587 -92430 -95331
5871 -95331 -91531 -92664 -89791 -84700 -91756 -93992 -92493 -90180 -94108 -89370 -82859 -85569 -87206 -89027 -92908
5856 -92908 -90868 -90206 -93867 -88068 -87090 -86125 -84882 -87252 -87123 -88858 -92257 -93179 -86930 -83301 -88839 -87952
5840 -87952 -83706 -87892 -91451 -90835 -90088 -85853 -81146 -82564 -81526 -84190 -86997 -81332 -87180 -84673 -88606
5825 -88606 -86480 -89772 -83859 -86569 -93340 -88457 -91241 -92150 -86552 -85674 -84502 -80523 -79227 -82353 -85396
5810 -85396 -89192 -84911 -91228 -84533 -81611 -81904 -79055 -79204 -78303 -86073 -81529 -77705 -79861 -79321 -83539 -84490
5794 -84490 -76463 -79304 -80427 -81948 -83535 -83596 -76483 -72850 -67536 -69454 -71641 -62238 -65907 -63368 -65944
5779 -65944 -62673 -67512 -63437 -63032 -64332 -61732 -67233 -71553 -68932 -75994 -69902 -68787 -69496 -69808 -67921
5764 -67921 -64053 -61278 -58327 -60270 -59807 -56800 -60441 -62310 -62903 -66133 -65690 -64282 -56720 -56317 -55642 -58402
5748 -58402 -58693 -66010 -65175 -67325 -69924 -68049 -68363 -61582 -63938 -60916 -59717 -65605 -69044 -70919 -70337 -70600
5732 -70600 -68401 -67382 -66122 -64481 -67451 -64525 -67201 -72627 -73289 -73941 -70550 -73047 -66136 -65977 -68348
5717 -68348 -67489 -73337 -70534 -65217 -64046 -59477 -58791 -59143 -54658 -52726 -45912 -41487 -38648 -42790 -44124
5702 -44124 -41703 -46083 -46882 -40392 -44857 -40160 -42824 -43834 -46830 -49602 -49959 -48640 -40404 -36178 -33757
5687 -33757 -32525 -33677 -30785 -32242 -33099 -29316 -32742 -30233 -36567 -40484 -41987 -45377 -38915 -38755 -33729
5672 -33729 -38380 -42567 -47533 -44140 -39340 -36315 -35660 -29366 -24230 -13650 -13122 -22333 -25090 -17820 -23579
5657 -23579 -20180 -20312 -17567 -21840 -19301 -15350 -12225 -10583 -10052 -1001 11714 5021 2470 1441 7354
5642 7354 19309 35118 34260 44866 45744 52490 53514 50842 42723 45070 45715 54136 54271 61652 65903
5627 65903 74484 81840 79915 88472 92608 102808 114345 126283 129433 134280 148796 172558 204822
5614 204822 236205 286221 341983 406588 464210 506712 531828 554987 580635 621313 686967 800784
5602 800784 979553 1227746 1519856 1775411 1921011 1968688 1949559 1912976 1920439 1980637 2084376
5591 2084376 2172342 2151744 2030718 1843234 1625923 1447179 1324933 1247225 1208414 1204175 1231038
5580 1231038 1283212 1369364 1454694 1511921 1537009 1536349 1524723 1533490 1593770 1724238 1838093 1832536
5568 1832536 1714610 1481343 1200375 942088 738642 594536 494251 438340 385017 342619
5558 342619 303856 277185 253178 230448 217771 202236 191148 185172 177501 175307 173754 171383 168506
5545 168506 165566 158145 144032 135061 122905 113096 108518 103790 108547 107626 102036 101934 102579 102159 95752
5530 95752 94555 88986 94744 88207 85568 79956 71530 66619 52386 46663 36875 36018 30734 32591 36180
5515 36180 40996 40564 38174 35851 36831 30694 32472 28661 29066 26644 24304 29391 24480 19808 18830 20469
5499 20469 17996 20147 24336 23907 24514 30140 24137 23349 20209 20797 22681 17678 25899 22718 19227 18324
5483 18324 16784 20156 25856 27280 24972 25053 27530 30556 33375 28366 33084 33739 42304 40106 47151
5468 47151 48480 50336 50094 48625 48140 48756 51045 54160 54924 49008 51482 53584 52300 60324 65827 78425
5452 78425 82355 95096 104357 108047 108779 113810 107018 103472 100454 92217 90302 86986 85212 83876 81567
5437 81567 81815 79306 77005 78086 81991 81056 77211 76482 83565 82315 81516 88998 86796 93147 90679 91931
5421 91931 88706 94709 91954 94060 98041 100738 105094 109873 113738 111518 113496 117336 118651 118823 122717
5406 122717 124768 127149 130603 133047 140355 142941 146951 155978 163986 166534 168222 171061 174404 177856
5392 177856 178561 182863 187773 190864 194840 200840 207710 211128 216132 212941 224169 229754 233204 242450
5378 242450 247321 261535 267069 269508 275957 281130 284174 296621 301722 306732 316108 328240 338182 345337
5364 345337 351194 353449 363370 370361 381558 398020 408870 420512 431334 440912 457811 469752 477639
5351 477639 492743 508175 522213 542014 556732 569155 581905 601920 620624 638576 652639 672321
5339 672321 693173 714344 737196 761748 786590 812329 834832 867521 898745 931686 962802 999708
5327 999708 1036109 1074337 1117077 1163710 1200308 1247454 1294387 1345216 1403404 1462017 1527910 1591233
5315 1591233 1659776 1738530 1812898 1899057 1984469 2087006 2185767 2303973 2428303 2563989 2705159
5304 2705159 2863834 3028355 3205513 3397134 3609503 3840129 4092668 4365187 4659743 4982942
5294 4982942 5329308 5714643 6123170 6568416 7057390 7583045 8143596 8744275 9372850 10027274
5284 10027274 10695644 11356976 11986269 12551785 13030079 13393947 13627435 13733935 13698269 13530420
5274 13530420 13236927 12824360 12318916 11742957 11117647 10472463 9831091 9194015 8587552
5265 8587552 8002262 7459436 6946621 6482490 6048108 5647812 5285877 4948919 4637146 4353662
5255 4353662 4085073 3841528 3618238 3415505 3227384 3060979 2906394 2763182 2628184 2501272
5245 2501272 2384676 2278745 2175348 2081015 1993254 1905714 1825495 1744744 1670845 1609579 1544612
5234 1544612 1490171 1429245 1378868 1326148 1280077 1233418 1184433 1147718 1109299 1072150 1048016
5223 1048016 1002215 970042 936886 904383 872193 845770 813329 789013 760448 736184 705303
5212 705303 689801 665725 643836 630948 607988 589604 573961 555796 539855 524773 505522 487748
5200 487748 476397 461719 447652 435963 424895 404990 395778 385125 371532 361629 353254 343141
5188 343141 333327 324251 311413 305025 291251 282231 275617 269429 261558 252334 252660 237920 222492 222721
5174 222721 218015 206192 198144 195946 193448 186754 180256 172227 163741 162054 150167 148900 140926 139675
5160 139675 133618 126676 122814 117452 111632 100700 93659 91648 85506 82631 81099 78779 76591 65815
5146 65815 69825 59714 56533 54866 56188 49002 43574 41626 41126 39448 33136 30134 26623 21817 15763
5131 15763 16593 10044 8141 4067 3487 3911 -2053 -3304 -6391 -4915 -9792 -12678 -14745 -14252 -13085 -12934
5115 -12934 -13784 -15416 -12265 -9568 -4264 -3348 5252 8926 9814 14551 8819 3016 -762 -6052 -15110
5100 -15110 -24931 -28440 -34819 -42591 -47580 -51533 -54786 -51829 -50387 -57176 -56292 -58844 -61407 -67637 -63666
5085 -63666 -67511 -71581 -69392 -72959 -77378 -75414 -83152 -84544 -86589 -85481 -87425 -88041 -86261 -93431 -88053
5070 -88053 -92783 -96162 -95774 -96196 -91718 -95570 -94318 -97300 -97152 -92993 -97479 -100675 -97650 -103998 -104712 -109052
5054 -109052 -101440 -105229 -107594 -107454 -106332 -109074 -111708 -106504 -111824 -114191 -113008 -110184 -110947 -112240 -111927
5039 -111927 -112807 -118647 -123435 -120525 -124305 -127414 -129052 -128516 -129718 -133641 -131846 -127237 -127756 -130344 -123702
5024 -123702 -128596 -126553 -126585 -128332 -136083 -135430 -140284 -139062 -131699 -133728 -134429 -136003 -135411 -144418 -148237 -146423
5008 -146423 -149189 -148395 -143850 -141251 -147755 -148746 -149391 -147280 -143848 -139611 -135801 -137696 -135608 -145542 -142787
4993 -142787 -146567 -151367 -149900 -144687 -149826 -146453 -147286 -148013 -145993 -151650 -154886 -154218 -155598 -157933 -159479
4978 -159479 -157992 -158095 -157957 -157000 -154948 -160067 -153412 -151980 -151987 -155984 -153249 -153725 -150861 -149729 -151113 -148130
4962 -148130 -150248 -150528 -155818 -156571 -161127 -156148 -162263 -156797 -160268 -156143 -155327 -158975 -163197 -158318 -160002
4947 -160002 -157567 -158214 -160229 -157964 -155416 -155749 -159532 -164444 -165150 -163880 -161828 -163183 -160506 -160943 -164719
4932 -164719 -161184 -161140 -161277 -159056 -159289 -167441 -161497 -161125 -158690 -159667 -163649 -168366 -169511 -168068 -174250 -169993
4916 -169993 -174197 -167386 -167310 -165889 -167331 -173260 -167670 -169240 -168505 -170930 -179078 -169733 -170456 -170708 -180857
4901 -180857 -171663 -176978 -171322 -172697 -174782 -177995 -179301 -183081 -182272 -178433 -174701 -176847 -172196 -178084 -177875
4886 -177875 -180497 -183978 -180123 -184942 -181512 -180449 -178358 -183439 -180906 -182873 -186426 -177324 -183914 -181061
4872 -181061 -177066 -176281 -176683 -176977 -179341 -182132 -186571 -184110 -181530 -185584 -185824 -183861 -178089 -176120 -177614
4857 -177614 -180850 -186564 -185197 -183979 -181038 -176377 -173643 -170987 -174887 -176325 -178901 -177187 -175001 -176120
4843 -176120 -175899 -175746 -178293 -178633 -172389 -174075 -173417 -172732 -177171 -178238 -176576 -170781 -167791 -169492 -168391 -166790
4827 -166790 -166438 -162847 -169324 -175630 -180808 -185248 -185417 -184014 -184956 -184108 -185560 -186782 -191873 -192689 -195431 -197540
4811 -197540 -199512 -201091 -197153 -198688 -197568 -189835 -181189 -176776 -179702 -178555 -180671 -182219 -169644 -175435
4797 -175435 -181941 -187412 -189092 -199319 -197022 -199524 -197348 -198954 -198675 -201259 -198816 -197220 -196389 -201725 -199425
4782 -199425 -204185 -208938 -206020 -206111 -198658 -187529 -190756 -191663 -190044 -191899 -191904 -191068 -199194 -202716 -202294 -198516
4766 -198516 -198770 -198635 -197223 -206849 -206706 -205384 -204649 -200690 -201456 -195868 -195805 -200270 -202550 -204930 -205959 -207660
4750 -207660 -203419 -207220 -204996 -206145 -205734 -206383 -200497 -199664 -207648 -207227 -205515 -209198 -208756 -204876 -201167 -204017
4734 -204017 -204508 -207721 -204740 -205940 -207127 -205624 -205250 -204406 -206153 -211913 -210440 -206395 -205676 -199476 -198517 -194938
4718 -194938 -199590 -201580 -198611 -200202 -197670 -199313 -202267 -202392 -205762 -205179 -210284 -206387 -202581 -206753 -207885
4703 -207885 -205404 -209691 -203415 -199007 -200283 -205997 -203305 -209989 -200438 -202370 -195500 -194979 -189104 -185632 -185334
4688 -185334 -184596 -189349 -195198 -200581 -200691 -197979 -195850 -193839 -197139 -190104 -190672 -194071 -194118 -190836 -191676 -187149
4672 -187149 -184453 -186735 -182850 -179685 -176355 -178555 -173033 -171719 -169368 -161729 -155685 -147163 -140671 -138707
4658 -138707 -126742 -105723 -63190 -296 65310 91745 74249 37181 -17384 -64443 -91393 -109796
4646 -109796 -124994 -132638 -137832 -136434 -136160 -134410 -133836 -132549 -133333 -128229 -125570 -114677 -114204 -101987 -89394
4631 -89394 -66984 -28091 40403 149893 268471 341425 339210 280016 188067 91135 20071 -24816
4619 -24816 -56525 -74200 -91221 -98750 -101606 -106221 -109354 -113187 -110038 -111050 -108105 -103694 -102614 -98005
4605 -98005 -92421 -91238 -78190 -53258 -5147 54637 102262 111706 92489 48507 -13 -40415
4593 -40415 -75161 -98185 -103889 -110219 -119072 -118936 -123443 -124477 -123678 -130601 -129672 -134561 -132223 -130025 -131535
4578 -131535 -130717 -124692 -121870 -123876 -125549 -126866 -124488 -123949 -121062 -124054 -121195 -121246 -120482 -123119 -117292 -115072
4562 -115072 -113379 -112049 -110400 -108267 -108500 -106838 -104261 -99938 -99607 -93314 -91218 -91173 -86905 -85971 -80172 -73438
4546 -73438 -77383 -69987 -74238 -74029 -70351 -72268 -70479 -63463 -53550 -39756 -28301 -14383 -788 4769
4532 4769 12863 5001 4500 -6693 -7557 -11254 -16210 -18480 -17460 -12233 -16437 -7721 -8557 -9491 -8611 -5746
4516 -5746 -2617 4924 19479 24294 41651 65944 94879 132378 157162 174370 184064 179260 158066
4503 158066 140134 124013 109535 100928 91325 92977 86905 96948 103263 122815 138197 157696 171411
4490 171411 178347 195311 211048 239255 279327 329173 390817 477715 588091 695562 772038
4479 772038 779011 741116 683117 639242 618149 617812 629768 621344 612216 617042 630369 651308 675032
4466 675032 685239 686503 678718 678650 690093 702379 736494 800077 912421 1088210 1322137 1550569
4454 1550569 1694319 1710694 1607622 1441592 1263435 1117631 1025013 977884 947701 929072
4444 929072 921247 918411 910374 893395 864071 816820 789928 769318 766600 771142 766825 756137 763649
4431 763649 791243 852675 931753 1001195 1021078 1010658 964086 898840 824986 751511 692179 645642
4419 645642 608699 596022 582658 577626 573203 566384 560499 559409 559382 569915 571139 580684 591877 611349
4405 611349 632555 663846 689599 707636 713724 713798 715894 724990 744800 771894 808984 832388 849656
4392 849656 857679 849187 841460 823762 814977 805650 798921 794147 795868 804617 806222 818633 831032 845848
4378 845848 866410 892112 918186 950982 988276 1045147 1087681 1111365 1114082 1097340 1074552 1063704
4366 1063704 1059855 1075011 1098846 1119729 1135428 1146673 1157039 1169006 1178643 1194210 1212928 1246335
4354 1246335 1275394 1309155 1327626 1352614 1374819 1388639 1411013 1433797 1442279 1454961 1477865 1509314
4342 1509314 1546159 1581557 1612037 1627442 1642202 1649970 1662840 1679279 1710476 1735607 1764842 1800159
4330 1800159 1833561 1868542 1918018 1963792 2003372 2036500 2074868 2110835 2145107 2182536 2216877
4319 2216877 2253321 2298021 2340263 2384662 2440819 2495100 2541046 2602774 2674872 2741873 2805150
4308 2805150 2871916 2935385 2996151 3042355 3082742 3113520 3160737 3212713 3274353 3354870 3445217
4297 3445217 3531784 3620536 3728080 3869682 4070112 4357913 4737039 5195775 5627419 5912016
4287 5912016 6071381 6149527 6167784 6159223 6124274 6064413 6013112 5971394 5957356 6007028 6105414
4276 6105414 6200079 6278926 6353986 6427334 6525730 6668188 6836396 6992821 7166160 7334369
4266 7334369 7518140 7779860 8129562 8560321 9052562 9567579 10027359 10284439 10238979 9981528
4256 9981528 9607661 9193494 8827461 8548971 8353383 8231422 8221949 8359571 8653589 9073110
4246 9073110 9529904 9966677 10318136 10565485 10808445 11083909 11425675 11764223 12114885 12456832
4236 12456832 12715331 12896756 12930925 12818861 12672101 12487054 12337589 12242122 12227555 12273623
4226 12273623 12421895 12682289 13108250 13726712 14529193 15467555 16394277 17137562 17707257
4217 17707257 18221166 18894390 19910362 21215212 22821006 24346983 25571341 26914791
4209 26914791 28055450 28989125 30135048 31713185 34196887 37587680 41338877 44508816
4201 44508816 47319964 51776019 59994082 72111964 88329065 101858964 107310504 109757201
4193 109757201 109254333 104549139 98589710 93389737 89408615 88977715 92477429 96057247
4185 96057247 97894818 100428811 103426431 107426598 114746117 121948573 125737885 127961212
4177 127961212 129861401 133666040 140584405 151339832 167783819 188746032 216152075
4170 216152075 241406781 248070724 239872992 225066505 203536472 182313569 165252823
4163 165252823 152236608 143395693 139651414 136344870 130352385 123661273 116849183 110204852
4155 110204852 106585313 104870954 101648151 96774697 92547060 90268348 91511056 95846674
4147 95846674 101879536 107338619 113465040 120528593 119214979 109038420 96239273 80688575
4139 80688575 68048821 59932283 54246574 49471563 45114954 40955248 37672974 35332388
4131 35332388 33771282 32440061 31305914 30360544 29122124 27622535 25983190 24310217
4123 24310217 22923760 21908320 21178791 20509793 19642518 18654162 17621810 16617377 15790478
4114 15790478 15101520 14568726 14155937 13853397 13647870 13502941 13415745 13328693 13219860 13012080
4104 13012080 12661411 12260660 11899313 11607525 11375309 11193535 11048474 10977858 10975720 10917161
4094 10917161 10748349 10455480 9984702 9449569 8928786 8469579 8092578 7806570 7599227
4085 7599227 7443639 7313267 7187349 7034214 6847426 6658260 6473123 6325100 6201395 6090772
4075 6090772 5987313 5883518 5800175 5744391 5735926 5790327 5849978 5811679 5666591 5456912 5209715
4064 5209715 4959850 4755776 4574809 4433561 4306999 4190233 4091286 4003254 3926465 3854171
4054 3854171 3789804 3732922 3672739 3625928 3581766 3542439 3521291 3522254 3599014 3770952 4044106
4043 4044106 4322424 4398735 4255640 3990281 3649821 3344517 3106331 2926631 2792852 2690582
4033 2690582 2608525 2536508 2473143 2413200 2356338 2306901 2252979 2208948 2171517 2139016 2119022
4022 2119022 2105580 2098238 2122594 2203764 2335617 2468693 2502640 2430225 2289692 2112273 1957150
4011 1957150 1827501 1731698 1649794 1583083 1533644 1494778 1463257 1431809 1402917 1382695 1356362
4000 1356362 1330714 1305910 1281736 1259498 1240110 1210780 1187768 1166085 1139666 1116785 1095952
3989 1095952 1080754 1059387 1036421 1025490 1007202 992477 973229 947118 933451 919204 902735
3978 902735 891060 879189 862193 845596 832687 825856 819760 813508 800580 791094 770386 761659 748704
3965 748704 729691 710061 697232 681124 667769 655458 645480 629705 618873 610928 603714 589565
3953 589565 581626 579366 572307 569509 558928 556579 548752 541531 529979 517861 508118 498085 488843
3940 488843 475521 466380 461196 453324 451210 448855 445042 442119 439578 440335 440821 437753 437573 433222 427866
3925 427866 428304 423017 423066 424509 429340 433719 437193 450750 452290 462175 475300 497494 533076 596647
3911 596647 666134 753906 843137 918397 944588 921257 859535 789120 736970 713944 711659 714976
3899 714976 710842 706506 714498 740013 770685 814046 858120 891490 920482 940559 936467 945168 978820
3886 978820 1042567 1168906 1329846 1526359 1718824 1834895 1826022 1699381 1507736 1291775
3876 1291775 1108620 976441 900509 853655 819881 810573 801961 792306 771621 748702 729530 713253
3864 713253 717976 722199 713728 699025 686740 705868 749408 816679 883481 909020 874514 797612
3852 797612 706802 629965 564260 523785 495593 481398 450418 424457 392687 350289 308705 274912
3840 274912 244728 229592 215055 206904 201069 198362 191459 180810 174853 169121 172439 178797 177388
3827 177388 174979 168613 166502 165422 179929 191411 205989 198856 189020 173832 154402 141970 134954
3814 134954 122851 122496 124470 118299 116079 117393 113968 113263 108973 103895 95819 91161 83038 87608 83814
3799 83814 82344 74648 77834 75720 71748 65999 62772 60786 59875 59522 53536 57713 56674 60694 55976
3784 55976 70247 72554 80624 87762 92017 90915 86301 88213 85958 84160 82995 79858 70453 62394
3770 62394 56786 54712 50684 55581 44607 41743 40354 38260 32009 32322 31858 34636 37794 32894 34726
3755 34726 39698 43769 52524 61058 65387 75107 74547 79560 84344 86451 89218 91330 86066 80057 70966
3740 70966 58879 52615 44584 38087 28557 30901 30692 34643 28644 31318 32750 38771 32426 37284 38852
3725 38852 42843 45429 45021 50874 47410 53724 53792 56068 57562 58209 69346 64522 60541 59607 59938 54112
3709 54112 51961 49501 50135 57268 56229 59252 61446 60293 66545 64134 61820 64636 63677 59798 60186
3694 60186 56594 59990 57739 61983 64483 63727 64304 64281 64376 69993 68720 69858 66167 65295 70145 63997
3678 63997 61584 56272 55015 49245 46882 46433 46896 38706 41765 44690 39845 40551 47604 49127 50853
3663 50853 55466 55933 65981 67947 77863 85877 85481 87001 85333 85766 86162 84188 80879 79788 76108
3648 76108 77855 75879 74395 70117 62874 57269 56179 55870 63097 69076 63588 66925 70102 75308 76491
3633 76491 79751 84260 91422 95055 97443 103387 111275 114163 118791 117238 119579 114632 115252 111955 118855
3618 118855 112188 115660 115007 113181 115778 118143 116932 123309 130637 130622 139097 143434 152329 156277 158432
3603 158432 159117 162218 166276 169431 171388 171816 179853 185972 190236 192433 198695 202749 206573 216610 213898
3588 213898 225383 233244 240926 247457 252531 264419 270421 279921 283831 290661 297301 304180 317740 329805
3574 329805 338197 348984 354444 362164 375258 386375 403058 414060 431800 440905 459801 478669
3562 478669 489058 497552 503589 514961 527953 550197 566876 594614 614878 635862 659396 688213
3550 688213 712402 736503 770965 806141 847094 877944 921559 978624 1040181 1105557 1180092 1251255
3538 1251255 1350251 1452385 1563715 1681817 1809437 1949009 2123362 2353467 2651294 3043139
3528 3043139 3539097 4165276 4904140 5719355 6564197 7354478 7998065 8414503 8547535 8391886
3518 8391886 7982162 7396668 6721819 6052688 5439938 4930347 4550744 4293172 4155114 4119494
3508 4119494 4134466 4177519 4225571 4309225 4436741 4638986 4939894 5367439 5950296 6730647
3498 6730647 7723513 8951387 10372010 11923417 13489224 14934509 16112510 16922680 17299787
3489 17299787 17206994 16694459 15837942 14764102 13605867 12484848 11507742 10740302 10210223
3480 10210223 9886918 9711033 9641691 9642342 9689860 9758801 9849654 9950354 10066661 10199416 10384895
3469 10384895 10670214 11091126 11694506 12493435 13485563 14620493 15816350 16965686 17946787
3460 17946787 18668931 19075645 19164190 18997377 18625142 18161085 17668736 17205580 16776917 16371146
3450 16371146 15966607 15557222 15133207 14682747 14219925 13763464 13323029 12930036 12620145
3441 12620145 12420031 12364536 12474545 12770321 13252891 13893646 14634767 15388426 16047606 16484179
3431 16484179 16609661 16379511 15811383 14955294 13930009 12823898 11732701 10724211 9840326
3422 9840326 9090930 8480675 7996732 7632964 7362615 7179277 7080246 7075782 7176467 7405244
3412 7405244 7785363 8336882 9075308 9998870 11076976 12243225 13395138 14430194 15255520
3403 15255520 15762529 15891969 15649250 15062882 14194866 13126005 11966539 10800011 9692085
3394 9692085 8690773 7823285 7106773 6532850 6084503 5747980 5492052 5317448 5194125
3385 5194125 5140291 5153833 5255420 5464291 5800919 6275206 6882451 7594507 8359473 9106490
3375 9106490 9740732 10184014 10358781 10246654 9834317 9188602 8365268 7457222 6541642 5682146
3365 5682146 4917317 4268112 3739403 3313601 2976328 2717225 2517740 2352242 2216994 2100692
3355 2100692 2011012 1927996 1871339 1826889 1786761 1742191 1689435 1643357 1597967 1552211 1524001
3344 1524001 1498725 1472486 1441842 1415752 1385234 1366991 1355841 1357876 1344821 1326438 1305821 1285968
3332 1285968 1280651 1279056 1283954 1280911 1271439 1263894 1264524 1276835 1299515 1310008 1315710 1310775 1293337
3319 1293337 1277319 1271190 1273920 1287622 1294548 1303003 1300945 1309765 1321260 1345869 1375411 1404156 1433543
3306 1433543 1456276 1491487 1525940 1562622 1602728 1645778 1689375 1734433 1787971 1852413 1922055
3295 1922055 1990534 2067845 2150706 2243650 2350084 2484948 2651278 2862176 3092072 3339394
3285 3339394 3642330 4049271 4724359 5948805 7951719 10780026 13822868 15774709 15868410
3276 15868410 14478732 12241978 9847718 7929166 6610711 5758920 5227839 4918094 4750739
3267 4750739 4695411 4708920 4797223 4940878 5154492 5458324 5863391 6375674 6983219 7649926
3257 7649926 8437683 9514562 11196792 14253129 19642472 27527688 37091466 44795390
3249 44795390 46380392 42635264 36018026 27951560 21179438 16455804 13290832 11242611
3241 11242611 9940267 9086392 8541602 8234992 8080661 8056714 8177419 8426110 8825549
3232 8825549 9377167 10064746 10865709 11808690 13033212 14809118 17789675 23037254 30932368
3223 30932368 40997523 50269386 53793165 51127775 44909170 36616659 29057685 23594908
3215 23594908 19896533 17451197 15872785 14807407 14089441 13655319 13398525 13305704 13370904
3206 13370904 13575021 13910151 14359289 14897771 15490623 16106933 16764674 17512810 18518650
3197 18518650 20108981 22499803 25628104 28535852 29717715 28704573 26106457 22677240
3189 22677240 19258000 16499558 14430336 12906082 11788788 10944730 10291730 9787684 9411519
3180 9411519 9135293 8955010 8851893 8791498 8752753 8698942 8616502 8484409 8282123 8017142
3170 8017142 7674205 7276489 6834215 6372730 5915381 5472177 5074982 4719576 4409915 4144810
3160 4144810 3905723 3688812 3488789 3328337 3197739 3085052 2978949 2860407 2744038 2630171
3150 2630171 2503938 2378189 2253128 2134874 2033110 1947026 1870181 1800441 1741471 1690877
3140 1690877 1649256 1600804 1555249 1511473 1466553 1427666 1392418 1356768 1328621 1305208 1287761
3129 1287761 1269395 1285550 1307629 1334937 1335090 1334758 1329403 1314039 1285247 1241241 1173634 1098888
3117 1098888 1034001 969261 921054 878116 842759 805492 779216 751347 730265 706084 684270
3106 684270 657760 638428 632437 611558 599366 586161 573886 562119 558077 553585 554619 545946 541443
3093 541443 531315 520406 508397 493171 482333 471259 453618 445015 435036 430823 419047 414925
3081 414925 401215 392829 389786 381763 372762 365813 366248 364228 360132 355123 350324 341468 340318 333971
3067 333971 332508 320048 320575 321804 321691 322425 319260 311355 313958 310761 314078 310203 313268 314944 317395
3052 317395 319173 330683 333828 341335 337827 336841 334105 331644 340438 351734 356710 358639 355491 345776
3038 345776 337030 329311 329814 323368 319273 320796 328742 331727 334283 335986 341247 352548 365364 379867
3024 379867 398566 422924 464376 531424 629345 731140 813669 872152 890116 848522 784456
3013 784456 711756 640682 587670 549892 528833 521938 524539 521571 528123 530297 535644 540084 551350
3000 551350 564801 590748 612167 646154 706947 797288 938616 1112921 1302463 1477361 1639186
2989 1639186 1733139 1721448 1622448 1471808 1316305 1188172 1119107 1082896 1065973 1045552 1016812
2978 1016812 979027 949341 924488 918687 918290 917475 930468 951280 986027 1040183 1128611 1261160
2966 1261160 1439778 1633319 1821830 1989060 2132654 2226851 2240278 2186094 2095579 1986973
2956 1986973 1892372 1823881 1767157 1689108 1618148 1549801 1486579 1446590 1421634 1409427 1413081 1428134
2944 1428134 1454343 1494668 1545694 1614486 1704898 1820488 1970973 2129752 2303110 2520568
2934 2520568 2794754 3124292 3486897 3854115 4205764 4490682 4679435 4751843 4671427 4444904
2924 4444904 4116095 3760363 3423429 3147889 2944791 2811519 2742372 2730907 2769304 2851507
2914 2851507 2955762 3053374 3128596 3198310 3292486 3424048 3636471 3949276 4389412 4926408
2904 4926408 5572203 6272422 6971952 7698214 8448265 9236557 10020836 10617476 10811896 10480229
2894 10480229 9707348 8694866 7649708 6745034 6061374 5605168 5332432 5206841 5161461
2885 5161461 5127754 5106202 5092248 5088824 5106506 5165115 5305835 5549023 5944237 6497295 7185424
2874 7185424 7915687 8712998 9663125 10739412 11849120 12875879 13707676 14163898 14091465
2865 14091465 13456474 12356908 11058054 9759441 8610625 7721067 7073478 6632018 6356696
2856 6356696 6207021 6138755 6119718 6104119 6074413 6044887 6007796 6001761 6039911 6137327 6333400
2845 6333400 6682696 7208373 7935365 8803185 9646503 10366326 10907572 11171278 11154619 10831665
2835 10831665 10244504 9488664 8681909 7925603 7295189 6827024 6511475 6316496 6200339
2826 6200339 6116722 6020670 5921129 5848008 5813551 5844482 5931319 6008455 6062978 6112709 6177884
2815 6177884 6286974 6497380 6819727 7238910 7647176 7945073 8118166 8174160 8066998 7844572
2805 7844572 7574990 7309740 7117335 7030941 7042276 7099282 7131904 7136692 7126764 7127162 7170940 7254516
2793 7254516 7397004 7605166 7882849 8178667 8443933 8648954 8746689 8798292 8860744 8979992
2783 8979992 9165939 9401298 9707994 10087599 10571042 11101954 11522676 11888775 12247102 12551921
2773 12551921 12984950 13493011 13821401 13994862 14119034 14181912 14275573 14355480 14434811 14481478
2763 14481478 14545200 14747150 15119595 15845198 17021939 18681990 20807219 22792905 24209072
2754 24209072 25258975 25490127 25055186 24566393 23960527 23408992 23014634 22846948 22918426
2745 22918426 23340836 24130206 25218215 26480902 27813288 29252684 31047879 33530722
2737 33530722 36917370 41292895 45690815 49453935 52874440 56621252 63186312 73532161
2729 73532161 88713724 107609061 120210316 123982304 123020280 115189263 105407526 97389153
2721 97389153 92530478 92513945 98995640 110157635 123501781 138279478 149464026 154956478
2713 154956478 157387700 155820911 152274727 149028277 146337881 144354456 143682432 147710809
2705 147710809 160985561 186765635 224482303 269333737 299151072 299081276 277756560
2698 277756560 243170837 206240137 178823437 162675719 154660061 150737245 149865203 152380608
2690 152380608 156744525 161910156 166852112 168173862 163624279 153590135 139351275 123172127
2682 123172127 109900970 101052195 98036031 100699026 107839375 116635716 126562735 132746131
2674 132746131 128591984 117481640 103781899 88642372 77300705 69614895 64041102
2667 64041102 59531602 55056341 50696329 46768084 43299752 40363322 37795434 35436910
2659 35436910 33295113 31430791 29926835 28818298 28037820 27500758 27063771 26771261 26731557
2650 26731557 27021349 27474826 27706830 27589040 26741968 25158859 23391809 21623538 20146474
2641 20146474 19108522 18406856 17957328 17599728 17256948 16908179 16555131 16272178 16077668
2632 16077668 15937570 15776360 15493507 15052376 14584473 14118577 13618517 13142192 12656490
2623 12656490 12115160 11600527 11139484 10747998 10455323 10228879 10003141 9748573 9470918
2614 9470918 9172078 8878594 8618358 8412206 8241659 8090384 7920151 7722051 7501400 7276473
2604 7276473 7060577 6866484 6694961 6536904 6393897 6266920 6149687 6044286 5957116 5881431
2594 5881431 5815240 5757498 5708971 5669218 5647838 5624417 5589581 5522505 5397184 5243046 5088412
2583 5088412 4935716 4805926 4698001 4599850 4493905 4395450 4293706 4187805 4099173 4027232
2573 4027232 3961703 3902598 3852130 3795825 3728651 3664056 3597468 3529015 3466965 3405200 3343450
2562 3343450 3278200 3228557 3177004 3139241 3102805 3061921 3033081 3006385 2968220 2928808 2872515
2551 2872515 2811444 2739779 2683767 2634863 2592942 2572702 2547942 2529964 2520001 2492803 2461467 2421764
2539 2421764 2375663 2318819 2271119 2222961 2182755 2152930 2115573 2091426 2074206 2067295 2069873 2084442
2527 2084442 2100646 2116471 2122244 2126323 2106558 2063751 2004751 1947201 1900511 1879147 1878023 1888646
2515 1888646 1900779 1902442 1881440 1847551 1805260 1749922 1690958 1644323 1601905 1571663 1553330 1553518
2503 1553518 1569733 1602852 1655969 1729290 1824838 1938052 2050518 2119502 2133749 2107991 2047888
2492 2047888 1948529 1848613 1752469 1680411 1639501 1618990 1605585 1588654 1555512 1509753 1457257
2481 1457257 1400843 1360076 1325215 1314823 1318100 1343593 1390669 1472449 1588721 1730955 1883474
2470 1883474 2042269 2216759 2358034 2409959 2376337 2271815 2141262 2021318 1904193 1782542
2460 1782542 1669303 1559168 1468632 1383449 1319991 1267633 1215591 1173776 1146296 1132037 1131339
2449 1131339 1150532 1188992 1257666 1353624 1455131 1552916 1641293 1745562 1831568 1906139 1981786
2438 1981786 2023058 2033886 2025199 1980957 1883750 1728905 1553793 1380758 1234862 1129055 1048214
2427 1048214 994375 952337 920352 900359 885193 875476 878553 886699 907068 935404 958166 970819
2415 970819 982794 1008635 1065700 1141161 1225352 1288536 1331974 1357523 1340690 1271295 1160789
2404 1160789 1050144 929674 828986 766528 714339 678986 650930 630337 611613 594878 588564
2393 588564 585053 568038 563858 555649 551440 550747 556348 574551 597290 625253 649879 658020 664467
2380 664467 664525 653821 630610 599986 565357 532927 510612 494495 480078 468799 466234 454661
2368 454661 452185 447267 444084 441289 433377 428607 416864 424474 424115 421794 423173 425178 424821 418779 414445
2353 414445 421803 423442 430024 431245 442736 451647 477027 521647 576977 635555 663384 650529 617954
2340 617954 572092 527833 492340 464158 450526 436972 428587 428297 428651 432281 435349 442682 444776
2327 444776 448584 454488 463495 475785 483067 491542 503290 517089 552188 619208 712928 828943
2315 828943 895529 886777 830553 741232 644173 572993 520315 483552 459343 443229 434559 427891
2303 427891 425219 414935 414087 407850 405567 402418 400409 402095 409501 414088 415219 426747 442042 474301
2289 474301 514489 572686 618750 630834 615172 578955 531190 490625 455441 427780 410832 398603
2277 398603 394761 391425 393041 395143 388046 389889 391734 382866 389950 383428 386130 383424 384856 391938
2263 391938 397642 406255 415015 426173 438581 459015 470782 481098 487599 481973 471110 458705 451205
2250 451205 443887 438155 437565 438827 440060 441666 445476 450161 452027 449935 445788 447940 453689 456883 467707
2235 467707 469590 479632 484227 482096 488895 488956 491345 496429 505777 510431 510301 508443 509764 507550 507264
2220 507264 503923 506104 519846 532697 543875 560164 572340 580046 574602 571574 568732 561272 565643
2207 565643 571376 582656 592249 599529 597893 596472 589968 594230 602005 609040 624956 631237 640286 642556
2193 642556 654133 663404 670506 683024 700855 709863 729361 742691 752604 759018 765497 769238 773438
2180 773438 792105 811244 825153 838551 845951 849931 851001 853537 864717 868523 880169 891398 905595
2167 905595 914184 925430 948709 968935 999915 1017017 1033446 1056279 1075638 1095192 1123069 1157887
2155 1157887 1191801 1239116 1267338 1282753 1297078 1310049 1318177 1329932 1339921 1352646 1369498 1397078
2143 1397078 1426842 1454312 1483477 1514586 1543733 1571687 1600622 1641359 1689840 1732436 1776296
2132 1776296 1824005 1877105 1935036 2008321 2100273 2210219 2322218 2436853 2535813 2622438 2709701
2121 2709701 2799907 2907892 3013554 3126269 3259145 3410414 3578548 3764253 3981009 4221282
2111 4221282 4501608 4824676 5236963 5728918 6330655 7009586 7804281 8788191 10213839
2102 10213839 12695457 17359177 24961463 35342728 45669059 50594888 48766528 42569256
2094 42569256 33993374 25859958 19846192 15730444 13010719 11287118 10195980 9530875
2086 9530875 9185736 9050904 9059499 9214103 9513960 9993565 10666630 11533073 12576068 13798450
2076 13798450 15344774 17559137 21236539 28575301 41372936 59900433 81255768 93849400
2068 93849400 92150854 81695093 65257141 48477446 35794562 26962804 20960569 17018012
2060 17018012 14379429 12583409 11415939 10615792 10035268 9634983 9384232 9284771 9325604
2051 9325604 9487782 9763574 10168585 10738654 11619134 13103359 16016958 21321868 29324423
2042 29324423 39057223 46277085 47343427 43431047 36458194 28461526 21778152 16869578
2034 16869578 13348954 10907868 9233682 8103065 7349764 6821446 6380698 5972721 5585888
2025 5585888 5220658 4903868 4626632 4399586 4213424 4060363 3936931 3832668 3731236 3645850
2015 3645850 3575867 3519489 3510603 3577638 3747856 4056940 4428280 4690082 4741504 4564992 4212565
2004 4212565 3851403 3558715 3416358 3410499 3432580 3405544 3284931 3065661 2822566 2589648
1994 2589648 2391195 2249058 2136502 2046828 1979765 1921470 1881357 1842864 1809851 1787112 1770690
1983 1770690 1794214 1849533 1958775 2089933 2197166 2240363 2210509 2103597 1973589 1863882
1973 1863882 1788383 1756521 1748019 1730929 1683956 1617625 1516995 1412316 1319763 1241636 1180830
1962 1180830 1137481 1092878 1061559 1037939 1012008 989094 962545 934591 911152 887494 866814
1951 866814 855336 838817 822268 808755 788009 777457 768231 756064 740786 723016 712328 709886
1939 709886 700554 690379 683820 671749 661459 650850 642538 633515 617979 607733 595976 582797
1927 582797 572404 559100 551647 535273 531990 530141 526721 511699 504497 491143 473408 472171 456921
1914 456921 454354 455142 451943 453356 446464 435970 433853 421120 423827 421924 422514 417393 411560 402644
1900 402644 408307 395266 390986 378210 372260 365598 362419 358839 359828 351791 343701 340869 334752 333762
1886 333762 331250 329305 328236 327993 323734 315993 304882 297877 299363 292021 297037 293824 299328 301069
1872 301069 305299 302975 295593 289451 287243 284707 279011 277513 275308 273343 270711 272504 270530 274932
1858 274932 277831 284286 288966 296292 301460 308965 334729 379014 436234 489094 501554 481153 442296
1845 442296 389277 344536 312572 284197 272359 258611 256868 250293 250854 248826 242969 242945 243965 248947
1831 248947 251966 259744 263408 269953 272760 288380 309750 355955 434936 548102 665347 708936
1819 708936 683789 604607 515791 424519 354259 307798 276498 251146 240631 233995 227245 221764
1807 221764 213519 212356 214379 212695 208862 208111 208664 212466 218411 228368 230887 249694 284276 329220
1793 329220 384542 416974 407963 380736 338071 292548 256197 223323 209482 199695 194309 191300
1781 191300 191079 181612 187615 182573 177168 162708 164378 155796 149906 153198 148165 149390 148403 149926 149652
1766 149652 149418 147478 147204 142080 149359 150236 149389 151523 148513 152209 145763 145148 147853 147894 149512 145619
1750 145619 150881 140406 137838 134585 132085 129283 123986 127707 122561 122222 125815 121352 122452 125488
1736 125488 122381 116935 129171 127186 122251 122836 128366 127736 125079 126601 122906 120903 123393 119967 120553
1721 120553 110401 114654 114858 114548 114029 113850 113270 109568 107425 108815 112727 107180 103294 105117 104764 103600
1705 103600 102586 107598 107663 106470 109606 102610 101951 102270 102214 102030 105381 99491 101930 95904 100498 101268
1689 101268 95648 98333 97738 102883 103050 99472 100500 98681 97599 101841 102233 96302 93844 93909 94895 100870
1673 100870 92601 96088 96177 97745 93288 95112 94966 95173 94483 92903 95637 88795 89081 87925 93317 92690
1657 92690 91012 88914 90548 91951 92958 94110 91549 91305 93030 84665 90366 89111 83514 86405 82870
1642 82870 81478 82731 85011 88240 89456 85326 87661 82340 81159 81494 79970 80457 82014 83093 83177 85415
1626 85415 76990 79900 79624 81544 78467 83497 81478 83349 76641 80321 79795 74165 73693 75925 74597
1611 74597 78993 75731 75172 76719 77585 77474 77193 76848 78738 71339 77307 76559 73022 75981 76348 76532 81688
1594 81688 75966 76030 74177 70521 75651 74319 75405 73495 76222 76818 74830 72857 75891 75049 74500 70512
1578 70512 69752 69873 70768 75245 73977 69888 65986 63568 61191 63367 72256 75866 73528 69332 71318
1563 71318 63434 63443 66456 65970 72470 67832 65168 58268 62780 63638 68015 72646 74961 65690 64160 63221
1547 63221 69959 78674 77490 70521 58557 53453 51790 55336 60084 68924 69934 64403 59654 56384
1533 56384 63867 64971 66154 67402 59878 47480 47977 49175 59298 71283 70330 70514 56142 57894
1519 57894 59578 69309 76214 75113 68952 61503 52482 51142 50936 54987 54731 53184 49234 47871 54649
1504 54649 58876 52829 62753 57183 53380 48337 45760 46443 55837 60806 59625 60884 52900 53080 48845
1489 48845 54177 53531 52840 57162 56955 52031 53649 55506 49280 47585 51599 49177 50808 51004 55180 51085
1473 51085 50145 52049 49392 51190 52478 56103 49708 49703 54859 57743 62604 58916 54018 43975 38526
1458 38526 38284 41907 49092 48957 51536 45980 44883 42716 45701 47626 49338 49401 46591 37686 33106 39196
1442 39196 51596 54431 55402 52570 44385 38525 42867 55728 57756 57515 51442 47136 40460 38778 40397
1427 40397 44602 44371 43402 46258 40226 39298 43894 45174 45275 42721 37023 29749 30367 31067 40111 47995
1411 47995 44285 45658 43253 38350 38623 37830 40528 41138 34268 38882 43063 38253 42774 47810 45873
1396 45873 43233 38528 42570 40447 43003 42033 48389 44495 39603 35620 32937 25814 28928 29605 25974
1381 25974 32058 29990 34906 35426 35047 31913 37201 32755 37303 35363 34030 32770 34077 33506 30846
1366 30846 26960 23730 24910 26202 28312 31902 33507 36975 37428 41238 40465 41328 39282 32205 27764
1351 27764 28933 25704 29463 31272 31616 27270 24425 20829 25290 22281 27417 30812 32563 37055 36976
1336 36976 35514 36906 31604 31335 26315 26811 25751 23242 17343 22087 24214 20890 22606 28912 23972
1321 23972 21381 19726 19383 29199 35126 39253 42226 37128 30637 25815 18990 24919 20797 19203 21512
1306 21512 24777 26209 32567 34552 41993 42860 40577 36890 28361 23549 24041 27287 28015 28082 25285 26646
1290 26646 19461 6862 7919 8676 11646 17962 29100 34475 32272 36844 33008 20657 23025 23595
1276 23595 21437 18958 6366 484 -2243 5064 16251 24685 24255 18144 7022 -3146 -7042 7597
1262 7597 15070 25612 29930 26811 25313 23657 17322 12330 11778 7283 5840 9778 11832 17135 24567
1247 24567 29329 34631 43423 47789 40954 27631 20526 14980 10547 20174 32779 45706 47350 40441
1233 40441 42846 39163 48393 62654 65447 52730 42542 22048 21656 17548 23012 32896 35836 40078
1219 40078 41018 40051 27692 19880 22878 20317 14963 6322 11301 18412 29344 30627 31440 33674 32023
1204 32023 33613 26730 12921 -4844 -9966 -12044 4291 9789 20767 26134 19318 15806 12938 15018
1190 15018 14080 16583 17670 13626 18305 17164 18562 22700 21777 19417 16796 9810 10972 12986 12442
1175 12442 17388 27901 32086 35925 32789 23581 21907 19468 13230 18521 18273 23201 21569 21092 11883
1160 11883 12474 15575 17334 21132 18061 19350 23437 25722 25934 24945 28455 26811 25185 18114 16049
1145 16049 11178 16109 15604 20358 18713 13668 9391 10433 14157 6992 8566 6831 8843 6385 8989
1130 8989 11354 10418 18799 19537 15891 22934 20634 19114 16916 13424 13794 19545 22411 19134 24074 22935
1114 22935 25623 20049 15552 15572 12423 11688 7975 8462 7055 3927 7289 10361 9109 3540 4331 7653
1098 7653 1548 13573 12591 13213 15916 15107 13923 13678 10224 13972 12372 8473 12565 13599 13620 5137
1082 5137 8213 4108 1229 10796 7061 12227 13400 13169 13713 13732 11432 6054 8593 7102 2735 2655
1066 2655 3646 5383 9548 8707 10226 10458 9072 9951 5979 4863 10574 5329 7338 9519 4759 7587
1050 7587 4825 8154 9342 3194 3595 13161 10280 14546 8687 8325 4660 6695 3538 5938 4908
1035 4908 11822 6737 9639 6852 9305 10040 8766 10234 6165 6856 5306 4037 13706 6782 11545
1020 11545 8006 4121 4275 7657 5185 4896 7106 12043 5667 1771 3588 5769 7050 3951 4164
1005 4164 3716 1512 3781 8730 12054 10616 8729 4589 6314 4510 4723 8784 12900 11515 6495
990 6495 6611 1406 -1738 2285 1960 2389 2115 971 4819 2312 -880 2051 521 -2466 1605 -4259
974 -4259 -3730 2610 4568 5900 2483 -6152 -4924 1534 1568 5960 3630 6470 5575 -642 -2649 -6212
958 -6212 -4128 -1552 189 -1477 -2114 1851 3263 810 8686 1441 -4683 1226 -146 -3773 650
943 650 5747 4274 5116 6767 -57 -4122 571 -2421 308 -3687 2992 7894 6684 1255 1341 -2879
927 -2879 -7138 -12516 -7050 -4722 6208 7459 8893 8360 766 -4922 -4989 -3979 -2689 2923 7602 5230
911 5230 -1147 -2765 -9667 -14024 -12476 -5248 -8776 -1932 4194 5438 4954 -2413 -4075 -9862 -9142 -11658
895 -11658 -7257 222 8641 12635 5138 3409 -5496 -4187 -9949 -290 3297 8054 4406 3828 501
880 501 -1918 -8004 -10990 -11092 -6500 -4715 -4718 207 -477 2554 2122 2452 -4373 -8052 -7017 -10969 -3357
863 -3357 85 -882 1717 -6444 -8267 -11842 -8901 -6756 -3663 -2835 4027 -4339 -2570 -1784 -7851 -11678
847 -11678 -7773 -10735 -5614 -9022 -3847 -4193 -5743 -4543 -7919 -10014 -11735 -7559 -3621 -4471 -3281
832 -3281 -1019 -3466 -6392 -10317 -10128 -12905 -9628 -4692 -5986 -6697 -5104 -5722 -3657 -1993 -9791 -14189
816 -14189 -7848 -10195 -5666 -3661 -10188 -3263 -10388 -10153 -9320 -8210 -4147 -3801 -2908 -8139 -7930 -6286
800 -6286 -575 -2595 -8528 -4980 -8270 -10942 -5822 -6286 -7312 -4974 -8432 -2931 -11731 -12855 -12212 -10367
784 -10367 -12085 -11488 -11301 -14553 -13368 -18815 -15162 -12287 -13208 -14311 -8574 -10327 -13383 -6766 -4704 -7859
768 -7859 -7050 -9570 -10092 -9879 -9601 -11392 -9895 -10366 -12946 -14077 -11787 -15943 -15442 -10146 -10700 -9484 -7431
751 -7431 -10798 -9731 -14441 -10159 -13397 -12812 -13329 -6835 -12062 -5721 -12347 -10533 -12234 -12258 -15291 -13895
735 -13895 -12912 -15454 -13112 -10731 -12684 -13375 -15614 -15201 -17046 -16880 -16090 -17618 -16169 -12730 -13235 -9944
719 -9944 -10850 -13167 -15414 -17226 -16465 -20965 -16553 -13145 -10715 -8309 -14944 -16643 -14774 -11123 -13744 -8200
703 -8200 -10057 -14191 -11896 -15265 -10931 -17940 -16242 -13359 -19871 -17428 -16682 -12685 -11034 -7618 -12561
688 -12561 -9826 -14593 -19475 -12144 -17615 -16409 -17836 -13419 -17700 -13351 -13138 -14109 -13197 -16975 -19779 -22633
672 -22633 -17754 -14851 -14207 -19684 -14259 -18920 -15102 -17115 -13332 -15613 -18963 -14801 -14545 -13302 -16123
657 -16123 -16557 -24917 -23850 -23325 -19176 -14641 -17963 -12719 -13383 -18026 -18602 -25280 -20456 -21898 -19525 -19066
641 -19066 -20291 -24381 -18719 -19351 -22642 -22500 -22552 -29540 -28272 -19866 -13683 -8279 -12334 -9668 -9449 -5098
625 -5098 -2409 -8113 -18370 -24890 -25613 -27212 -26399 -27424 -26534 -23356 -24013 -23943 -21454 -21717 -19653 -16526 -25820
608 -25820 -25173 -27818 -24070 -8673 -4649 -2967 -5822 -4601 -2721 1583 4947 1582 -4701 -10869 -15762
593 -15762 -16985 -20063 -25895 -29100 -26910 -26248 -25187 -25456 -22331 -20031 -15700 -21540 -23570 -23119 -26206 -26815
577 -26815 -16100 -8948 -9789 -6830 -11316 -13612 -11293 -14442 -19398 -21664 -20407 -17534 -17668 -16129 -16840
562 -16840 -16003 -15981 -17126 -22346 -18588 -14704 -18825 -18285 -18192 -20506 -23086 -21541 -23527 -30153 -24761 -26870
546 -26870 -23514 -23458 -19681 -21048 -16078 -21288 -21579 -23995 -21135 -20265 -18019 -15473 -14733 -16866 -21732 -19159
530 -19159 -17824 -17820 -15112 -20475 -20294 -20002 -18345 -19794 -18785 -16563 -22620 -19238 -21647 -21591 -20297 -22621 -25717
513 -25717 -23654 -26033 -18021 -19713 -16034 -19269 -19358 -17691 -20008 -21890 -20358 -19619 -20249 -14497 -14356 -19172
497 -19172 -19050 -16397 -23085 -23790 -22757 -23192 -21852 -20404 -22946 -24097 -24962 -23637 -27740 -29446 -21180 -20643
481 -20643 -20708 -19591 -19756 -16886 -21998 -22666 -20895 -25570 -27776 -19919 -22238 -18994 -15966 -18685 -22219 -26716
465 -26716 -27211 -30505 -22241 -23836 -22659 -25156 -26966 -25703 -26276 -25712 -22827 -20363 -25211 -20615 -18127 -23716
449 -23716 -16023 -22890 -28447 -30378 -28520 -24330 -23258 -25083 -21406 -25610 -25489 -25864 -24201 -23423 -21994 -22792
433 -22792 -19274 -23546 -28481 -26161 -29806 -33909 -25933 -25278 -20403 -12373 -21910 -21865 -24257 -24589 -21452 -22457
417 -22457 -23092 -19754 -22589 -24559 -23412 -23355 -22192 -21906 -21580 -19533 -21180 -19734 -22442 -24942 -28679 -27141
401 -27141 -22941 -24403 -22261 -20523 -19440 -21868 -19239 -22671 -22386 -22495 -20287 -22273 -23396 -29469 -28050
386 -28050 -31561 -23528 -30868 -24520 -25188 -20863 -26589 -22877 -23094 -24184 -24129 -21711 -21943 -25809 -27692 -22661
370 -22661 -21064 -22505 -23656 -20959 -27169 -27260 -26529 -23565 -27955 -28552 -27477 -30906 -24167 -26183 -26864 -22891
354 -22891 -27056 -30798 -31672 -31756 -30440 -26708 -30299 -24850 -25289 -28708 -29385 -27078 -23330 -19494 -19867 -21209
338 -21209 -28605 -27811 -31714 -35093 -34923 -33022 -23890 -27205 -26351 -31543 -26703 -27599 -28926 -31076 -33100 -27536
322 -27536 -33081 -30787 -29420 -30890 -29076 -30832 -28674 -27583 -27562 -26528 -25625 -33335 -27487 -31586 -33828 -34321
306 -34321 -28302 -30634 -33356 -30872 -28395 -32646 -36629 -34040 -34345 -32447 -30302 -31823 -32000 -28244 -26477
291 -26477 -34361 -30315 -36648 -35541 -32795 -33078 -33827 -35010 -33715 -32402 -29611 -33645 -29087 -28371 -28628 -25793
275 -25793 -29886 -32540 -35206 -31395 -37894 -34489 -40464 -35313 -38399 -33992 -32892 -32312 -33654 -32107 -34339
260 -34339 -33932 -31685 -32909 -35197 -34203 -36716 -35762 -39929 -35491 -35834 -37016 -32621 -35833 -34990 -38621 -37503
244 -37503 -35546 -36982 -36076 -36158 -42596 -40287 -41970 -37860 -41442 -37462 -40269 -42367 -38633 -41587 -40818 -33379
228 -33379 -33947 -36721 -35341 -38763 -39451 -41377 -42387 -39547 -47279 -43133 -44380 -42755 -41494 -42191 -39270 -38062
212 -38062 -44766 -45368 -46000 -45183 -43622 -44270 -46200 -49511 -49104 -48786 -53699 -55228 -47579 -46839 -47141 -49614 -48617
195 -48617 -47843 -52174 -48201 -50204 -51060 -54446 -53163 -53396 -48936 -52550 -50931 -52140 -46159 -51071 -49177 -50067
179 -50067 -52714 -52110 -53840 -57586 -58761 -56469 -60237 -59346 -63502 -57615 -58419 -59709 -63663 -62302 -58296 -58637
163 -58637 -57937 -59946 -58238 -64933 -61714 -61246 -63718 -64188 -69459 -67035 -66553 -68158 -67445 -70465 -68702 -65120
147 -65120 -69149 -70121 -71486 -71746 -69327 -68246 -73567 -73055 -76871 -76104 -76767 -74241 -74755 -75531 -76289 -76732 -76531
130 -76531 -75534 -78052 -76773 -74756 -78687 -78902 -77919 -82056 -80884 -82480 -81249 -85114 -82680 -84001 -83594 -83565
114 -83565 -86485 -86993 -89642 -90610 -91470 -89498 -89653 -93228 -95275 -95725 -93741 -98367 -95555 -95116 -94276 -95784 -96542
97 -96542 -99496 -98206 -95538 -100897 -100707 -100769 -103162 -103462 -102932 -102548 -101581 -104038 -106356 -106907 -110719 -111572 -110834 -108195
79 -108195 -107642 -110085 -112345 -113300 -119500 -115042 -118908 -115316 -117797 -114652 -113449 -119515 -120993 -120534 -121325 -125334
63 -125334 -126805 -126110 -125891 -124359 -125260 -128976 -129711 -130822 -130445 -137818 -133092 -133543 -134438 -136179 -136459 -137543 -138805
46 -138805 -139534 -137301 -135159 -138561 -138298 -138565 -144090 -141764 -143450 -143870 -143312 -144981 -145346 -146333 -149621 -151282 -151191
29 -151191 -153425 -153859 -155697 -156305 -156183 -154866 -156293 -160055 -164155 -164555 -163959 -162805 -163362 -162853 -165024 -163996 -168337
12 -168337 -168317 -170499 -165879 -173138 -169507 -174809 -171458 -170148 -170782 -172338 -173270 -178806
0 -178806
$$ Imaginary data points
##PAGE= N=2
##DATA TABLE= (X++(I..I)), XYDATA
16383 -1167915 -1152609 -1140030 -1129608 -1115542 -1103141 -1090792 -1081350 -1068369 -1052435 -1038931 -1028787
16372 -1028787 -1017502 -1001630 -990753 -978806 -967302 -954456 -941507 -926473 -916716 -903026 -889200
16361 -889200 -876518 -865900 -853461 -839678 -827545 -816802 -802742 -795682 -779005 -766879 -760653 -746848
16349 -746848 -738064 -722357 -711954 -701370 -687292 -677248 -661976 -649975 -639023 -627863 -615513 -601769
16337 -601769 -591667 -579964 -569141 -552747 -548049 -534197 -518962 -509906 -501308 -484878 -475116 -463584
16325 -463584 -456105 -444791 -434322 -422359 -410164 -401044 -391924 -380670 -370970 -356880 -351266 -334129
16313 -334129 -326492 -313247 -300464 -292363 -281204 -269082 -260232 -252254 -242386 -230212 -221425 -213485 -204394
16300 -204394 -192641 -180339 -169479 -161925 -155228 -142483 -132932 -123154 -114594 -104307 -95784 -85092 -75921
16287 -75921 -67005 -54391 -50627 -39886 -26605 -21274 -12907 -3294 7168 16326 24563 33163 43381
16274 43381 51324 61801 66047 74503 84835 90595 99203 109129 115351 124266 129585 136638 147864 155187
16260 155187 162618 168034 179596 184791 195412 199993 207422 217357 224253 229157 239149 244298 250644 258273
16246 258273 267950 274743 278546 289326 294686 300585 304598 314294 321487 328918 334351 339378 343568 349495
16232 349495 355987 361585 365205 375740 377766 388162 395780 396630 405990 407532 415619 418537 422390 429602
16218 429602 431971 437879 450390 455572 455981 467126 472401 472653 478679 482476 490151 491409 498763 503232
16204 503232 509554 510484 513332 520188 525018 526980 532810 536422 541664 549001 549093 551977 558572 564117 562646
16189 562646 569796 571453 574086 576930 580625 584247 592098 596093 599815 599749 603034 607002 613189 613818 616324
16174 616324 625310 622844 623725 628364 628737 637698 640990 639520 639520 648271 646763 649287 653313 658190 660107
16159 660107 663871 666480 673598 668556 674713 672665 676637 679527 678197 686763 685711 694973 689045 688869
16145 688869 691847 695816 697763 699671 699975 706982 707311 704506 707748 709715 710739 714733 716811 720844 721356
16130 721356 723604 724370 723224 723912 730719 730792 732035 731773 733422 734541 735469 737567 735783 743179 741400 742580
16114 742580 741578 743668 744519 744683 752402 747986 749921 747765 749704 753406 753745 761054 751175 754163 755425
16099 755425 754675 758611 757376 759370 763207 763984 765275 761430 769325 766638 770167 768666 769041 770055 763890
16084 763890 765808 768221 772754 770678 771842 771731 773236 774765 774365 771314 772607 778160 777156 779135 778060
16069 778060 776315 778366 779512 773952 778402 778321 779468 781638 780735 780896 781061 781899 778308 782594 782107 783740
16053 783740 787308 786763 784841 785764 789731 790413 786453 788173 788167 784238 781563 785194 789747 784945 785878 789399
16037 789399 786063 788163 788880 790080 790989 785021 794317 793821 794844 793026 788922 793458 794187 791440 791388 791495
16021 791495 792454 793270 791538 788936 791621 792903 793696 792157 788148 792728 789142 792116 792469 794350 792806
16006 792806 794313 800445 795745 792945 789972 792836 796551 794125 789948 792647 796575 794571 799863 794512
15992 794512 796566 795422 795290 794082 791904 795997 797006 799484 797097 797285 795878 793986 796139 796933 796271
15977 796271 795119 795109 798886 794740 798613 799148 794404 793773 797381 799514 799515 798347 801473 800879 799820 797676
15961 797676 794417 800415 796876 794914 795896 799414 795174 797124 801536 800045 800433 798861 791377 799159 796572
15946 796572 801562 797799 797550 797628 794059 799814 798453 796833 798688 794512 795434 796802 800529 796539 797446
15931 797446 799257 794107 796569 798645 799438 800349 801879 800807 803361 802523 802881 799286 799560 797681 802303
15916 802303 801550 802464 802815 800383 803135 803937 799867 800869 801101 798535 801047 798146 798707 801688 805433 799141
15900 799141 799665 801042 800843 800423 799836 800420 798160 800620 803883 801378 802436 801377 805925 803582 800216
15885 800216 804213 803940 805301 807126 807853 806242 805305 805591 801109 806184 802677 807469 804632 803524 802481
15870 802481 800985 802088 803986 802971 801087 805526 804173 803530 807974 803644 806846 801348 801908 803763 803315
15855 803315 806829 805128 805478 802623 804966 805847 807049 805284 802866 808145 801020 801874 804300 802032 807130
15840 807130 807096 810586 809749 804991 805668 805750 803814 806558 804857 807256 803309 807999 804127 802914 809420 805848
15824 805848 804989 810401 803272 804224 807319 806289 805654 810252 811424 806451 805562 805483 807433 805859 803481 807107
15808 807107 806827 806088 808178 809504 806495 811061 806322 806102 808872 807600 806622 809650 807555 806674 806434 809582
15792 809582 807480 809171 806290 809463 811638 809521 805778 809463 807390 810585 807525 809586 811035 809367
15778 809367 809876 809785 806061 809594 810102 812908 812465 809974 811340 810074 812288 810921 811738 813882 807734 808981
15762 808981 806493 812048 812127 810379 807709 805544 811526 810805 808950 812537 807214 807003 812148 811388 813303
15747 813303 811292 812672 810983 811705 815657 814085 812597 813688 810988 813697 814702 813731 814593 811695 813460
15732 813460 814007 813504 813766 811298 815194 814144 812506 816697 815890 815964 814494 809676 815077 814363 812760 812738
15716 812738 813713 815683 810817 810826 813165 812129 811808 813399 814348 817221 815630 813489 815744 815584 815049 810306
15700 810306 815973 815330 817069 816669 812557 814816 813518 811598 811744 813327 812985 817101 816002 813206 817042
15685 817042 815736 816852 816031 819287 815546 817862 821090 817048 820257 818663 820012 818503 818590 816958 813521
15670 813521 818364 820303 816536 816438 817796 818426 816479 821562 823321 820246 822618 815660 819107 821210 815315
15655 815315 818842 813650 816716 816655 816244 820526 816656 817667 822735 816955 817239 819569 817603 821102 819371
15640 819371 823175 821348 820627 818832 824052 821496 820231 822432 820987 819314 822990 816293 825848 817392
15626 817392 817528 824717 818721 825038 822665 823531 821208 821444 819643 817805 816340 823127 821101 821050 821411 817527
15610 817527 819374 822056 821243 820263 820199 821185 825481 823054 818578 826089 821129 823481 825197 824838 824417 824519
15594 824519 823578 823379 823821 823206 822505 822189 822742 821186 819961 825826 823366 823497 822350 824255 820778 821740
15578 821740 823262 824773 824976 820199 821921 824940 824018 823414 827174 822526 820451 826757 823567 821644 822827
15563 822827 824302 824349 825301 826186 821819 824952 824252 823230 826078 822783 825781 830120 824020 824584 827048 828061
15547 828061 825435 825315 829865 824676 825405 828296 826422 826186 828821 825755 823335 824574 830161 826903 828012
15532 828012 828211 823812 827742 827021 827011 825724 826066 825378 822911 826555 830772 826200 827820 826382 828716 825116
15516 825116 825707 831763 827688 826512 826236 829319 823277 824918 829096 829379 829475 824481 828245 830664 826390
15501 826390 830952 832683 829986 827509 830481 824492 828155 831445 828911 827973 828908 830884 830893 827594 829287
15486 829287 833662 828339 827201 831458 830839 828069 829512 825107 829498 828777 830128 830038 832855 825323 830123
15471 830123 828039 831602 828356 833601 832349 829370 830943 831318 835214 831821 835149 832480 830877 828390
15457 828390 834270 836408 832633 832250 827962 828453 833958 832240 830986 828725 832860 832365 833440 834129 835841
15442 835841 829582 832923 830173 835496 829761 830880 834793 834345 834155 830000 835074 830831 835636 833393 835107
15427 835107 835574 829770 833845 836770 837217 838804 832032 833049 832793 833349 835521 835929 839883 837492 834477
15412 834477 831150 835226 834389 834473 833200 832641 837665 835636 835866 833205 835274 835095 837490 835086 836858 840066
15396 840066 836105 839767 837289 836835 835829 836195 834708 838248 834139 835516 839229 838331 838739 839056 838347 837913
15380 837913 834368 833070 839447 836034 839124 838071 840386 836004 836083 838733 837878 838199 836488 836138 836865 839264
15364 839264 836597 836474 838484 835331 836226 838765 842249 841809 841234 839416 840183 841055 843995 838650 840963 841602
15348 841602 838364 837646 839654 839870 838791 842067 842299 844117 838498 841843 838306 839334 844733 838524 842285
15333 842285 841791 838747 844400 839813 837085 838662 839539 840943 844517 842771 839943 842256 842531 843834 846084
15318 846084 846487 843615 842085 845668 840660 840430 845229 847106 845756 841264 839651 843326 841588 839407 837795
15303 837795 841556 841874 840056 839250 847929 838877 845597 843940 844994 845350 846992 848147 843153 843058 847723
15288 847723 843395 843921 846027 840778 844070 844038 843650 842264 840851 844853 845226 846097 850536 846852 846179 846569
15272 846569 844487 849234 847757 845533 845828 848759 843257 844106 843644 845268 845369 843641 847705 843277 848282
15257 848282 844349 843699 843848 849015 847965 851233 846315 845855 849728 847870 844711 847067 847240 850737 849729
15242 849729 843229 846623 852384 849091 850340 853192 852008 849148 852539 853615 851625 854143 847853 851076
15228 851076 851599 850296 851976 848716 847712 847332 846796 851808 846781 846902 848176 849868 845857 850983 852166
15213 852166 852744 850811 850187 851622 851020 850504 851090 849468 849520 854105 849849 849444 849803 849943 852700 850474 851426
15196 851426 848605 850060 850631 854227 850440 853029 850550 852111 852422 851740 853102 849117 849911 852033 851144
15181 851144 847592 852871 848506 856072 849992 856109 851287 854548 850111 853585 853857 856802 854718 853988 852396
15166 852396 853372 852347 854177 855507 855160 851061 855789 854650 853123 851820 856599 856800 855994 848113 856617
15151 856617 850712 853479 854867 855715 852614 855136 853842 857743 853241 852808 856131 853167 858950 857813 855132
15136 855132 855477 855797 856062 852979 855451 856785 857442 856087 853517 850222 852696 857330 861296 856944 861643
15121 861643 849986 855088 853646 854003 861819 860139 859290 859164 857817 855951 859689 858422 858630 859652 855986
15106 855986 858794 856651 859367 859223 859651 858260 858488 855684 857551 858591 858352 859531 860034 861779 856284
15091 856284 854076 863293 859824 856302 857417 860914 859818 864003 860988 859658 859192 859295 857790 859179 859903
15076 859903 859175 856241 861821 863476 862241 862406 861933 858392 862852 860744 861310 860119 861349 854857 857994
15061 857994 863312 861370 861324 861840 859601 862112 860580 857254 860989 862890 864868 867254 862866 863474 863591
15046 863591 866005 865280 860973 861730 860026 861958 863960 860342 863948 864703 858121 859768 862174 860436 863996
15031 863996 861122 865186 864143 863320 863648 863648 866746 863193 863992 863881 865155 866844 861377 861591 864320 862055
15015 862055 865585 862457 860268 867980 862691 865152 870470 866329 867981 865987 866004 867074 864362 866130 865693
15000 865693 867020 866147 868844 866177 871124 868710 869123 865209 864916 866945 865704 868016 867700 865781 866807
14985 866807 868045 866673 869071 869178 869254 866884 867725 869356 866492 865703 869225 865882 871748 867933 869542
14970 869542 865734 869670 869107 869966 869719 869733 870003 870856 870853 871335 865498 870994 869328 866780 870823 868285 870034
14953 870034 870056 869686 868606 866578 871705 869963 869771 870655 875758 872266 875700 868904 870915 871574 872946 870949
14937 870949 869743 870754 873186 872058 871716 871165 874777 869549 866084 872817 871764 870097 870998 872879 873326
14922 873326 874485 871289 878217 874032 874041 871433 871348 871961 869689 867933 871304 871326 871390 870819 873871 875574 872250
14905 872250 872688 874019 872757 877478 875426 876979 874828 878343 873547 872801 873934 878465 878782 873505 874077
14890 874077 873740 874445 872776 875204 873614 877170 875053 873857 877696 878167 878443 875007 877595 874350 873875
14875 873875 878811 876859 875209 875640 874915 873062 873895 873108 877613 871954 876090 878556 877549 876946 878748
14860 878748 876835 879129 877934 873946 877847 880519 878060 875804 879490 878453 876605 880640 879219 882700
14846 882700 878860 875506 877698 876197 879773 876529 876425 879358 876813 877224 879098 881944 878666 878067 881853
14831 881853 879997 882227 881925 878861 878004 881150 878542 879514 877271 882469 883979 876580 880563 879360 882134
14816 882134 880035 880951 885303 886749 880285 882316 881348 882306 879890 884641 885014 879183 882548 883847 880861
14801 880861 879497 884162 881992 882126 881524 884527 881418 881030 881892 883401 884898 884682 880258 879155 884583
14786 884583 884822 885106 881296 881180 884971 884751 882964 887462 884041 885000 884899 882218 885601 886269 883564 886643
14770 886643 883630 886188 881971 885851 886241 883799 885175 886185 885330 886045 886028 885745 882043 889782 884365 885728
14754 885728 888209 886014 885809 887288 884601 886109 886481 884162 887556 886013 887432 890601 883919 891027 884260
14739 884260 883649 887913 888117 888201 886170 887081 886193 887717 889504 890528 889041 890634 889071 885372 890911 887698
14723 887698 887334 887176 890558 890610 888639 890337 891049 886916 891547 889659 888481 886917 885142 890754 887539
14708 887539 891568 887622 891021 887710 890705 885459 884785 887625 885181 889477 890585 891477 891619 886112 893851
14693 893851 890954 893506 892055 890545 889830 890020 892532 889053 888433 890956 892449 892052 888704 890426 892754
14678 892754 891810 893093 887362 896426 890803 893973 895182 896046 894002 889512 890009 892835 889562 889558 889484 886914
14662 886914 890715 890560 892741 892564 893076 893627 893802 896088 892022 895038 891917 896261 894262 894017 897843 892403
14646 892403 892845 893466 894702 895896 894898 895217 896678 897002 893101 897283 900526 898763 897603 893606 894308 897158
14630 897158 898744 896089 894589 895596 900722 896885 894547 896574 891706 893879 895011 895886 896671 900909 899855
14615 899855 895922 895730 896991 895727 898622 900012 899765 898299 894026 899102 898759 895922 897647 899299 895650
14600 895650 896980 898364 898911 899608 901101 899184 896356 898113 900828 898614 900304 894190 901202 902835 900902
14585 900902 895137 900010 898833 896690 897463 898571 900123 895228 900738 898132 899827 897353 900366 900047 899801
14570 899801 899183 902311 900451 900013 903285 903482 896455 896865 901535 901205 900696 901387 902754 896763 901445 897461
14554 897461 899428 904550 901830 900904 905144 900822 901664 901980 900648 899480 900477 906421 904933 902137 903949
14539 903949 903938 904964 909048 904759 903738 905546 902304 905631 909332 907819 902231 904358 906741 907969 905508
14524 905508 907298 901993 905550 904740 905984 905905 902978 903702 906250 906584 910429 907466 908091 906973 907710 907115
14508 907115 906960 904104 907227 908456 910748 904499 902946 902362 904383 907183 908257 904028 906754 905715 908548
14493 908548 910023 911651 908240 906080 910584 908280 911006 909911 909049 907086 910033 906695 906889 904740 909849
14478 909849 909221 911892 912874 905689 906089 906616 906787 915092 909039 905939 908368 907137 911627 912453 912187 912603
14462 912603 914667 909055 913339 912683 912465 910774 912076 907590 908866 910870 913073 914159 909315 907766 911117
14447 911117 910145 903821 910049 911526 914721 906978 911203 908346 907973 911897 914057 910995 912835 913050 914613
14432 914613 910183 909956 914079 916168 913917 914917 909438 914196 913395 913317 911965 913872 914337 916765 914574
14417 914574 915151 917340 916968 913112 913713 915799 914981 910813 916219 914745 915005 915569 911478 917007 913686 912918
14401 912918 913583 915469 916474 915852 916670 915937 915005 914501 913101 914931 916810 916628 916410 911302 922159 915871
14385 915871 916164 914214 912595 918482 919239 914836 918255 918510 915608 921197 916594 917888 913651 914731 918339
14370 918339 917773 916600 918209 923203 921324 916925 922812 918156 917085 916448 920192 924629 923240 919597 919851
14355 919851 919187 923128 916121 921282 918403 920547 917539 921013 917717 919288 924845 920320 922686 917577
14341 917577 919009 922066 922731 924419 922081 922008 925420 920428 919871 917639 916262 922764 918635 922203 924282
14326 924282 922525 922954 923750 922005 924549 923983 924077 916464 918629 921189 921662 922295 914267 916258 919008 926052
14310 926052 931558 925474 923973 926595 925565 924623 924152 920946 924114 926285 921760 926128 921720 928563 921356
14295 921356 926034 926628 923678 924939 923652 921875 919109 928019 927568 925896 922559 924021 922697 928299 922309
14280 922309 924074 926161 927263 925518 927612 923883 921766 926455 921895 925014 922791 925102 926367 930865
14266 930865 926974 930427 931465 929583 929631 927398 929792 929353 927871 927594 925666 926863 928862 931600 928619
14251 928619 929113 927319 929364 927768 927166 929349 932221 930562 928582 929794 926610 929947 929481 929420 929199 928480
14235 928480 927490 930526 931023 927745 927846 930600 928335 931334 932973 934654 931970 929337 932280 933700 933673
14220 933673 931515 927807 928276 930332 929211 931693 926822 933571 928150 925510 931391 936135 935127 934203 929917
14205 929917 929060 930205 937690 930706 933298 934716 934035 931710 933029 939012 931021 934342 930391 935153 935672
14190 935672 932971 932505 929859 934028 932738 933133 934102 933667 935391 932932 935188 935248 934245 933931 935349 935277
14174 935277 934151 937917 935015 935568 934244 936605 930908 937136 934596 937724 938949 940014 934610 936139
14160 936139 935068 934769 934597 941695 937708 937427 936111 935794 935344 938490 939719 935565 934779 935643 936431 939659
14144 939659 937704 936397 938418 938511 938504 939600 937841 939203 941681 939902 940029 937488 941402 938117 941195 933741
14128 933741 937962 937941 943045 940869 940755 939801 941981 943748 941140 939055 941341 939094 937443 937325 940418
14113 940418 939860 941069 941449 940803 940097 941894 938006 933064 940641 939722 937660 941943 944845 942176 942327 936965
14097 936965 941126 940147 939351 941871 943927 943985 943610 943459 948740 943406 942988 942873 945983 942926 946258 946551
14081 946551 945234 942504 944434 943776 941619 942626 943578 948085 945070 944148 946372 946292 945214 946459 946270 945370
14065 945370 939659 943713 944076 946312 941607 943073 944421 941162 947209 944180 945115 947818 948444 944588 948951
14050 948951 946553 945403 942023 946520 945432 945853 948992 951348 947792 946352 947206 946032 951824 947305 951995
14035 951995 951771 946238 948481 941153 944519 945792 947015 946973 946450 943918 947727 948035 949741 949964 944549 950346
14019 950346 945431 947876 949876 949873 947542 948311 950329 947756 951965 953128 950225 951646 952500 953483 950707 952557
14003 952557 952635 953392 951432 949282 949672 948142 953798 949657 952125 948896 951810 951869 949426 955885 955269 953975
13987 953975 948657 948226 952464 954424 951299 952556 952588 952989 954425 948643 953617 945909 951883 950632 953150
13972 953150 952108 952990 951248 954137 950353 951328 951980 950099 958045 955834 949379 955031 955837 953822 955867
13957 955867 957233 952083 955592 951073 956749 952469 958140 955288 952989 957672 957280 953621 958072 956525
13943 956525 952993 956687 953752 954340 955821 955726 957301 956210 950831 955941 957702 956787 954125 956915 956868 954713
13927 954713 953723 952697 954939 955349 954111 962699 958518 956109 958951 957972 958036 958772 958868 961380 962132 959490
13911 959490 956447 957322 960412 958998 959771 957488 961414 959280 959172 958254 956980 964296 961684 957012 964812
13896 964812 954659 961654 962781 959429 958175 964106 960335 955067 959871 960928 960485 962051 961917 959716
13882 959716 961483 958658 961077 960126 965505 963651 962934 969670 967892 965331 964738 963856 964627 961048 965681
13867 965681 962130 962670 961696 962765 960664 960613 965138 959299 966088 960873 961478 962213 964729 961511 963175 965579
13851 965579 961961 961167 962632 964795 967349 961650 967238 963677 963307 966116 965013 968655 966759 965562 965418
13836 965418 967738 968204 964246 966440 967305 969712 968024 970774 963525 968259 968849 967656 970195 969158 968424
13821 968424 967379 968356 962623 966432 969015 965868 961823 964342 969608 967491 969185 968683 968547 970783 971370
13806 971370 968521 972912 969225 968968 969042 967627 972895 973567 972529 974754 979397 971194 971000 968627 974415
13791 974415 977730 970850 972787 969845 972923 970463 974062 969607 972308 972700 974358 972563 969573 972624
13777 972624 972596 975855 971169 971426 972333 974527 970619 974784 976215 972646 969918 974009 971751 973569 975938
13762 975938 972807 972028 969440 974943 973290 976760 976438 975827 970980 972112 976314 972015 976454 974128 971988
13747 971988 974854 975177 972186 972011 976582 978986 975098 977262 974407 979665 976893 981424 980063 978961 973267
13732 973267 974517 973091 979702 981002 977617 977861 977294 976397 975997 980858 979911 976367 976763 976041 975618 976232
13716 976232 976254 978926 980334 976712 973160 979142 976131 973875 968726 975099 975452 979875 979780 982894 979769
13701 979769 979181 980091 978871 977870 979205 980512 978795 979047 985508 980899 985302 985769 989118 983099 976782
13686 976782 977528 984960 980865 975809 965557 974256 982113 989900 994182 990384 985222 985751 981554 981780 980445
13671 980445 982269 982943 982909 980275 985700 989042 987528 990403 985058 989353 983683 985620 987829 985339 985611
13656 985611 987525 982903 991446 988370 988357 991574 985195 989488 989363 989869 988983 985954 984413 986129 987316
13641 987316 983640 983124 984821 987341 983981 985519 985336 989778 989150 988753 986505 986743 990053 993705 992513
13626 992513 986320 990500 989769 992872 994058 992530 989230 993288 992262 991654 991436 992030 991797 991037 990758 990671
13610 990671 988877 989953 988846 986162 988795 985552 988967 991403 993353 994001 992461 987976 990794 993370
13596 993370 986539 989859 992361 992671 991477 994688 991929 992745 993326 993641 991219 994469 989618 991492 992976
13581 992976 993035 994368 994675 997050 990236 994375 992036 995445 997648 991516 996777 992968 993477 993883 993991 993357
13565 993357 994761 994693 995227 994471 992586 995068 994422 995335 998056 994135 997356 998626 1001283 998597 993623 991343
13549 991343 997956 994894 1000612 994679 995395 993550 991101 991236 993497 991425 993186 995541 995913 993848 996801
13534 996801 993863 993592 994763 998114 997191 998839 996138 1000464 996449 997237 995900 999381 999440 1001547 1000082
13519 1000082 993381 994166 1000813 999110 995721 998087 1000168 1000557 1003331 999535 1004021 1001668 1002149 1003554 1004162
13504 1004162 998801 1000461 1000594 1000076 1002564 998934 997088 997190 999599 999913 999674 999413 995650 1001383 1000411 999740
13488 999740 999017 1001666 1001745 1002009 1001233 998241 1004952 1009539 1004808 1006600 1002842 1001612 1002365 997949 1001754 1001412
13472 1001412 1001378 1000446 1002299 1005037 1004753 1002260 1000566 1003704 1006014 1004987 1000424 1003267 1002777 1004894 1002801
13457 1002801 1003469 999537 1003197 1002593 1002636 1001099 1005806 1009112 1001379 1001301 1005891 1005347 1005350 1003983 1008058 1005784
13441 1005784 1004904 1006254 1005294 1008942 1003791 1003872 1004369 1003513 1009115 1006194 1006360 1007207 1002821 1007280 1006248 1005986
13425 1005986 1007489 1005289 1007406 1010029 1006447 1008816 1010437 1009641 1006060 1008715 1008120 1009059 1009885 1005838 1011302
13410 1011302 1008464 1010885 1007521 1009335 1008701 1006879 1010475 1012645 1008558 1011364 1013823 1010935 1012405 1012251
13396 1012251 1015568 1009146 1010126 1010478 1014166 1011217 1010666 1012451 1009202 1004845 1011334 1008977 1008618 1008437 1008480 1008347
13380 1008347 1009244 1011154 1011946 1017896 1014572 1010964 1011319 1014638 1011747 1011782 1014568 1009542 1013507 1016284 1015300
13365 1015300 1012351 1013275 1013441 1012884 1013579 1013538 1014130 1013495 1015183 1013804 1014829 1016740 1011597 1012008 1012712 1015441
13349 1015441 1017824 1018878 1014577 1015473 1013307 1014467 1017310 1014746 1013125 1015552 1014199 1020813 1016231 1015192
13335 1015192 1018780 1018061 1017001 1018065 1015504 1018544 1015242 1018784 1019594 1017354 1022713 1020088 1020220 1017908 1016233
13320 1016233 1019535 1017203 1018290 1018809 1018053 1019791 1018999 1015632 1021291 1020373 1016998 1021473 1020252 1025881 1021138
13305 1021138 1021997 1020801 1019034 1020058 1017429 1016516 1021844 1023098 1020263 1023633 1021476 1022105 1018247 1019302 1022672
13290 1022672 1021607 1023937 1021601 1023355 1024269 1020935 1020119 1023215 1022075 1028200 1023317 1021666 1022761 1024097
13276 1024097 1024403 1022751 1023517 1025434 1023229 1023124 1022413 1020137 1024413 1025750 1024719 1025894 1024795 1019465 1025577
13261 1025577 1022891 1025268 1026331 1024855 1025359 1027587 1029705 1031789 1028336 1024286 1022036 1027587 1028729 1030368
13247 1030368 1028088 1025426 1028730 1028117 1027519 1024897 1029466 1025824 1025809 1026151 1025998 1029680 1020949 1029097 1028940 1029955
13231 1029955 1026104 1024711 1033793 1025336 1029526 1032544 1025632 1029124 1027080 1029796 1026692 1027530 1026359 1029418
13217 1029418 1029333 1026405 1027742 1031913 1031788 1025980 1029626 1029711 1028667 1030636 1029453 1027281 1030065 1027580 1028701
13202 1028701 1029135 1031705 1031720 1032225 1034700 1037414 1032019 1031930 1032264 1031896 1030481 1025749 1028177 1031065 1034605 1034468
13186 1034468 1032770 1032602 1032529 1032977 1033865 1035798 1028929 1033178 1036525 1033427 1031691 1038700 1034594 1028506 1033724
13171 1033724 1036354 1030935 1028416 1029607 1031917 1035746 1028066 1034656 1033893 1035653 1032773 1035535 1034579 1041543
13157 1041543 1037574 1036898 1038685 1033680 1036467 1041000 1039187 1035284 1040399 1040725 1038531 1037055 1038116 1042767
$$ [...]
##END NTUPLES=NMR SPECTRUM
##END=
