##TITLE=abcd
##JCAMPDX= 6.0         $$ Bruker NMR JCAMP-DX V2.0
##DATA TYPE= NMR SPECTRUM
##DATA CLASS= NTUPLES
##ORIGIN= UXNMR, Bruker Analytische Messtechnik GmbH
##OWNER= root
$$ XWIN-NMR		Version 3.5
$$ Sun Dec  7 14:42:56 2025 Russian Standard Time (UT+4h)  servis@DPX200
##.OBSERVE FREQUENCY= 200.131235884673
##.OBSERVE NUCLEUS= ^1H
##.ACQUISITION MODE= SIMULTANEOUS
##.ACQUISITION SCHEME= undefined
##.AVERAGES= 32
##.DIGITISER RES= 18
##SPECTROMETER/DATA SYSTEM= spect
##.PULSE SEQUENCE= zg
##.SOLVENT NAME= CDCl3
##.SHIFT REFERENCE= (INTERNAL, CDCl3, 0, 16.4885)
##AUDIT TRAIL= $$ (NUMBER, WHEN, WHO, WHERE, WHAT)
$$ ##TITLE= Audit trail, XWIN-NMR		Version 3.5
$$ ##JCAMPDX= 5.01
$$ ##ORIGIN= Bruker BioSpin GmbH
$$ ##OWNER= servis
$$ F:\spectra/data/av/nmr/H1/1/pdata/1/auditp.txt
$$ ##AUDIT TRAIL=  $$ (NUMBER, WHEN, WHO, WHERE, WHAT)
(   1,<2025-12-07 14:36:00.79 +0400>,<servis>,<DPX200>,
      <created by zg, POWCHK disabled, PULCHK disabled
       configuration hash MD5:
       00 E9 B6 7A A2 85 ED C7 34 08 36 98 17 FE 4E 26
       data hash MD5: 32K
       18 C0 2B AF 4C 66 61 12 AE 45 D9 B7 14 4E 80 44>)
(   2,<2025-12-07 14:42:18.84 +0400>,<servis>,<DPX200>,
      <Start of raw data processing
       efp BC_mod = 2 LB = 0.05 FT_mod = 6 PKNL = 1 PHC0 = -183.783 PHC1 = 6.301564 SI = 16K 
       data hash MD5: 16K
       73 44 EF 66 13 F4 FE F2 30 5D 9F 03 F7 36 40 BE>)
(   3,<2025-12-07 14:42:35.81 +0400>,<servis>,<DPX200>,
      <pk PHC0 = -0.6 PHC1 = 0 
       data hash MD5: 16K
       79 F0 B5 0A DF DF A0 C3 54 E6 D1 0E 41 5A 5A 51>)
$$ ##END=
$$ 
$$ hash MD5
$$ 1B 57 72 B1 8B 48 39 62 92 52 F3 6A 43 A0 71 D5
##$RELAX= 
##$RELAX= 
##$RELAX= 
##$RELAX= 
##$RELAX= 
##$RELAX= 
##$RELAX= 
##$RELAX= 
$$ Bruker specific parameters
$$ --------------------------
##$DU= <F:\spectra>
##$EXPNO= 1
##$NAME= <H1>
##$PROCNO= 1
##$TYPE= <nmr>
##$USER= <av>
##$AMP= (0..31)
100 100 100 100 100 100 100 100 100 100 100 100 100 100 100 100 100 100 
100 100 100 100 100 100 100 100 100 100 100 100 100 100 
##$AQSEQ= 0
##$AQ_mod= 1
##$AUNM= <au_zg>
##$AUTOPOS= <>
##$BF1= 200.13
##$BF2= 200.13
##$BF3= 200.13
##$BF4= 200.13
##$BF5= 500.13
##$BF6= 500.13
##$BF7= 500.13
##$BF8= 500.13
##$BYTORDA= 1
##$CFDGTYP= 0
##$CFRGTYP= 5
##$CHEMSTR= <none>
##$CNST= (0..31)
1 1 145 1 1 1 1 1 1 1 1 1 1 1 1 1 1 1 1 1 1 1 1 1 1 1 1 1 1 1 1 1 
##$CPDPRG= <>
##$CPDPRG1= <>
##$CPDPRG2= <>
##$CPDPRG3= <>
##$CPDPRG4= <mlev>
##$CPDPRG5= <mlev>
##$CPDPRG6= <mlev>
##$CPDPRG7= <mlev>
##$CPDPRG8= <mlev>
##$CPDPRGB= <>
##$CPDPRGT= <>
##$D= (0..31)
0 2 0 0 0 0 0 0 0 0.06 0 0 0 0 0 0 0.0002 0 0 0 0 0 0 0 0 0 0 0 0 0 0 
0 
##$DATE= 1765103760
##$DBL= (0..7)
120 120 120 120 120 120 120 120 
##$DBP= (0..7)
150 150 150 150 150 150 150 150 
##$DBP07= 0
##$DBPNAM0= <>
##$DBPNAM1= <>
##$DBPNAM2= <>
##$DBPNAM3= <>
##$DBPNAM4= <>
##$DBPNAM5= <>
##$DBPNAM6= <>
##$DBPNAM7= <>
##$DBPOAL= (0..7)
0.5 0.5 0.5 0.5 0.5 0.5 0.5 0.5 
##$DBPOFFS= (0..7)
0 0 0 0 0 0 0 0 
##$DE= 6
##$DECBNUC= <off>
##$DECIM= 32
$$ [...]
##$SUBNAM4= <"">
##$SUBNAM5= <"">
##$SUBNAM6= <"">
##$SUBNAM7= <"">
##$SUBNAM8= <"">
##$SUBNAM9= <"">
##$SW= 20.6817932712277
##$SWIBOX= (0..15)
0 0 3 0 0 0 0 0 0 0 0 0 0 0 0 0 
##$SW_h= 4139.07284768212
##$TD= 32768
##$TD0= 1
##$TE= 0
##$TE2= 300
##$TE3= 300
##$TEG= 300
##$TL= (0..7)
0 120 120 120 120 120 120 120 
##$TP= (0..7)
150 150 150 150 150 150 150 150 
##$TP07= 0
##$TPNAME0= <>
##$TPNAME1= <>
##$TPNAME2= <>
##$TPNAME3= <>
##$TPNAME4= <>
##$TPNAME5= <>
##$TPNAME6= <>
##$TPNAME7= <>
##$TPOAL= (0..7)
0.5 0.5 0.5 0.5 0.5 0.5 0.5 0.5 
##$TPOFFS= (0..7)
0 0 0 0 0 0 0 0 
##$TUNHIN= 0
##$TUNHOUT= 0
##$TUNXOUT= 0
##$USERA1= <user>
##$USERA2= <user>
##$USERA3= <user>
##$USERA4= <user>
##$USERA5= <user>
##$V9= 5
##$VALIST= <valist>
##$VCLIST= <CCCCCCCCCCCCCCC>
##$VD= 0
##$VDLIST= <DDDDDDDDDDDDDDD>
##$VPLIST= <PPPPPPPPPPPPPPP>
##$VTLIST= <TTTTTTTTTTTTTTT>
##$WBST= 1024
##$WBSW= 30
##$XGAIN= (0..3)
0 0 0 0 
##$XL= 0
##$YL= 0
##$YMAX_a= 1964271
##$YMIN_a= -1788882
##$ZGOPTNS= <>
##$ZL1= 120
##$ZL2= 120
##$ZL3= 120
##$ZL4= 120
##$ABSF1= 0
##$ABSF2= 0
##$ABSG= 0
##$ABSL= 0
##$ALPHA= 0
##$AQORDER= 0
##$ASSFAC= 0
##$ASSFACI= 0
##$ASSFACX= 0
##$ASSWID= 0
##$AUNMP= <proc_1d>
##$AZFE= 0.1
##$AZFW= 0.1
##$BCFW= 0
##$BC_mod= 2
##$BYTORDP= 0
##$COROFFS= 0
##$CY= 18.4799938201904
##$DATMOD= 1
##$DC= 0
##$DFILT= <>
##$DTYPP= 0
##$F1P= 9.9274215381318
##$F2P= -0.165520771350173
##$FCOR= 1
##$FTSIZE= 16384
##$FT_mod= 6
##$GAMMA= 0
##$GB= 0
##$INTBC= 1
##$INTSCL= 4.127829e-11
##$ISEN= 128
##$LB= 0.05
##$LEV0= 0
##$LPBIN= 0
##$MAXI= 10000
##$MC2= 0
##$MEAN= 0
##$ME_mod= 0
##$MI= 50
##$NCOEF= 0
##$NC_proc= -2
##$NLEV= 6
##$NOISF1= 3.799351
##$NOISF2= 2.8
##$NSP= 0
##$NTH_PI= 0
##$NZP= 0
##$OFFSET= 16.48848
##$PC= 4
##$PHC0= -184.383
##$PHC1= 6.301564
##$PH_mod= 1
##$PKNL= yes
##$PPARMOD= 0
##$PSCAL= 4
##$PSIGN= 0
##$REVERSE= no
##$SF= 200.130005582386
##$SI= 16384
##$SIGF1= 3
##$SIGF2= 2
##$SINO= 400
##$SIOLD= 16384
##$SREGLST= <1H.CDCl3>
##$SSB= 0
##$STSI= 16384
##$STSR= 0
##$SW_p= 4139.07284768211
##$SYMM= 0
##$S_DEV= 0
##$TDeff= 32768
##$TDoff= 0
##$TI= <>
##$TILT= no
##$TM1= 0
##$TM2= 0
##$TOPLEV= 0
##$USERP1= <user>
##$USERP2= <user>
##$USERP3= <user>
##$USERP4= <user>
##$USERP5= <user>
##$WDW= 1
##$XDIM= 16384
##$YMAX_p= 277060911
##$YMIN_p= -248472
$$ End of Bruker specific parameters
$$ ---------------------------------
##NTUPLES= NMR SPECTRUM
##VAR_NAME=  FREQUENCY,     SPECTRUM/REAL,   SPECTRUM/IMAG
##SYMBOL=    X,             R,               I
##VAR_TYPE=  INDEPENDENT,   DEPENDENT,       DEPENDENT
##VAR_FORM=  AFFN,          ASDF,            ASDF
##VAR_DIM=   16384,         16384,           16384
##UNITS=     HZ,            ARBITRARY UNITS, ARBITRARY UNITS
##FACTOR=    0.252644378177508, 1,           1
##FIRST=     3299.83951724647, 0,            0
##LAST=      -839.233330435636, 0,           0
##MIN=       -839.233330435636, -248472,     0
##MAX=       3299.83951724647, 277060911,    0
$$ Real data points
##PAGE= N=1
##DATA TABLE= (X++(R..R)), XYDATA
$$ [...]
8585 -79762 -84239 -85798 -86865 -85658 -83857 -83733 -88829 -86321 -80474 -83870 -87959 -88786 -86976 -84531 -82942
8570 -82942 -78712 -80387 -84914 -84165 -84041 -83276 -84766 -83569 -83577 -83086 -83047 -82757 -84317 -86058 -85561 -85071 -79634 -80432
8552 -80432 -81801 -80779 -81109 -81121 -83092 -84006 -85924 -83593 -84612 -82695 -80784 -83900 -83052 -86381 -87764 -85806
8536 -85806 -85574 -83946 -83385 -81713 -85203 -83761 -85407 -92726 -132162 -99004 -82883 -80765 -80052 -81771 -83788
8521 -83788 -82702 -83022 -82856 -83267 -83703 -83364 -81865 -80079 -81159 -79959 -81937 -79978 -81113 -82878 -82376 -83049
8505 -83049 -81689 -82047 -83956 -86519 -83961 -84195 -81311 -83560 -83162 -82119 -80904 -83239 -80520 -81990 -82427 -84550
8489 -84550 -85013 -82102 -84685 -83415 -85301 -85538 -86359 -85703 -87674 -84289 -86609 -84912 -81429 -81469 -84220 -84162 -84104
8472 -84104 -84463 -85064 -83559 -82754 -84651 -83904 -84812 -82409 -85991 -83355 -83300 -85809 -83546 -81954 -80172 -81618
8456 -81618 -80493 -80444 -79174 -80295 -84834 -86086 -86605 -84347 -83878 -85926 -84661 -85107 -82364 -83424 -83288 -85908
8440 -85908 -87016 -85877 -79791 -81251 -83063 -81635 -79609 -82429 -79897 -82701 -83475 -86007 -82766 -81398 -83399
8425 -83399 -81991 -83743 -84716 -82692 -84435 -82281 -83047 -81035 -79423 -81542 -83327 -81783 -81154 -81658 -83108 -82322
8409 -82322 -79918 -82689 -81550 -85414 -85714 -82490 -82981 -82135 -82411 -81223 -82515 -82390 -80947 -82575 -82677 -84073
8393 -84073 -81799 -79481 -81170 -82474 -81751 -82231 -83796 -82673 -82527 -85515 -82064 -80473 -80368 -83160 -77743 -82368
8377 -82368 -82980 -83147 -84396 -82431 -82832 -82222 -83600 -83830 -84545 -84044 -85748 -84821 -84660 -84594 -82910 -83005 -79607 -81338
8359 -81338 -84524 -81583 -82083 -80632 -81396 -82997 -83719 -79466 -81963 -82732 -84751 -84560 -82254 -85489 -86440 -81477
8343 -81477 -81910 -81632 -78686 -79381 -81564 -83603 -84362 -83220 -82185 -85087 -81795 -81967 -82228 -83643 -82299 -83161
8327 -83161 -84792 -84652 -83569 -80645 -81885 -78927 -82567 -81445 -82804 -80557 -84791 -80309 -82583 -85120 -83623
8312 -83623 -82207 -80244 -80453 -80661 -80975 -85457 -81251 -81203 -83441 -82708 -82481 -80460 -83537 -80082 -81738 -82394 -78616
8295 -78616 -80372 -83143 -81171 -84415 -81238 -84988 -82281 -82362 -81082 -83566 -82236 -84162 -82827 -82583 -82135 -82106
8279 -82106 -78677 -79311 -82007 -81493 -81474 -83144 -83078 -85248 -86515 -82659 -82038 -83291 -79801 -81914 -84356 -84447 -83977
8262 -83977 -79689 -81678 -80212 -80447 -80378 -81354 -80642 -80239 -82676 -81561 -83315 -83294 -83033 -80319 -78813 -80642 -79304
8245 -79304 -79324 -78185 -79943 -83622 -83292 -80637 -81055 -81404 -83461 -82416 -77262 -82030 -82846 -82015 -77839 -81590
8229 -81590 -83415 -84400 -82046 -81817 -78377 -78053 -80954 -74060 -76214 -75320 -82320 -79614 -76636 -81258 -71248
8214 -71248 -79912 -78042 -83041 -82411 -78412 -76201 -81644 -77756 -84965 -81745 -79725 -80017 -82546 -78856 -83928
8199 -83928 -75093 -84911 -92050 -78215 -80046 -76608 -69094 -127484 -61788 -62934 -83367 -85277 -94276 -88176
8185 -88176 -84770 -83492 -78500 -82547 -84715 -83930 -82424 -75833 -87697 -83093 -81514 -77697 -76637 -79151 -80028
8170 -80028 -85036 -83947 -81518 -80817 -76301 -76350 -83099 -76845 -83846 -81356 -78458 -81553 -83557 -82239 -84997
8155 -84997 -82656 -80659 -84157 -84015 -82081 -82000 -82920 -85612 -81133 -83668 -81822 -83856 -87566 -81843 -84027 -82727
8139 -82727 -84898 -83801 -87606 -80929 -83592 -85750 -85259 -81372 -82901 -81977 -85935 -81204 -85177 -84231 -84071 -86363
8123 -86363 -79669 -81236 -82243 -83862 -84679 -83584 -80787 -82920 -82692 -83793 -83296 -82897 -83475 -83997 -82377 -86122
8107 -86122 -84599 -83367 -83078 -85080 -85437 -81642 -82407 -82748 -80112 -83998 -81839 -85965 -82115 -84173 -86862 -84454
8091 -84454 -85045 -85422 -80011 -85598 -83273 -81898 -83996 -83887 -83954 -81022 -84150 -81659 -84887 -83647 -81757 -84105
8075 -84105 -85323 -82277 -83126 -83242 -85280 -85344 -83559 -84989 -81136 -86447 -81456 -81347 -82984 -84226 -82396 -82635
8059 -82635 -84048 -82529 -81943 -79851 -83970 -80970 -84329 -81591 -83590 -81542 -82795 -82876 -83353 -83237 -84649 -82278
8043 -82278 -84845 -82355 -85324 -85756 -82746 -85294 -83583 -83251 -86039 -82612 -83910 -85137 -85534 -82879 -82136 -84146
8027 -84146 -84777 -82889 -81238 -83922 -84125 -81551 -80618 -81835 -81088 -82016 -83123 -84062 -84527 -86185 -81115 -82620
8011 -82620 -83988 -82637 -81089 -84070 -80380 -84822 -84357 -82988 -82943 -82414 -82016 -82697 -83647 -80100 -80908 -80680 -83786
7994 -83786 -75644 -81029 -82520 -83541 -83382 -81572 -82718 -84075 -82620 -82306 -82481 -82247 -81702 -80993 -83229 -81330
7978 -81330 -83137 -81907 -84495 -84353 -80893 -81904 -84017 -83809 -82855 -81606 -81825 -84483 -83325 -83162 -81009 -81879
7962 -81879 -80466 -82357 -83319 -83884 -78795 -81839 -80934 -79879 -84516 -83733 -83611 -81906 -83198 -80816 -83711 -81395
7946 -81395 -83117 -83927 -83140 -81940 -82063 -79765 -81325 -82497 -80584 -81879 -81687 -83928 -82961 -81825 -81478 -83205
7930 -83205 -82333 -80795 -83593 -82835 -83359 -81877 -81950 -83240 -84799 -83165 -83519 -85012 -81212 -83793 -80386 -83672
7914 -83672 -83760 -83918 -84472 -84218 -82869 -81560 -83888 -80202 -82151 -81933 -85367 -83681 -81116 -84263 -86257 -84263
7898 -84263 -82435 -82152 -81831 -84247 -80535 -84039 -84073 -83173 -83069 -83636 -83996 -80650 -83586 -82971 -83631 -83390 -83357 -85494
7880 -85494 -87162 -84251 -85104 -85395 -84466 -85140 -87042 -87322 -86380 -85373 -88387 -87730 -88080 -87749 -85509 -88031 -90111
7863 -90111 -89655 -91933 -94233 -98165 -104413 -118241 -162885 15542 -34520 -56683 -65539 -66957 -71969
7850 -71969 -71645 -74293 -74544 -75846 -76557 -76847 -77355 -75651 -77862 -78033 -81246 -80096 -77943 -78396 -76915 -80444
7834 -80444 -79772 -82411 -80213 -78345 -81965 -79097 -79735 -79421 -81552 -79692 -77991 -79727 -80111 -81181 -81022 -78913
7818 -78913 -80499 -77427 -78968 -81369 -78327 -80765 -81061 -79449 -78996 -82614 -80078 -79059 -82235 -81122 -80862
7803 -80862 -81875 -82586 -81804 -78224 -81056 -81802 -79441 -80006 -81730 -80753 -78327 -82181 -79170 -79337 -79210 -79010 -80432
7786 -80432 -79818 -78813 -80538 -78952 -79530 -78562 -79096 -80063 -79499 -78567 -81606 -79098 -80572 -79388 -81583 -80167
7770 -80167 -78162 -79279 -78449 -80544 -79525 -79416 -76795 -78125 -77231 -77809 -77442 -79225 -76578 -78559 -77606 -77241
7754 -77241 -78969 -77284 -78897 -75487 -76079 -74208 -76002 -72208 -74294 -73318 -73543 -70102 -66417 -62048 -54533
7739 -54533 -46555 -34997 -21462 -14603 -2777 2961 1798 -5150 -11626 -22732 -36802 -48527 -55964
7726 -55964 -64763 -69899 -72569 -72360 -74582 -74669 -76687 -78815 -76445 -77096 -77962 -78760 -77403 -78667 -75684 -76603
7710 -76603 -81705 -81416 -79004 -79785 -78489 -80603 -78623 -80255 -79820 -78403 -78835 -78629 -82121 -77600 -79733 -78189
7694 -78189 -79475 -77036 -82232 -79489 -79631 -79519 -79260 -80053 -80603 -82247 -79973 -79533 -81182 -79513 -81965 -79568
7678 -79568 -80485 -80576 -80580 -79128 -78499 -80193 -79494 -81200 -80790 -78412 -78566 -79602 -80441 -80670 -80956 -78010 -79990 -76131
7660 -76131 -78591 -80754 -80806 -81875 -77873 -79775 -81006 -79354 -78637 -80407 -80506 -76404 -75719 -76142 -69139 -59021
7644 -59021 -55237 -61027 -69869 -74908 -74261 -76680 -77643 -79067 -79976 -79525 -80846 -78998 -80161 -78520 -80856 -82072
7628 -82072 -82893 -80132 -80969 -81059 -83248 -81280 -79709 -81220 -82728 -80462 -82093 -81458 -80564 -79822 -82296 -79662
7612 -79662 -82932 -81189 -82235 -82178 -81859 -81234 -82064 -81857 -82421 -82438 -83759 -81562 -83913 -85989 -75307 -77164 -78756
7595 -78756 -80140 -81821 -81542 -79329 -82150 -79566 -79593 -79847 -80276 -79874 -80192 -81127 -82320 -78897 -83309 -80577 -80594
7578 -80594 -81281 -81169 -80547 -82012 -82109 -79755 -80877 -81216 -81080 -82246 -81033 -79824 -80269 -80098 -80904 -82316 -80582
7561 -80582 -79834 -83325 -80668 -82549 -81944 -81817 -82452 -81903 -80547 -82117 -80469 -81486 -79564 -81317 -78726 -82037
7545 -82037 -81956 -79806 -82489 -81037 -84455 -80033 -80199 -83501 -80718 -80347 -80127 -82026 -82272 -79861 -80702 -81774
7529 -81774 -80397 -81569 -81180 -82035 -83330 -80281 -81352 -81822 -82055 -79910 -81640 -81015 -81872 -80310 -83773 -79847
7513 -79847 -80700 -79918 -81426 -81913 -82859 -81480 -81473 -81432 -82606 -81266 -83582 -82208 -81418 -79535 -82190 -79433 -79919
7496 -79919 -81367 -82048 -80892 -81096 -82601 -83014 -83030 -80870 -81791 -79706 -82253 -81608 -79513 -78110 -82341 -81494 -80837
7479 -80837 -78858 -80631 -80406 -81737 -79898 -80904 -80631 -81671 -79630 -78136 -80491 -79412 -78793 -80121 -81139
7464 -81139 -81009 -80231 -80075 -80685 -82397 -82785 -82288 -81158 -81772 -82422 -81934 -81517 -79637 -82081 -77850 -80023 -79871
7447 -79871 -80909 -81030 -81810 -81976 -80232 -79590 -82039 -82607 -81295 -80255 -81069 -81792 -81487 -80952 -81594 -78435 -82450
7430 -82450 -81135 -78288 -79425 -80109 -80870 -81990 -81358 -83945 -81618 -82031 -81121 -80805 -82924 -81701 -81802 -81016 -82799
7413 -82799 -82548 -81521 -79896 -81357 -81357 -78981 -79721 -80127 -79700 -79534 -77308 -79401 -77584 -80441 -80785 -80730 -78486
7396 -78486 -81155 -81503 -81956 -79755 -79882 -81537 -82790 -82014 -76561 -79506 -80073 -81214 -82050 -81094 -80845 -79427 -81293
7379 -81293 -80073 -80778 -80218 -82342 -82349 -80362 -78789 -79912 -79790 -79434 -80566 -81857 -83307 -81090 -80140 -81005 -80481
7362 -80481 -82570 -79406 -80824 -82684 -82914 -81541 -82257 -81077 -81434 -79474 -79240 -78074 -80356 -80534 -81052 -82533
7346 -82533 -82633 -82812 -80635 -78844 -79754 -82552 -82249 -80756 -82438 -81629 -79823 -80582 -79425 -79434 -79597 -79700 -79014 -79665
7328 -79665 -80679 -80760 -80674 -83498 -82960 -82668 -81253 -82563 -82161 -82015 -81793 -81689 -80778 -80110 -80609 -79059 -80595 -79723
7310 -79723 -80232 -79352 -80952 -79695 -79905 -79941 -80500 -82117 -82180 -78777 -80403 -78632 -79179 -79076 -77570 -77524 -77662 -81752
7292 -81752 -78699 -79713 -82255 -79806 -80643 -77930 -80019 -78495 -80978 -82211 -81674 -83006 -82853 -79228 -80159 -78568
7276 -78568 -79131 -78971 -77527 -81743 -82581 -84961 -84477 -82693 -81319 -77791 -78961 -80637 -79202 -82421 -84715 -85349
7260 -85349 -82232 -83281 -79808 -77089 -78069 -78327 -78520 -83435 -83587 -82740 -79353 -80541 -82118 -80396 -79448 -77092
7244 -77092 -80515 -84049 -82200 -80622 -80685 -76943 -79409 -78708 -80312 -77937 -80662 -80467 -82260 -79873 -80622 -77132
7228 -77132 -80269 -80517 -82920 -82520 -80953 -79407 -82325 -81786 -79869 -77188 -79232 -80671 -81619 -79875 -78444 -79590
7212 -79590 -80369 -78258 -75327 -75734 -79053 -80854 -80879 -79603 -78500 -77184 -77969 -76514 -75329 -75226 -75769 -80138
7196 -80138 -85027 -83254 -80726 -76505 -77021 -80581 -82289 -76005 -77240 -89892 -93628 -89806 -76357 -72814
7182 -72814 -77588 -81801 -81859 -77291 -75053 -76912 -81524 -77711 -73514 -67835 -69203 -76226 -82319 -85366 -83376
7167 -83376 -78824 -80409 -86220 -95071 -91141 -84088 -90413 -97478 -101235 -90209 -80024 -78816 -86860 -90021
7153 -90021 -84141 -74799 -72413 -71124 -75018 -74871 -73432 -69431 -69169 -75231 -80746 -76331 -71165 -71594 -77128
7138 -77128 -90028 -95039 -86093 -80873 -82989 -88166 -84712 -77765 -75777 -81998 -86344 -87132 -82717 -77312 -76197
7123 -76197 -73675 -74549 -76967 -78959 -78332 -77913 -78212 -78617 -79257 -78918 -77409 -78358 -82412 -79696 -81684 -80204 -78515
7106 -78515 -77863 -76136 -75750 -78685 -80791 -80394 -78107 -79842 -80643 -83332 -78511 -74101 -78763 -83762 -84973 -83031
7090 -83031 -81541 -80818 -81464 -79670 -75844 -78154 -76634 -79356 -80445 -80535 -81439 -79226 -73590 -76193 -77598 -78618
7074 -78618 -76858 -78759 -80392 -82621 -82662 -77285 -76679 -75656 -78060 -79644 -78319 -80521 -81583 -82570 -81732 -81039
7058 -81039 -75362 -79025 -78724 -78002 -78784 -81450 -83055 -79854 -80147 -79409 -78889 -77489 -78968 -79260 -80559 -81977
7042 -81977 -80430 -79177 -79656 -80804 -79539 -80720 -80239 -76594 -78310 -79868 -77484 -82231 -81977 -81901 -80271 -77076
7026 -77076 -78232 -80904 -79879 -78573 -78959 -81206 -82339 -81911 -79439 -79372 -81972 -79151 -79797 -78745 -80902 -81179
7010 -81179 -80679 -76201 -82326 -80734 -80612 -80143 -81210 -80116 -80911 -80692 -80755 -77825 -82004 -82933 -83702 -82336 -81738
6993 -81738 -78912 -80251 -79149 -79668 -78375 -79848 -78139 -80967 -79485 -80597 -78695 -77441 -79267 -78962 -82145
6978 -82145 -80439 -80485 -79725 -81055 -82365 -80369 -80614 -79493 -77037 -79701 -79875 -77514 -81224 -78943 -80580 -78319
6962 -78319 -78492 -76430 -80368 -80540 -80141 -81574 -84022 -80639 -81376 -82202 -81206 -79618 -79245 -78217 -77967 -78938 -82367
6945 -82367 -80199 -77180 -79988 -80001 -78580 -79195 -78424 -78738 -76628 -79161 -77713 -79325 -79068 -78044 -78550 -79213 -79260
6928 -79260 -78094 -78181 -78833 -79013 -80181 -81014 -76843 -78894 -77836 -79511 -81141 -79404 -79530 -80219 -78154 -76524
6912 -76524 -77312 -78701 -76817 -77647 -78654 -78738 -78554 -78322 -77465 -78812 -80560 -80478 -79602 -80668 -78947 -80348 -81413
6895 -81413 -79853 -79125 -79365 -79552 -80804 -80699 -76177 -77532 -80851 -79239 -78011 -77677 -79491 -77465 -78903 -79521
6879 -79521 -79950 -78435 -81792 -79959 -79260 -77809 -76935 -77424 -78152 -77931 -78359 -77113 -77892 -79867 -78806 -79101 -79846
6862 -79846 -79099 -80057 -81502 -80537 -80353 -78886 -76105 -78276 -82249 -78778 -78955 -77751 -77907 -79049 -78007 -78182
6846 -78182 -81219 -78844 -78117 -78414 -78706 -78998 -78738 -78411 -80849 -80594 -79344 -79659 -80139 -77941 -78405 -77173 -77820
6829 -77820 -77022 -79979 -80128 -80533 -79432 -77793 -77858 -80153 -78582 -79724 -79099 -79267 -79754 -77934 -78824 -80406 -78282
6812 -78282 -80397 -76593 -79128 -78096 -77618 -77206 -76250 -78902 -80727 -77860 -79318 -77850 -78387 -78856 -79801 -76865
6796 -76865 -75595 -79166 -78270 -79223 -78895 -79514 -77331 -79603 -77542 -79490 -77717 -78343 -77541 -77332 -81515 -79995
6780 -79995 -78761 -78003 -76822 -76707 -76421 -75908 -76145 -77007 -79255 -77753 -78005 -77000 -77840 -78350 -78947 -76487 -77391
6763 -77391 -78437 -77751 -76402 -77371 -75877 -78576 -75613 -77646 -78599 -77087 -77017 -77780 -75844 -77554 -78638 -77707
6747 -77707 -77443 -78710 -77696 -78525 -75626 -77814 -74864 -77031 -75770 -77054 -77775 -75950 -78111 -76845 -72674
6732 -72674 -78930 -77175 -77350 -76373 -78271 -77341 -76497 -75023 -76693 -79519 -77106 -77555 -76831 -76657 -75708 -77985 -76450
6715 -76450 -76839 -78402 -79302 -76568 -77185 -77843 -79730 -80857 -79880 -78954 -77957 -78205 -79155 -76700 -77045 -77626 -75897
6698 -75897 -79269 -78501 -77730 -78232 -79884 -78844 -75945 -78683 -78293 -77874 -77514 -77522 -78342 -77944 -76911 -76454 -79103 -76534
6680 -76534 -78174 -78249 -78390 -78156 -77209 -78757 -77955 -77265 -80585 -78361 -78097 -78006 -78243 -78315 -77868 -77779 -77944 -76769 -77227
6661 -77227 -79149 -79971 -77886 -77671 -78692 -78736 -78041 -79402 -80140 -78204 -77857 -77665 -79939 -78119 -77915 -80072 -76987
6644 -76987 -77107 -79874 -77529 -78575 -79876 -77952 -78084 -76328 -77807 -79154 -76380 -77743 -77515 -77530 -78174 -79587
6628 -79587 -79167 -79092 -77301 -77610 -78802 -79633 -79287 -79209 -79284 -79409 -78511 -77956 -78868 -78959 -77073 -79401 -76034 -78468 -78529
6609 -78529 -76110 -77712 -77888 -77925 -77994 -77757 -76973 -77219 -77349 -77434 -77333 -76113 -77986 -78900 -78301 -78350 -78840 -77041 -77047 -77452
6589 -77452 -76182 -75964 -77808 -78149 -76550 -78405 -75486 -77470 -78565 -79231 -78562 -78572 -76510 -78399 -75756 -76397
6573 -76397 -76600 -76070 -76960 -75972 -77686 -76445 -78559 -76789 -78632 -77202 -75507 -77547 -77524 -77184 -77276 -76939 -77187
6556 -77187 -76388 -77064 -78624 -75940 -76042 -75958 -77413 -77223 -78028 -75077 -77507 -76967 -75837 -77012 -78020 -75746 -75785
6539 -75785 -77346 -76316 -76656 -75251 -77374 -76675 -76017 -77276 -75133 -74674 -75325 -76147 -77449 -75028 -77520 -77211
6523 -77211 -75057 -77201 -75880 -72661 -73711 -76040 -74224 -75539 -75181 -74036 -74870 -76950 -77441 -74004 -75755
6508 -75755 -75178 -77036 -75617 -74268 -77091 -75341 -75598 -74073 -77227 -74345 -73544 -74320 -73847 -74549 -75098 -75540 -76034
6491 -76034 -74282 -75039 -73906 -75968 -77425 -74305 -73784 -73983 -73672 -75434 -75761 -75725 -72060 -76400 -73139 -73013 -76059
6474 -76059 -74807 -74549 -74642 -75247 -73107 -74955 -74691 -71982 -73235 -74069 -74500 -71236 -73494 -74083 -72755 -71744 -73265
6457 -73265 -74082 -73767 -72490 -72724 -74150 -71255 -72464 -73616 -74415 -72313 -73756 -73688 -72750 -72206 -75365 -71571 -71566
6440 -71566 -72589 -71663 -73637 -73042 -73766 -74634 -73984 -70755 -71270 -73067 -73574 -72909 -72535 -73378 -72744 -75377 -74357
6423 -74357 -70420 -71812 -72325 -72570 -72583 -70634 -73996 -71772 -73185 -72465 -71009 -70212 -67757 -73284 -73288 -72518 -71947
6406 -71947 -72774 -73043 -73399 -76153 -71159 -72121 -71445 -71215 -71790 -71599 -72700 -72429 -72831 -70636 -70902 -72170 -69935
6389 -69935 -69809 -70642 -71842 -73795 -71584 -71097 -71607 -71770 -71487 -69925 -68539 -68248 -70960 -72296 -71180 -71836 -68699
6372 -68699 -70977 -69310 -70672 -70812 -71589 -69012 -72330 -70480 -67060 -69261 -70178 -68054 -70524 -66595 -68185
6357 -68185 -70194 -70457 -70539 -69533 -67734 -67832 -67696 -68253 -67911 -69745 -68427 -67905 -69186 -70521 -70341 -69488 -68421
6340 -68421 -66291 -68085 -69446 -67364 -69084 -68601 -67593 -68910 -67907 -66916 -67954 -65525 -68470 -69248 -68695 -69438
6324 -69438 -68398 -67752 -67937 -66883 -68244 -67197 -67721 -68451 -69311 -67908 -68289 -67687 -67285 -65307 -66573 -67462 -68668
6307 -68668 -68312 -68185 -68411 -65710 -67356 -67983 -67631 -64662 -67546 -66575 -64564 -66718 -67441 -66375 -66746 -65172 -64066
6290 -64066 -62665 -64920 -65141 -67792 -67847 -65047 -68278 -67737 -68729 -68986 -67316 -67236 -69431 -65841 -66149 -66741 -64809
6273 -64809 -68156 -66840 -68234 -67064 -68743 -67926 -69059 -65964 -68295 -67943 -65469 -65168 -66539 -66803 -67652 -65419
6257 -65419 -67660 -67899 -67925 -67641 -65297 -65160 -66735 -66609 -66555 -68057 -64955 -66534 -66913 -65139 -66457 -66965 -65318
6240 -65318 -65780 -65028 -66779 -67010 -63568 -66069 -67432 -64836 -64781 -65576 -64990 -65670 -65051 -64669 -65453 -64886 -66001 -63837
6222 -63837 -64693 -63886 -64748 -66073 -65008 -63289 -65099 -67354 -66616 -64433 -66356 -67652 -63901 -64245 -67990 -64940
6206 -64940 -64578 -62963 -62996 -60703 -62296 -65496 -64507 -64211 -63713 -64599 -62993 -64013 -63868 -61908 -62362 -65289 -63373
6189 -63373 -62225 -64439 -64112 -62415 -63849 -62647 -62154 -63862 -61885 -64578 -64503 -64203 -65629 -64599 -62534 -62566
6173 -62566 -61158 -65280 -62396 -63655 -64100 -61684 -62633 -62601 -62190 -65039 -62913 -63616 -63334 -63608 -64967 -62961 -63220
6156 -63220 -59814 -63881 -62756 -60210 -61954 -61557 -60402 -62375 -61063 -61745 -60999 -60096 -60618 -62965 -60915 -61468
6140 -61468 -61618 -63129 -61211 -61145 -60416 -57654 -59032 -61987 -60197 -62162 -62246 -61088 -61265 -62033 -60536 -58258 -60952
6123 -60952 -60201 -59275 -59138 -60179 -60383 -61556 -60493 -59762 -60593 -58273 -60661 -60250 -60536 -60899 -62727 -61029 -60130
6106 -60130 -61406 -57343 -60480 -60622 -61210 -59263 -58413 -59445 -56761 -57955 -58084 -58287 -60015 -61162 -57861 -58204
6090 -58204 -58751 -59514 -58096 -57408 -57360 -58348 -57939 -58056 -56763 -57035 -57012 -58066 -56512 -57978 -55730 -58340 -57468 -57683
6072 -57683 -58502 -57864 -58625 -55318 -59814 -58532 -59125 -56472 -57147 -59527 -60983 -58895 -58754 -58080 -58756 -60445 -57470
6055 -57470 -58051 -58666 -57348 -57840 -58398 -59047 -58170 -57820 -59026 -58293 -58067 -59605 -58534 -59979 -56365 -55826 -56086
6038 -56086 -59200 -56200 -57755 -58902 -56502 -56277 -58811 -58377 -58401 -55611 -57444 -57186 -56362 -55823 -58334 -56405
6022 -56405 -56368 -58378 -56822 -56220 -55302 -56488 -56710 -61693 -53369 -55160 -55318 -53841 -55516 -52874 -54418 -53475
6006 -53475 -53967 -53814 -57075 -53367 -54098 -53823 -51377 -50411 -47962 -45048 -47348 -49214 -47622 -50188 -48762 -50454
5990 -50454 -46603 -46971 -47095 -48472 -51787 -50828 -52723 -52415 -51501 -50749 -53211 -49793 -47847 -47871 -46323 -46747 -52291
5973 -52291 -50852 -49703 -51050 -48428 -49079 -48426 -46550 -47730 -47432 -50222 -49958 -48763 -50125 -49665 -51315 -52229
5957 -52229 -49740 -51475 -51176 -50212 -51282 -52476 -51038 -52352 -52353 -50804 -52930 -53232 -50353 -51809 -50934 -49873
5941 -49873 -52181 -49714 -49574 -49948 -49245 -50247 -50519 -46324 -49631 -50500 -47946 -48803 -49959 -49696 -48197 -49188 -48861
5924 -48861 -49271 -50047 -48606 -49850 -50219 -48536 -50546 -49099 -52353 -51914 -49654 -50321 -51490 -49963 -48993 -49323
5908 -49323 -47412 -48224 -48210 -49505 -48266 -47850 -46626 -49132 -48518 -49586 -51032 -49381 -49994 -49724 -49923 -47078 -46749
5891 -46749 -51167 -48646 -49042 -50825 -49579 -49735 -47325 -46681 -47208 -46493 -46342 -47694 -47676 -49312 -50333 -49647 -48385
5874 -48385 -48298 -44077 -43242 -43847 -44409 -46487 -48280 -47178 -44782 -44959 -45485 -42800 -39627 -41968 -43414 -44770
5858 -44770 -41775 -45683 -47128 -42786 -42275 -41238 -39581 -40083 -40100 -43566 -41643 -41686 -42473 -39077 -36884 -30772
5842 -30772 -28092 -24832 -26649 -30842 -32848 -32420 -29130 -24965 -26729 -23991 -27647 -28497 -32257 -32589 -36101
5827 -36101 -38810 -37601 -37185 -33579 -30796 -27649 -24698 -23664 -26573 -27278 -27418 -31375 -33832 -32466 -27564
5812 -27564 -22863 -21340 -21416 -27733 -28444 -30768 -33758 -35479 -36464 -35684 -33185 -32704 -32002 -33295 -35260 -35200 -37139
5795 -37139 -34532 -34238 -33941 -33716 -29428 -30784 -31612 -33405 -30885 -28849 -27676 -27084 -24685 -19380 -20415 -21086
5779 -21086 -21381 -18393 -17158 -16909 -16745 -17871 -14393 -15046 -19665 -24494 -26108 -21428 -18941 -14647 -17839 -23098
5763 -23098 -26894 -20652 -16242 -15081 -15157 -19561 -13323 -9220 -9660 -16340 -16807 -17650 -11896 -10289 -8286 -9293
5747 -9293 -7157 -3995 -7257 -8768 -15638 -26334 -26661 -18640 -15760 -19036 -19346 -14860 -12465 -16604 -23479
5732 -23479 -29262 -21326 -13669 -16627 -16603 -2102 5177 -9794 -22541 -23241 -15174 -12961 -17822 -20114 -15747
5717 -15747 -9120 -15926 -28288 -24724 -19443 -19571 -20858 -7915 2618 2470 -6472 -11992 6581 31321
5703 31321 25886 9319 28019 47798 45840 13870 939 15682 27551 24772 5790 -610 6223
5690 6223 6187 -2809 846 13290 13253 11215 15581 23810 28138 30823 19975 26247 54082 64062 51770
5675 51770 48318 56223 62358 53813 51435 68015 89650 97507 91528 92371 101155 113286 114285 114189 129434
5660 129434 152311 169426 182073 200928 225238 264693 334089 470237 703373 984793 1158511
5649 1158511 1132173 986022 881162 894220 1013786 1187393 1304714 1277463 1100845 850973
5639 850973 642240 515005 448305 416838 412564 427148 467721 553033 708479 912200 1068544
5628 1068544 1089753 1018983 941956 862889 816478 830515 894026 1011843 1168309 1224309 1088352
5617 1088352 840357 636482 520507 446763 394341 355267 333057 323640 321314 313447 297205
5606 297205 273311 251171 241358 237771 238261 239779 238477 230097 224895 215189 208867 203985 200565 201149
5592 201149 193268 177201 148531 122310 105595 91235 78517 64926 59807 55111 52975 47185 43377
5579 43377 41590 39405 36250 33891 34589 35609 33593 32765 29503 27561 23310 17622 15036 11853 10400
5564 10400 11880 11656 12584 10243 6224 5398 6374 2553 -11 -89 340 3693 3621 3609 90 -2239 -4261
5547 -4261 -4776 -3964 -7403 -7149 -6861 -6627 -3767 -7010 -8605 -12101 -11919 -8361 -10229 -11472 -12829 -10611
5531 -10611 -10294 -13808 -13579 -16372 -13660 -15392 -14647 -15741 -14438 -13359 -14239 -14135 -11445 -8425 -10293 -11974
5515 -11974 -15483 -14752 -12776 -14022 -12496 -12145 -12865 -13509 -13284 -11303 -13644 -13204 -12385 -11175 -13499 -13660 -14084
5498 -14084 -14700 -13481 -13800 -16398 -16003 -16093 -16499 -14991 -17829 -18950 -19790 -19982 -18239 -16315 -18499 -16618 -20921
5481 -20921 -17051 -18680 -17870 -18045 -16927 -16580 -17702 -15041 -13535 -16835 -15260 -16479 -15143 -15742 -13764 -14120
5465 -14120 -13346 -14165 -13942 -14528 -13054 -15682 -14988 -15160 -13278 -13073 -13107 -16102 -18366 -16199 -18152 -18111 -19023 -17381
5447 -17381 -19232 -19232 -20171 -16874 -18510 -22110 -17684 -17747 -18259 -16426 -16496 -17095 -16339 -17464 -17764 -17350 -17261 -13969
5429 -13969 -17365 -18436 -18640 -13943 -12706 -16823 -17207 -15772 -14708 -15870 -16432 -17173 -17060 -15079 -16672 -18672
5413 -18672 -17971 -17985 -18445 -21114 -19199 -19974 -20432 -18674 -17038 -16657 -17897 -20562 -20492 -18555 -20759 -19926 -19854 -17923
5395 -17923 -19588 -18753 -19322 -21602 -19820 -19753 -16732 -18660 -16390 -16157 -15061 -14539 -14643 -14945 -12869 -11871 -11437
5378 -11437 -11399 -11920 -11205 -11402 -11127 -9247 -8244 -8329 -5831 -3964 -2031 -112 2776 7317 10592 16979 20232
5361 20232 24574 29981 33467 45102 69031 101115 122617 126678 115194 104281 102942 117537 143682
5348 143682 166722 169096 161752 146723 135468 126287 123599 132358 144274 146152 141283 128479 119725
5335 119725 112877 107653 99265 95941 82786 69605 53087 37471 27141 21193 16608 12832 8528
5322 8528 3154 3672 2560 4185 2823 356 1036 -2239 -2620 -1775 -1486 -3074 47 -1312 -3423 -1933
5306 -1933 -2985 270 160 983 2119 4017 7420 7021 7001 9093 9881 8983 10842 13037 13516 15887 13316
5289 13316 15246 13219 11224 13391 14569 13980 14160 13878 17636 16750 19763 23502 23858 25377 27126 24700
5273 24700 25677 30245 29101 30859 31091 35905 30947 30492 31049 32174 29086 28840 30123 31198 30610 32703
5257 32703 32128 30283 29409 30197 28469 29224 29150 27492 27582 27524 27420 24238 25327 21415 20709 22492 19311 19928
5239 19928 19154 18724 16652 17641 15229 12535 13101 13711 12550 10765 11101 8387 7406 3622 1820 2108 2133
5222 2133 -1619 1066 -3145 -1992 -4315 -5280 -5854 -6380 -6620 -8034 -8631 -10270 -9837 -10086 -11589 -14945 -11265
5205 -11265 -13095 -14417 -15498 -13256 -16878 -16337 -14999 -17409 -17424 -17482 -18562 -18949 -19013 -19868 -21319 -18657 -22443
5188 -22443 -20349 -21117 -21797 -21388 -21863 -24503 -25871 -23601 -24577 -25834 -22884 -24332 -26039 -23946 -25421 -25046
5172 -25046 -25783 -25079 -25337 -28675 -27609 -27126 -28135 -27717 -27509 -25949 -27990 -26243 -24876 -27608 -25327 -25422 -25473
5155 -25473 -25683 -27799 -29010 -27315 -28250 -28494 -31126 -29325 -29863 -30063 -32278 -32150 -29574 -30946 -31757 -29667
5139 -29667 -31573 -30692 -29489 -32953 -32737 -31965 -30290 -31529 -31738 -31930 -32179 -30715 -31455 -33007 -29667 -30677
5123 -30677 -33271 -33580 -32414 -33203 -33218 -31345 -34747 -31651 -33048 -31259 -32399 -33580 -32802 -34891 -34121 -35343
5107 -35343 -33751 -34048 -31930 -35396 -33292 -33995 -32567 -33677 -34614 -34702 -33098 -34313 -32614 -32916 -33232 -33650 -34081
5090 -34081 -36131 -31244 -35446 -34534 -33779 -33364 -34689 -31559 -34593 -33071 -34819 -36234 -33992 -35209 -34445 -34548
5074 -34548 -34116 -34294 -33197 -34533 -35629 -34451 -33899 -34613 -33486 -32372 -34652 -33421 -30891 -32713 -32226 -33873
5058 -33873 -34797 -32757 -34411 -33560 -32328 -30974 -33054 -35385 -35581 -35906 -33399 -33231 -33370 -34765 -33724 -31334
5042 -31334 -30944 -31773 -32705 -30091 -33204 -32892 -32857 -33834 -32442 -33134 -31978 -32052 -27333 -31433 -30205 -30193 -32938 -33594
5024 -33594 -32194 -32732 -32130 -31447 -31843 -30379 -31747 -29355 -30559 -29461 -27250 -31761 -28444 -28660 -30790 -27575
5008 -27575 -28895 -30750 -30529 -30326 -30250 -30269 -29958 -28831 -30521 -30074 -30234 -28675 -29463 -30434 -29147 -29816 -32218 -31274
4990 -31274 -30488 -28011 -29242 -30317 -30439 -31639 -32308 -31347 -31422 -30242 -32074 -27591 -28494 -29812 -30025 -29425 -29905
4973 -29905 -31959 -29201 -31805 -29864 -31345 -29976 -29245 -31241 -29101 -32525 -29408 -32014 -30924 -29064 -29224
4958 -29224 -28015 -31088 -27486 -28388 -28445 -29029 -28507 -28387 -25924 -25946 -27217 -27598 -26655 -28214 -26541 -28085 -27006
4941 -27006 -25662 -26248 -25457 -25493 -24148 -23350 -24956 -23281 -21828 -21805 -22825 -21882 -22523 -20309 -20333 -19608 -21146 -21063
4923 -21063 -21533 -17925 -18131 -16430 -14806 -17488 -18377 -17233 -16151 -16755 -18255 -19011 -17698 -17694 -17554 -19602 -18744
4906 -18744 -18657 -20241 -19261 -20171 -21489 -17642 -19696 -18999 -20829 -21872 -18494 -21170 -21340 -23679 -22767 -22981 -22395
4889 -22395 -23341 -23133 -22062 -23359 -24482 -21646 -21923 -22953 -21325 -24382 -23161 -22487 -23579 -21536 -21089 -23095
4873 -23095 -21386 -22502 -21785 -22738 -23820 -21364 -23220 -19914 -24316 -23882 -20710 -20471 -21415 -21167 -22538 -22165
4857 -22165 -22156 -19983 -17489 -20969 -19574 -20735 -20364 -16654 -18661 -18041 -18186 -20598 -18059 -18205 -18129 -16434 -19825
4840 -19825 -18709 -19018 -16995 -18485 -18499 -17830 -16523 -18364 -18404 -17379 -19061 -16151 -15769 -13482 -17981 -16413
4824 -16413 -16749 -16258 -14046 -13920 -14143 -15293 -13137 -12241 -14871 -15558 -12140 -12860 -12761 -10342 -12210 -11004 -10730
4807 -10730 -12623 -10173 -11531 -9348 -10038 -8110 -9518 -8638 -7369 -10436 -7396 -6428 -8079 -7541 -6379 -5840
4791 -5840 -5379 -5128 -7048 -5602 -3966 -3819 -2172 -2757 -1625 -1709 -4292 320 -1035 -988 1024 419 554
4774 554 1086 1002 1040 2784 2759 6020 5059 7909 5680 6503 5336 6608 6370 8724 9939 9550 11890 14655
4756 14655 14755 17279 17158 21516 22711 27990 29903 36436 46501 76218 132881 188358 192904 145407
4742 145407 98775 75668 59738 49350 41402 39251 36649 36459 35097 36020 36362 38690 40166 40220 43858
4727 43858 48026 51153 53197 60407 64911 74675 96587 139754 223832 322084 366387 320982 228389
4714 228389 161468 117434 96002 84238 75856 70209 67969 63903 64675 65540 69073 71617 73061 69858
4700 69858 69843 70021 69227 68043 69781 73364 86320 111051 144281 192466 221030 202797 155575 117432
4686 117432 96957 86448 81766 75955 73977 70467 64775 65712 64483 66806 70036 71159 71819 69808
4672 69808 69412 67909 66347 67636 65340 69176 69000 71231 67372 67172 67140 68506 69588 69793 71009 71128
4656 71128 73001 74940 75823 77134 79178 77332 78519 77617 77888 78754 78194 79253 79852 78182 82415 81518
4640 81518 84476 84912 83864 84402 84434 88052 87988 91468 93173 93854 95403 97369 97181 98760 101721 105142 106444
4623 106444 108302 110610 114471 116164 120783 127287 137152 154528 169458 173677 173393 178196 173952 167637
4609 167637 154306 153837 150115 150622 151365 152041 153960 156849 159345 161896 163380 161835 169396 171705 177066
4594 177066 182597 188110 196184 211591 241337 271038 288530 292243 301341 307348 284132 261285 246578
4581 246578 244093 241956 240363 239423 241415 244398 248730 256644 258328 261055 263151 265669 273336 282096 292088
4566 292088 304057 325713 359858 388029 402505 407810 422358 444276 469081 488758 516579 573229
4554 573229 685702 809470 858496 803866 707794 654133 639798 659183 698660 722380 699506
4543 699506 669889 675558 712999 753185 773052 765116 740445 725041 736981 755029 763011 773213
4531 773213 819137 922809 1111016 1402038 1699326 1833662 1721299 1468059 1247660 1099451
4521 1099451 1002774 957071 956973 956217 940646 936328 948988 949797 923017 873185 818818 785947 783534
4508 783534 799850 809953 799555 773261 769692 800732 883517 996660 1066967 1022989 922938
4497 922938 843579 789427 738785 692590 662325 650295 645939 651665 657010 653947 646305 640764 648740
4484 648740 665007 680588 693341 696582 691311 685530 685129 685894 687864 686337 690015 692939 698346 703406
4470 703406 709221 717971 725322 738783 747847 757400 767582 787859 816316 843281 859134 858516 856335
4457 856335 857531 869848 892271 920787 950351 977306 996510 1006454 1008181 1004184 999043 1002914 1011712
4444 1011712 1025460 1034993 1044388 1058804 1075007 1091679 1108756 1123668 1140302 1156734 1175950 1201055
4432 1201055 1238787 1288966 1348712 1387339 1406660 1415842 1427344 1452371 1506007 1595781 1704403
4421 1704403 1800943 1893212 2039702 2323904 2743211 3133034 3329434 3288032 3072397 2781940
4411 2781940 2514263 2307244 2141531 2027855 1950479 1920318 1929757 1968873 2040013 2138047 2256410
4400 2256410 2373608 2460672 2540633 2697418 3013281 3406849 3703000 3777125 3649115 3428714
4390 3428714 3341811 3587789 4165851 4719699 4771095 4301004 3784547 3526263 3451899 3393319
4380 3393319 3291996 3222104 3172936 3088151 2990169 2936105 2948098 2997643 3067094 3174650 3319850
4369 3319850 3437567 3542980 3722146 3985252 4257339 4407149 4354382 4078491 3757510 3529630
4359 3529630 3416717 3382013 3396059 3430632 3464911 3470682 3459179 3454696 3475635 3522962 3595781 3668940
4347 3668940 3716338 3762159 3806783 3844765 3862349 3875244 3906324 3962385 4037915 4123938 4220371
4336 4220371 4314374 4386328 4447279 4512203 4597138 4705174 4831470 4951445 5048730 5115709 5174118
4325 5174118 5235383 5313474 5418069 5570059 5811622 6172979 6608411 7004377 7258776 7313995
4315 7313995 7208731 7123647 7202572 7338997 7411236 7452822 7633017 8032672 8513029 8840982
4305 8840982 8933679 8945061 8963139 8978148 9013049 9109961 9273827 9517750 9855439 10280717 10862333
4294 10862333 11714279 12750051 13667842 14197521 14369043 14559999 15080593 16108832 17623152
4285 17623152 19378671 20700923 21502396 22403818 23485640 23994653 24171139 25114816 27755513
4276 27755513 32171867 36560341 38564616 38681338 40575772 48281895 64781282 87406589
4268 87406589 101007218 98687093 91521139 91093171 88303695 79357582 71110821 68231332
4260 68231332 71840952 79237067 83587354 82696038 82278296 85186180 90717219 99232380
4252 99232380 107403453 108771086 105280802 104695224 109170914 117456555 127893729 142327052
4244 142327052 167045769 206874751 238594230 236880857 203590688 175828230 158289548
4237 158289548 141752750 126007145 115889423 113095259 115292835 114627846 106743830 96722626
4229 96722626 90127939 85520896 84059368 85138714 82943212 75261007 68353445 67458446
4221 67458446 72877081 81158949 87034594 89746196 97792697 109639878 108906195 88049703
4213 88049703 65555378 51726849 45185202 42610540 40413781 36355939 31409106 27474560
4205 27474560 25341324 24539785 23977333 23105147 22242595 21719521 20910088 19256615 17433539
4196 17433539 15988689 15161527 14807199 14640851 14231394 13382063 12259760 11304888 10582292
4187 10582292 10030665 9591340 9246439 8988286 8803865 8690816 8660563 8690680 8740874 8741174
4177 8741174 8570948 8185341 7728790 7440070 7307523 7186685 7027050 6966357 7108170 7309580
4167 7309580 7353994 7139723 6764923 6273914 5757206 5323622 5004547 4766272 4589117 4472446
4157 4472446 4412959 4369202 4293790 4167533 4008298 3858367 3738549 3651654 3571803 3489080 3393572
4146 3393572 3296851 3226390 3182183 3154561 3118025 3063878 2995509 2907674 2805247 2706327 2616545
4135 2616545 2543399 2476908 2423004 2368823 2314229 2260769 2206208 2160561 2120955 2081480 2038859
4124 2038859 2004349 1968513 1927285 1886117 1850648 1823269 1791400 1761392 1735442 1712433 1691197
4113 1691197 1669207 1645833 1634176 1628238 1625477 1611625 1586679 1561242 1522318 1475133 1419708 1366268
4101 1366268 1321109 1274373 1234245 1194940 1166183 1142779 1123647 1110204 1102161 1086752 1072685 1062252
4089 1062252 1061111 1069745 1076363 1092041 1117185 1167473 1219100 1258588 1255046 1227426 1176258 1108773
4077 1108773 1032967 959745 890784 831405 782742 742866 714173 681331 650570 629809 618133
4066 618133 608316 594688 585025 575773 576037 575621 583245 594801 614796 644870 665897 665238 644789 610984
4052 610984 566227 524704 477951 441253 406664 374670 350609 330376 313774 296680 281865 269829
4040 269829 259466 249571 235621 228719 223235 215582 207488 207211 204182 201963 194488 186016 180831 176637
4026 176637 170207 163633 154823 146523 143679 139919 136186 130680 128033 126183 128043 126307 120480 117225
4012 117225 109540 107932 107067 108593 112964 115076 109912 107277 103255 101016 100039 101940 104350 109645 108185
3997 108185 108209 109803 112702 119909 130962 144632 156716 161819 159093 157657 171531 200999 256103
3984 256103 318552 360906 399174 475152 561994 585970 524474 435917 373026 345447 350482 374744
3972 374744 383912 373014 361336 375705 418171 465496 504311 533218 559855 591552 612533 605919
3960 605919 607665 658631 730579 794496 888050 1087701 1345845 1484520 1381097 1136692 894909
3949 894909 724947 632056 583431 538810 480443 433287 432300 456989 468035 452013 417484 395888
3937 395888 397127 424676 456638 465733 455965 437786 417341 421997 486065 585350 637240 575962
3925 575962 447877 352927 315349 306414 298208 255825 200181 159085 136173 116877 97050 72469
3913 72469 57400 46321 36349 29397 27506 24896 28040 28118 22225 23505 20490 17936 20535 21426 16737
3898 16737 17840 29361 47310 59414 51898 31520 11937 -146 -9114 -12091 -14768 -17555 -19676
3885 -19676 -22053 -24602 -27970 -27709 -29262 -27980 -27060 -25546 -29665 -27998 -27720 -29406 -32540 -34700 -35562 -37127
3869 -37127 -40099 -39132 -41439 -38855 -40594 -40615 -40274 -44949 -42125 -41254 -43162 -42680 -44679 -44930 -45041 -46693 -47895
3852 -47895 -47479 -46567 -45286 -46015 -45234 -46124 -44850 -47692 -49126 -49012 -49869 -49775 -50804 -51668 -52104 -52025 -52733 -53209
3834 -53209 -52758 -55161 -52682 -53523 -53715 -53927 -53721 -54661 -54953 -55273 -54686 -56250 -56523 -55207 -53476 -54004 -56353
3817 -56353 -54342 -55987 -58914 -57099 -54992 -55466 -56609 -54833 -53174 -55423 -56710 -56380 -55482 -54909 -54946 -55900
3801 -55900 -54249 -54087 -56281 -53812 -52757 -55080 -56358 -56533 -57468 -57506 -55675 -55943 -57627 -56359 -57361 -57335 -54741
3784 -54741 -54118 -54992 -53344 -53189 -53834 -52682 -52369 -53663 -53360 -53346 -54699 -51121 -51823 -49941 -50927 -52705 -50790
3767 -50790 -54992 -51415 -51939 -53765 -52677 -52791 -49929 -51594 -52036 -48606 -49016 -49905 -52235 -50573 -52368 -48669
3751 -48669 -49939 -51286 -50093 -50724 -47253 -46671 -49806 -48351 -48369 -46870 -46136 -46104 -46563 -48121 -47445 -47644 -48113
3734 -48113 -46040 -45565 -45657 -44238 -43695 -42701 -43098 -41320 -44468 -42753 -44692 -40140 -40907 -40796 -41341 -39774 -38581
3717 -38581 -40779 -36008 -38550 -35169 -34989 -35209 -34626 -32354 -32984 -34536 -34582 -31083 -33710 -34554 -31020 -31342 -29607
3700 -29607 -29262 -29283 -28515 -28274 -27305 -26621 -24330 -23514 -22274 -22205 -22333 -20525 -21202 -19288 -20572 -18761 -16986 -16475
3682 -16475 -14600 -13252 -11722 -13686 -11414 -9775 -11239 -7134 -8123 -7361 -3912 -3925 -2531 -1911 -1027 1488
3666 1488 3147 3542 3973 2353 6422 8130 8498 10042 14853 14477 15938 17277 20520 23505 23660 26440
3650 26440 27314 29453 30846 33057 35422 37557 39449 42027 44173 43468 47645 51138 53345 55282 59601
3635 59601 58848 63715 64897 70422 71185 77461 81191 84888 86924 92304 98238 101758 105358 109207 112122
3620 112122 120189 122853 127383 134333 138349 146437 153624 157849 164306 169856 178205 187006 194773 201682
3606 201682 210500 219828 229401 239110 250607 263780 273921 284946 298039 311084 326295 342208
3594 342208 357121 374687 392873 411988 430619 450743 473612 498393 522613 549906 577994 608381
3582 608381 639282 670804 707097 745878 785149 825266 868298 910412 958101 1007242 1055129 1103808
3570 1103808 1152802 1202010 1250687 1296271 1335996 1375161 1406811 1433971 1452460 1461706 1462868 1456436
3558 1456436 1443584 1418641 1389612 1354017 1310286 1263488 1213689 1163263 1112986 1062705 1009619
3547 1009619 961739 911873 864936 819736 777119 736762 696534 659950 627017 592717 562339
3536 562339 535283 507107 480542 457164 437225 414143 392867 373934 355816 340215 324401 307306
3524 307306 294916 281549 268461 256818 244111 229668 220727 210158 202865 194714 184285 176062
3512 176062 169833 161214 155167 148981 143010 135056 130801 122841 120122 112662 106628 101542 92901 91836
3498 91836 85757 81477 78890 76725 72751 69999 65543 60722 58802 52382 49188 47253 42946 41212 40701
3483 40701 35196 33961 31377 29999 28370 24225 20874 20032 20796 17920 17313 14662 10046 8060 6729
3468 6729 5815 4315 3771 2650 -1464 -2883 -5034 -5368 -5447 -7512 -8496 -10316 -9597 -13891 -13602 -16711 -17338
3451 -17338 -18236 -18314 -19653 -19501 -19592 -21431 -22026 -21190 -24561 -25466 -25876 -26409 -27952 -26257 -27884 -30817 -31280 -31834
3433 -31834 -32003 -33035 -32954 -31538 -33203 -34560 -34227 -37853 -35313 -35879 -37144 -36159 -36213 -37245 -39197 -41129 -41023
3416 -41023 -39191 -42556 -41025 -42565 -41541 -42751 -41706 -44426 -42976 -43220 -45508 -46259 -44821 -44895 -44490 -45831
3400 -45831 -46632 -45815 -47690 -49096 -47489 -46553 -47538 -48344 -46884 -48616 -48961 -47021 -49746 -48725 -49279 -49341 -50371
3383 -50371 -47504 -48246 -48186 -49105 -50431 -49485 -51997 -52053 -51247 -50931 -50553 -48540 -51055 -51483 -52056 -49311 -53783 -52012
3365 -52012 -51747 -51350 -52335 -50669 -52690 -51190 -49081 -50738 -49590 -51286 -49635 -49566 -49674 -50075 -50443 -49349 -51201
3348 -51201 -50143 -50881 -50116 -49924 -49137 -48660 -47984 -46675 -45831 -44648 -39816 -40886 -42423 -43093 -43111 -42869 -39427
3331 -39427 -39505 -41490 -43147 -42328 -43141 -44447 -44370 -45928 -43594 -45178 -46574 -45167 -46013 -46118 -44346 -45850 -44048
3314 -44048 -44105 -41570 -39707 -35644 -28724 -28668 -25364 -28879 -30091 -29852 -25937 -23196 -23607 -27354 -30887 -32325
3298 -32325 -35994 -37352 -37745 -38055 -39826 -38745 -37892 -37379 -35777 -34411 -32006 -31503 -30091 -30040 -28243 -25735
3282 -25735 -19160 -8467 7322 21626 28504 18866 7734 1807 -309 7677 20983 41362 37214
3269 37214 18103 2278 -6716 -10886 -15774 -17749 -18650 -19875 -17038 -15690 -14490 -11850 -12301 -12410 -10406
3254 -10406 -8612 -985 8524 22421 32932 45649 53172 48269 42809 52177 80261 118094 148953
3241 148953 148455 144952 134222 128433 99442 60086 34561 20439 14371 8414 4544 2706 3699 3535
3227 3535 4455 2015 6037 4000 7706 8537 13965 22490 29287 33750 42273 61592 99252 137456 151395
3212 151395 144774 145862 154018 144207 117613 79937 56330 39793 29609 25592 23241 27152 26074
3199 26074 24358 19862 17856 16488 14278 14554 14963 15132 18332 19336 26137 27130 24460 21639 18238 19194
3183 19194 18079 19516 22069 19709 18637 18407 18667 21007 20783 23596 23825 25530 25971 29075 28913 30548
3167 30548 31873 37690 37596 37775 40801 41544 45073 49594 52163 50093 51301 52223 55541 56958 57511 62785
3151 62785 68423 79412 97230 110159 113670 106548 102115 102765 109736 119726 120355 112325 103389 98322
3137 98322 92525 93983 93352 92919 93597 96749 97784 108753 119618 126001 127973 126136 123935 125052 126265
3122 126265 132148 143952 166577 200336 234263 254391 257850 247469 227880 208137 190352 179312
3110 179312 176973 176285 178439 183992 197886 206310 209552 223226 245591 290687 349358 388857 403287
3097 403287 397480 367525 326698 306660 301702 314672 336038 355211 365177 366919 359345 349271 332167
3084 332167 317265 310588 313690 332645 349531 363504 376061 400129 451791 553971 697762 820427
3072 820427 895722 943275 965481 901664 770892 643500 563951 537250 554410 590248 600093
3061 600093 577447 544408 519956 505719 488992 477978 479742 486840 495947 508767 533187 564491
3049 564491 616243 723597 893173 1078617 1199007 1250194 1278277 1287171 1221164 1105150 1024250
3038 1024250 989457 963951 948039 919491 852060 752307 680885 635407 611425 602412 594333 595678
3026 595678 601434 613799 627185 647655 666273 702384 777822 882275 959230 994504 1036279 1140249
3014 1140249 1276552 1359155 1330937 1218311 1097984 1015253 962068 900790 834412 781014 747636
3003 747636 732571 722576 714246 719171 728074 733409 740698 747835 757735 770239 780333 793373 809212
2990 809212 835622 885607 969533 1061490 1131243 1153216 1136885 1101671 1076892 1061139 1029341 998013
2978 998013 973131 957141 954805 965837 978975 982614 985691 1001570 1027668 1054703 1066412 1075840
2966 1075840 1087658 1105056 1120774 1142745 1167218 1194118 1220378 1245935 1260193 1258644 1258673 1271627
2954 1271627 1298893 1337058 1373954 1396411 1402099 1416200 1434494 1458303 1501636 1595678 1734060
2943 1734060 1832398 1850865 1799200 1771319 1765630 1778961 1813316 1851925 1892307 1925759 1940983 1939764
2931 1939764 1957262 1987516 2011296 2026331 2059482 2140102 2241850 2307400 2327272 2360723 2504799
2920 2504799 2749483 2944303 2983759 2915845 2846467 2784993 2749875 2744160 2739426 2745660 2764454 2781967
2908 2781967 2795930 2798769 2795972 2813953 2896690 3029257 3160021 3207408 3194341 3207995 3325728
2897 3325728 3540800 3733490 3777708 3664116 3540506 3473755 3467759 3498254 3552889 3631544 3742489
2886 3742489 3913620 4119469 4304292 4410154 4479838 4589432 4735056 4813107 4794064 4722985
2876 4722985 4675299 4684170 4764086 4850834 4911865 4957311 5051435 5180638 5320532 5441734 5588492
2865 5588492 5804781 6113183 6548813 7030446 7327653 7451213 7619899 7923366 8259819 8588350
2855 8588350 8850106 9208949 9739111 10024796 9813446 9461623 9226520 9110149 9103781 9180032
2845 9180032 9293247 9386803 9529266 9833189 10314557 11085262 12534449 14765191 16884072
2836 16884072 18109810 18740244 18823167 18031566 16883184 16136886 15655588 15299371 15147490
2827 15147490 15276724 15614153 16169899 16915397 17784413 18713365 19738575 20999811 22820353
2818 22820353 25883637 30648445 35504219 38437568 39291124 40811259 44538014 53003834
2810 53003834 70915359 95624443 110438779 106522551 95394647 86262183 75999262
2803 75999262 66030937 60600847 61767539 70373931 83687453 98595933 112994669 123317606
2795 123317606 125261286 122010116 118086278 113227582 108819357 106053630 103209771 99449364
2787 99449364 99148805 109152848 134321269 180558044 240720786 277060911 265057809
2780 265057809 213131366 165335324 132363675 112563664 104706122 104116546 102998290 100873562
2772 100873562 102860380 109439792 116660090 123234957 125894240 121136951 108814844 92523283
2764 92523283 75573563 63236380 57556810 58105214 63839798 71963417 81673914 95627232
2756 95627232 106283592 101175499 80259994 62152578 50744588 43688726 40334914 38517671
2748 38517671 35759118 31507000 27048711 23817893 21691360 20196122 19105223 18184305
2740 18184305 17157292 16073816 15148986 14555661 14333412 14387385 14472979 14556172 14910567 15821900
2730 15821900 16890544 17721854 17889243 17153949 15389990 13417686 12073118 11076306 10259978
2721 10259978 9696240 9414103 9284990 9088132 8779337 8532174 8451331 8520267 8715524 8906622
2711 8906622 8822761 8384971 7879320 7554153 7299110 7034619 6821794 6569605 6226768 5893765
2701 5893765 5571710 5312124 5140520 5043847 4998555 4928572 4789654 4599214 4430813 4294965
2691 4294965 4195316 4092428 3961954 3811726 3680063 3583624 3493417 3386013 3279346 3184411
2681 3184411 3092331 3001282 2917112 2837728 2759840 2682971 2614532 2561594 2518258 2477098 2436394
2670 2436394 2402425 2368690 2331879 2291043 2249252 2207785 2173865 2152468 2145666 2122243 2080593 2027589
2658 2027589 1964771 1889693 1811693 1740827 1679356 1625521 1574874 1530941 1495287 1462623 1430132
2647 1430132 1405193 1386072 1372397 1353420 1328349 1304510 1275157 1240619 1208482 1181611 1157452
2636 1157452 1136573 1120487 1113957 1103071 1087119 1067364 1039349 1010924 979346 950371 919421 896976
2624 896976 885012 877247 866119 856013 849643 856250 860341 864555 862252 854765 850069 851715 855224 852631
2610 852631 838485 815729 803657 803342 805150 799737 778410 749948 722768 696966 678403 667383
2598 667383 661214 659190 650294 641787 636076 634236 635311 637756 642478 651539 674104 702003 744197 778299
2584 778299 784889 768153 750261 734542 718589 733011 781303 832436 844798 836114 805524 740156
2572 740156 641172 552064 491120 453950 428520 414933 407922 408797 411796 425776 442412 465046
2560 465046 504799 555270 600574 646780 702753 768049 823014 866122 915817 1005923 1141521
2549 1141521 1271221 1310081 1249116 1144961 1047392 976341 897944 780505 651652 543906
2539 543906 472226 426131 401131 388148 383000 388214 402156 426008 458524 510297 572610 645325
2527 645325 742588 847201 916880 946437 977097 1047942 1140437 1210023 1235337 1234028 1229611 1211929
2515 1211929 1112833 915443 695517 532186 430375 364738 322982 294311 276248 266978 260146
2504 260146 261606 274259 291864 326701 374060 427575 458177 458104 446857 465014 515181 613554
2492 613554 720572 777864 785375 778376 759089 670865 516617 373777 279362 221279 180108
2481 180108 151236 130713 117071 104480 96568 92698 89615 89140 88875 88723 89716 93523 104261 116570
2467 116570 131988 154704 190701 210332 206215 200757 203064 183446 140418 99265 70116 50788
2455 50788 40320 31505 22671 17650 14359 13451 8555 7160 4996 2678 -1328 -1473 -1293 -5945 -6833
2440 -6833 -9557 -10095 -11468 -13971 -12423 -13573 -13070 -18572 -17643 -19354 -21793 -21120 -18870 -23303 -23977 -23932 -25882
2423 -25882 -25201 -25222 -27046 -26264 -25749 -28900 -29048 -28898 -31212 -30857 -29917 -29566 -29890 -28443 -29849 -31819 -30593
2406 -30593 -28484 -27613 -29251 -29872 -30364 -28154 -26744 -26172 -27323 -26749 -26327 -22103 -21996 -20933 -22828 -25015
2390 -25015 -25010 -25572 -27125 -27884 -31008 -36155 -36280 -38282 -42066 -43690 -45025 -44208 -45805 -43932 -46704 -47326 -48637
2373 -48637 -49361 -49264 -51300 -50388 -51381 -53678 -51109 -53596 -52455 -53954 -53152 -52034 -51478 -49917 -50662 -52410 -53349
2356 -53349 -52275 -53283 -52375 -52063 -52160 -52305 -51303 -49862 -48019 -43276 -42279 -43627 -43789 -42932 -43700 -45794 -46091
2339 -46091 -48346 -47492 -49866 -51796 -51774 -53506 -49995 -52929 -51054 -53927 -51724 -52241 -53288 -53088 -56806 -56752
2323 -56752 -55859 -54820 -55189 -52370 -46848 -42656 -40433 -46326 -50517 -50613 -51684 -56716 -56007 -55941 -56725 -59724 -56684
2306 -56684 -59941 -60291 -58014 -58613 -60301 -60214 -59405 -59924 -58682 -59301 -58227 -57043 -58863 -60607 -57876 -56004
2290 -56004 -50852 -49884 -51402 -50006 -52389 -56934 -54621 -53883 -56641 -54138 -57594 -52609 -52804 -51252 -43908
2275 -43908 -43093 -45500 -48459 -51157 -49790 -51804 -54690 -54696 -54827 -56064 -53230 -52206 -53353 -54879 -55677 -55124
2259 -55124 -56651 -56333 -58193 -56047 -57375 -58041 -55917 -55410 -53904 -47859 -39667 -31028 -28544 -34652 -37123
2244 -37123 -37445 -38686 -47075 -50614 -51446 -52577 -54195 -55284 -55999 -55441 -56954 -57040 -56830 -56148 -56670 -55006 -55807
2227 -55807 -56061 -56905 -57490 -54018 -54758 -49529 -47431 -43275 -41811 -44803 -49235 -48997 -51934 -52145 -50157 -50833
2211 -50833 -53718 -53513 -55059 -55230 -53983 -55901 -57275 -55598 -55806 -56210 -57676 -56706 -55007 -55898 -56136 -56904 -58486
2194 -58486 -58292 -55351 -56702 -56694 -54583 -54496 -54161 -55801 -54075 -53762 -52268 -53185 -54157 -51294 -50438 -50803 -50736 -52639
2176 -52639 -51938 -50034 -50096 -50546 -49233 -49286 -46275 -47919 -47911 -49162 -46731 -46114 -46184 -44972 -46533 -43644 -42554 -41430
2158 -41430 -40309 -39656 -38569 -37463 -36825 -33823 -30935 -28638 -24144 -21212 -13182 2162 30899 66515
2144 66515 91190 88401 65100 33699 15335 1938 -7703 -10593 -13064 -14117 -11216 -10969 -10306 -6159
2130 -6159 -3787 -2123 3 317 2798 4077 9131 13680 15851 23235 29133 43849 66325 118976
2116 118976 195822 260105 269513 231422 178918 144411 128987 118984 119498 129006 145152 175003
2104 175003 237168 363696 589670 896729 1177359 1284055 1152313 877951 603677 416760
2094 416760 303085 235979 190409 166373 151144 149337 162730 186416 212315 224521 219349 205025
2082 205025 194185 188415 192885 201608 215776 239061 277456 342569 486631 841544 1469545 2095473
2070 2095473 2357362 2117310 1616748 1083613 729038 510934 377304 284516 224844 183947
2060 183947 158931 141125 126927 117574 105911 100203 98119 97982 100067 100054 102779 109770 116877 134187
2046 134187 165203 231825 373557 579988 803445 934935 916993 765128 573715 386207
2036 386207 254791 173150 122835 87282 64185 47663 36854 28840 20020 14424 8132 3291
2024 3291 -239 -4733 -7018 -10563 -15968 -15027 -17619 -20590 -21708 -22702 -23198 -23697 -27761 -29519 -28848 -30813
2008 -30813 -33562 -32041 -36447 -36539 -38171 -39515 -40045 -41146 -41318 -41832 -44879 -45985 -47111 -47830 -47292 -48578
1992 -48578 -48976 -49579 -51455 -50191 -51065 -52758 -49803 -52553 -52090 -52042 -53879 -57813 -53450 -54625 -55806 -57397
1976 -57397 -57568 -56399 -56500 -56215 -56201 -58665 -57437 -58984 -58913 -57987 -59999 -59763 -59690 -62223 -63063 -60545 -61201 -63591
1958 -63591 -62536 -61927 -63811 -65057 -63443 -63731 -63426 -62159 -65098 -63700 -64911 -65998 -66455 -66047 -65965 -66102 -66071
1941 -66071 -65373 -66238 -65967 -66587 -68140 -67212 -66983 -67551 -65921 -66502 -67859 -68215 -69693 -67822 -67521 -67817 -69692
1924 -69692 -69343 -68995 -68534 -67822 -69356 -68704 -68060 -69245 -69087 -69339 -69900 -70071 -70842 -70962 -72935 -67226 -70775 -69837
1906 -69837 -68267 -69237 -70976 -69532 -69802 -69997 -70686 -68532 -71065 -71747 -69557 -70788 -69958 -69844 -69555 -69457 -70244
1889 -70244 -69854 -71759 -74378 -72520 -70293 -73816 -72760 -72738 -72363 -71505 -71649 -70763 -71201 -74104 -71014 -71615 -71392
1872 -71392 -74615 -72580 -72503 -70757 -71524 -72687 -71122 -70208 -69621 -70450 -73248 -71297 -69517 -69858 -71213 -73113
1856 -73113 -69564 -72989 -69771 -67615 -67025 -66408 -66110 -68913 -69222 -69942 -72491 -72184 -70806 -73296 -72306 -72167 -71359
1839 -71359 -71869 -73381 -72407 -71245 -72670 -72729 -70472 -70922 -70885 -70095 -71533 -71052 -72999 -70555 -70431 -68566 -64992
1822 -64992 -61682 -61866 -63326 -67909 -70129 -70311 -72200 -70164 -73140 -75428 -72322 -73784 -71326 -73719 -72572
1807 -72572 -74473 -74895 -75556 -75193 -74309 -72451 -73826 -73704 -73909 -73825 -74084 -74962 -73635 -73445 -71043 -68975 -70947
1790 -70947 -70464 -73151 -73420 -72474 -72534 -73149 -74298 -73707 -73490 -74742 -74861 -75927 -74430 -74975 -73547 -74813 -73607
1773 -73607 -73515 -73978 -74127 -72840 -74745 -75266 -73549 -71358 -74160 -72403 -73251 -73434 -71487 -73368 -72932 -74667 -73976
1756 -73976 -73513 -73444 -74269 -75678 -73960 -72462 -74424 -72288 -73506 -73448 -73141 -74188 -71061 -73177 -74782 -71424
1740 -71424 -72876 -71744 -74402 -72008 -71927 -72790 -74381 -73067 -74334 -73578 -73159 -70464 -72163 -71742 -74842 -73019
1724 -73019 -74043 -73243 -71286 -72687 -71619 -74213 -73337 -73406 -72642 -72883 -74555 -73722 -75013 -72892 -72555 -72958 -72915
1707 -72915 -74631 -75193 -72273 -73938 -74051 -75975 -73805 -74185 -73743 -73464 -73219 -74060 -74369 -74332 -74552 -74045 -72401 -74939
1689 -74939 -72498 -74301 -71610 -73270 -71306 -72222 -75458 -75310 -74405 -74706 -72038 -73527 -72487 -75013 -73950 -74188
1673 -74188 -73873 -73145 -72103 -73590 -73605 -72009 -72163 -73660 -73337 -74168 -72720 -75267 -73576 -72314 -73446 -72784 -72563
1656 -72563 -72948 -73039 -70061 -75001 -75600 -74714 -72648 -72284 -73148 -74434 -76479 -74888 -73381 -74211 -74305 -73790 -74169 -73365
1638 -73365 -73047 -71779 -72934 -74692 -73354 -75039 -75602 -73694 -70675 -73772 -73447 -73709 -73491 -74537 -73240 -74688
1622 -74688 -73057 -74051 -73175 -73666 -73465 -72218 -73331 -75167 -73609 -74444 -74154 -72010 -73758 -74965 -74179 -73155
1606 -73155 -74144 -73656 -73809 -74182 -73522 -73580 -73102 -72283 -73181 -72647 -73174 -73498 -72819 -70815 -74638 -73446 -72820 -73960
1588 -73960 -75162 -71264 -73529 -73304 -73112 -74595 -72261 -72383 -71049 -71634 -72662 -72510 -72764 -72203 -72390 -74195 -74029
1571 -74029 -75132 -74709 -74260 -72179 -72309 -72886 -71939 -72834 -70953 -70905 -72635 -72109 -73653 -73504 -71179 -70748 -73969
1554 -73969 -75082 -72916 -73947 -73864 -73522 -71396 -71947 -76310 -74899 -76545 -71313 -74155 -75348 -72982 -74896 -73362
1538 -73362 -72970 -72733 -74169 -75185 -74685 -73838 -73419 -74861 -72077 -75099 -76542 -76502 -73543 -74413 -71621 -71888 -72449
1521 -72449 -75284 -76117 -73883 -72744 -75549 -74518 -76146 -75656 -73263 -74739 -77720 -76169 -77685 -77370 -74062
1506 -74062 -73993 -73551 -74871 -74757 -72773 -72442 -74898 -73052 -74694 -77341 -77146 -73972 -72414 -73278 -74038 -76127 -76257
1489 -76257 -73689 -73974 -72951 -77398 -78546 -72801 -70269 -74397 -74822 -75534 -77179 -79008 -76470 -74439 -74766 -73563
1473 -73563 -76567 -76447 -74253 -74590 -74688 -74453 -72588 -75872 -75751 -73869 -71445 -71383 -73809 -79008 -74970 -75912 -71980
1456 -71980 -73397 -72765 -75104 -73459 -73735 -74965 -76516 -76578 -75290 -75172 -74839 -73973 -73476 -74188 -75924 -77153 -81445
1439 -81445 -77022 -74952 -74472 -78694 -78490 -75123 -72705 -70136 -72932 -78179 -81970 -78231 -77228 -74910 -73909
1424 -73909 -75502 -76127 -76480 -75457 -77629 -79019 -80354 -79925 -77825 -77369 -76493 -74954 -73248 -75101 -78166 -80705
1408 -80705 -82115 -77842 -82396 -80875 -83492 -79975 -72183 -69241 -73440 -76530 -77998 -79552 -79993 -78664 -75645
1393 -75645 -77348 -77768 -78261 -79896 -79182 -79608 -79197 -78516 -79796 -81208 -78372 -73200 -69455 -72488 -77794 -79775
1377 -79775 -70829 -66850 -76362 -89044 -92272 -83168 -74814 -73470 -73376 -84346 -87236 -84518 -77164 -78663 -84366
1362 -84366 -90251 -85789 -80487 -80577 -85843 -84392 -80692 -72707 -84726 -101940 -102696 -87323 -77514 -79211 -68769
1347 -68769 -64505 -68172 -81741 -89172 -88235 -88448 -91275 -87062 -78186 -75235 -74327 -77148 -74699 -69181 -70679
1332 -70679 -78551 -79121 -70598 -65115 -73408 -88823 -90266 -67261 -46715 -42804 -41336 -29522 -43193 -70007
1318 -70007 -88357 -81739 -71091 -71888 -74370 -74393 -77332 -70385 -66635 -67051 -63962 -61116 -69386 -75712 -84923
1303 -84923 -84740 -82835 -86691 -87633 -78043 -65016 -60929 -64184 -57433 -66587 -82170 -90807 -81224 -66877
1289 -66877 -66932 -70125 -74503 -75302 -70054 -68568 -73861 -78310 -76292 -69327 -63611 -66853 -68544 -66355 -60573
1274 -60573 -56707 -65843 -73483 -77662 -69340 -65075 -62079 -63678 -66307 -66344 -61669 -62344 -62892 -68154 -66549 -68494
1258 -68494 -66198 -65843 -65391 -66999 -67291 -67436 -64050 -65531 -68616 -70128 -70755 -66476 -66796 -67033 -63707 -62414
1242 -62414 -65281 -69344 -69075 -67184 -68185 -72993 -70307 -66824 -62793 -64267 -65515 -67333 -69807 -65843 -68090
1227 -68090 -69397 -70328 -68374 -65486 -66599 -65390 -68080 -67257 -70316 -67648 -68690 -68750 -69959 -71135 -67510 -64683
1211 -64683 -63540 -67806 -68583 -68078 -69895 -67876 -70399 -68325 -69794 -66214 -65245 -65930 -65794 -67976 -67102 -69931
1195 -69931 -68201 -69617 -68263 -66848 -67546 -67535 -68447 -67459 -68745 -71275 -68751 -66768 -66610 -65483 -67103 -68068
1179 -68068 -67852 -64952 -68753 -69786 -69764 -67600 -68878 -67063 -66522 -67765 -66375 -68089 -68246 -67203 -68584 -68403
1163 -68403 -67010 -66903 -64875 -67027 -70048 -70173 -67914 -69022 -68141 -70609 -65939 -67038 -66355 -65445 -67421 -67416 -66637
1146 -66637 -69490 -67526 -66152 -66120 -68205 -67547 -67461 -69723 -69543 -70008 -69556 -71439 -70424 -68072 -66912 -67656 -67798
1129 -67798 -69365 -67610 -66903 -68803 -68979 -67956 -67921 -65460 -67250 -68119 -71054 -68725 -69963 -71247 -67131 -68742
1113 -68742 -68959 -67643 -67848 -67215 -68606 -66913 -68415 -68398 -68071 -67393 -67545 -68543 -66821 -66871 -67433 -67286 -65903 -67946
1095 -67946 -69117 -67243 -68388 -67529 -67680 -67990 -65651 -65478 -65852 -68031 -68630 -70520 -70163 -67574 -66885 -67296 -68707
1078 -68707 -69056 -69470 -68661 -67758 -66724 -68446 -66847 -67596 -65292 -67885 -68876 -69245 -66816 -66674 -66532 -67769 -66724
1061 -66724 -71201 -68191 -70105 -69220 -69692 -66993 -67744 -67609 -69094 -67752 -68659 -69442 -68562 -68499 -65989 -66490 -70302
1044 -70302 -67611 -68961 -69961 -68453 -68799 -67544 -69540 -68545 -67803 -69582 -69023 -68840 -70357 -68984 -69401 -71784
1028 -71784 -69384 -67237 -68061 -68704 -69077 -70756 -71673 -69054 -70005 -68145 -69322 -69405 -68562 -69610 -68937 -68318 -68052
1011 -68052 -68423 -69444 -70891 -70374 -67433 -68270 -67014 -68540 -67753 -68373 -69043 -68944 -69796 -68109 -68207 -67874 -70398 -69044
993 -69044 -67165 -67889 -67976 -67834 -67548 -68014 -66940 -68233 -66713 -67470 -68446 -69122 -67244 -69117 -68297 -67513 -68961 -68287
975 -68287 -67348 -68420 -68104 -68075 -70644 -70463 -68409 -69565 -66915 -68221 -68635 -70573 -71000 -68604 -68151 -69088 -68428
958 -68428 -67387 -68068 -68772 -69886 -68607 -69078 -70246 -69140 -69049 -68631 -71189 -69945 -69295 -69923 -66841 -69978 -69058
941 -69058 -68674 -68725 -69995 -69461 -69678 -71027 -68869 -68926 -68652 -68162 -70469 -69557 -66823 -68279 -69071 -69579 -69174 -69508
923 -69508 -68552 -69149 -67320 -70411 -68505 -67898 -68361 -69498 -67562 -68617 -69808 -69875 -65388 -69745 -69162 -68932 -68454
906 -68454 -69908 -70477 -69620 -68814 -68560 -68654 -69276 -69351 -69776 -67602 -69331 -68099 -69936 -67704 -68329 -68469 -69856 -69177
888 -69177 -69722 -68117 -66814 -70736 -67470 -69919 -68152 -67407 -67603 -69084 -68844 -69909 -68818 -69938 -69124 -69325
872 -69325 -68236 -69068 -67245 -69551 -67448 -67701 -68163 -69775 -66834 -68429 -69498 -70932 -69195 -68401 -69200 -67611
856 -67611 -69982 -68570 -69495 -68573 -69204 -67353 -67995 -65382 -68339 -68005 -68243 -70509 -70812 -68260 -67405 -69067 -68761
839 -68761 -69665 -68683 -69186 -68358 -68534 -69839 -67712 -68732 -68354 -69165 -67694 -69319 -68496 -68844 -69801 -67558 -68504 -68715
821 -68715 -70869 -69669 -67182 -70252 -70442 -67727 -68401 -69123 -68980 -68178 -69527 -67462 -68048 -68617 -67616 -70032 -68126
804 -68126 -69942 -68462 -67774 -70039 -67929 -68969 -66930 -67797 -70546 -69071 -68553 -68854 -68927 -68079 -68226 -70013 -71009
787 -71009 -68930 -69643 -68921 -69190 -69231 -67900 -68520 -67362 -68788 -67175 -68948 -69392 -66577 -69220 -68557 -68316 -68415 -68620
769 -68620 -68202 -68263 -70319 -69047 -69609 -67675 -66338 -67597 -68941 -68798 -68522 -68854 -68877 -68215 -68434 -67154 -68861 -67600
751 -67600 -68356 -69601 -68590 -68485 -69094 -68773 -68702 -67977 -69137 -69153 -70249 -67705 -66863 -67202 -68692 -69596 -68705 -67693
733 -67693 -69105 -69206 -68833 -69270 -69334 -68081 -70013 -68716 -70711 -68015 -68932 -68915 -69954 -68568 -68869 -67820 -68351
716 -68351 -69265 -70385 -69136 -70733 -68452 -67814 -69651 -67815 -68373 -69223 -70387 -67866 -69582 -67715 -69193 -68784
700 -68784 -69031 -67657 -70211 -68786 -68280 -69337 -70110 -68838 -69354 -68130 -71691 -69671 -67185 -69370 -69354 -68032
684 -68032 -68446 -68267 -68267 -69163 -68105 -67031 -66296 -69720 -69103 -69745 -69498 -67618 -68510 -67449 -68706 -68643 -70699 -68394
666 -68394 -68366 -67145 -67814 -67555 -67735 -68145 -68244 -68120 -66305 -68186 -70137 -68884 -68721 -67635 -69250 -67722 -71296
649 -71296 -68962 -67981 -67971 -70289 -70163 -67375 -67693 -69154 -68443 -70458 -69100 -69358 -70190 -67434 -70477 -70544 -69304
632 -69304 -69676 -70063 -69675 -67967 -67449 -68610 -69901 -67650 -65784 -68279 -68363 -69439 -70893 -67880 -67032 -69504 -68685
615 -68685 -69232 -69285 -67029 -67460 -68660 -67990 -68126 -67281 -68079 -68593 -69333 -66984 -68507 -68473 -67493 -68029 -69889 -68000
597 -68000 -67970 -67597 -70155 -68968 -69720 -67358 -67083 -66755 -69172 -70164 -69444 -65806 -67571 -68328 -69397 -70857 -70653
580 -70653 -72102 -68326 -70580 -68425 -69061 -66308 -69067 -68439 -67487 -68242 -69967 -68225 -70087 -67845 -67636 -70580
564 -70580 -70182 -68987 -65875 -68575 -67573 -68345 -70795 -67939 -68422 -68652 -67247 -69404 -67589 -70013 -69998 -69170 -66117
547 -66117 -68958 -69625 -68283 -67124 -68123 -69681 -69331 -69880 -68552 -69058 -69481 -68703 -68814 -67802 -70047 -68335 -68104
530 -68104 -70066 -69215 -68924 -67624 -67885 -67220 -67100 -69498 -69630 -67711 -69127 -70183 -68099 -68693 -68949 -70350 -68207
513 -68207 -69008 -69724 -69801 -68593 -67796 -69678 -69677 -69800 -68071 -68731 -68892 -67130 -69394 -70467 -68528 -68174 -67836 -67964
495 -67964 -68699 -67187 -68291 -68058 -68442 -69286 -67810 -67253 -68831 -66822 -69918 -67338 -69015 -68720 -68155 -66815 -68050
478 -68050 -67542 -68390 -66824 -67406 -67903 -70274 -67503 -68557 -69028 -67589 -68987 -67843 -69607 -68677 -66447 -69081
462 -69081 -67212 -68598 -68363 -69569 -67959 -69088 -66660 -67218 -68886 -68948 -69616 -66805 -67685 -66120 -68988 -67276
446 -67276 -67401 -67077 -69022 -67398 -66093 -68372 -67827 -65134 -68126 -67297 -68021 -68134 -68764 -67916 -69205 -69606 -67919
429 -67919 -66238 -67774 -66730 -68045 -67665 -68275 -67782 -69899 -70478 -68595 -70015 -70289 -67142 -68122 -67874 -70114 -67574
412 -67574 -67269 -67314 -68690 -67188 -67881 -68934 -67354 -68978 -69293 -68948 -69275 -68248 -67688 -69127 -68647 -69946 -69409
395 -69409 -69729 -69404 -68722 -67984 -68205 -67612 -69775 -67968 -66979 -68924 -67197 -67859 -69575 -69727 -68053 -67898 -68163 -68536
377 -68536 -66966 -69834 -69383 -68648 -68292 -69591 -68454 -67479 -67244 -68386 -68570 -68353 -68190 -68794 -68630 -69015 -69792 -69156
359 -69156 -68222 -70928 -68111 -68344 -69492 -68582 -68592 -69238 -70750 -67467 -69111 -68868 -67874 -68819 -70156 -69218 -68466 -67493
341 -67493 -69063 -68447 -69359 -69534 -69283 -69418 -69150 -68726 -68974 -68232 -67130 -68765 -68037 -66659 -68077 -70330 -70614 -67419
323 -67419 -66374 -67731 -68386 -66820 -68340 -69433 -72223 -69649 -66620 -67529 -70175 -68990 -68654 -68056 -70396 -68703
307 -68703 -71115 -67818 -69427 -69321 -71576 -66372 -67450 -70234 -69868 -68736 -67765 -69400 -72487 -69775 -67683 -68428
291 -68428 -67867 -70415 -69146 -68952 -67401 -68294 -70519 -68717 -69572 -70092 -70547 -69410 -69969 -69750 -69375 -68659 -70549
274 -70549 -69849 -70696 -68702 -67282 -69919 -69224 -69442 -70186 -69573 -67470 -68984 -69268 -69673 -67466 -68309 -69026 -69025 -71025
256 -71025 -70410 -69955 -70146 -70422 -68704 -72063 -69035 -70151 -70367 -72138 -69892 -69417 -68940 -68589 -71347 -71546 -70100
239 -70100 -70279 -70213 -70439 -71649 -71819 -72900 -69652 -69964 -69809 -71218 -71063 -70872 -69847 -68699 -70403 -71244 -69862
222 -69862 -71371 -71507 -70624 -71422 -72806 -72211 -73446 -73366 -72760 -73193 -72223 -71915 -74731 -71941 -72718 -72769 -70334 -74150
204 -74150 -71937 -70845 -72463 -74230 -74914 -74113 -73673 -74593 -75549 -73035 -73206 -73109 -75045 -73478 -75666 -73979 -75664
187 -75664 -75856 -75804 -76006 -75044 -76158 -75516 -76633 -75955 -78233 -75998 -78868 -76855 -77730 -77577 -78949 -76875 -77217
170 -77217 -76427 -75378 -76572 -76708 -78732 -77562 -75818 -76875 -79284 -77407 -77339 -76999 -78954 -77744 -78309 -80423
154 -80423 -78944 -80679 -80256 -80623 -80005 -80553 -78784 -80178 -80000 -80463 -79582 -80908 -81062 -83448 -81614 -82056 -81477
137 -81477 -82700 -83578 -82347 -83933 -82942 -82471 -84317 -84542 -83536 -83469 -83730 -82412 -83126 -84482 -83866 -85326 -85245 -85779
119 -85779 -86691 -86619 -87258 -86300 -87859 -85953 -85844 -86556 -86680 -85983 -88042 -87941 -86904 -87567 -88090 -89388 -90370 -90825
101 -90825 -92310 -92305 -91913 -90548 -90330 -89767 -92521 -91317 -90989 -91278 -91594 -92147 -90900 -91069 -90944 -92107 -92250 -92478
83 -92478 -93435 -94082 -96213 -95754 -93779 -96418 -96084 -96947 -94439 -96315 -95750 -96234 -96369 -98305 -98777 -100047 -97739
66 -97739 -98493 -98519 -100479 -101140 -101601 -101503 -102970 -102328 -101062 -100139 -101036 -101835 -101098 -101611 -102986 -103791 -106347 -104902 -104695
47 -104695 -103577 -103461 -105552 -104366 -105531 -107474 -107493 -108031 -108119 -107852 -107965 -107025 -107845 -109706 -108779 -111146 -109706 -110331
29 -110331 -109613 -112747 -110724 -113085 -112098 -110306 -111639 -111903 -111912 -113500 -114728 -113916 -115052 -113320 -113681 -114728 -114397
12 -114397 -115002 -114081 -115874 -116916 -117624 -117520 -117177 -120058 -120013 -120425 -119394 -119157
0 -119157
$$ Imaginary data points
##PAGE= N=2
##DATA TABLE= (X++(I..I)), XYDATA
16383 -591072 -583885 -578315 -571462 -563422 -557134 -548799 -544245 -538197 -531228 -523807 -519338 -511171 -504680 -499039
16369 -499039 -491464 -484226 -475963 -470559 -463673 -458232 -452042 -445283 -440103 -432549 -425106 -417546 -412247 -406287
16355 -406287 -400405 -393894 -387616 -381008 -376144 -368302 -362657 -354652 -348511 -342073 -335987 -329557 -323565 -316657
16341 -316657 -311170 -306098 -298633 -291281 -284841 -278593 -274040 -268512 -261714 -254370 -247955 -241462 -240207 -233108
16327 -233108 -225985 -217356 -210463 -206055 -200476 -195061 -190828 -182932 -179001 -173360 -167555 -160640 -154313 -148405
16313 -148405 -144419 -137157 -132671 -126595 -121777 -114533 -110168 -105320 -98422 -92253 -88112 -82180 -77996 -71813
16299 -71813 -66147 -62126 -58168 -50584 -45265 -41506 -35199 -30095 -25485 -22211 -16718 -11127 -5746 -1699
16285 -1699 3682 7513 12790 17170 21187 27679 32672 38145 42093 44665 49773 53472 56921 63721 68754
16270 68754 73960 79023 81294 84738 91294 94030 98986 101677 106801 111212 115652 120120 125031 129948
16256 129948 130665 134946 140634 144396 149420 153124 154740 159815 163904 165601 171219 176646 179469 181863
16242 181863 185789 189098 192217 197230 198464 201530 205776 208504 214362 217847 219832 224218 228048 230598
16228 230598 231154 236858 238619 242847 245001 248468 249286 255192 258179 259486 261109 264509 265739 270223 274905
16213 274905 275562 277378 280675 282962 284830 288078 290834 293873 295194 299427 300025 305590 304881 308717 311598
16198 311598 313061 313755 318321 320460 321986 324106 328239 329384 331793 332675 333363 334588 338253 341844 340638
16183 340638 344339 346373 347667 348758 351775 352112 355136 357065 357630 359442 364819 361303 365478 367420 368335
16168 368335 369535 370959 373793 375363 376433 376108 378203 379548 380530 381561 384618 385100 386856 385879 388570
16153 388570 388481 391280 392123 392852 394988 394994 398165 397574 398977 398245 402893 403454 404319 405010 404101 405282 407902
16136 407902 408830 410333 410599 410446 413494 413919 412929 415497 415850 416187 417789 416996 419118 420793 420313 421789
16120 421789 421721 422572 423703 425399 423964 423950 428633 426043 428993 428873 429878 429189 430763 431257 431435 433395
16104 433395 433094 432841 431727 431649 434019 431734 435384 435408 435889 436693 438369 435335 436371 438440 440928 438323
16088 438323 439656 438694 442201 443159 443252 441575 442255 443213 443295 440404 443739 443593 442724 444137 445613 444154 443468
16071 443468 443356 445394 443712 447453 447420 446665 446250 446595 448443 447455 447315 448527 447759 447554 446906 447470 449501
16054 449501 448654 449462 448935 450077 449739 451012 448600 448334 450374 452071 449160 449511 449689 449375 449170 453252
16038 453252 451325 451514 449658 449790 451611 452119 451333 451977 451819 450758 452448 449896 451106 452889 450973 454229
16022 454229 451930 452180 453224 451483 453368 452916 453993 454388 453102 452972 453885 452306 453343 452970 454553 454081
16006 454081 452415 454653 452097 454296 453792 454636 454556 452279 452814 452335 453621 453672 454308 452668 452987 454753 456063
15989 456063 453533 454192 454238 456017 455069 456070 454334 456941 456246 454125 457131 454540 455282 457485 456659 457804
15973 457804 456006 454293 454723 454783 455538 457812 456045 455880 456273 456123 454395 454929 455310 454727 454346 456499 456427
15956 456427 454853 451925 456598 454665 455465 454009 454409 455288 456692 455724 455266 455240 454611 455452 455022 458463 457455
15939 457455 456354 456402 457877 455355 454761 456097 457152 457019 458529 455523 457724 454647 455485 456381 457057 455906
15923 455906 456662 456583 457405 456560 457659 457017 454055 455070 456386 458853 459806 459116 458534 456852 459785 457470
15907 457470 454655 456439 458856 458561 459221 460240 459056 459332 457584 456416 457924 458522 457497 458492 460622
15892 460622 460445 460209 458216 460469 461054 461733 459207 459767 461434 461080 460598 460309 460047 458630 460704 460235 457881
15875 457881 459998 459749 459886 459012 460163 459568 459320 458824 460930 459926 458742 459988 458736 458551 458883 460572
15859 460572 459725 458283 459816 461169 458702 458651 459505 461135 462058 462196 462623 459636 461681 462246 461937 459448
15843 459448 459851 460609 459914 459476 461104 460078 462328 461617 463158 463166 459980 460646 460497 461505 459811 461715 460649
15826 460649 461303 460045 460112 461451 460284 459509 458150 460079 459945 461074 460171 460854 460773 463670 460407 463297
15810 463297 459835 461086 461589 463707 461076 460838 462034 461246 461024 460939 459168 461347 462701 462162 464921 463283
15794 463283 465373 462179 460410 461959 464896 462722 464165 461395 463711 462886 461716 462314 462153 462436 460648
15779 460648 461715 462256 463143 461211 463820 461383 461202 461311 463598 463687 463181 463722 461393 462356 463279 461565 461007
15762 461007 462766 463734 462816 464069 464458 463773 466174 464618 464473 465029 466993 466834 465338 467074 465531 465376
15746 465376 465135 464227 464086 463979 462876 464475 463105 462602 462582 463547 462620 464251 464524 466262 466516 466016 463675
15729 463675 464685 467544 466867 465155 464164 465575 465968 465002 463792 465671 464182 467260 466610 466536 467833 466320
15713 466320 467174 463749 467257 465501 466169 467865 467402 466616 468475 465402 463471 465515 467580 464223 464530
15698 464530 465966 466444 466771 465230 462306 466212 466462 469138 465754 467327 468027 466942 466875 469220 470007 469003
15682 469003 468060 467952 469205 468436 469122 465140 467340 467828 467891 464786 465441 466848 465896 467473 464471 465393 465110
15665 465110 467180 468214 470094 467291 466921 467588 469415 469487 468014 468764 469245 468530 468911 468040 465687 466423 466544
15648 466544 465079 467806 466673 466053 466008 467324 467400 468378 467856 467898 469408 469631 470617 470108 470353 469911 469247 471288
15630 471288 469421 468353 467361 467988 468350 468334 466146 467455 467516 470026 468627 469242 469928 468716 469972 471123
15614 471123 469214 466835 468987 466724 469021 467864 468011 467152 468306 469696 468314 465323 467345 469441 471487
15599 471487 470404 472325 471533 472064 471570 472807 468822 471216 470937 472557 471520 470091 470858 469562 471296
15584 471296 470616 470841 470031 471081 470940 471267 470753 470794 470888 470924 471732 469248 471863 470315 471745 471334 470444 471368
15566 471368 470056 471181 471267 470081 471678 471549 472046 470852 473709 471732 471245 473869 473090 474662 472292 474067
15550 474067 472704 472093 473374 470873 470124 471627 472186 473343 471842 471697 471541 470468 470944 472020 474102 472598
15534 472598 473327 472293 473180 472806 473593 472355 472274 471110 472747 471742 472733 472724 474410 473031 471494 473468 473518
15517 473518 473863 472220 475303 473284 473726 474710 474035 474629 473737 472889 473609 474798 474067 475867 474327 476044
15501 476044 475444 473674 474374 475852 474798 476217 472716 473479 475232 475789 473515 473948 474913 474168 473100 474232
15485 474232 475837 474249 474308 475115 473291 473456 473621 473993 477305 473896 474443 475504 476136 474686 474763 473467 475238
15468 475238 475319 474060 478205 475539 474806 474763 475481 474181 476396 475871 476665 475095 476161 475323 475296 476841 473640
15451 473640 474794 474943 472504 477337 476859 474543 474450 474689 475650 476730 473645 475660 475063 475931 477611 476708
15435 476708 479837 475857 475592 477627 475444 477116 475296 476225 476361 478502 477276 475831 476118 476817 477697 478078
15419 478078 476167 474061 477647 477755 476406 476391 478981 478283 478903 478863 478194 479572 480137 478530 478549 478475 479119 479763
15401 479763 478822 478551 478999 478239 477700 478959 476613 477589 478465 477841 476750 477801 477378 478019 477664 479406 478374
15384 478374 479812 478497 480938 478613 476958 479091 479556 477650 476440 478783 479021 480071 479780 480303 478651
15369 478651 478415 478620 479171 478581 478935 480488 479977 481273 482691 480500 479055 477998 477399 481109 479400 482083
15353 482083 480953 478948 478029 481349 481328 480361 481800 480153 480784 479478 479812 480256 479373 480352 482383 480719
15337 480719 482155 482178 481476 481269 481162 480478 480287 481617 483114 482917 480380 484019 483579 478992 480760 479970 481356
15320 481356 481247 482580 481743 482708 483517 480526 482260 483660 481071 481036 481201 482394 481419 482309 484321 483037
15304 483037 480705 481829 483232 479270 482539 483629 483341 484518 484021 480877 482567 481529 482138 482515 483671
15289 483671 484157 482994 483308 483432 484763 484603 483648 482271 482307 483767 482149 483922 481871 486052 483605 481835
15273 481835 483228 483946 483363 483870 481009 482263 481280 484182 483184 483776 485246 483237 484498 485836 483381 483791
15257 483791 484283 484590 484425 485555 483514 484655 483778 482159 484383 485122 483365 484351 485392 484132 486730 485191
15241 485191 484151 486058 486884 485597 484392 485416 485401 485134 485456 486393 485041 485622 485329 485653 486310 487171 485103
15224 485103 486227 485483 486168 486834 484574 486111 483715 485893 484866 486902 485255 486249 485767 487418 485814
15209 485814 485738 486917 486083 487919 487280 487094 487562 487848 487569 484981 486488 486642 486557 486382 487463 487992 487209 488065
15191 488065 488159 487219 486453 485786 488222 487940 486231 485593 486530 488964 487975 488779 486531 486782 488420 489477 489367
15174 489367 487813 487747 486112 486486 489610 488828 486263 485584 486849 486577 487189 487395 490801 488383 488629 488433 487795
15157 487795 489302 488832 487882 488780 490463 489983 490160 488512 487257 488852 490046 490708 489729 486541 488998 489378
15141 489378 488627 489234 488592 489267 490443 492369 489562 489558 490176 490511 489428 491086 490757 488467 490045 489294 490338
15124 490338 488507 488642 490527 491713 488856 489101 490567 491557 489523 491406 490539 493254 491550 490725 491522 489313
15108 489313 490775 488170 491205 492251 491055 491298 490028 491295 490147 490545 490849 492993 492026 491815 492378 492551
15092 492551 490902 491186 490267 492023 489466 491016 492416 492038 492900 492725 492172 490566 491767 494144 491936 493927
15076 493927 491748 492331 494593 489680 492403 492715 493062 493008 493849 491361 494099 492635 492768 492061 491604 493283
15060 493283 493408 492587 493917 494499 494400 493540 492049 493323 492166 492471 491541 493743 494736 494990 492863 493680 493715
15043 493715 492776 492390 494424 493356 495192 493317 493872 492917 493065 495871 493381 495056 494618 495240 494506 493976
15027 493976 493770 493465 494210 495358 495472 495970 495791 494937 494493 494365 496166 493125 494157 495445 495090 494951 494223
15010 494223 495157 495880 496191 497863 496721 495980 494782 494263 493596 495275 497083 495968 494513 496768 496362 495798
14994 495798 495678 494642 493965 495842 496718 494838 497211 496601 495014 496217 496431 498080 497193 497468 495866 497423
14978 497423 496059 499411 496289 497318 495407 497372 496682 496728 497644 496453 496835 497732 497140 496250 497489 496789
14962 496789 498441 497848 496353 497317 497805 496647 498918 497119 499273 495678 497652 497235 498197 498419 497842 498174
14946 498174 498264 497342 498037 497922 499820 497030 497608 499060 497591 499307 498285 498613 500047 498844 497955 497007
14930 497007 501013 499549 498905 498288 498922 499575 497988 498743 498898 498172 500026 496946 501066 499352 497785 498986
14914 498986 497409 500198 499553 500287 500618 500739 498609 501919 498298 499909 499639 500480 500592 501530 502099 500318
14898 500318 501427 499304 500613 501819 500688 501943 499848 500732 501861 500922 500428 500066 498118 501997 501144
14883 501144 501093 500875 500191 500679 499985 500345 501615 501807 502121 500513 502081 502098 501111 500556 500966 503506 501495 502622
14865 502622 502146 502478 502109 500397 500679 502629 502011 501248 502483 503424 501023 500541 500232 503547 503537 501760 499172
14848 499172 501283 502738 501361 501890 501846 500713 502222 504158 502709 501057 502885 504891 502884 503872 504242
14833 504242 503531 503450 504119 502972 503195 502486 503467 503786 503409 506414 504206 505820 503563 503283 501822 502956 503541
14816 503541 503629 503736 503049 504840 504237 504514 502927 503016 504098 504402 504320 504960 504827 505361 504408 505113 505328 506438
14798 506438 503101 505864 504393 504099 502381 505460 505225 504870 505411 504378 503701 505017 503354 504236 505269 505958
14782 505958 506063 507181 506394 506987 508282 507567 504783 503773 505290 504894 508381 505496 504436 507397 505935
14767 505935 507838 505226 505826 507186 505473 505315 506341 506490 506481 506532 506503 507503 505855 505893 506192 508216 506198
14750 506198 505754 507043 506686 507849 509300 504914 507423 507757 506624 508585 508462 508006 508373 508791 508740 509970
14734 509970 506695 508841 508454 506167 507699 509617 509425 507452 508955 507439 508452 509409 507027 510590 511067
14719 511067 509265 507111 509431 509668 508027 510133 507928 508290 508388 509419 507249 509949 509594 510297 507854 509577
14703 509577 509261 509413 507586 509001 508615 510160 509597 511021 510139 510215 510853 510804 510157 510124 509552 511135 511628 512597
14685 512597 509569 510715 511131 509928 511857 511382 511447 511224 509004 511348 510198 509157 511332 511144 510921 512120
14669 512120 512227 511742 512056 512106 511217 512655 511353 511761 511924 513450 512836 510683 511084 509146 509921 509679 510483
14652 510483 512359 509398 512552 511860 511219 511971 512261 513137 512223 512287 511612 513916 511892 510853 512291 513067 511754
14635 511754 513119 512657 513674 512808 513683 512919 513698 512865 515148 510734 509349 512330 512586 513139 515110 513316
14619 513316 512777 512521 512884 512425 512269 512791 514497 516917 513291 512874 514395 511934 514858 514929 514424 513332 514478
14602 514478 514153 513097 513313 514371 512346 514023 514496 516494 511824 516750 515490 513372 515577 514146 513535
14587 513535 517175 515895 515710 516589 515608 516086 515076 513962 514734 516846 517917 514369 518065 516316 516775 514731
14571 514731 514288 515438 516284 515796 517731 516315 514831 517034 515871 514730 515418 515948 516640 515272 515107 515896
14555 515896 516140 516850 515928 514976 515013 517698 516821 514130 514227 518537 517229 515472 516631 517559 516949 517470 518494
14538 518494 517076 514997 517882 517962 516611 519718 519232 518593 517630 516200 518100 518082 516233 516687 517991 517414
14522 517414 519197 519264 517418 517979 515159 517909 518103 517534 518269 518878 520448 520271 516569 517542 517955 518397 517826
14505 517826 519534 518472 520038 518148 520636 522253 518793 518618 520537 521777 519750 518735 519480 521217 519752
14490 519752 518424 522212 521822 521849 519007 521941 520666 521236 519295 520361 521181 520961 520710 521414 522723 518953
14474 518953 518945 522181 520844 520324 523551 520621 522963 521884 522285 522801 521976 520503 523703 523130 522433 520617
14458 520617 520611 521993 523340 520053 521144 521198 521160 520736 519971 518349 522950 522312 520350 519316 522370 523076 521564
14441 521564 521501 521848 522429 523114 521262 522396 522446 521511 521443 520400 522160 521576 521762 521327 520337 522538 523170 520338
14423 520338 523166 522389 522972 521992 522947 522834 524061 522056 521410 524588 523972 521109 524324 523092 522645 524181
14407 524181 523230 523014 524970 525514 523770 525110 523950 523304 523394 523122 524493 523915 523478 524427 524445 524724 522987
14390 522987 521358 524254 521545 524866 524262 524524 524798 525128 524720 523627 524228 522496 524807 525600 526817 526190
14374 526190 523287 522894 522205 524934 524860 523156 527272 526390 525471 524240 526136 526962 527191 527317 529256 528320 527509
14357 527509 526236 525072 528052 527328 524731 526028 528853 525571 526925 526174 526795 527587 527128 526527 526011 528345
14341 528345 526938 527022 528464 525653 528994 527443 526056 527047 525667 527055 529424 527987 525624 528778 526197
14326 526197 527566 527238 527841 528028 529264 527193 528917 529141 526340 527131 527563 529961 528738 529325 526216 529795
14310 529795 530266 528509 529656 528882 530356 528463 532206 530882 529471 526358 529338 526037 528311 531143 530289
14295 530289 529692 530309 529476 528748 527686 527480 528578 529115 530325 531954 531049 529101 530698 529403 529045 530338
14279 530338 530402 530490 530293 532657 531509 529701 528983 529747 529678 529431 527699 530558 529897 530165 530186 530984 529566 531513
14261 531513 530471 532195 531082 532686 531205 528823 531969 532026 530167 531168 531476 530705 530457 529042 531671
14246 531671 531240 533005 530858 533886 532919 533486 533474 534040 532493 532727 533809 533954 532940 534053 532299 532062
14230 532062 531969 532973 531503 532120 533569 533922 533170 532337 531784 532984 530838 531590 531157 533462 531563 532172 531882
14213 531882 534430 534502 532843 534029 533921 533520 535978 535168 533911 537931 534401 533290 534552 532511 533596
14198 533596 533001 535149 535968 533314 537279 537069 535609 535943 536888 535830 538561 535699 535713 535928 536766 536440 535287
14181 535287 535476 536525 534797 534743 535555 533577 535359 534106 536673 535650 534865 535438 535874 536501 537353 535590
14165 535590 534770 535525 538527 537996 536956 535857 537311 534725 536415 533319 535992 535204 536271 536847 539251
14150 539251 538281 539018 538670 535611 537268 537192 537634 538462 539348 539274 536023 536831 537445 536665 537587 537464 536936 535288
14132 535288 537093 537219 539010 536128 536674 536925 538248 538929 539426 539471 539602 541778 537779 539138 536454 541029
14116 541029 538156 539155 538364 538605 538134 540171 539670 541626 541368 539789 539631 540857 538751 541173 538977 537783
14100 537783 539520 540410 540361 538570 540713 538641 539859 538612 540028 539557 540084 539500 541077 539936 540627 540672
14084 540672 539455 540093 541682 541491 541841 541326 540505 541414 540225 542694 540884 541290 542459 542057 541943 541132 540423
14067 540423 543031 541681 542862 543281 539368 542923 541742 540361 541821 541596 540573 542174 542840 542216 542278 541081
14051 541081 541357 539820 541223 541782 540728 543325 541180 542640 541696 542116 540872 541316 542400 542722 541686 541694
14035 541694 540753 543686 544454 545926 544012 545207 543921 543749 543486 544347 543268 543865 544886 544423 543758 543286
14019 543286 544946 542515 543722 542928 542513 543847 544834 546209 544836 544212 543118 542596 544018 544580 545738 545877
14003 545877 544421 544890 544954 544166 544741 544180 543023 544242 543858 546653 546197 544894 545384 545324 544667 545457 544568 545999
13985 545999 542974 546916 545512 547121 546119 546203 546190 546636 545080 547793 546691 545838 545553 546092 548095 546084
13969 546084 547147 545146 547352 545927 548596 546774 548061 547303 547911 547351 548042 548112 547914 549994 548338 549305
13953 549305 547156 546500 546326 545856 547452 546785 548531 548060 548787 548767 548890 549757 548490 546803 548588 548339 549450
13936 549450 549704 549026 548360 549687 550636 549361 549099 550113 547369 549388 548697 550268 549656 548785 548799 549553 549578
13919 549578 549392 550259 550035 550552 551092 551903 549950 548178 550965 550051 550194 551034 548332 549385 549002 548296 550899
13902 550899 552223 550365 551577 550261 550264 549076 549613 550132 549757 551742 550605 552210 552253 552625 551556 552515 550897
13885 550897 553555 552541 553198 550920 551481 552231 552244 550652 550492 550462 550784 551130 551574 551158 553377 553151 551360
13868 551360 552553 554609 552224 552803 553208 554581 554731 553710 552224 554516 553652 552915 555381 554162 553114
13853 553114 553163 553300 552969 552620 554158 553481 553559 553954 552795 551544 554556 553338 553896 555514 554794 553383 556038
13836 556038 554049 554189 555005 554195 553919 554998 555118 553448 555927 554190 554454 550935 555414 554003 555164 554100
13820 554100 554434 554173 554482 557149 553847 553070 556180 556771 556407 554983 553172 555691 557210 554315 556742 557686
13804 557686 555241 554275 556818 556218 554362 555846 556216 556250 554499 554917 556813 557565 557673 558326 556083 555577 557600
13787 557600 556659 558123 556442 557140 556300 556321 556711 558355 557801 557407 558711 556395 558473 559031 557342 558599
13771 558599 558921 558339 557500 556678 557361 558784 556506 560004 557989 558094 558840 557390 558342 558958 557390 559334
13755 559334 558381 560306 557055 557598 558578 558498 557789 559177 557960 557972 558790 557388 559733 559970 558916 561153 559104
13738 559104 561609 559512 559820 559572 562901 559283 559929 559372 559066 557721 558903 560474 559878 561345 559093 561539
13722 561539 559997 561016 561287 561588 560053 559871 562274 560016 561644 562381 559923 561102 561898 560545 558925
13707 558925 562044 560631 560637 560607 563050 562726 563108 561517 559749 559864 562218 564571 561866 559548 562247 564090
13691 564090 561656 562216 561463 561824 562038 562666 562420 563105 562465 561338 562750 563009 561838 561116 562341 563975 564439
13674 564439 562263 564001 562920 562326 564045 563074 564624 563790 563739 563748 564017 562456 563132 563869 562957 563424 564831
13657 564831 563892 563579 562359 564771 564621 565081 564111 564442 565140 563501 565309 563251 564862 566047 564944 565881
13641 565881 564014 565929 566375 565651 566114 565678 564013 564411 567231 567638 562285 566049 567021 565237 566235 566477
13625 566477 567680 566073 566441 568230 568437 567787 564314 564079 566699 566586 564976 568539 569734 567098 566179 567076
13609 567076 568342 566464 567953 570391 564880 564788 568265 566623 567137 566110 571625 572058 570889 571440 572150 570274
13593 570274 569237 570960 569958 567843 569764 567968 569690 568276 572387 570680 570708 569870 569562 568972 570743
13578 570743 569247 570617 570094 569297 571598 574868 572801 570418 572522 571590 571793 569255 571862 569760 572436
13563 572436 572022 572221 572095 570640 571577 571214 572731 571325 571781 569905 570739 572428 569864 571982 572539 572710
13547 572710 571949 570024 572339 573083 572648 570908 572488 573420 571091 570099 571857 573162 570189 572765 573400 573128
13531 573128 573201 571801 573014 571760 572840 572741 572087 572170 574671 572299 573192 572736 572878 570617 573759 573000 572685
13514 572685 572308 573591 573855 574035 575212 574549 572963 573506 572884 575375 573333 574275 575148 573453 574214 575161 573952
13497 573952 573889 573883 574036 573522 576057 574290 574278 575593 574239 574890 573270 574987 577723 575864 576598 575286 574623
13480 574623 577338 574949 573917 574692 576642 574337 574193 573991 575993 575228 576847 574679 574769 575007 576774 577194
13464 577194 576287 576358 575063 574614 575969 576107 577748 576780 577014 575930 577132 578298 577720 577581 577394 576568 578499
13447 578499 580431 577651 578382 578009 575971 578296 579523 577574 578871 578351 577938 578700 577621 576899 578968 579289
13431 579289 578772 580962 576814 577983 577278 578595 577961 578557 577511 578493 577103 576518 577998 577880 577373 577640
13415 577640 578115 579855 576593 580164 579157 579848 579002 580877 579942 577550 579110 580580 580411 579315 579076 581386
13399 581386 579336 579546 578505 581340 579473 580558 579575 579005 581661 580439 579936 580852 581634 581635 580589 580046 581111
13382 581111 582224 579391 581202 583733 580721 581979 579566 580661 582340 580338 582229 581274 582237 583068 583654
13367 583654 583695 581839 581213 582737 582941 583309 582980 582108 582723 583005 580277 581285 582235 581112 581715 583864 580446
13350 580446 583715 583094 584391 581636 583260 582979 583711 584630 583102 586934 581498 584402 584161 584885 585454 585587
13334 585587 583147 586452 583987 582970 583101 583269 584192 583693 583810 586608 585431 584787 583503 582883 583916 583690
13318 583690 584759 584216 583785 585288 586185 584058 583910 583560 585287 585562 581796 585187 586394 585914 585653 583651
13302 583651 584781 586655 584903 585952 585314 586800 586617 585905 585678 586488 587042 586519 587376 587562 587671 585804 585663
13285 585663 588353 588066 585247 586729 586188 587030 588625 587723 588589 588838 587287 589326 589271 589147 587700 588799
13269 588799 586788 588952 590825 587438 587962 587504 590179 587315 587307 588591 588489 587381 586718 587298 590906 588179
13253 588179 589399 590437 590309 589597 590558 591513 592204 590247 590322 590490 588953 590188 589635 590334 591300 589601 587859
13236 587859 588211 592173 590364 589708 589491 592134 588265 590488 589593 590955 591150 591526 591190 592296 591724 592603
13220 592603 590995 591562 591512 594686 592476 591953 592975 591010 589644 590443 591051 590020 591165 590192 590449 590535 591098
13203 591098 591849 591319 591837 590457 592520 592399 593835 592413 593721 593312 593709 592330 593699 591811 592616 591744
13187 591744 592479 593903 591340 592497 591281 592288 593033 591521 592982 594757 595773 593383 591279 590626 592958
13172 592958 593849 591541 594804 592459 593542 594738 596060 594575 594784 594265 596614 592820 594857 595780 594127
13157 594127 592911 595530 593398 594155 595576 594901 596529 597347 594784 598176 597343 597831 597561 598334 595179 595973
13141 595973 599244 596844 596427 597747 596777 594503 595977 598831 595671 599828 599038 595358 596341 596388 596260 594616
13125 594616 595396 595261 596959 598544 598778 598241 596859 596882 598427 596948 598728 598610 598027 599386 600322 598947
13109 598947 599021 600204 597357 599907 598978 598477 600780 598433 600236 601086 599757 600217 598942 599480 602185 600795
13093 600795 600317 600184 597471 599473 599861 599499 598831 600628 601569 600274 599576 598330 599197 599665 600617 599539 601168
13076 601168 600888 600791 601332 601511 600295 599157 602084 600643 600652 601470 601886 601064 600713 599997 602127 600385 599758 604194
13058 604194 602347 601809 603578 602574 604148 601990 602633 603484 602763 603798 601900 601627 602300 603604 601293 600286
13042 600286 602404 604688 601233 602678 603896 601164 601500 602451 598220 602124 604335 600546 600731 601598 602390
13027 602390 604714 601303 602265 602913 602351 604112 602497 602241 602070 601514 602503 604295 604110 605523 605079 603241
13011 603241 603283 605305 603987 603138 603655 604146 603534 603104 604108 604250 604479 604872 606633 605920 608462 608489 606559
12994 606559 606563 609852 608054 604771 608371 609154 607640 607530 606150 605146 605980 607181 605614 606940 607424 606484
$$ [...]
##END NTUPLES=NMR SPECTRUM
##END=
