##TITLE=abcd
##JCAMPDX= 6.0         $$ Bruker NMR JCAMP-DX V2.0
##DATA TYPE= NMR SPECTRUM
##DATA CLASS= NTUPLES
##ORIGIN= UXNMR, Bruker Analytische Messtechnik GmbH
##OWNER= root
$$ XWIN-NMR		Version 3.5
$$ Tue Nov 18 17:04:48 2025 Russian Standard Time (UT+4h)  servis@DPX200
##.OBSERVE FREQUENCY= 200.131235884673
##.OBSERVE NUCLEUS= ^1H
##.ACQUISITION MODE= SIMULTANEOUS
##.ACQUISITION SCHEME= undefined
##.AVERAGES= 32
##.DIGITISER RES= 18
##SPECTROMETER/DATA SYSTEM= spect
##.PULSE SEQUENCE= zg
##.SOLVENT NAME= CDCl3
##.SHIFT REFERENCE= (INTERNAL, CDCl3, 0, 16.4885)
##AUDIT TRAIL= $$ (NUMBER, WHEN, WHO, WHERE, WHAT)
$$ ##TITLE= Audit trail, XWIN-NMR		Version 3.5
$$ ##JCAMPDX= 5.01
$$ ##ORIGIN= Bruker BioSpin GmbH
$$ ##OWNER= servis
$$ F:\spectra/data/av/nmr/H1/1/pdata/1/auditp.txt
$$ ##AUDIT TRAIL=  $$ (NUMBER, WHEN, WHO, WHERE, WHAT)
(   1,<2025-11-18 17:03:34.35 +0400>,<servis>,<DPX200>,
      <created by zg, POWCHK disabled, PULCHK disabled
       configuration hash MD5:
       00 E9 B6 7A A2 85 ED C7 34 08 36 98 17 FE 4E 26
       data hash MD5: 32K
       BE D3 15 E4 B9 94 F9 0E 36 AB E6 8C 0A D3 AC 77>)
(   2,<2025-11-18 17:04:06.76 +0400>,<servis>,<DPX200>,
      <Start of raw data processing
       efp BC_mod = 2 LB = 0.05 FT_mod = 6 PKNL = 1 PHC0 = -262.562 PHC1 = 1.301565 SI = 16K 
       data hash MD5: 16K
       DC FE 43 1E 8C 55 FB 4F 14 69 CA 57 C3 A9 55 E9>)
(   3,<2025-11-18 17:04:18.35 +0400>,<servis>,<DPX200>,
      <abs ABSG = 5 
       data hash MD5: 16K
       A3 2E D6 90 AA E1 2B 85 5B 08 00 1D 48 08 65 84>)
(   4,<2025-11-18 17:04:30.31 +0400>,<servis>,<DPX200>,
      <pk PHC0 = 3.8 PHC1 = 0 
       data hash MD5: 16K
       13 63 BA E4 AA 51 51 33 81 DE B4 9D 8B 0A 81 1D>)
$$ ##END=
$$ 
$$ hash MD5
$$ 93 C0 61 B8 98 16 23 BB E5 CD AF 0B EB 67 35 2D
##$RELAX= 
##$RELAX= 
##$RELAX= 
##$RELAX= 
##$RELAX= 
##$RELAX= 
##$RELAX= 
##$RELAX= 
$$ Bruker specific parameters
$$ --------------------------
##$DU= <F:\spectra>
##$EXPNO= 1
##$NAME= <H1>
##$PROCNO= 1
##$TYPE= <nmr>
##$USER= <av>
##$AMP= (0..31)
100 100 100 100 100 100 100 100 100 100 100 100 100 100 100 100 100 100 
100 100 100 100 100 100 100 100 100 100 100 100 100 100 
##$AQSEQ= 0
##$AQ_mod= 1
##$AUNM= <au_zg>
##$AUTOPOS= <>
##$BF1= 200.13
##$BF2= 200.13
##$BF3= 200.13
##$BF4= 200.13
##$BF5= 500.13
##$BF6= 500.13
##$BF7= 500.13
##$BF8= 500.13
##$BYTORDA= 1
##$CFDGTYP= 0
##$CFRGTYP= 5
##$CHEMSTR= <none>
##$CNST= (0..31)
1 1 145 1 1 1 1 1 1 1 1 1 1 1 1 1 1 1 1 1 1 1 1 1 1 1 1 1 1 1 1 1 
##$CPDPRG= <>
##$CPDPRG1= <>
##$CPDPRG2= <>
##$CPDPRG3= <>
##$CPDPRG4= <mlev>
##$CPDPRG5= <mlev>
##$CPDPRG6= <mlev>
##$CPDPRG7= <mlev>
##$CPDPRG8= <mlev>
##$CPDPRGB= <>
##$CPDPRGT= <>
##$D= (0..31)
0 2 0 0 0 0 0 0 0 0.06 0 0 0 0 0 0 0.0002 0 0 0 0 0 0 0 0 0 0 0 0 0 0 
0 
##$DATE= 1763471013
##$DBL= (0..7)
120 120 120 120 120 120 120 120 
##$DBP= (0..7)
150 150 150 150 150 150 150 150 
##$DBP07= 0
##$DBPNAM0= <>
##$DBPNAM1= <>
##$DBPNAM2= <>
##$DBPNAM3= <>
##$DBPNAM4= <>
##$DBPNAM5= <>
$$ [...]
##$SUBNAM5= <"">
##$SUBNAM6= <"">
##$SUBNAM7= <"">
##$SUBNAM8= <"">
##$SUBNAM9= <"">
##$SW= 20.6817932712277
##$SWIBOX= (0..15)
0 0 3 0 0 0 0 0 0 0 0 0 0 0 0 0 
##$SW_h= 4139.07284768212
##$TD= 32768
##$TD0= 1
##$TE= 0
##$TE2= 300
##$TE3= 300
##$TEG= 300
##$TL= (0..7)
0 120 120 120 120 120 120 120 
##$TP= (0..7)
150 150 150 150 150 150 150 150 
##$TP07= 0
##$TPNAME0= <>
##$TPNAME1= <>
##$TPNAME2= <>
##$TPNAME3= <>
##$TPNAME4= <>
##$TPNAME5= <>
##$TPNAME6= <>
##$TPNAME7= <>
##$TPOAL= (0..7)
0.5 0.5 0.5 0.5 0.5 0.5 0.5 0.5 
##$TPOFFS= (0..7)
0 0 0 0 0 0 0 0 
##$TUNHIN= 0
##$TUNHOUT= 0
##$TUNXOUT= 0
##$USERA1= <user>
##$USERA2= <user>
##$USERA3= <user>
##$USERA4= <user>
##$USERA5= <user>
##$V9= 5
##$VALIST= <valist>
##$VCLIST= <CCCCCCCCCCCCCCC>
##$VD= 0
##$VDLIST= <DDDDDDDDDDDDDDD>
##$VPLIST= <PPPPPPPPPPPPPPP>
##$VTLIST= <TTTTTTTTTTTTTTT>
##$WBST= 1024
##$WBSW= 30
##$XGAIN= (0..3)
0 0 0 0 
##$XL= 0
##$YL= 0
##$YMAX_a= 160272
##$YMIN_a= -77901
##$ZGOPTNS= <>
##$ZL1= 120
##$ZL2= 120
##$ZL3= 120
##$ZL4= 120
##$ABSF1= 16.48848
##$ABSF2= -4.193441
##$ABSG= 5
##$ABSL= 3
##$ALPHA= 0
##$AQORDER= 0
##$ASSFAC= 0
##$ASSFACI= 0
##$ASSFACX= 0
##$ASSWID= 0
##$AUNMP= <proc_1d>
##$AZFE= 0.1
##$AZFW= 0.1
##$BCFW= 0
##$BC_mod= 2
##$BYTORDP= 0
##$COROFFS= 0
##$CY= 18.4799938201904
##$DATMOD= 1
##$DC= 0
##$DFILT= <>
##$DTYPP= 0
##$F1P= 9.9274215381318
##$F2P= -0.165520771350173
##$FCOR= 1
##$FTSIZE= 16384
##$FT_mod= 6
##$GAMMA= 0
##$GB= 0
##$INTBC= 1
##$INTSCL= 4.127829e-11
##$ISEN= 128
##$LB= 0.05
##$LEV0= 0
##$LPBIN= 0
##$MAXI= 10000
##$MC2= 0
##$MEAN= 0
##$ME_mod= 0
##$MI= 50
##$NCOEF= 0
##$NC_proc= -9
##$NLEV= 6
##$NOISF1= 3.799351
##$NOISF2= 2.8
##$NSP= 0
##$NTH_PI= 0
##$NZP= 0
##$OFFSET= 16.48848
##$PC= 4
##$PHC0= -258.762
##$PHC1= 1.301565
##$PH_mod= 1
##$PKNL= yes
##$PPARMOD= 0
##$PSCAL= 4
##$PSIGN= 0
##$REVERSE= no
##$SF= 200.130005582386
##$SI= 16384
##$SIGF1= 3
##$SIGF2= 2
##$SINO= 400
##$SIOLD= 16384
##$SREGLST= <1H.CDCl3>
##$SSB= 0
##$STSI= 16384
##$STSR= 0
##$SW_p= 4139.07284768211
##$SYMM= 0
##$S_DEV= 0
##$TDeff= 32768
##$TDoff= 0
##$TI= <>
##$TILT= no
##$TM1= 0
##$TM2= 0
##$TOPLEV= 0
##$USERP1= <user>
##$USERP2= <user>
##$USERP3= <user>
##$USERP4= <user>
##$USERP5= <user>
##$WDW= 1
##$XDIM= 16384
##$YMAX_p= 307671758
##$YMIN_p= -6403175
$$ End of Bruker specific parameters
$$ ---------------------------------
##NTUPLES= NMR SPECTRUM
##VAR_NAME=  FREQUENCY,     SPECTRUM/REAL,   SPECTRUM/IMAG
##SYMBOL=    X,             R,               I
##VAR_TYPE=  INDEPENDENT,   DEPENDENT,       DEPENDENT
##VAR_FORM=  AFFN,          ASDF,            ASDF
##VAR_DIM=   16384,         16384,           16384
##UNITS=     HZ,            ARBITRARY UNITS, ARBITRARY UNITS
##FACTOR=    0.252644378177508, 1,           1
##FIRST=     3299.83951724647, 0,            0
##LAST=      -839.233330435636, 0,           0
##MIN=       -839.233330435636, -6403175,    0
##MAX=       3299.83951724647, 307671758,    0
$$ Real data points
##PAGE= N=1
##DATA TABLE= (X++(R..R)), XYDATA
$$ [...]
11764b854905k8658m68255Q63485O16562n3405p92052J87782N11131P09031k229912
$$ -2854905 -2883563 -3351818 -2488333 -1871771 -1925176 -2717228 -2529446 -2018315 -1309284 -3539196
11754c539196R78619L24221J653056j142491j015733O49987J153998j985214P12101
$$ -3539196 -2560577 -2236356 -583300 -1725791 -2741524 -2091537 -937539 -2922753 -2210652
11745b210652L594Q05833p33972m89558R72647J565205j634354j350146J344253
$$ -2210652 -2207058 -1401225 -2135197 -2624755 -1652108 -86903 -1721257 -3071403 -1727150
11736a727150P59802j870364J358098j020883M84306n56273M6424k00185J42259
$$ -1727150 -967348 -2837712 -1479614 -2500497 -2016191 -2572464 -2526040 -2726225 -2583966
11727b583966l19879o05449n9457R13355K501194k386064L40240O62324J92461
$$ -2583966 -2903845 -3509294 -3568751 -2655396 -154202 -2540266 -2200026 -1537702 -1345241
11718a345241o24306j3653k54929k042733J184902J368653J670850k094073p24623
$$ -1345241 -1969547 -1983200 -2238129 -4280862 -3095960 -1727307 -56457 -2150530 -2875153
11709b875153J933978j683001J227682L50002M01263j804532O70090n43505N81356
$$ -2875153 -941175 -2624176 -1396494 -1046492 -645229 -2449761 -1779671 -2323176 -1741820
11700a741820m80231j42322R12078j365014J965161k282813J118281M13423p69890
$$ -1741820 -2222051 -2364373 -1452295 -2817309 -852148 -3134961 -2016680 -1603257 -2373147
11691b373147P40567j5091q86134K513608j991713R59325k96444o71848J624422
$$ -2373147 -1632580 -1647671 -2533805 -20197 -2011910 -1052585 -1349029 -2020877 -396455
11682c96455p98111Q5590J60618j855653Q90232m44533n15216N91940K31722L28511
$$ -396455 -1194566 -1108976 -948358 -2804011 -1913779 -2358312 -2873528 -2281588 -2049866 -1721355
11672a721355j334411J702218q04683j464265J527322q32473K139289j386500
$$ -1721355 -3055766 -1353548 -2158231 -3622496 -2095174 -2927647 -788358 -2174858
11664b174858k31707j074982J164908L96136L62185j565271J408261j180628j148785
$$ -2174858 -2406565 -3481547 -2316639 -1920503 -1558318 -3123589 -1715328 -2895956 -4044741
11655d044741J752268k147902K927400j377997J211100J29193j606353J328309
$$ -4044741 -2292473 -4440375 -1512975 -2890972 -1679872 -1550679 -3157032 -1828723
11647a828723k37577J127478j999680N72382o50557K632220j549171K078498l077933
$$ -1828723 -2066300 -938822 -2938502 -2366120 -3016677 -384457 -1933628 144870 -2933063
11638b933063K150531k954841J771070J296795j207539N08550P08700k632526
$$ -2933063 -782532 -3737373 -1966303 -669508 -1877047 -1368497 -659797 -3292323
11630c292323N64845k47045K039601k080987P08060N61329M23926o81928j396696
$$ -3292323 -2727478 -2974523 -934922 -3015909 -2307849 -1746520 -1322594 -2004522 -3401218
11621c401218P51840P63257P28086l22812m88206J220863j570096M01469O81298
$$ -3401218 -2649378 -1886121 -1158035 -1480847 -1969053 -748190 -2318286 -1916817 -1235519
11612a235519j672727J461839l05436P28984j501392P40975k33036J313034j155511
$$ -1235519 -2908246 -1446407 -1751843 -1022859 -2524251 -1783276 -2016312 -703278 -1858789
11603a858789Q0851O05437J54757L4239q49513M7135L25127P68020j934963J685052
$$ -1858789 -1777938 -1172501 -1017744 -983505 -1833018 -1785883 -1460756 -692736 -2627699 -942647
11593i42647j640854J024910q57330K35793P85476o81251P16285J018759k471847
$$ -942647 -2583501 -1558591 -2415921 -2180128 -1394652 -2075903 -1359618 -340859 -2812706
11584b812706p481p93023J899331q96111J170489J78865j428002J224267o27146
$$ -2812706 -2820187 -3613210 -1713879 -2609990 -1439501 -1260636 -2688638 -1464371 -2091517
11575b091517O18786k88665j191394J325115r62112K59240K10762J04568p2314
$$ -2091517 -1472731 -1761396 -2952790 -1627675 -2589787 -2330547 -2119785 -2015217 -2087531
11566b087531p20559L54436l8609j53750J936055j101400O71840p37431J130900
$$ -2087531 -2808090 -2453654 -2492263 -2646013 -709958 -1811358 -1139518 -1876949 -746049
11557g46049l66490q28405O6254L13176j154840K01554P46805K9490j95069L07
$$ -746049 -1112539 -1940944 -1874690 -1561514 -2716354 -2514800 -1767995 -1738505 -1933574 -1933267
11547a933267m86913K97513r34678J788154r34482k42536K610978j956909J11225
$$ -1933267 -2420180 -2122667 -3057345 -1269191 -2203673 -2446209 164769 -1792140 -1680915
11538a680915p36406Q14126r33243J222234k11372J057982j894947J609659m37791
$$ -1680915 -2417321 -1603195 -2536438 -1314204 -1525576 -467594 -2362541 -752882 -1190673
11529a190673k16872O08639k25554j424471K063031L4351r51684l53986K6194
$$ -1190673 -1407545 -798906 -1024460 -2448931 -385900 -351549 -1303233 -1657219 -1631025
11520a631025r26114k99477J94283Q53539R74015j744721K94998O46901o96048
$$ -1631025 -2557139 -2856616 -2662333 -1808794 -834779 -2579500 -2284502 -1637601 -2333649
11511b333649J73624J120103O78806k317757K243147m41619k77714j062227N74497
$$ -2333649 -2160025 -1039922 -361116 -2678873 -435726 -877345 -1155059 -2217286 -1642789
11502a642789J106394k088711K230283o37778j004257J41469j368676J644064
$$ -1642789 -536395 -2625106 -394823 -1032601 -2036858 -1895389 -3264065 -1620001
11494a620001P1328m47196J298001j020083m26325N99829K46183p91985R02524
$$ -1620001 -1548673 -1995869 -697868 -1717951 -2144276 -1544447 -1298264 -2090249 -1187725
11485a187725j494686K173393j878296N45544O20458o23706J34148P80865j169921
$$ -1187725 -2682411 -509018 -2387314 -1841770 -1221312 -1845018 -1710870 -930005 -2099926
11476b099926Q81615k42991L37241o51410j02158J59344p15523N66606J017232
$$ -2099926 -1218311 -1461302 -1124061 -1775471 -1877629 -1718285 -2433808 -1867202 -849970
11467h49970j075113M43131J89986m70438L1737N81849j1524j426075N52486M71401
$$ -849970 -1925083 -1481952 -1291966 -1762404 -1730667 -1148818 -1160342 -2586417 -2033931 -1562530
11457a562530Q84559j441680j4519l63024l83755P28172Q9092J12875j126430
$$ -1562530 -677971 -2119651 -2134170 -2497194 -2880949 -2152777 -2063685 -1950810 -3077240
11448c077240J917004N04626l81375j369957R29448Q83553j732497K241990l119229
$$ -3077240 -1160236 -655610 -1036985 -2406942 -1477494 -593941 -2326438 -84448 -3203677
11439c203677Q46946q88658K163183j722315J326176j77733L35964n24134j434261
$$ -3203677 -2356731 -3245389 -1082206 -2804521 -1478345 -1656078 -1320114 -1844248 -3278509
11430c278509J437555p36968L52520Q2984O63911o89849M61263N0801J44300P14072
$$ -3278509 -1840954 -2577922 -2225402 -2142418 -1478507 -2168356 -1707093 -1656292 -1511992 -797920
11420g97920j112129L97616M58151p15390R54325L47362j007582M76075l13184
$$ -797920 -1910049 -1512433 -1054282 -1769672 -815347 -467985 -1475567 -999492 -1312676
11411a312676l2297l39397M30787P64749j857975O51137m4598K43868n1104j11708
$$ -1312676 -1344973 -1684370 -1253583 -488834 -2346809 -1695672 -1740270 -1496402 -1547506 -1659214
11401a659214O62233j076344J133442k36223r91249n52236N68028l62892O73008
$$ -1659214 -996981 -2073325 -939883 -1176106 -2167355 -2719591 -2151563 -2514455 -1841447
11392a841447L2956j011231Q91130J666300j843123M2068J018419l44071m23241
$$ -1841447 -1808491 -2819722 -1928592 -262292 -2105415 -2063347 -1044928 -1388999 -1812240
11383a812240M28610j125975n62500K200494j572827J474592k17641j01146j385879
$$ -1812240 -1383630 -2509605 -3072105 -871611 -2444438 -969846 -1187487 -1288633 -2674512
11374b674512J443573M64805j323372J388685L26264j402814Q208l36877J195220
$$ -2674512 -1230939 -766134 -2089506 -700821 -374557 -1777371 -1769163 -2106040 -910820
11365i10820J68717j149572M05268J029552k702296J761100l69233J055013j042907
$$ -910820 -742103 -1891675 -1486407 -456855 -3159151 -1398051 -1767284 -712271 -1755178
11356a755178O69311j038108K71286J046589j114043o37668n54074K04020O89730
$$ -1755178 -1085867 -2123975 -1852689 -806100 -1920143 -2557811 -3111885 -2907865 -2218135
11347b218135J196981k098810K108815J67842p26644R6724P38988p88822j546053
$$ -2218135 -1021154 -3119964 -1011149 -843307 -1569951 -1473227 -734239 -1523061 -3069114
11338c069114M56994L79843M87326k94419k2021k77146J182767j09513k23698
$$ -3069114 -2612120 -2232277 -1744951 -2039370 -2061391 -2338537 -1155770 -1265283 -1488981
11329a488981J606019j521441K57657l76346N16543p87797Q5932J202369j176161
$$ -1488981 117038 -1404403 -1146746 -1523092 -1006549 -1794346 -1708414 -506045 -1682206
11320a682206r70385L07118J069610N13472N55524j699222L9534O70957j052793
$$ -1682206 -2652591 -2345473 -1275863 -762391 -206867 -1906089 -1866555 -1195598 -2248391
11311b248391M27647Q20532k6901o67261J178154j550778R35685r78238J666591
$$ -2248391 -1820744 -1000212 -1027113 -1694374 -516220 -2066998 -1131313 -2109551 -442960
11302d42960j543321R80183k17746L02018q78479O06254j357492J139901M6495
$$ -442960 -1986281 -1006098 -1223844 -921826 -1800305 -1194051 -2551543 -1411642 -1365147
11293a365147k85551M86609J76624K14835j58225P77797q98917m82725q10943
$$ -1365147 -1650698 -1164089 -987465 -772630 -930855 -153058 -1051975 -1534700 -2345643
11284b345643K307234k42479j568887M23525p17110J207329j277575P16911r30711
$$ -2345643 -38409 -280888 -1849775 -1426250 -2143360 -936031 -2213606 -1496695 -2427406
11275b427406J397799o87498J966828j641100j015996J890771K74916q29823l85207
$$ -2427406 -1029607 -1717105 249723 -1391377 -2407373 -516602 -241686 -1071509 -1456716
11266a456716O10782L09442l8089o12474N17691j435982J091719M1528n31777
$$ -1456716 -845934 -536492 -574581 -1187055 -669364 -2105346 -1013627 -972099 -1503876
11257a503876J10645O40756J92711o31009J4706O97544j227219J362775j337182
$$ -1503876 -1393231 -752475 -559764 -1190773 -1176067 -478523 -1705742 -342967 -1680149
11248a680149L57315R96551p29746r50308J072119M41026j675921N16484M03616
$$ -1680149 -1322834 -326283 -1056029 -2006337 -934218 -493192 -2169113 -1652629 -1249013
11239a249013m77089J062477m4074j432379l50931J161390k582649J809596k16292
$$ -1249013 -1726102 -663625 -707699 -2140078 -2491009 -1329619 -3912268 -2102672 -2318964
11230b318964J035916J382908l94428k787930J451447O20414J070834r42596p98266
$$ -2318964 -1283048 99860 -294568 -3082498 -1631051 -1010637 60197 -882399 -1680665
11221a680665J57549m26897R68563l63029J223949k09949p84410j85433K41081
$$ -1680665 -1523116 -1950013 -981450 -1344479 -120530 -330479 -1114889 -1300322 -1059241
11212a059241Q03848j515926N94781p78293O04610N17340n0479q19359M97369
$$ -1059241 -255393 -1771319 -1176538 -1954831 -1350221 -832881 -883360 -1702719 -1205350
11203a205350o24599P41123m33570O35457l32424k08747P70186j397880j72310
$$ -1205350 -1829949 -1088826 -1522396 -886939 -1219363 -1428110 -657924 -2055804 -2228114
11194b228114O58566k33546L80231M71685o93869J195942j807928L78253J721057
$$ -2228114 -1569548 -1803094 -1422863 -951178 -1645047 -449105 -2257033 -1878780 -157723
11185a57723p96408p55995J346015j210522m554m46027K338154j087778j600370
$$ -157723 -954131 -1710126 -364111 -1574633 -1579187 -2025214 312940 -774838 -2375208
11176b375208J092798N44646o11488r6436m34903P79912k21041J567266j195771
$$ -2375208 -1282410 -737764 -1349252 -1445688 -1880591 -1100679 -1321720 245546 -950225
11167i50225r23950J792257j665819j02044J189736n06409k02316J181890k3533
$$ -950225 -1874175 -81918 -1747737 -1849781 -660045 -1166454 -1368770 -186880 -210413
11158b10413j052725J236645p19001j189880M01966J278176p31867M19235J014221
$$ -210413 -1263138 -26493 -745494 -1935374 -1533408 -255232 -987099 -567864 446357
11149D46357j438862j67583q05293N99591l58896J08582R98275L29858K56216
$$ 446357 -992505 -1160088 -1965381 -1365790 -1724686 -1616104 -617829 -287971 -31755
11140c1755j527656R63992K14084o1383j95447j99985j217595L50877K62583L85662
$$ -31755 -1559411 -595419 -381335 -442718 -638165 -838150 -2055745 -1704868 -1442285 -1056623
11130a056623l11052J221102k191963K657005j221288q67521k92459K106520l27863
$$ -1056623 -1367675 -146573 -2338536 318469 -902819 -1770340 -2062799 43721 -284142
11121b84142m74039j228716J700627j133063K059819J52009k092418P57103r55007
$$ -284142 -758181 -1986897 -286270 -1419333 640486 792495 -1299923 -542820 -1497827
11112a497827L27419K95259j77897K96207k18708j041361K187625j79885m78599
$$ -1497827 -1170408 -875149 -1053046 -756839 -975547 -2016908 170717 -9168 -487767
11103d87767P93992j968834O63690J552784j534089J444534j513657l66389Q29607
$$ -487767 306225 -1662609 -998919 553865 -980224 464310 -1049347 -1415736 -586129
11094e86129j242841l15761Q90268l04367P64705q56327K28691J030585L44960
$$ -586129 -1828970 -2144731 -1254463 -1558830 -794125 -1650452 -1421761 -391176 -46216
11085d6216m40743j431436J652851Q51652j248840P29439j106870L24393K69514
$$ -46216 -486959 -1918395 -265544 586108 -662732 66707 -1040163 -715770 -446256
11076d46256j768769O15074Q25825k53938r0800P31771N17947j326221J385733
$$ -446256 -2215025 -1599951 -774126 -1028064 -1118864 -387093 130854 -1195367 190366
11067A90366j025132j573689J421965r05171J755786l30943j02497Q98097j094861
$$ 190366 -834766 -2408455 -986490 -1891661 -135875 -466818 -569315 328782 -766079
11058g66079j93905J84066p15591O66068m24879K08607J904321p40937q73280
$$ -766079 -959984 -775918 -1491509 -825441 -1250320 -1041713 862608 121671 -751609
11049g51609K33695J329970j546053n57935l16924O09970M77256O61751j299200
$$ -751609 -517914 812056 -733997 -1291932 -1608856 -998886 -521630 140121 -1159079
11040a159079L54507r15731M31330P3620j113553J276691N58995m61741p44619
$$ -1159079 -804572 -1720303 -1288973 -1215353 -2328906 -1052215 -493220 -954961 -1699580
11031a699580L16954l06949P04937L46749J226786o95429n01892L361J616898
$$ -1699580 -1382626 -1689575 -984638 -637889 588897 -106532 -608424 -605063 1011835
11022A011835j852554p1469J252566q65548j62838m59472O2476J416015K03858
$$ 1011835 -840719 -912188 340378 -525170 -688008 -1147480 -1085004 331011 534869
11013E34869j168182j386427r79652J551848J246994r28093J558542j394493l86889
$$ 534869 -633313 -2019740 -2999392 -1447544 -200550 -1128643 429899 -964594 -1351483
11004a351483J016173M35406j031260q00504R39280P91539j786436J392765R89407
$$ -1351483 -335310 100096 -931164 -1731668 -792388 -849 -1787285 -394520 594887
10995E94887j279574j046496k64437K048614n93012P04775o57281O80746l40596
$$ 594887 -684687 -1731183 -1995620 52994 -540018 164757 -492524 188222 -152374
10986a52374q46606K543j317061J197569N15839N00522l0732p66844J070820r38801
$$ -152374 -998980 -996437 -2313498 -1115929 -600090 -99568 -130300 -897144 173676 -765125
10976g65125O33882P251J9064k396299J646716P55824J84809j89383q65421K40075
$$ -765125 -131243 -123992 -104928 -2501227 -854511 -98687 86122 -103261 -968682 -728607
10966g28607J963279j996095k19602N02116M09960k101543K432168m86787j724099
$$ -728607 1234672 -761423 -981025 -478909 -68949 -2170492 261676 -225111 -1949210
10957a949210J189341o57058n06278O39694J936164r42289n42418l08334q18624
$$ -1949210 -759869 -1416927 -1923205 -1283511 652653 -289636 -832054 -1140388 -1959012
10948a959012K265365l23634j975675J545806m31002Q02723k45805K04913j91465
$$ -1959012 306353 -17281 -1992956 -447150 -878152 -75429 -321234 -116321 -307786
10939c07786O97151j367376L28939l55221K73098q07933J765077O7483j177650
$$ -307786 389365 -978011 -649072 -1004293 -731195 -1539128 225949 293432 -884218
10930h84218M55902r51019n35019J857060k39848o94082J18643k08415M34799
$$ -884218 -428316 -1379335 -1914354 -57294 -297142 -991224 -872581 -1080996 -646197
10921f46197K47685r82524J493144j44219k68779j006781j280843J99408J437640
$$ -646197 -398512 -1381036 112108 -32111 -300890 -1307671 -2588514 -2389106 -951466
10912i51466l00291K008788j650940l87815L69967L90101j56798L99923n05226
$$ -951466 -1251757 757031 -893909 -1281724 -911757 -521656 -678454 -278531 -783757
10903g83757j110627J127539J76201j169389J755646J06895l78891p11324N40628
$$ -783757 -1894384 -766845 -590644 -1760033 -4387 102508 -276383 -987707 -447079
10894d47079J342940k06914j019966J58392L13778r59053K52668N50676r64137
$$ -447079 895861 688947 -331019 -172627 141151 -817902 -565234 -14558 -978695
10885i78695k24900m17356O70140K096394j855584K08306o52118J536685o87017
$$ -978695 -1203595 -1620951 -950811 1145583 -710001 -501695 -1153813 382872 -304145
10876c04145r67622J830373r52462R37765o32916j067435N0555J500268j521191
$$ -304145 -1271767 558606 -393856 543909 -89007 -1156442 -1105887 394381 -1126810
10867a126810J57443O08234n56831O23210R03683k038680j88561K354147j526232
$$ -1126810 -969367 -361133 -917964 -294754 608929 -1429751 -1618312 735835 -790397
10858g90397R21275m31246j81796N60646K50593j488933J401033l3353q94776
$$ -790397 130878 -300368 -482164 78482 329075 -1159858 241175 207822 -686954
10849f86954O32689l85719Q80798J39275m90836l17642j015661R92042J519779
$$ -686954 -54265 -439984 440814 580089 89253 -228389 -1244050 -252008 1267771
10840A267771j809538O06439p77560J73805K27875m94656J539757l46376j174727
$$ 1267771 -541767 64672 -712888 -539083 -311208 -805864 733893 387517 -787210
10831g87210O60757J102565p42551j348633r76151J766649P5541M769o02954J783611
$$ -787210 -126453 976112 233561 -1115072 -2091223 -324574 -249033 -244264 -847218 936393
10821I36393o75213l07007m61626r78323J045509R4358O51056j306613J577962
$$ 936393 261180 -45827 -507453 -1485776 -440267 -345909 305147 -1001466 576496
10812E76496p0321L78895j682007O81612J85303q4841r445R79145j615524n97538
$$ 576496 506175 885070 -796937 -115325 69978 -14863 -24308 954837 -660687 -1258225
10802a258225J896751j179156O06912j589142K917118p85542N85109j345641L27703
$$ -1258225 638526 -540630 66282 -1522860 1394258 608716 1193825 -151816 175887
10793A75887K8474k81871j76530j863277K630005L55636l26635m14626r87730
$$ 175887 204361 -77510 -254040 -2117317 512688 868324 541689 127063 -860667
10784h60667J330149r05582j23230k24184R62754L6199k498p38357O51218m44700
$$ -860667 469482 -436100 -559330 -783514 179240 215439 212941 -525416 125802 -318898
10774c18898J3801R41777m69650j036944K416195j481773j272008O6264l34832
$$ -318898 -305097 636680 167030 -869914 1546281 64508 -1207500 -1141236 -1476068
10765a476068M6784J390076m38301J423968k331997J382248P03009r67472R97936
$$ -1476068 -1429284 -39208 -477509 946459 -1385538 -3290 699719 -267753 730183
10756G30183j576007l36069K0939J276547O16778j098016L03092N55774N34995
$$ 730183 -845824 -1181893 -1160954 115593 732371 -365645 -62553 493221 1028216
10747A028216j865302J012982L22433J92448j461271N69677N23187n31004J176295
$$ 1028216 -837086 175896 498329 690777 -770494 -200817 322370 -208634 967661
10738I67661j438450J411817K77462j607622R41795k164678K184687J35796j014808
$$ 967661 -470789 941028 1218490 -389132 552663 -1612015 572672 708468 -306340
10729c06340R84348j115957O67698j39358P34711p67427j302495R66287M97933
$$ -306340 678008 -437949 229749 90391 825102 57675 -1244820 -278533 219400
10720B19400J249269k010731k69946q8966J091306q50960J471492j124657K180109
$$ 219400 1468669 -542062 -812008 -900974 190332 -660628 810864 -313793 1866316
10711A866316n28077n90707j383399P48133K37993L60614j169032K17264j506853
$$ 1866316 1338239 747532 -635867 112266 350259 710873 -458159 -240895 -1747748
10702a747748m8429K210769J43738q40209O30198l07167r22857P07338J462925
$$ -1747748 -1796177 414592 558330 -281879 348319 41152 -881705 -174367 1288558
10693A288558m79353o70741q86001l68446P31559K15647N7674j078939J101660
$$ 1288558 809205 138464 -747537 -1115983 -384424 -168777 -111103 -1190042 -88382
10684h8382j06164J511366j104411l65584J023620l342824L340486q99884j061437
$$ -88382 -194546 1316820 212409 -153175 870445 -2472379 868107 -31777 -1093214
10675a093214O31155R50154J067308j442592r45245M69627l5076N21036q85942
$$ -1093214 -462059 488095 1555403 112811 -832434 -362807 -397883 123153 -762789
10666g62789k38395J591596j172544M87422J094478j175390R92818j012302N14903
$$ -762789 -1001184 590412 -582132 -94710 999768 -175622 817196 -195106 319797
10657C19797p73679R36580R91026j939216O37535O64612j29680j176495k96557
$$ 319797 -453882 482698 1473724 -465492 172043 836655 706975 -469520 -766077
10648g66077K20790J933133j158563j208223P22965q06759K157572r72982r69531
$$ -766077 -545287 1387846 229283 -978940 -255975 -1062734 1094838 121856 -847675
10639h47675o58844J794362L41438p68942J359100j01330j747096P74388j006099
$$ -847675 -1506519 287843 629281 -139661 1219439 1118109 -628987 145401 -860698
10630h60698K086063j977909L45120j365173K088587q73664j27691p7127K305048
$$ -860698 1225365 -752544 -407424 -1772597 315990 -557674 -685365 -762492 1542556
10621A542556k636939K099384p92697j79845o38500Q66897L47475n29784r4418
$$ 1542556 -1094383 1005001 212304 32459 -606041 260856 608331 78547 -15871
10612a5871p68295J477907m35334o35819O39136m04008J487124j480265O88124
$$ -15871 -784166 693741 258407 -377412 261724 -142284 1344840 -135425 552699
10603E52699K48310k86103J913422k056175j46473M3173M26718j777726J086157
$$ 552699 801009 514906 2428328 372153 225680 268853 695571 -1082155 4002
10594D002M85986j35101P73827k596891K955459j715978O6590R68451k85314j098729
$$ 4002 489988 354887 1128714 -1468177 1487282 -228696 -162106 806345 521031 -577698
10584e77698Q66578m88429N95371m78165N44679n42937J360758n97122r94843
$$ -577698 288880 -199549 395822 -82343 462336 -80601 1280157 683035 -311808
10575c11808N56793O42798n11645j016341K027448k183060Q04294M93794k10118
$$ -311808 244985 887783 376138 -640203 1387245 -795815 8479 502273 292155
10566B92155P26291j634191J386823K43184k269779J963247j006756J064279m5182
$$ 292155 1018446 -615745 771078 1014262 -1255517 707730 -299026 765253 720071
10557G20071J313298j042982j488513p67287J675539J33318O92986k050376J60115
$$ 720071 2033369 990387 -498126 -1265413 410126 543444 1236430 -813946 -653831
10548f53831L98912J67306J8133L39196J459511j938339N87884J063902r20839
$$ -653831 -254919 -87613 -69480 269716 1729227 -209112 378772 1442674 521835
10539E21835J494403k449524n94286K604507q74235m8742l37155J69670k360129
$$ 521835 2016238 -433286 -1027572 1576935 702700 653958 316803 486473 -1873656
10530a873656J459638J75036P26724P01709j160549L46703J4453j157588J565130
$$ -1873656 -414018 -238982 487742 1189451 28902 375605 390058 -767530 797600
10521G97600r39956q38689J608424k68015m27194j80078Q61077J06591k157308
$$ 797600 -142356 -981045 627379 359364 -67830 -247908 613169 719760 -1437548
10512a437548J234725M84283l10607j314632J270376r80423J279489O0416q60708
$$ -1437548 -202823 281460 -29147 -1343779 -73403 -1053826 225663 286079 -574629
10503e74629N3202m3571O42353r02775J667497Q74482j312645q65333n39007J617119
$$ -574629 -521427 -564998 77355 -825420 842077 1716559 403914 -461419 -1000426 616693
10493F16693l80573k19547J008873j750309m95659J033238J098541j668466N20346
$$ 616693 236120 16573 1025446 -724863 -1220522 -187284 911257 -757209 -236863
10484b36863j16359k54317J370756j201215k33085J342780l42430J872936j431655
$$ -236863 -353222 -607539 763217 -437998 -671083 671697 329267 2202203 770548
10475G70548K40808J33796j686478R15269K051068l565444J395503m81169K02402
$$ 770548 1011356 1145152 -541326 373943 2425011 -1140433 255070 -226099 -23697
10466b3697M90190N91032p09204K98617j272468Q32044J243967j434273M90257
$$ -23697 466493 1057525 348321 646938 -625530 206514 1450481 16208 506465
10457E06465n41395J258187j482342J218942K23568l73248p85595m3134P68655
$$ 506465 -34930 1223257 -259085 959857 1183425 810177 24582 -18552 750103
10448G50103j791268K198590n58362L11416q67878J008415k604030P33470J427792
$$ 750103 -1041165 1157425 599063 910479 42601 1051016 -1553014 -819544 608248
10439F08248J21222R44987j812184Q91602K053761j967946j220282R72972J29820
$$ 608248 729470 1674457 -137727 753875 2807636 839690 -380592 592380 722200
10430G22200l88403N24636m12627j286893Q38918P18944R13981k194853M44945
$$ 722200 333797 858433 445806 -841087 -2169 716775 1630756 -564097 -119152
10421a19152Q17108j324563O93408p6287n5113p90839L94403R12798k90016N20064
$$ -119152 697956 -626607 66801 -9486 -64599 -855438 -461035 451763 161747 681811
10411F81811k116057M93131J395430j04550q73041O7196J48152J131233m33165
$$ 681811 -1434246 -941115 454315 349765 -523276 -456080 -307928 823305 390140
10402C90140O03064r57746o85033K20360J285135k61912P49546j025469P26184
$$ 390140 993204 35458 -649575 -429215 855920 594008 1343554 318085 1044269
10393A044269q34422k91055O03234j335375L83991l47976J453495J53250j576437
$$ 1044269 209847 -81208 522026 -813349 -429358 -777334 676161 829411 -747026
10384g47026J244241Q0035n28010N88515n97415L32466J630822l040927M7037
$$ -747026 497215 577250 49240 637755 40340 372806 2003628 -1037299 -990262
10375i90262O71949L90971j364502J636872j53486r82071K349487q58455K18550
$$ -990262 -318313 72658 -1291844 345028 191542 -790529 1558958 700503 919053
10366I19053J52503j67324j255158J896629j263857k70230j25974J418369r94982
$$ 919053 1071556 904232 -350926 1545703 281846 11616 -114358 1304011 309029
10357C09029P40315k1691k488526K515036j062730Q04803j482814L82974K113416
$$ 309029 1049344 1027653 -1460873 1054163 -8567 796236 -686578 -303604 1809812
10348A809812k771724K89296J373654k15909m93386J46632k55025J427441k923990
$$ 1809812 -961912 -672616 701038 485129 -8257 138375 -116650 1310791 -1613199
10339a613199M88831Q40785m9672J451329j01371K48576p91278k077054J166069
$$ -1613199 -1124368 -283583 -333255 1118074 1016703 1265279 474001 -1603053 -436984
10330d36984R58531J014229k82006l62383M6754r38210K00389J222397r30693
$$ -436984 521547 1535776 1253770 891387 938141 -69 200320 1422717 492024
10321D92024K22683K36331o73326l43322K474197k397819J72072n69539K42149
$$ 492024 714707 951038 277712 -65610 2408587 10768 182840 -386699 -144550
10312a44550j21184O85741L52823r34707L34012n54786J04505O26898p7365r3773
$$ -144550 -265734 420007 772830 -161877 172135 -382651 -278146 348752 271387 177614
10302A77614J217559m31377r7186j976653J285870q614j073400Q11457J434802
$$ 177614 1395173 963796 866610 -1110043 175827 167213 -906187 -94730 1340072
10293A340072q39683j230243J324586J72566J24986j633086J042430p16627M05118
$$ 1340072 500389 -729854 594732 767298 892284 -740802 301628 -414999 -9881
10284i881N85191q3562j882660J524013J323328n70270k20460l67769r3359R45391
$$ -9881 575310 491748 -1390912 133101 1456429 886159 665699 297930 204571 1149962
10274A149962p0445j427233J111189K41676j813668l9050J56911J671696j261433
$$ 1149962 1079517 -347716 763473 1005149 -808519 -847569 -690658 981038 -280395
10265b80395N71120M10963j482279K175182k92821k01346m5197r47650n18414
$$ -280395 290725 701688 -780591 1394591 1101770 900424 855227 -92423 -610837
10256f10837O86988J669362j222421J184389n77255j392367P58941J39914L08677
$$ -610837 76151 1745513 523092 1707481 1130226 -262141 496800 636714 945391
10247I45391j487254P87263n79339P51697L24000K06147k183525L596299k050159
$$ 945391 -541863 245400 -333939 417758 741758 947905 -1235620 2360679 310520
10238C10520K46339j754718R75220n8050K191516k01397j804990Q79939K01427
$$ 310520 556859 -1197859 -222639 -280689 1910827 1709430 -95560 784379 985806
10229I85806J038694k199940M29670L74624j464911l2300R19392k3675Q12247
$$ 985806 2024500 -175440 254230 628854 -836057 -868357 51035 27360 839607
10220H39607m71906M99731M1718M59537j057162l26084J478641j97386k41336
$$ 839607 367701 867432 909150 1368687 311525 -14559 1464082 1266696 1025360
10211A025360M0415p24122Q8866N14975o48291J65769Q15458j146590k01836J421189
$$ 1025360 1065775 341653 430519 945494 297203 462972 1278430 131840 -69996 1351193
10201A351193k03487j843137J781962j018860O70951j73112j145291J056901l99769
$$ 1351193 1147706 -695431 1086531 67671 738622 565510 -579781 477120 77351
10192G7351j455729J231169J518141m58370j656224k86951N32504Q49683m00047
$$ 77351 -1378378 -147209 1370932 912562 -743662 -1030613 -498109 351574 -48473
10183d8473M42294k75012J632967j804896l43854P13372m79274R84805j237838
$$ -48473 393821 118809 1751776 -53120 -396974 316398 -162876 821929 -415909
10174d15909J167239p655j76083q61255J260180n16580j116542J055528R89274
$$ -415909 751330 743675 567592 -293663 966517 449937 -666605 388923 1378197
10165A378197j32633n1025j100888J663990j675994J12439k46255L62131J170095
$$ 1378197 1245564 1194539 93651 1757641 81647 194086 -52169 309962 1480057
10156A480057q36603j8474M1005j895711K121487L44765p99256j517148J328924
$$ 1480057 643454 624980 665985 -1229726 891761 1236526 437270 -1079878 249046
10147B49046p4774Q24474j691335J701263j31279r31893Q5593R30368r85602q089
$$ 249046 174272 998746 -692589 1008674 877395 -54498 31095 961463 -24139 -32228
10137c2228O56566m3499q62934N87047P49797j948804P72041K06924L1951R92449
$$ -32228 624338 580839 -282095 304952 1054749 -894055 -122014 84910 116861 1109310
10127A109310j687255L117211l633656m3347K227514m27945K99598N2647o86074
$$ 1109310 -577945 2539266 -1094390 -1137737 1089777 661832 961430 1014077 328003
10118C28003o9194j460430K406241M51326j450996K98153j476320J800807K85496
$$ 328003 258809 -1201621 1204620 1655946 204950 503103 -973217 827590 1113086
10109A113086n42152n07062J72283L84341j827554J03769Q05657N13446j799560
$$ 1113086 570934 63872 236155 620496 -1207058 -1103289 -297632 215814 -1583746
10100a583746K332194k02674J137537n00359r29616j075865K423785j159001j302436
$$ -1583746 748448 545774 1683311 1182952 253336 -822529 1601256 442255 -860181
10091h60181M97983R80820l87599N75229N05044K97070j314862J768682j750847
$$ -860181 -362198 618622 231023 806252 1311296 1608366 293504 2062186 311339
10082C11339l9835m93199J406580p08573p34363J149208L89505O39886r51767
$$ 311339 271504 -221695 1184885 476312 -258051 891157 1280662 1920548 968781
10073I68781p99310J571015j856967P8421l74790J894751j237505o77353j07223
$$ 968781 169471 1740486 -116481 -38060 -412850 1481901 244396 -432957 -540180
10064e40180N52980l01228R54271o34935J091786r91561J789597k162851J346607
$$ -540180 12800 -288428 665843 30908 1122694 131133 1920730 -242121 1104486
10055A104486o63798k66856p80320N13838j28779J849256m47495J21613q59526
$$ 1104486 440688 173832 -606488 -92650 -221429 1627827 1180332 1301945 442419
10046D42419p97580P02673J13356j5711m37882J800830J67477j789745m81339
$$ 442419 -355161 347512 460868 445157 7275 1808105 1975582 185837 -295502
10037b95502J78603o22161M73741O00537J880850j038607n53187K83013L79662
$$ -295502 -116899 -739060 -265319 335218 2216068 1177461 624274 907287 1286949
10028A286949j455241P39079l23019q36352J330320m01390p76048j28426P40619
$$ 1286949 -168292 570787 247768 -588584 741736 340346 -435702 -564128 176491
10019A76491N39989p1284j230009O49460N32908O39055r81478J067524j572934
$$ 176491 716480 645196 -584813 64647 597555 1236610 255132 1322656 -250278
10010b50278n63457J842508q92176N58226K66829k79889K4765o98575O61936J35984
$$ -250278 -813735 1028773 136597 694823 961652 681763 706528 7953 669889 805873
10000H05873j698561J014221l74004n01196l89926K646138l70926j565144J012789
$$ 805873 -892688 121533 -252471 -753667 -1143593 1502545 1131619 -433525 579264
9991E79264M46079j188267J458427q88240j048013N71403M61544j328219J101875
$$ 579264 1025343 -162924 1295503 407263 -640750 -69347 392197 -936022 165853
9982A65853j33706K093883j186016j409273m53038J839564R293m10436j22900
$$ 165853 32147 2126030 940014 -469259 -922297 917267 926560 516124 393224
9973C93224j835635K339906j45001q46097O99106q54468O09091q73997J423686
$$ 393224 -1442411 897495 752494 -93603 605503 -248965 360126 -513871 909815
9964I09815K70342k036922Q25463n14129J69647J259709o87996q29468L1540J179545
$$ 909815 1180157 -856765 -31302 -545431 -375784 883925 195929 -633539 -601999 577546
9954E77546J186576k449158Q34743R80195n84152J191399j714314L16936k26940
$$ 577546 1764122 -685036 149707 1129902 545750 1737149 22835 339771 112831
9945A12831M80717j480958J324152R78860l600384P24697L512532p06978q31563
$$ 112831 593548 -887410 436742 1415602 -2184782 -1460085 2052447 1345469 513906
9936E13906j005031J92086R07317j119969J351879j813626J554540j095653O76767
$$ 513906 -491125 -299039 608278 -511691 840188 -973438 581102 -514551 162216
9927A62216O17498q43498J577435j778172P06011j00984N10198l41113M9716P53508
$$ 162216 779714 -63784 1513651 -264521 441490 340506 850704 509591 559307 1312815
9917A312815j725222Q93925L1200Q08793J42420k239912J340770N46842k209922
$$ 1312815 -412407 481518 512718 1321511 1463931 -775981 564789 1111631 -1098291
9908a098291R58247P95801L3057j086329M03047m87821N66607K20826n38628J47362
$$ -1098291 -140044 655757 688814 -397515 5532 -482289 84318 305144 -233484 -86122
9898h6122J421906l02807j540544K344592r78775N38324l06715k060830j24561
$$ -86122 1335784 1032977 -507567 1837025 858250 1396574 1089859 -970971 -1095532
9889a095532J223238j504745K176183r27278l14798M00924J200152m2793j140912
$$ -1095532 127706 -1377039 799144 -128134 -442932 -42008 1158144 1115351 -25561
9880b5561Q48800r07857O86014j42996J556775j938538O50229J02376l27613J69699
$$ -25561 823239 -84618 601396 458400 2015175 76637 726866 829242 501629 671328
9870F71328k135473K562463P75700k253355J918600l077725K158057r82588J770685
$$ 671328 -1464145 1098318 1874018 -379337 1539263 -1538462 619595 -362993 1407692
9861A407692J72909m69153l12487j67483L73434j825876J709956k208350J109392
$$ 1407692 1580601 1111448 798961 631478 1004912 -820964 888992 -1319358 -209966
9852b09966J431197j84086j865521j952k45337J543175M28426n82316Q9526p07108
$$ -209966 1221231 1037145 -828376 -830328 -1075665 467510 895936 313620 403146 -303962
9842c03962R70364N78099j137947j90364R56769j713405J049850q98711J230534
$$ -303962 666402 1244501 106554 -83810 872959 -840446 209404 -689307 541227
9833E41227r17989N08913o41831m1150P12355L10596P0827p41415k14799J92324
$$ 541227 -376762 132151 -509680 -550830 161525 472121 542948 -198467 -413266 -220942
9823b20942J041754J32869n4421o24718o06204M65910N51691j081800J286169
$$ -220942 820812 953681 899260 274542 -331662 134248 685939 -395861 890308
9814H90308j483327J597272o33756o5656K160386j548079k83454O51674j099356
$$ 890308 -593019 1004253 370497 304841 2465227 917148 633694 1285368 186012
9805A86012k27249J15769J441757m02344k044237L67344N36940O02303j233215
$$ 186012 -41237 74532 1516289 1113945 -930292 -562948 -26008 576295 -656920
9796f56920J836811n39502m31069J016551j298013K23039j340645K217461j51524
$$ -656920 1179891 640389 209320 1225871 -72142 150897 -1189748 1027713 876189
9787H76189j18893o65877M42658J17857j129165o6071J36466K63483K076465l51431
$$ 876189 757296 91419 534077 651934 -477231 -543302 -406836 -143353 1933112 1581681
9777A581681k754362J919650N65177j115313k483983J782048P17456k36458j22200
$$ 1581681 -1172681 746969 1312146 196833 -2287150 -505102 212354 -24104 -146304
9768a46304n31149J300483k139767O0676J692372p00471J64707m0874M29046O96400
$$ -146304 -677453 623030 -1516737 -1456061 236311 -464160 -299453 -340327 88719 785119
9758G85119K56228q59274o20161Q47331j269754N34981M48698n51466P79744m94862
$$ 785119 1041347 182073 -438088 409243 -860511 -325530 123168 -428298 351446 -143416
9748a43416L95437j279734J687081q25272N77188n90115j048703K145126O52135
$$ -143416 252021 -1027713 659368 -165904 411284 -178831 -1227534 917592 1569727
9739A569727j196440J929779l929703K122962K07466L04102j347819J347172N65851
$$ 1569727 373287 2303066 -1626637 496325 703791 1007893 -339926 1007246 1573097
9730A573097j822099J347987q81270j92844J048455j644677J494057j757564M58277
$$ 1573097 -249002 1098985 217715 24871 1073326 -571351 922706 -834858 -376581
9721c76581O62163Q91614j769681J313063j283255J101842n47022l82472N05324
$$ -376581 285582 1177196 -592485 720578 -562677 539165 -7857 -390329 114995
9712A14995Q60716j304749K55590K452574j910928J198884k370409J749066j583111
$$ 114995 975711 -329038 -73448 2379126 468198 1667082 -703327 1045739 -537372
9703e37372O57772r9303j371085K041057m05895N36507q75988R43582j015159
$$ -537372 120400 21097 -1349988 691069 285174 821681 -54307 889275 -125884
9694a25884Q86640q28251J747656j376523j106486O08728N04575R6888J14509
$$ -125884 760756 -67495 1680161 303638 -802848 -194120 310455 407343 521852
9685E21852k91188K10875J303591j725935L0443O97342k99810k78515k25572K599600
$$ 521852 230664 441539 1745130 19195 49638 746980 447170 168655 -56917 2542683
9675B542683l045817J121001J766593l102384M99708L61311J125397j427204R01150
$$ 2542683 -503134 617867 2384460 -717924 -218216 143095 1268492 -158712 742438
9666G42438m51068k54332O13284l87526n39206n20811L020689k052959q70458
$$ 742438 291370 37038 650322 262796 -276410 -797221 2223468 170509 -699949
9657f99949P65169P52085j505614J56014J78954P95015N04834r20482K02J524251
$$ -699949 65220 817305 -688309 -532295 -353341 441674 946508 26026 26228 1550479
9647A550479j440595M63468J170871j885273Q88671N19171j150068J763222k189481
$$ 1550479 109884 573352 1744223 -141050 747621 1266792 116724 1879946 -309535
9638c09535l85876M90259J271877m72397J56635p34553p26900R04265J89587R69607
$$ -309535 -695411 -205152 1066725 594328 750963 16410 -710490 193775 383362 1352969
9628A352969m03927j266262K35766N59102l29109k76121M10181j086987J552821
$$ 1352969 949042 -317220 -81454 477648 148539 -127582 282599 -804388 748433
9619G48433J415866k274483l05409Q85170k066285J051540N39942q42036Q81897
$$ 748433 2164299 -110184 -415593 469577 -1596708 -545168 -5226 -847262 34635
9610C4635n45142m807M83523n66874J392904p6526M4999N50552n31425R01311
$$ 34635 -510507 -515314 -31791 -598665 794239 717713 762712 1313264 781839 1683150
9600A683150j616144L7896Q76652k210527J487337K13466L05587Q11700J33787
$$ 1683150 67006 104902 981554 -1228973 258364 471830 777417 1589117 1722904
9591A722904j882354K422720q32297j235783J75493n2285J10506j632408J782200
$$ 1722904 -159450 2263270 1430973 195190 370683 318398 428904 -1203504 578696
9582E78696p05413N85747L76968j68410k67426L05583N76191j708595J068343
$$ 578696 -126717 459030 835998 667588 400162 705745 1281936 -426659 641684
9573F41684m13386N58916L7297p49939N23018J250959j497758P26138R0553k11109
$$ 641684 228298 787214 824511 74572 597590 1848549 350791 1076929 1167482 956373
9563I56373j009125J369474l13724j626866J106622k61107K080023j456802J90818
$$ 956373 -52752 1316722 1002998 -623868 482754 221647 2301670 844868 1035686
9554A035686m56004j19811L41759J097447k48841k10784j88573p90691J06033
$$ 1035686 579682 459871 801630 1899077 1650236 1439452 1250879 460188 566221
9545E66221J938396j742023L9658P5176q63869L34877N39467m10186n1111J139100
$$ 566221 2504617 762594 802252 877428 13559 348436 887903 477717 426606 1565706
9535A565706o07308j50691Q56440j036750Q32174m57660j62073j458745J456419
$$ 1565706 958398 807707 1664147 627397 1459571 1001911 839838 -618907 837512
9526H37512n09818o18034J443382j54843M79186j056293J224902j735938L098531
$$ 837512 327694 -290340 1153042 998199 1477385 421092 1645994 -89944 3008587
9517C008587k244136r59372Q32990J891365j186877m08437J094774j082230m88840
$$ 3008587 764451 -194921 638069 2529434 1342557 934120 2028894 946664 457824
9508D57824J804157j988395j177987K498318L17020o25924P31375p43780J33227
$$ 457824 2261981 273586 -904401 1593917 1910937 1285013 2016388 1272608 1405835
9499A405835K715374k653079j72828K233219j947525M23998M7715o16580J196024
$$ 1405835 4121209 1468130 1295302 3528521 1580996 2004994 2052709 1436129 2632153
9490B632153N00134j377885m47693J131799p61425J686397l21845k715614J459151
$$ 2632153 3132287 1754402 1306709 2438508 1677083 3363480 3041635 326021 1785172
9481A785172j273242J441216R3333m1075R0322j254875r33951J585228l11079
$$ 1785172 511930 1953146 2046479 2005404 2095726 840851 -93100 1492128 1181049
9472A181049j171353J774569n92960K36970p75578J562406j038211r15891J899128
$$ 1181049 9696 1784265 1191305 1428275 652697 2215103 1176892 261001 2160129
9463B160129k852361J438006m70737J773724n22410K28020j538680P55402O83160
$$ 2160129 -692232 745774 275037 2048761 1526351 1754371 215691 971093 1654253
9454A654253j564032N47247j80399J230339k164789J509413l32424m9828r53829
$$ 1654253 90221 637468 457069 1687408 -477381 1032032 699608 649780 -304049
9445c04049K375624L68155j648419P63646P40309j341976P69850J274812k552599
$$ -304049 2071575 2439730 791311 1554957 2295266 953290 1723140 2997952 445353
9436D45353J78444l97898K108598p58133L80520k56822P86333n07552Q3449L39435
$$ 445353 623797 225899 2334497 1576364 1956884 1700062 2486395 1978843 2062292 2401727
9426B401727q77272K95796m01006J487157p58829j448843J213573p58828O54905
$$ 2401727 1524455 1820251 1419245 2906402 2147573 698730 1912303 1153475 1808380
9417A808380m75122J76612q96040N89560J244355k394594K503415p07701j065154
$$ 1808380 1333258 1509870 613830 1203390 2447745 53151 2556566 1848865 783711
9408G83711J381038j478320L68244K73010l08476P78495m5015J191717m17654
$$ 783711 2164749 686429 1054673 1327683 1019207 1797702 1752687 2944404 2526750
9399B526750n55297P80716o94119P08184N47754l44715p36615J346831p82960
$$ 2526750 1971453 2752169 2058050 2766234 3313988 2969273 2232658 3579489 2796529
9390B796529O36404j016389J679719j186159J261487l13291m62205l95939Q10678
$$ 2796529 3432933 2416544 4096263 2910104 4171591 3858300 3396095 3000156 3810834
9381C810834O72015p83553N27049j388066J370266J66318n73581J78163K076563
$$ 3810834 4482849 3699296 4226345 2838279 4208545 4374863 3801282 3979445 6056008
9372F056008k689864O87136J40218j129171J113186j295933N55940M36669j824389
$$ 6056008 3366144 4053280 4193498 3064327 4177513 2881580 3437520 3874189 2049800
9363B049800J329622J085222J82681K06365q20735J862020m63116l44176l90471
$$ 2049800 3379422 4464644 4647325 4853690 4032955 5894975 5431859 5087683 4697212
9354D697212Q61857j190666K15757N31983o93810Q56733J64080J201548j636563
$$ 4697212 5559069 4368403 4584160 5116143 4422333 5279066 5443146 6644694 5008131
9345E008131o06406Q66263j258332M36607o77749J194870j405906M48259l62497
$$ 5008131 4401725 5267988 4009656 4446263 3768514 4963384 3557478 4005737 3643240
9336C643240j159951O85044j414478J164416k88424r22061J225030j486631J386579
$$ 3643240 2483289 3168333 1753855 2918271 2629847 1707786 2932816 1446185 2832764
9327B832764j372027K36617o85411J529971K68107j210990Q55179Q78031j234579
$$ 2832764 1460737 1697354 1011943 2541914 2810021 1599031 2454210 3332241 2097662
9318B097662N97718n10518L26007M82628l34058O04471j763274J167625N97063
$$ 2097662 2695380 2184862 2510869 2993497 2659439 3263910 1500636 2668261 3265324
9309C265324k070173K709150j123402Q5985Q74204n60387j76307n84554O98937
$$ 3265324 1195151 3904301 2780899 2866884 3741088 3180701 3004394 2419840 3118777
9300C118777N44556k749753K247871j367760L65725K92716J745959j966502l84996
$$ 3118777 3663333 913580 3161451 1793691 2159416 2452132 4198091 2231589 1846593
9291A846593K379704K85399o85421K63518l80057n35874R36733k164081J428239
$$ 1846593 4226297 4511696 3826275 4089793 3709736 3173862 4110595 1946514 3374753
9282C374753J456590j655577l57057m3857J725203p39800J625181k632852J462011
$$ 3374753 4831343 3175766 2818709 2774852 4500055 3760255 5385436 2752584 4214595
9273D214595P47035o78502R47962Q11016j383386K89745q90053J598219J747788
$$ 4214595 4961630 4283128 5231090 6042106 4658720 4948465 4058412 5656631 7404419
9264G404419j475834m93644J43617J486059j521382q61078J454638Q38833j842987
$$ 7404419 5928585 5434941 5578558 7064617 5543235 4682157 6136795 6975628 5132641
9255E132641j2173q11720l64264m7804J433022Q19662J90135r52390K49579j280607
$$ 5132641 5120468 4308748 3944484 3896680 5329702 6149364 6339499 5387109 5636688 4356081
9245D356081J277567J805130j373332K76952n21340l78714Q52848J231861m38976
$$ 4356081 5633648 7438778 6065446 6342398 5821058 5442344 6295192 7527053 7088077
9236G088077N5408J398756j69332k362635J48437J95165p339j583241K342249
$$ 7088077 7143485 8542241 8372909 6010274 6158711 6353876 6346537 4763296 7105545
9227G105545p50269O4517j631168Q01041j99873N23126k51728m97784o32406J102996
$$ 7105545 6355276 6419793 4788625 5589666 5389793 5912919 5661191 5163407 4531001 5633997
9217E633997j90473M88389j197431k83503R48273j908736k03081J616168n06442
$$ 5633997 5443524 5931913 4734482 4450979 5399252 3490516 3287435 4903603 4397161
9208D397161m13435l08048Q62937M28198J34277J3644M87170K90678m31623J404611
$$ 4397161 3983726 3675678 4538615 4966813 5101090 5114734 5601904 5892582 5460959 6865570
9198F865570l1769j100020k73988M11875O92062M58515j25733q42094J821277
$$ 6865570 6833801 5733781 5459793 5871668 6563730 7022245 6896512 6054418 7875695
9189G875695j339991J583838r88918L20565m96759j105409Q73369N87998j993971
$$ 7875695 6535704 8119542 7130624 7451189 6954430 5849021 6722390 7310388 5316417
9180E316417k43580K051304j804284J537100M22104J552484j997540R58751L39901
$$ 5316417 5072837 7124141 5319857 6856957 7279061 8831545 6834005 7792756 8132657
9171H132657J586749j523330J708181j45419M26089o92983J153055j977783L239008
$$ 8132657 9719406 8196076 9904257 9758838 10184927 9491944 10644999 8667216 11906224
9162A1906224j096311n83429K0796R4936j9426M82299p11382K48242J181870o92242
$$ 11906224 10809913 10226484 10247280 10342216 10322790 10805089 10093707 10341949 11523819 10831577
9152A0831577n89279N51741o97679Q06590P9746o18552k33248L07644J972148
$$ 10831577 10242298 10794039 10096360 10902950 10982696 10364144 10130896 10438540 12410688
9143A2410688r71968P90154O43712J337913r75140J778917q78114L01206J650241
$$ 12410688 11438720 12228874 12872586 14210499 13235359 15014276 14136162 14437368 16087609
9134A6087609J194767Q0728j317796M08164R8305O84700P0006P28116N14306r10770
$$ 16087609 17282376 17363104 16045308 16453472 16551777 17236477 17306483 18034599 18548905 17638135
9124A7638135K618041j547686J898075j773935J996371m92124N00959J32983O93224
$$ 17638135 20256176 18708490 20606565 18832630 20829001 20336877 20837836 20970819 21664043
9115B1664043l74834J522233n34813J399756J543597J629029O59671l62596J675252
$$ 21664043 21289209 22811442 22276629 23676385 25219982 26849011 27508682 27146086 28821338
9106B8821338K898744J139257K830978L868810P133220O085785M352603Q707966
$$ 28821338 31720082 32859339 35690317 39559127 46692347 52778132 57130735 65838701
9098F5838701R256379Q357577J2495392Q103171J4019300J4463236J9395352K1250828
$$ 65838701 75095080 83452657 95948049 104051220 118070520 132533756 151929108 173179936
9090A73179936K3241165K6358890K3848074K5478501K1219307J0455084L890801
$$ 173179936 196421101 222779991 246628065 272106566 293325873 303780957 307671758
9083C07671758k897691o943790j1557861j5637382j8779414j8112945j6201148
$$ 307671758 304774067 297830277 286272416 270635034 251855620 233742675 217541527
9076B17541527j5083817j9923859k0361117k0630043j7539959j8570973j3568388
$$ 217541527 202457710 182533851 162172734 141542691 124002732 105431759 91863371
9069I1863371j3126678j2570759j0473306q524617n579002p611404l039264m456767
$$ 91863371 78736693 66165934 55692628 47168011 41589009 33977605 30938341 26481574
9061B6481574m70148j921846j152015l39825r08249k833557K120075l542219p90225
$$ 26481574 26011426 24089580 22937565 22597740 21689491 18855934 20976009 17433790 16643565
9052A6643565K556157j290054k47654n21061k003693J313126K98355j958309n33042
$$ 16643565 19199722 17909668 17662014 17140953 15137260 16450386 16748741 14790432 14257390
9043A4257390O59321R34930p01708m27054J763099j301440q86025J555381J07455
$$ 14257390 14916711 15851641 15149933 14722879 16485978 15184538 14298513 15853894 15961349
9034A5961349l41336p14945k287907K970823o02984n48157j589994J484738j0165
$$ 15961349 15620013 14905068 12617161 15587984 14985000 14436843 12846849 14331587 14321422
9025A4321422l98446P65051O90820o21270n68861k86995l29944J794255j026826
$$ 14321422 13922976 14688027 15378847 14757577 14188716 13901721 13571777 15366032 14339206
9016A4339206j004973P99331O15358j966933K150782j128341L16520l68577r744
$$ 14339206 13334233 14133564 14748922 12781989 14932771 13804430 14120950 13752373 13742629
9007A3742629k34868l51587N88121J081113p62251q34743L066482j896143k99369
$$ 13742629 13507761 13156174 13744295 14825408 14063157 13228414 16294896 14398753 14099384
8998A4099384J531010j461515L57649m15526M70376o23034N72554M12329M28326
$$ 14099384 15630394 14168879 14526528 14111002 14581378 13958344 14530898 14943227 15371553
8989A5371553L35040N45495p2524k517663J420745J48290J313878j594471K26687
$$ 15371553 15706593 16252088 16179564 13661901 15082646 15230936 16544814 14950343 15177030
8980A5177030M68044N16329m83476J175825j64913l33201p4604l5322L246446
$$ 15177030 15645074 16161403 15677927 16853752 16688839 16355638 16281034 16245712 19492158
8971A9492158j046619j39798L59870o27675Q65928n51907N45789M51187J196034
$$ 19492158 18445539 18305741 18665611 18037936 18903864 18351957 18897746 19348933 20544967
8962B0544967j96613j539214J237052M95253r62309J578836j494691Q94849O10171
$$ 20544967 20348354 18809140 20046192 20541445 19579136 21157972 19663281 20558130 21168301
8953B1168301m74767L18985M91111j457763j360180R35810M2611K9691n53593
$$ 21168301 20693534 21012519 21503630 20045867 18685687 19621497 19664108 19693799 19140206
8944A9140206J625991L77616j342567k69738p4712j524015J560835l14076M47149
$$ 19140206 20766197 21143813 19801246 19531508 19456796 17932781 19493616 19179540 19626689
8935A9626689m54897R24604k215588J225070R70261k62677m91824J415267r6730
$$ 19626689 19171792 20096396 17880808 19105878 20076139 19813462 19321638 20736905 20640175
8926B0640175j241494L698K664018j545314K73603k850980K744132l76468L23676
$$ 20640175 19398681 19402379 22066397 20521083 20794686 17943706 20687838 20311370 20635046
8917B0635046m30510K59464R12374j345109J412809n90461j25658q81926J06527
$$ 20635046 20204536 20464000 21376374 20031265 21444074 20853613 20727955 19846029 19952556
8908A9952556J664507O83710j068020k69978l19529j55335J155490P13519p35608
$$ 19952556 21617063 22300773 21232753 20962775 20643246 20487911 21643401 22356920 21621312
8899B1621312J173029j850325K321717m80064N05912n60810R20143o73193J119185
$$ 21621312 22794341 20944016 23265733 22785669 23291581 22730771 23650914 22977721 24096906
8890B4096906j47175J460424n97616n08155m02350J030314l93104L79675k93705
$$ 24096906 23949731 25410155 24812539 24304384 23902034 24932348 24539244 24918919 24625214
8881B4625214N54580J949758k809908J921629p4771J97138j93928Q72105J57156
$$ 24625214 25179794 27129552 24319644 26241273 26166502 26363640 26169712 27041817 27198973
8872B7198973J88588K51059p25182J255083O46941r6118N18925j920001J043415
$$ 27198973 27387561 27638620 26913438 28168521 28815462 28719344 29238269 27318268 28361683
8863B8361683N82221K6110K50524M82505L64053M37559P93343J52638j522107
$$ 28361683 28943904 28970014 29220538 29703043 30067096 30504655 31297998 31450636 29928529
8854B9928529K858815j88463K39697o81806k69652J69674J330899q0475J328439
$$ 29928529 32787344 32598881 32838578 32156772 31887120 32056794 33387693 33307218 34635657
8845C4635657r06747L49145K221351j785020K401675j944642P02730R8730K569878
$$ 34635657 33728910 34078055 36299406 34514386 36916061 34971419 35674149 35772879 38342757
8836C8342757L08786n35395j105210Q67995R92326n38436J194639K16953o70034
$$ 38342757 38651543 38116148 37010938 37878933 38871259 38332823 39527462 39744415 39074381
8827C9074381m82122N38418L68915J797407j363460n76895P14922r57505P30405
$$ 39074381 38592259 39130677 39499592 41296999 39933539 39356644 40071566 39114061 39844466
8818C9844466R89498p58679K251315k947702K231956N71925j397594j19912J314538
$$ 39844466 40833964 40075285 42326600 39378898 41610854 42182779 40785185 40665273 41979811
8809D1979811J077996R69200k767166P53371R17878J081841m73546l93823j543612
$$ 41979811 43057807 44027007 41259841 42013212 42931090 44012931 43539385 43145562 41601950
8800D1601950J778722j81024j8603J139170L91593j129693P55902K94654k28634
$$ 41601950 43380672 43199648 43181045 44320215 44711808 43582115 44338017 44632671 44404037
8791D4404037N02048O43853J042276o00583n57385K183915j552401q6126J641960
$$ 44404037 44906085 45549938 46592214 45991631 45434246 47618161 46065760 45979634 47621594
8782D7621594j849190K081395j263194J378036J116047M76334J25030k45043J388756
$$ 47621594 45772404 47853799 46590605 47968641 49084688 49561022 49686052 49441009 50829765
8773E0829765M71679Q26527L65403K88013O70054R22412j57275J29319J290834
$$ 50829765 51301444 52127971 52493374 52781387 53451441 54373853 54216578 54345897 55636731
8764E5636731m42723K07906K219381j06877l47963j85339J485177j413477J191107
$$ 55636731 55194008 55401914 57621295 57514418 57166455 56981116 58466293 57052816 58243923
8755E8243923R04973j291102K574358j172056j209777K932471m48485l4565n4522
$$ 58243923 59148896 57857794 60432152 59260096 58050319 60982790 60534305 60499740 60445218
8746F0445218n93482J010622l37915M34425l15408P34932j226855J810854k45117
$$ 60445218 59851736 60862358 60524443 60958868 60643460 61378392 60151537 61962391 61717274
8737F1717274K473042j343096K809598k937131J016436J549568m18137J845468
$$ 61717274 64190316 62847220 65656818 62719687 63736123 65285691 64867554 66713022
8729F6713022k194296J497089q8870N45911J709127j922787K130300P70090K6729
$$ 66713022 64518726 66015815 65926945 66472856 68181983 66259196 68389496 69159586 69186315
8720F9186315J758280j42315L90330R40882J290732O39147j493017J806210J138284
$$ 69186315 70944595 70802280 71192610 72133492 73424224 74063371 72570354 74376564 75514848
8711G5514848K16385J61662j4886K82887K349753J03533J48290R48756R31431
$$ 75514848 75731233 75892895 75878009 76160896 78510649 78614182 78762472 79711228 80642659
8702H0642659n54549K352700J81597J197479l06784J146809l76739J244560K235079
$$ 80642659 80088110 82440810 82622407 83819886 83513102 84659911 84283172 85527732 87762811
8693H7762811l64873q13066J363201K513892P81100l79523P48705J156424j55474
$$ 87762811 87397938 86584872 87948073 90461965 91243065 90863542 91612247 92768671 92613197
8684I2613197J558472m08070p15340L540837N58702M24284P44819P03766R51320
$$ 92613197 94171669 93763599 93048259 96589096 97147798 97572082 98316901 99020667 99971987
8675I9971987K556709J52166Q12396K38888J625816J465185k907127L474654J430381
$$ 99971987 102528696 102680862 103493258 103732146 105357962 106823147 103916020 107390674 108821055
8666A08821055N04903J581975J91083K740711j88801k43098J642418O62244J771351
$$ 108821055 109325958 110907933 111099016 113839727 113650926 113407828 115050246 115712490 117483841
8657A17483841j95608M79854N71241Q70644O14041J503511K904013m04684O01417
$$ 117483841 117288233 117768087 118339328 119209972 119824013 121327524 124231537 123826853 124428270
8648A24428270R70059K289732K27831L52589P25644K866038o49705J222879K048188
$$ 124428270 125398329 127688061 127915892 128268481 128994125 131860163 131210458 132433337 134481525
8639A34481525j169207K820689P77121J322523J73310J396734J600076R09707
$$ 134481525 133312318 136133007 136910128 138232651 138405961 139802695 141402771 142312478
8631A42312478M37709K913436L45670j83710J200839J404927J216466J464643
$$ 142312478 142750187 145663623 146009293 145825583 147026422 148431349 149647815 151112458
8623A51112458J124449R21990J741072J352410M56997M10828K477689J213742
$$ 151112458 152236907 153158897 154899969 156252379 156709376 157120204 159597893 160811635
8615A60811635J747635l21956J084575J245097L00495K448732j083284J611084
$$ 160811635 162559270 162237314 163321889 164566986 164867481 167316213 166232929 167844013
8607A67844013K301798K805318P77944K607J247325K158793l51658K133115n3329
$$ 167844013 170145811 172951129 173729073 173731680 174979005 177137798 176786140 178919255 178865926
8598A78865926K30175K055533K054036M75516M99720J787504M87389J960458l94859
$$ 178865926 179096101 181151634 183205670 183681186 184180906 185968410 186455799 188416257 188021398
8589A88021398J088521J318271J157402L40697K78265J955739N31354J018766
$$ 188021398 189109919 190428190 191585592 191926289 192204554 194160293 194691647 195710413
8581A95710413M21933J002833L511178j930490J454484Q69267K400486k655847
$$ 195710413 196132346 197135179 200646357 198715867 200170351 201039618 203440104 200784257
8573B00784257M248269k83572J370495P17610j85112J032471J236466j81070J091924
$$ 200784257 205032526 204748954 206119449 206837059 206651947 207684418 208920884 208739814 209831738
8564B09831738O49474Q03036J528158q68265J797419J435245P91751m25906L51961
$$ 209831738 210481212 211284248 212812406 211944141 213741560 215176805 215968556 215542650 215894611
8555B15894611J06142j24397L002577l526040K099980j49776J492720j088166
$$ 215894611 216000753 215876356 218878933 215352893 217452873 217303097 218795817 217707651
8547B17707651K74065J292887j5735R96395j557207J131182J007985K40491j247711
$$ 217707651 217981716 219274603 219258868 220255263 218698056 219829238 220837223 221077714 219830003
8538B19830003L11184R38653j800553N65620l27607l209185M546150K017738k482340
$$ 219830003 220141187 221079840 219279287 219844907 219517300 216308115 220854265 222872003 220389663
8529B20389663J304549k265427J507668k105901R65695j01895k070179j073265
$$ 220389663 221694212 219428785 220936453 218830552 219796247 219694352 217624173 216550908
8521B16550908K168653j383100j085155R18847j241497N39615j087414k030813
$$ 216550908 218719561 217336461 216251306 217170153 215928656 216468271 215380857 213350044
8513B13350044J132815j263497N7034q46306j633911k93178j893784J44021J32775
$$ 213350044 214482859 213219362 213276396 212430090 210796179 210503001 208609217 208753238 208886013
8504B08886013m96298q47694j525549R88813k571857M5524r44500k420352O8088
$$ 208886013 208389715 207542021 206016472 207005285 204433428 204478952 203534452 201114100 201182188
8495B01182188J477022j393066q15320k571063j357087j88973j733029k24213
$$ 201182188 202659210 201266144 200450824 197879761 196522674 196333701 194600672 194376459
8487A94376459p0512j199993j607708j49876j663734k44015j875064O07775j894276
$$ 194376459 194305947 193105954 191498246 191348370 189684636 189440621 187565557 188173332 186279056
8478A86279056j487014j19805k646740o59656m29187j826453j184726J737225
$$ 186279056 184792042 184672237 182025497 181365841 180936654 179110201 177925475 179662700
8470A79662700j559754j976564j987172j441028j724429m27088p33985q75530
$$ 179662700 178102946 176126382 174139210 172698182 170973753 170546665 169812680 168937150
8462A68937150r66499j804295j763541M96411j071966j716600j260131j974844
$$ 168937150 167970651 166166356 164402815 164899226 163827260 162110660 160850529 158875685
8454A58875685m07391M75788k843953k6839j903190j854952Q79702l005485j86359
$$ 158875685 158468294 158944082 156100129 156073290 154170100 152315148 153194850 150189365 150003006
8445A50003006j810370j238509P87426j734233k045551q30360j473666j37601
$$ 150003006 148192636 146954127 147741553 146007320 143961769 143131409 141657743 141520142
8437A41520142q82840l317483J289082q89919k523032q48006j339438O25219k329109
$$ 141520142 140637302 137319819 138608901 137718982 135195950 134347944 133008506 133633725 131304616
8428A31304616J85701r55392k66029k230997j070056L79352m91961j376530j622748
$$ 131304616 131490317 130534925 130268896 128037899 126967843 127347195 126855234 125478704 123855956
8419A23855956k843687J84173j373207j791463j7745N62945j658339k090165m29365
$$ 123855956 121012269 121196442 119823235 118031772 118014027 118576972 116918633 114828468 114399103
8410A14399103l90263m78343j109398j861027J048231k634249k96421o41835p21475
$$ 114399103 114008840 113530497 112421099 110560072 111608303 108974054 108677633 108035798 107314323
8401A07314323k127141M04360l36395j410529R3764o84403k219310j976507J107223
$$ 107314323 105187182 105591542 105255147 103844618 103938382 103253979 101034669 99058162 100165385
8392A00165385j699954J377354j679876o43604m01527j696368o07389q50653j3174
$$ 100165385 98465431 99842785 98162909 97519305 97117778 95421410 94814021 93963368 93950194
8383I3950194j244885j616920R51751k888953j3082o5192J43215j275780j35332
$$ 93950194 92705309 91088389 92040140 89151187 89138105 89072913 89216128 87940348 87805016
8374H7805016k377743n41775M02206q02071m95853M40639j686034r98452q91064
$$ 87805016 85427273 84885498 85287704 84485633 83989780 84430419 82744385 81745933 80854869
8365H0854869j5740m74405r21556m80872q10764r34852J07337p74147J04396j356367
$$ 80854869 80839129 80364724 79443168 78962296 78151532 77216680 77324017 76549870 76654266 75297899
8355G5297899j318028r15825L67982m29778j352236n89482M98769L24456j349916
$$ 75297899 73979871 73064046 73432028 73002250 71650014 71060532 71559301 71883757 70533841
8346G0533841j832382P15552j732364N83887K98997o04137r70490O9534r56530
$$ 70533841 68701459 69417011 67684647 68268534 68567531 67963394 66992904 67062438 66105908
8337F6105908K49462j331649P85073j189456q8865k77234j339701j308371Q5808
$$ 66105908 66355370 65023721 65808794 64619338 64530473 64253239 62913538 61605167 61690975
8328F1690975R7606P2833j4663m22087k603521k76900J010771j629695l01976
$$ 61690975 61788581 61861414 61846751 61424664 58821143 58544243 59555014 57925319 57623343
8319E7623343L39481Q37513k962431R03611j052672n74580J254823j326168o16157
$$ 57623343 57962824 58800337 55837906 56741517 55688845 55114265 56369088 55042920 54426763
8310E4426763k36487l55189J554080j728366m19245j572078l42810M41681m86585
$$ 54426763 54190276 53835087 55389167 53660801 53241556 51669478 51326668 51768349 51281764
8301E1281764L05143K83698k415954Q93833j010633J540641j284148j331135j571256
$$ 51281764 51586907 51870605 49454651 50348484 49337851 50878492 49594344 48263209 46691953
8292D6691953K504309o60004j071194j22468r55653L54972j058248m60539k77719
$$ 46691953 49196262 48536258 47465064 47342596 46386943 46741915 45683667 45223128 44945409
8283D4945409j05955P45515r43287j191378J215368j204759k35971N6931q89621
$$ 44945409 44839454 45584969 44641682 43450304 44665672 43460913 43224942 43281873 42392252
8274D2392252o48250J640384j522006m80203J692008k281127j700264K062668
$$ 42392252 41744002 43384386 41862380 41382177 43074185 40793058 39092794 41155462
8266D1155462o21789j29561p66614m55203N57884j649228R17856r32421J225629
$$ 41155462 40533673 40404112 39637498 39182295 39740179 38090951 39008807 38076386 39302015
8257C9302015q45512R912O44452j356042P09366j743533r57505J237983p63063
$$ 39302015 38456503 38466415 39110867 37754825 38464191 36720658 35763153 37001136 36238073
8248C6238073P88656j885360K377488j742448k50534L05852j862665J323286P5570
$$ 36238073 37026729 35141369 37518857 35776409 35525875 35831727 33969062 35292348 35367918
8239C5367918k464431J336659Q38585j16911j220341j463974J036307o67094r4158
$$ 35367918 32903487 34240146 35078731 34961820 33741479 32277505 33313812 32646718 32552560
8230C2552560K62357j821120J446054r55964J723073j992276j443254L003182
$$ 32552560 32814917 30993797 32439851 31483887 33206960 31214684 29771430 32774612
8222C2774612j870130p224l17728J286638j646732J946034j935564j785820K936373
$$ 32774612 30904482 30897258 30579530 31866168 30219436 32165470 30229906 28444086 31380459
8213C1380459j618017l81458j90418k13268m64459K89220k14181k044209J458127
$$ 31380459 29762442 29380984 29190566 28977298 28512839 28802059 28587878 26543669 28001796
8204B8001796J396127k645249J076004M61656k93697k417959Q40857m69614j625832
$$ 28001796 29397923 26752674 27828678 28290334 27996637 25578678 26419535 25949921 24324089
8195B4324089L182448J628956j900013J2996773j5829122J235612l343387L696147
$$ 24324089 27506537 29135493 27235480 40232253 24403131 25638743 22295356 25991503
8187B5991503J246474j557573K55749j743227K93029J661647k732675N62273p1719
$$ 25991503 27237977 25680404 25936153 24192926 24485955 26147602 23414927 23977200 23905481
8178B3905481j91037o06238J154777M87787j146931Q92549j460598l63524N52625
$$ 23905481 23714444 23108206 24262983 24750770 23603839 24496388 23035790 22672266 23224891
8169B3224891k402428J654820M85250j051688J412545K8506m76143j826678J34016
$$ 23224891 20822463 22477283 22962533 21910845 23323390 23351896 22875753 21049075 21183091
8160B1183091J79507K063076j784661j58271j072946K73497O27309j835643J907890
$$ 21183091 21362598 23425674 21641013 21482742 20409796 20683293 21310602 19474959 21382849
8151B1382849j419323n76709Q15106J354225p39247n81353o46840J024771j085619
$$ 21382849 19963526 19386817 20201923 21556148 20816901 20235548 19588708 20613479 19527860
8142A9527860Q12247k341130J243839k85308J480908k485804J73822M88442N31075
$$ 19527860 20340107 17998977 19242816 18957508 20438416 17952612 18126434 18614876 19145951
8133A9145951q89805O06425k89411J287414j463884K64406N91324j385763j423149
$$ 19145951 18256146 18862571 18573160 19860574 18396690 18661096 19252420 17866657 16443508
8124A6443508J721048j982049K167546j252591Q86219J592898k950442m13079
$$ 16443508 18164556 16182507 18350053 17097462 17983681 19576579 16626137 16213058
8116A6213058J533506n56187j86918k69875m0936k09541P7533j865439L390417
$$ 16213058 17746564 17190377 17003459 16733584 16692648 16483107 16560640 14695201 18085618
8107A8085618k641294P46238M78177j369708l49504K35593J772154j524051J537636
$$ 18085618 15444324 16190562 16668739 15299031 14949527 15185120 16957274 15433223 16970859
8098A6970859j328258L34099k400663K556591j359720N08649J17464j485080M94465
$$ 16970859 15642601 15976700 13576037 16132628 14772908 15281557 15399021 13913941 14408406
8089A4408406n93991J823179j430418n52616J323578n08681M74632j563022J374735
$$ 14408406 13814415 15637594 14207176 13654560 14978138 14469457 14944089 13381067 14755802
8080A4755802k137802O37691K51423J30140K42178M86414m82156J22832n35555
$$ 14755802 12618000 13255691 13507114 13637254 13879432 14365846 13883690 14006522 13470967
8071A3470967n66719N58803m29437m56633N62036Q95909j392337J05J359148j493457
$$ 13470967 12904248 13463051 13033614 12576981 13139017 14034926 12642589 12642694 14001842 12508385
8061A2508385j367556J310341J171806j624968q26202o71014j93775K187708j196737
$$ 12508385 11140829 12451170 13622976 11998008 11171806 10500792 10307017 12494725 11297988
8052A1297988p89048O66784k10174J136496q49455J561182j075886k99968P5126
$$ 11297988 10508940 11175724 10965550 12102046 11252591 12813773 11737887 11437919 11513045
8043A1513045k86623N76577j089898J200089j853413P41255k61251q03254K219756
$$ 11513045 11226422 11802999 10713101 11913190 10059777 10801032 10539781 9736527 11956283
8034A1956283k426551M24013q5632J146158j101980J514113p2023p85482n14367
$$ 11956283 9529732 9953745 9868113 11014271 9912291 11426404 11354381 10568899 10054532
8025A0054532r54222Q31439j793927Q25987J025447k221340J223455j384891K439577
$$ 10054532 9100310 9931749 8137822 8963809 9989256 7767916 8991371 7606480 10046057
8016A0046057q78615K28366L62490j626401J828938L71559j678152K7472Q61032
$$ 10046057 9167442 9395808 9758298 8131897 9960835 10332394 8654242 8681714 9542746
8007I542746N01964j666938M10364k47595m3191K87466J43972r84606o32088K758444
$$ 9542746 10044710 8377772 8788136 8540541 8497350 8784816 8928788 7944182 7312094 10070538
7997A0070538j862684Q12197k00184l04151r19189J346281j307344q59997R17203
$$ 10070538 8207854 9020051 8819867 8515716 7596527 8942808 7635464 6775467 7692670
7988G692670K16669M91823l5709J67891j399177k92617R73280m39533J095067
$$ 7692670 7909339 8401162 8365453 8533344 7134167 6841550 7814830 7375297 8470364
7979H470364l04845O87619j770836m8820N1376J14792j32191J542018j370949
$$ 8470364 8165519 8853138 7082302 7033482 7084858 7199650 7067459 8609477 7238528
7970G238528O83753j102291j796003K676462r39639N94680l39730m556J550503
$$ 7238528 7922281 6819990 5023987 7700449 6760810 7355490 7015760 7011204 8561707
7961H561707k287124P340J559585q61422L68357j472288R48356j74410O91041
$$ 8561707 6274583 6281923 7841508 6980086 7348443 5876155 6824511 6650101 7341142
7952G341142j377356J456727l48581R58701k313118J752261q80623j393230J263397
$$ 7341142 5963786 7420513 7071932 8030633 5717515 7469776 6589153 5195923 6459320
7943F459320n586j119141Q79452o77485J148597l27766O02297j060740P32338
$$ 6459320 6453734 5334593 6214045 5536560 6685157 6357391 6959688 5898948 6631286
7934F631286j965614K840858k692994m06872K115172j05717p71588q6537P75268
$$ 6631286 4665672 7506530 4813536 4406664 6521836 6416119 5644531 5557994 6333262
7925F333262o73202r57114p46604J891586M09285j82143k424459M63239K007936
$$ 6333262 5660060 4702946 3956342 5847928 6257213 6075070 3650611 4113850 6121786
7916F121786k297492J066244O14234l12219P65622j562865P36866m16444O12263
$$ 6121786 3824294 4890538 5504772 5192553 5958175 4395310 5132176 4715732 5327995
7907E327995o96789O30464k18850m28499M79696J77455j63044j302514J76978
$$ 5327995 4631206 5261670 5042820 4614321 5094017 5271472 5108428 3805914 3982892
7898C982892L58561o67P64756K66121j029177j061539J258439P35994k471098
$$ 3982892 4341453 4340786 5105542 5371663 4342486 3280947 4539386 5275380 2804282
7889B804282K239394o67404q3182M68146r7749j594292N18535K02209n74824J698418
$$ 2804282 5043676 4376272 4293090 4761236 4663487 3069195 3587730 3789939 3215115 4913533
7879D913533j756214O84407j206051N7138p2015J843599m32610L62568j585697
$$ 4913533 3157319 3841726 2635675 2692813 2620798 4464397 4031787 4394355 2808658
7870B808658l32918R62528Q92617j833016J617601j483031J264901n10522q74545
$$ 2808658 2475740 3438268 4330885 2497869 4115470 2632439 3897340 3386818 2512273
7861B512273Q13898P4470P188k40138o07300p2449j185198J318939P74318k289476
$$ 2512273 3326171 3400641 3407829 3167691 2560391 2487942 1302744 2621683 3396001 1106525
7851A106525P067652j994067j403358j718849J305267r88873M93497j384060N38440
$$ 1106525 8174177 6180110 4776752 3057903 4363170 3374297 3867794 2483734 3022174
7842C022174k65888M14183o22263O47964J019287k98104J083124j952804j44336
$$ 3022174 2756286 3170469 2548206 3196170 4215457 3917353 5000477 3047673 2903337
7833B903337p25141Q47071o21658J964515r77157j936417J922519q73829P43769
$$ 2903337 2178196 3025267 2403609 4368124 3390967 1454550 3377069 2503240 3247009
7824C247009j182907J125092j687423K111039j272079P0378R69679q72136R90225
$$ 3247009 2064102 3189194 1501771 3612810 2340731 2411109 3380788 2508652 3498877
7815C498877j585653L25655J329972j376987R01643q94895N61114O67734j549066
$$ 3498877 1913224 2238879 3568851 2191864 3093507 2198612 2759726 3427460 1878394
7806A878394J061615N41146p15103j686761K66469J131629K062813j231722j631427
$$ 1878394 2940009 3481155 2766052 1079291 1345760 2477389 4540202 3308480 1677053
7797A677053R08706L77163L1951n45502j46197n55768m89716K71718J271569M10430
$$ 1677053 2585759 2962922 2994873 2449371 2303174 1747406 1257690 1529408 2800977 3211407
7787C211407j698049K94709J969717n00074j13359n59576n75534j560480J522697
$$ 3211407 1513358 1808067 3777784 3277710 3164351 2604775 2029241 468761 1991458
7778A991458q01519K247453j596453K55130j580034j53192l43676J336466J90427
$$ 1991458 1189939 3437392 1840939 2096069 516035 362843 19167 1355633 1546060
7769A546060J551452m59336r09471O15657q03595o50711M9404l56499J631229
$$ 1546060 3097512 2638176 1728705 2344362 1540767 890056 939460 582961 2214190
7760B214190p95532m06944J150742j554981N07788J44822K58750j555319O92557
$$ 2214190 1418658 1011714 2162456 607475 1115263 1260085 1518835 -36484 656073
7751F56073M12581n31561k39463R85091R5265j17785k00721K16637L70037K79306
$$ 656073 1068654 537093 297630 1282721 1377986 1260201 1059480 1276117 1646154 1925460
7741A925460j261674O82762p13394R84338L73444q52466Q60089k848337J188318
$$ 1925460 663786 1346548 633154 1617492 1990936 1138470 1998559 -849778 338540
7732C38540L29583J585838j004117o2736n19095o21353Q10505m77092k13668j29512
$$ 338540 668123 2253961 1249844 1187108 668013 46660 857165 380073 166405 36893
7722C6893J421626j125750J000166j132966k46479m408q8462N75959J023883p41758
$$ 36893 1458519 332769 1332935 199969 -46510 -50918 -139380 436579 1460462 718704
7712G18704o20612P49291k839512K529131p47646J016398r78129q00955J081215
$$ 718704 98092 847383 -1992129 537002 -210644 805754 -172375 -973330 107885
7703A07885L85497R92268j636388J96412l2758l20100J165067k18220O8203k30097
$$ 107885 493382 1485650 -150738 45674 12916 -307184 857883 639663 707866 477769
7693D77769m41695J467880n21692N94960j981462R47807P24791n96950m35815
$$ 477769 36074 1503954 982262 1577222 -404240 543567 1268358 671408 235593
7684B35593r96415R62440q43242k85753J162299j174369J302115j786461J34107
$$ 235593 -760822 201618 -641624 -927377 234922 -939447 362668 -1423793 -1289686
7675a289686J309157p46051k50996J370928j166207q89391N05285P04456n73219
$$ -1289686 19471 -726580 -977576 393352 -772855 -1662246 -1156961 -452505 -1025724
7666a025724J672220j488720K03226L81643J327168q1869l71982j193421l93246
$$ -1025724 646496 -842224 -638998 -257355 1069813 987944 615962 -577459 -970705
7657i70705j70047J171337l82637j010243J116974r27494O02991J459148L25321
$$ -970705 -1140752 30585 -352052 -1362295 -245321 -1172815 -569824 889324 1214645
7648A214645j327635k89483n05803J500195j319191K171520k379138J497830n37055
$$ 1214645 -112990 -402473 -908276 591919 -727272 1444248 -934890 562940 25885
7639B5885r44521L86254M2920P47798K17970j821899J094709k37206J88627k89045
$$ 25885 -918636 -532382 -489462 258336 476306 -1345593 -250884 -488090 -299463 -588508
7629e88508P0759Q57875n44692j228835O80722J761967o24513n14251j072469
$$ -588508 -517749 340126 -204566 -1433401 -752679 1009288 384775 -129476 -1201945
7620a201945l92357K088244q59487J85217K8528j284136J98154J209235m62443
$$ -1201945 -1594302 493942 -365545 -180328 -151800 -1435936 -1237782 -28547 -490990
7611d90990k0203m54605N94950n74549n56710q90898J972719l45475L20161j594388
$$ -490990 -511193 -965798 -370848 -945397 -1502107 -2393005 -420286 -765761 -445600 -2039988
7601b039988J0303J623239j142068K374720j098751j93348j91997l9107j056700
$$ -2039988 -2029685 -406446 -1548514 826206 -272545 -465893 -657890 -696997 -1753697
7592a753697k63828K118858k965266J539198p42678L82949J439890k08485p67705
$$ -1753697 -2017525 101333 -2863933 -1324735 -2067413 -1684464 -244574 -453059 -1220764
7583a220764M26872n75568K53322n11338j15920O16022L61840j250832K162j32906
$$ -1220764 -793892 -1369460 -1116138 -1627476 -1743396 -1127374 -765534 -2016366 -2014204 -2147110
7573b147110M24273k27506n92778J850215j211956P92000M80579m07943n53079
$$ -2147110 -1722837 -1950343 -2543121 -692906 -1904862 -1112862 -632283 -1040226 -1593305
7564a593305o33960J080108p80127K016571k031000r3340K19933K23618J109651
$$ -1593305 -2227265 -1147157 -1927284 89287 -1941713 -2035053 -1815120 -1591502 -481851
7555d81851r00893j46950R68500j1796O03119j172119j246544L26906J178864
$$ -481851 -1382744 -1529694 -561194 -572990 30129 -1141990 -2388534 -2061628 -882764
7546h82764k050094J476473J5553l75999N46856p04695J085978j126446r97339
$$ -882764 -2932858 -1456385 -1440832 -1816831 -1269975 -1974670 -888692 -2015138 -3012477
7537c012477J508950Q18609q00297q88147j025500J312659J096620j761789J466298
$$ -3012477 -1503527 -684918 -1485215 -2373362 -3398862 -2086203 -989583 -2751372 -1285074
7528a285074j247268L28723j22812k80685M94684L75687K58864n40198J168057
$$ -1285074 -2532342 -2203619 -2326431 -2607116 -2112432 -1736745 -1477881 -2018079 -850022
7519h50022j921160l7623P48452j27934j53330J560891n34999m42797k594379
$$ -850022 -2771182 -2808805 -2060353 -2188287 -2341617 -780726 -1315725 -1758522 -4352901
7510d352901K557636K10583j6220O03709r87886l77732k16432N05177J036988
$$ -4352901 -1795265 -1584682 -1600902 -997193 -1985079 -2362811 -2579243 -2074066 -1037078
7501a037078m06700j414633L67603J633090p06077j353476m55884K094579N80806
$$ -1037078 -1443778 -2858411 -2490808 -857718 -1563795 -2917271 -3373155 -1278576 -697770
7492f97770j766697N03907m33176j96298j03589J24708j510142J958885P93636
$$ -697770 -2464467 -1960560 -2393736 -2590034 -2693623 -2568915 -4079057 -2120172 -1326536
7483a326536m41797L97036q84470K194832k315429M60988o4666j295464P84124
$$ -1326536 -1768333 -1371297 -2255767 -60935 -2376364 -1915376 -1980042 -3275506 -2491382
7474b491382Q7353p40115j86653J158999k339821K253568l42261N55272p76676
$$ -2491382 -2404029 -3144144 -3330797 -2171798 -4511619 -2258051 -2600312 -2045040 -2821716
7465b821716Q50214p82648J357580o3605k076332J409356J89668K7244J280961
$$ -2821716 -1971502 -2754150 -1396570 -1460175 -3536507 -2127151 -1937483 -1910239 -629278
7456f29278k428434J825175n50059J197720j994137j18181j40831L69827O69959
$$ -629278 -3057712 -1232537 -1782596 -584876 -2579013 -2697194 -2838025 -2468198 -1798239
7447a798239j203214K83748L3143O9737P03918j264795J189929o08341j27159
$$ -1798239 -3001453 -2717705 -2684562 -2614825 -1910907 -3175702 -1985773 -2594114 -2721273
7438b721273K692838k972749K24782M67344m90926j0886P0130R75611j113008
$$ -2721273 -28435 -3001184 -2776402 -2309058 -2799984 -2810870 -2740740 -1765129 -2878137
7429b878137j5162J094331j425812p09415J56290R32332q23368J645211J83116
$$ -2878137 -2893299 -1798968 -3224780 -3934195 -3777905 -2845573 -3668941 -2023730 -1840614
7420a840614j211O22044q01900J120540j173122l58807l35664P19654Q11488j94511
$$ -1840614 -1841825 -1219781 -2021681 -901141 -2074263 -2433070 -2768734 -2049080 -1237592 -1432103
7410a432103k004849L118274l949557K244154K27432l193331J262157L55505n91817
$$ -1432103 -3436952 -318678 -4268235 -2024081 -1796649 -4989980 -3727823 -3372318 -3964135
7401c964135J24979m04958K174581K21703k22688r93530R32631J256836k212349
$$ -3964135 -3839156 -4244114 -2069533 -1847830 -2070518 -3064048 -2131417 -874581 -3086930
7392c086930J186774j044331J177652j640337J639531j346524M98025p12804J345888
$$ -3086930 -1900156 -2944487 -1766835 -3407172 -1767641 -3114165 -2616140 -3328944 -1983056
7383a983056j697379Q69678j324197J864181j934213J214263O63067J9583J105600
$$ -1983056 -3680435 -2810757 -4134954 -2270773 -4204986 -2990723 -2327656 -2308073 -1202473
7374a202473j731622j567330K776708j484374j149597J532779N26550M33032o87049
$$ -1202473 -2934095 -4501425 -1724717 -3209091 -4358688 -2825909 -2299359 -1866327 -2553376
7365b553376j58622R30311L08541j877125P00534L99932k967855J240495J050878
$$ -2553376 -2711998 -1781687 -1473146 -3350271 -2649737 -2249805 -5217660 -3977165 -2926287
7356b926287j148429J250355O4889q16844J039261r23106J471684j556791p11200
$$ -2926287 -4074716 -2824361 -2759472 -3576316 -2537055 -3460161 -1988477 -3545268 -4256468
7347d256468J968353j452750L60122P979q43170j63229J558694l16212j658562
$$ -4256468 -2288115 -3740865 -3380743 -3372764 -4215934 -4379163 -2820469 -3136681 -4795243
7338d795243R05021J910556r79972n45015R06566r3679q42297L30883j8345K92885
$$ -4795243 -3890222 -1979666 -2959638 -3504653 -2598087 -2691766 -3534063 -3203180 -3221525 -2928640
7328b928640J92155j069442J310478m81235O45536j037584L17439L44920n1867
$$ -2928640 -2736485 -3805927 -2495449 -2976684 -2331148 -3368732 -3051293 -2706373 -2758240
7319b758240r72381M97001n82022J055723p49171N04243o98521j514469J529503
$$ -2758240 -3730621 -3233620 -3815642 -2759919 -3509090 -3004847 -3703368 -5217837 -3688334
7310c688334J052K74660j136709K246179j929523J275745j82071o13348L73565
$$ -3688334 -3687282 -3412622 -4549331 -2303152 -4232675 -2956930 -3139001 -3752349 -3378784
7301c378784P09419k191661J034566O1073J404516Q1990l87851j85836J040484
$$ -3378784 -2669365 -4861026 -3826460 -3765387 -2360871 -2278881 -2666732 -2852568 -1812084
7292a812084n19390k57086j266339J95028n92810p5781J307190p0700l41615l16195
$$ -1812084 -2331474 -2588560 -3854899 -3659871 -4252681 -4328462 -3021272 -3091972 -3433587 -3749782
7282c749782J797219k031252J544381j538686K49645N70670j26565k111745R56546
$$ -3749782 -1952563 -3983815 -2439434 -3978120 -3728475 -3157805 -3284370 -5396115 -4439569
7273d439569J238421p57285L587472k909700m04209k53853N68075j45972j10107
$$ -4439569 -3201148 -3958433 -370961 -3280661 -3684870 -3938723 -3370648 -3516620 -3626727
7264c626727m81288J338432O25852k170563J168950q54512q46175J19455J232424
$$ -3626727 -4108015 -2769583 -2143731 -4314294 -3145344 -3999856 -4846031 -4726576 -3494152
7255c494152J650301k46793q72482j483555O06306P09088k113537K387825L67501
$$ -3494152 -1843851 -2090644 -2963126 -4446681 -3840375 -3131287 -5244824 -2856999 -2489498
7246b489498j462293N18468L59980q42050N2040Q45363o09031L8524r97618J625880
$$ -2489498 -3951791 -3433323 -3073343 -3915393 -3863353 -3017990 -3627021 -3588497 -4586115 -2960235
7236b960235o69404o33822K656080k052007J589971k001592R65786p06794N0271
$$ -2960235 -3629639 -4263461 -1607381 -3659388 -2069417 -4071009 -3105223 -3812017 -3761746
7227c761746L71110l53150q07345O68996j329604J552987n13646l474M31870m62740
$$ -3761746 -3390636 -3743786 -4551131 -3882135 -5211739 -3658752 -4172398 -4175872 -3744002 -4206742
7217d206742J94282K368978k044588m8498n7206M4586k43637n36910N53493J337090
$$ -4206742 -4012460 -1643482 -3688070 -3736568 -3793774 -3749188 -3992825 -4529735 -3976242 -2639152
7207b639152j63438j865482L51816K96784r7913n6270N18531j339881L21502J384299
$$ -2639152 -2802590 -4668072 -4316256 -4019472 -4117385 -4173655 -3655124 -4995005 -4673503 -3289204
7197c289204j475350J296332l91196L76320Q00433Q00075j084193M17400j001137
$$ -3289204 -4764554 -3468222 -3859418 -3483098 -2682665 -1882590 -2966783 -2549383 -3550520
7188c550520l00679K31748m6542J274241j467416K42869l00991R66646j70170
$$ -3550520 -3851199 -3619451 -3665993 -2391752 -3859168 -3616299 -3917290 -2950644 -3120814
7179c120814o18544R35083j906422L0826J419299P12009j641745M86417R67428
$$ -3120814 -3739358 -2804275 -4710697 -4679871 -3260572 -2548563 -4190308 -3703891 -2736463
7170b736463j333492J202238j39479r67900L50779N44381n58553R14482j335908
$$ -2736463 -4069955 -2867717 -3007196 -3975096 -3624317 -3079936 -3638489 -2724007 -4059915
7161d059915p4398l7035J88592l05482m05557J339394n19371l57815J26046L98825
$$ -4059915 -4134313 -4171348 -3982756 -4288238 -4693795 -3354401 -3873772 -4231587 -4105541 -3706716
7151c706716K062166l538895J385871o67919J168627j032895k01078J96535L48870
$$ -3706716 -1644550 -5183445 -3797574 -4465493 -3296866 -4329761 -4530839 -4334304 -3985434
7142c985434J83892r62989j52346K458346p15298q78885k78266L08640J576422
$$ -3985434 -3801542 -4764531 -4916877 -2458531 -3173829 -4052714 -4330980 -4022340 -2445918
7133b445918j444433k09490n76526k8026R14641j59269m21087R76232q35517o51145
$$ -2445918 -3890351 -4099841 -4676367 -4704393 -3789752 -3949021 -4370108 -3393876 -4229393 -4880538
7123d880538q8125J532051p30181j050759J254750J1704r72715J064127j515486
$$ -4880538 -4968663 -3436612 -4166793 -5217552 -3962802 -3951098 -4923813 -3859686 -5375172
7114e375172K195372l93576j541826J577788J068047j496139K00984j23046R09447
$$ -5375172 -3179800 -3573376 -5115202 -3537414 -2469367 -3965506 -3764522 -3887568 -2978121
7105b978121j014274N06462j033874R35036M70051j174809N88081j037168L42342
$$ -2978121 -3992395 -3485933 -4519807 -3584771 -3114720 -4289529 -3701448 -4738616 -4396274
7096d396274q17844R39720P43580j002640k10851J139817r72191j16613M83736
$$ -4396274 -5214118 -4274398 -3530818 -4533458 -4744309 -3604492 -4576683 -4693296 -4209560
7087d209560l07664Q64051q79853Q63059K16048j821782J952602l4360j217156
$$ -4209560 -4517224 -3653173 -4533026 -3669967 -3453919 -5275701 -3323099 -3357459 -4574615
7078d574615J162426o44931P18656j93753r10584P88276j66592J5407q24059j76927
$$ -4574615 -3412189 -4057120 -3338464 -3532217 -4442801 -3654525 -3821117 -3805710 -4629769 -4806696
7068d806696n89002K075110M59716J01640r21442n09423l1257K314147j020103
$$ -4806696 -5395698 -3320588 -2860872 -2759232 -3680674 -4190097 -4221354 -1907207 -2927310
7059b927310j475794j544534J364662p3076J26853j15118N82436n5446j627866
$$ -2927310 -4403104 -5947638 -4582976 -4656052 -4529199 -4644317 -4061881 -4117327 -5745193
7050e745193Q68133M91928j09291K24131J131177r92930K410843k562693P8339
$$ -5745193 -4877060 -4385132 -4494423 -4270292 -3139115 -4132045 -1721202 -4283895 -4205556
7041d205556R19012p64118r01694J273212l80389m02983n60210J431042j34575
$$ -4205556 -3286544 -4050662 -4952356 -3679144 -4059533 -4462516 -5022726 -3591684 -3726259
7032c726259j154083o1223Q68607O3327N13716k1181J72983O40642j741498P92194
$$ -3726259 -4880342 -4941565 -4072958 -4009631 -3495915 -3517096 -3344113 -2703471 -4444969 -3652775
7022c652775M13388j730843K43965P78401J120008k122719M9877J235537j303575
$$ -3652775 -3239387 -4970230 -4726265 -3947864 -2827856 -4950575 -4900698 -3665161 -4968736
7013d968736R26611L6366j265824K27777J561566k364559R2273L057091p39752
$$ -4968736 -4042125 -4005759 -5271583 -5043806 -3482240 -5846799 -5754526 -2697435 -3437187
7004c437187j087654J246581N50823j563583J160347k410753J489046j708774
$$ -3437187 -4524841 -3278260 -2727437 -4291020 -3130673 -5541426 -4052380 -5761154
6996e761154J973941n5964L01472j831562M52642O36001L98461L27282k014878
$$ -5761154 -3787213 -3843177 -3541705 -5373267 -4920625 -4284624 -3886163 -3558881 -5573759
6987e573759J571661R418M95741p79701N2400J34527O04144n68352N70262j33522
$$ -5573759 -4002098 -3992680 -3496939 -4276640 -4224240 -4089713 -3485569 -4053921 -3483659 -3617181
6977c617181o84055j134065Q32353R1308R42856n12908k65455L01121M01962n29285
$$ -3617181 -4301236 -5435301 -4602948 -4511640 -3568784 -4081692 -4347147 -4046026 -3644064 -4173349
6967d173349k597j035676m51902J124820N37487Q98229m72788m84122K69686j158366
$$ -4173349 -4175946 -5211622 -5663524 -4538704 -4001217 -3102988 -3575776 -4059898 -3790212 -4948578
6957d948578K186563j934414J039548r36449J21136K182441l102034R12815n38950
$$ -4948578 -2762015 -4696429 -3656881 -4593330 -4472194 -2289753 -5391787 -4478972 -5017922
6948e017922J816901k109623J54460J301747j151445m81505O81784Q31781j020804
$$ -5017922 -3201021 -5310644 -5156184 -3854437 -5005882 -5487387 -4805603 -3973822 -4994626
6939d994626J811650j234275J066245j226256K25310j23240L02320M78284k00933
$$ -4994626 -3182976 -4417251 -3351006 -4577262 -4351952 -4475192 -4172872 -3694588 -3895521
6930c895521j504086K229916j56946j492108p70012O56945O99957J593074j530043
$$ -3895521 -5399607 -3169691 -3326637 -4818745 -5588757 -4931812 -4231855 -2638781 -4168824
6921d168824M314J501416k047486n0016R62428j18029p62076P16961o78751N60351
$$ -4168824 -4164510 -2663094 -4710580 -4760596 -3798168 -3916197 -4678273 -3961312 -4640063 -4079712
6911d079712n0419l481j895635J400143p23350M0293J379627k69681o13804J678317
$$ -4079712 -4130131 -4133612 -6029247 -4629104 -5352454 -5312161 -3932534 -4202215 -4816019 -3137702
6901c137702J15352l060374K895857j297334J783528k871214J336355k167643
$$ -3137702 -3022350 -6082724 -3186867 -4484201 -2700673 -5571887 -4235532 -6403175
6893f403175J299539q4702J069678J51382l81799R80288o99003O46973P77012
$$ -6403175 -5103636 -5188338 -4118660 -3967278 -4349077 -3368789 -4067792 -3420819 -2643807
6884b643807j678516J563767j331690J70599j26218r71309J177184Q99852o62003
$$ -2643807 -4322323 -2758556 -4090246 -3919647 -4045865 -5017174 -3839990 -2940138 -3602141
6875c602141M59399m94920n23326k00644J519784k719664J944132j358403K249858
$$ -3602141 -3142742 -3637662 -4160988 -4361632 -2841848 -5561512 -3617380 -4975783 -2725925
6866b725925j771471M38826O80894k131588J745379J514845k526097j387923L484561
$$ -2725925 -4497396 -4058570 -3377676 -5509264 -3763885 -2249040 -4775137 -6163060 -2678499
6857b678499j06647j073554Q66105j784511P29933n56153O83463N56133J437776
$$ -2678499 -2785146 -3858700 -2992595 -4777106 -4047173 -4603326 -3919863 -3363730 -1925954
6848a925954k339307K37029k31993k63023m86875M99315n79128m74960K383770
$$ -1925954 -4265261 -4028232 -4260225 -4523248 -5010123 -4510808 -5089936 -5564896 -3181126
6839c181126j401487l28707J691237j202940j086530Q51021L44012o274P64301
$$ -3181126 -4582613 -4911320 -3220083 -4423023 -5509553 -4658532 -4314520 -4320794 -3556493
6830c556493l35350j196929R65238K008607j646721n69447M82621m0178j362183
$$ -3556493 -3891843 -5088772 -4123534 -2114927 -3761648 -4331095 -3848474 -3888652 -5250835
6821e250835J419572O92456k865658K663357j165900M3015M18063P53733j365679
$$ -5250835 -3831263 -3138807 -6004465 -3341108 -4507008 -4463993 -4045930 -3292197 -4657876
6812d657876j13994K268148j605708j491670J033757l41326N5099O99884p93906
$$ -4657876 -4771870 -2503722 -4109430 -5601100 -4567343 -4908669 -4853570 -4153686 -4947592
6803d947592J16962L88332j139981J596675R18519j546555n63219K491741k054705
$$ -4947592 -4830630 -4442298 -5582279 -3985604 -3067085 -4613640 -5176859 -2685118 -4739823
6794d739823K97582l56067K25212l67654p20068K86151R23272J029748j694945
$$ -4739823 -4442241 -4798308 -4573096 -4940750 -5660818 -5374667 -4451395 -3421647 -5116592
6785e116592J190243j458127O26667m17066K294497j085227J159663j882079R76213
$$ -5116592 -3926349 -5384476 -4757809 -5174875 -2880378 -3965605 -2805942 -4688021 -3711808
6776c711808J45673j293618J417200j651421J38516J468357r58978m46405R69404
$$ -3711808 -3566135 -4859753 -3442553 -5093974 -4955458 -3487101 -4446079 -4892484 -3923080
6767c923080K32619N9051P26796k447094Q58139J659175l84187j028850R04571
$$ -3923080 -3690461 -3631410 -2904614 -5351708 -4493569 -2834394 -3218581 -4247431 -3342860
6758c342860k90876k734234L862828l79517k31193j322109k92918n72042j95243
$$ -3342860 -3633736 -6367970 -2505142 -2884659 -3115852 -4437961 -4730879 -5302921 -5498164
6749e498164J800066k16792J92027j684935J713847P21206k107010K530376j891476
$$ -5498164 -3698098 -3914890 -3722863 -5407798 -3693951 -2972745 -5079755 -2549379 -4440855
6740d440855j320501J114770O1120K78681J912182k533652J638871r39179N60344
$$ -4440855 -5761356 -4646586 -4585466 -4306785 -2394603 -4928255 -3289384 -4228563 -3668219
6731c668219j740113P33966k10925N70262P92437r46507P46069j99436J79367
$$ -3668219 -5408332 -4674366 -4885291 -4315029 -3522592 -4469099 -3723030 -3922466 -3743099
6722c743099K21240j914713J131431O03431j112518J010091j537834M43476J661273
$$ -3743099 -3521859 -5436572 -4305141 -3701710 -4814228 -3804137 -5341971 -4898495 -3237222
6713c237222p48820l96379j200875R34680Q05862R7493k052534J913859K8345
$$ -3237222 -3986042 -4382421 -5583296 -4648616 -3842754 -3745261 -5797795 -3883936 -3855591
6704c855591q78372K64446M72101K06689o94859j60638J292652j744739O71933
$$ -3855591 -4733963 -4469517 -3997416 -3790727 -4485586 -4646224 -3353572 -5098311 -4426378
6695d426378m69863O11888M63702j809487P68242J259819j378957J734225K67492
$$ -4426378 -4896241 -4284353 -3820651 -5630138 -4861896 -3602077 -4981034 -3246809 -2979317
6686b979317j176783L14331J42138k4897j588199R52188J635487j230405m86753
$$ -2979317 -4156100 -3841769 -3699631 -3724528 -5312727 -4360539 -2725052 -3955457 -4442210
6677d442210K364468j648532j497762J108091p50321p4348N42888K32900K035366
$$ -4442210 -2077742 -3726274 -5224036 -4115945 -4866266 -4940614 -4397726 -4164826 -2129460
6668b129460j046584r4158O39669j739035J071945p20760q84639J32404L239814
$$ -2129460 -3176044 -3270202 -2630533 -4369568 -3297623 -4018383 -4903022 -4770618 -1530804
6659a530804j796626K90752r82250M72052k5301m77924p52395J740730o75069
$$ -1530804 -3327430 -3036678 -4018928 -3546876 -3572177 -4050101 -4802496 -3061766 -3736835
6650c736835L40854j062195M00348j66385J261506j217288J54812J143484j105490
$$ -3736835 -3395981 -4458176 -4057828 -4224213 -2962707 -4179995 -4025183 -2881699 -3987189
6641c987189l16582l11829K041040j242784N57978n72435O72226p37147M38898
$$ -3987189 -4303771 -4615600 -2574560 -3817344 -3259366 -3831801 -3159575 -3896722 -3457824
6632c457824J36814m65359Q83086m76542j067357J11257O29324Q33932j149336
$$ -3457824 -3321010 -3786369 -2903283 -3379825 -4447182 -4335925 -3706601 -2872669 -4022005
6623d022005L16049P49678N28032O49281j676895J380738r18718L69375j40699
$$ -4022005 -3705956 -2956278 -2428246 -1778965 -3455860 -2075122 -2993840 -2624465 -2765164
6614b765164J065442N7066K16267l23411P88852o97360R13455j389287j416014
$$ -2765164 -1699722 -1642656 -1426389 -1749800 -960948 -1658308 -744853 -2134140 -3550154
6605c550154J862265j3321J059152M19327L88552o45398K280310p7458j080374
$$ -3550154 -1687889 -1701210 -642058 -222731 165821 -479577 1800733 1723275 642901
6596F42901o6833J329303o59402R87198n38588J209572q54815O51460J745106
$$ 642901 576068 1905371 1245969 2233167 1694579 2904151 2049336 2700796 4445902
6587D445902m45897J086027k56268j144852l12516q07743L164857q06569R11778
$$ 4445902 4000005 5086032 4829764 3684912 3372396 2564653 5729510 4922941 5834719
6578E834719n19915K497253j580046m02564p05203J375891j06177P02507O53032
$$ 5834719 5314804 7812057 6232011 5829447 5124244 6500135 6393958 7096465 7749497
6569G749497J416716j697011J336481n13485J607924j428536L1628q44456J51634
$$ 7749497 9166213 7469202 8805683 8292198 9900122 8471586 8503214 7658758 7810392
6560G810392l93302J526161k337138j03536p71766J073694j951891K489521k18112
$$ 7810392 7417090 8943251 6606113 6502577 5730811 6804505 4852614 7342135 7124023
6551G124023j272179R55330j271826o6903n0796J090613j222736K19030J33522
$$ 7124023 5851844 6807174 5535348 5468445 5417649 6508262 5285526 5504556 5638078
6542E638078j291248j70358P74321j489049L42292p59134J133777N0577j234825
$$ 5638078 4346830 4176472 4950793 3461744 3804036 3044902 4178679 4229256 2994431
6533B994431j221214j165446P58983j775915L12930j159636O14885R11284p57483
$$ 2994431 1773217 607771 1366754 -409161 -96231 -1255867 -640982 270302 -487181
6524d87181j017786J000707j96759j389647R77908j041424M21333O30078m25608
$$ -487181 -1504967 -504260 -701019 -2090666 -1112758 -2154182 -1732849 -1102771 -1528379
6515a528379m71069r23696P23268J30669Q2400j226344M15297k95636p60004O91683
$$ -1528379 -1999448 -2923144 -2199876 -2069207 -1986807 -3213151 -2797854 -3093490 -3853494 -3161811
6505c161811q80594M72604J79891L72963j972937Q92801M29613M52624P0773p36036
$$ -3161811 -4042405 -3569801 -3389910 -3016947 -4989884 -4097083 -3667470 -3214846 -3144073 -3880109
6495c880109J36960o35843Q68120j083330J281266R7324Q28503k17892J19850
$$ -3880109 -3743149 -4378992 -3510872 -4594202 -3312936 -3215612 -2387109 -2605001 -2485151
6486b485151q14394J293462L22076m24038O95192o23123l67958q46360L74499
$$ -2485151 -3299545 -2006083 -1684007 -2108045 -1412853 -2035976 -2403934 -3250294 -2875795
6477b875795J84488P52926r20833l22526q297J318779j076002J93320o33509J362941
$$ -2875795 -2691307 -1938381 -2859214 -3181740 -3190037 -1871258 -2947260 -2753940 -3387449 -2024508
6467b024508l91096P97902K84792j554320R63398j189668j15650J703033j813976
$$ -2024508 -2415604 -1617702 -1332910 -2887230 -1923832 -3113500 -3229150 -1526117 -3340093
6458c340093J645013j038591J379084k816667J092349J168784Q38896j956801
$$ -3340093 -1695080 -2733671 -1354587 -4171254 -3078905 -1910121 -1071225 -3028026
6450c028026r09301K287729k091450J029817J02591N9233l78444P74492k137609
$$ -3028026 -3937327 -1649598 -3741048 -2711231 -2608640 -2549407 -2927851 -2153359 -4290968
6441d290968J157203M80050j982041Q94439J090879k297357M75831O87682j251073
$$ -4290968 -3133765 -2653715 -4635756 -3741317 -2650438 -4947795 -4471964 -3784282 -5035355
6432e035355J853764k370314J560231o64220O91191j396924J885304m02572m35357
$$ -5035355 -3181591 -5551905 -3991674 -4655894 -3964703 -5361627 -3476323 -3878895 -4314252
$$ [...]
##END NTUPLES=NMR SPECTRUM
##END=
