##TITLE=abcd
##JCAMPDX= 6.0         $$ Bruker NMR JCAMP-DX V2.0
##DATA TYPE= NMR SPECTRUM
##DATA CLASS= NTUPLES
##ORIGIN= UXNMR, Bruker Analytische Messtechnik GmbH
##OWNER= root
$$ XWIN-NMR		Version 3.5
$$ Sun Dec  7 17:53:32 2025 Russian Standard Time (UT+4h)  servis@DPX200
##.OBSERVE FREQUENCY= 200.131235884673
##.OBSERVE NUCLEUS= ^1H
##.ACQUISITION MODE= SIMULTANEOUS
##.ACQUISITION SCHEME= undefined
##.AVERAGES= 32
##.DIGITISER RES= 18
##SPECTROMETER/DATA SYSTEM= spect
##.PULSE SEQUENCE= zg
##.SOLVENT NAME= CDCl3
##.SHIFT REFERENCE= (INTERNAL, CDCl3, 0, 16.4885)
##AUDIT TRAIL= $$ (NUMBER, WHEN, WHO, WHERE, WHAT)
$$ ##TITLE= Audit trail, XWIN-NMR		Version 3.5
$$ ##JCAMPDX= 5.01
$$ ##ORIGIN= Bruker BioSpin GmbH
$$ ##OWNER= servis
$$ F:\spectra/data/av/nmr/H1/1/pdata/1/auditp.txt
$$ ##AUDIT TRAIL=  $$ (NUMBER, WHEN, WHO, WHERE, WHAT)
(   1,<2025-12-07 17:52:59.48 +0400>,<servis>,<DPX200>,
      <created by zg, POWCHK disabled, PULCHK disabled
       configuration hash MD5:
       00 E9 B6 7A A2 85 ED C7 34 08 36 98 17 FE 4E 26
       data hash MD5: 32K
       DF 2F 0A C4 D6 02 6A 51 1B 54 3D 77 8C D1 71 90>)
(   2,<2025-12-07 17:53:08.34 +0400>,<servis>,<DPX200>,
      <Start of raw data processing
       efp BC_mod = 2 LB = 0.05 FT_mod = 6 PKNL = 1 PHC0 = -263.8463 PHC1 = 6.301564 SI = 16K 
       data hash MD5: 16K
       9B 71 54 CA 0D AB 8B D8 0C 56 17 C9 12 DA 34 F5>)
$$ ##END=
$$ 
$$ hash MD5
$$ DB 4D F2 7A F4 CA CB FB AB D5 5C 85 B5 B5 54 E7
##$RELAX= 
##$RELAX= 
##$RELAX= 
##$RELAX= 
##$RELAX= 
##$RELAX= 
##$RELAX= 
##$RELAX= 
$$ Bruker specific parameters
$$ --------------------------
##$DU= <F:\spectra>
##$EXPNO= 1
##$NAME= <H1>
##$PROCNO= 1
##$TYPE= <nmr>
##$USER= <av>
##$AMP= (0..31)
100 100 100 100 100 100 100 100 100 100 100 100 100 100 100 100 100 100 
100 100 100 100 100 100 100 100 100 100 100 100 100 100 
##$AQSEQ= 0
##$AQ_mod= 1
##$AUNM= <au_zg>
##$AUTOPOS= <>
##$BF1= 200.13
##$BF2= 200.13
##$BF3= 200.13
##$BF4= 200.13
##$BF5= 500.13
##$BF6= 500.13
##$BF7= 500.13
##$BF8= 500.13
##$BYTORDA= 1
##$CFDGTYP= 0
##$CFRGTYP= 5
##$CHEMSTR= <none>
##$CNST= (0..31)
1 1 145 1 1 1 1 1 1 1 1 1 1 1 1 1 1 1 1 1 1 1 1 1 1 1 1 1 1 1 1 1 
##$CPDPRG= <>
##$CPDPRG1= <>
##$CPDPRG2= <>
##$CPDPRG3= <>
##$CPDPRG4= <mlev>
##$CPDPRG5= <mlev>
##$CPDPRG6= <mlev>
##$CPDPRG7= <mlev>
##$CPDPRG8= <mlev>
##$CPDPRGB= <>
##$CPDPRGT= <>
##$D= (0..31)
0 2 0 0 0 0 0 0 0 0.06 0 0 0 0 0 0 0.0002 0 0 0 0 0 0 0 0 0 0 0 0 0 0 
0 
##$DATE= 1765115579
##$DBL= (0..7)
120 120 120 120 120 120 120 120 
##$DBP= (0..7)
150 150 150 150 150 150 150 150 
##$DBP07= 0
##$DBPNAM0= <>
##$DBPNAM1= <>
##$DBPNAM2= <>
##$DBPNAM3= <>
##$DBPNAM4= <>
##$DBPNAM5= <>
##$DBPNAM6= <>
##$DBPNAM7= <>
##$DBPOAL= (0..7)
0.5 0.5 0.5 0.5 0.5 0.5 0.5 0.5 
##$DBPOFFS= (0..7)
0 0 0 0 0 0 0 0 
##$DE= 6
##$DECBNUC= <off>
##$DECIM= 32
##$DECNUC= <off>
##$DECSTAT= 4
##$DIGMOD= 1
##$DIGTYP= 9
##$DL= (0..7)
0 120 120 120 120 120 120 120 
##$DP= (0..7)
150 150 150 150 150 150 150 150 
##$DP07= 0
##$DPNAME0= <>
$$ [...]
##$SUBNAM4= <"">
##$SUBNAM5= <"">
##$SUBNAM6= <"">
##$SUBNAM7= <"">
##$SUBNAM8= <"">
##$SUBNAM9= <"">
##$SW= 20.6817932712277
##$SWIBOX= (0..15)
0 0 3 0 0 0 0 0 0 0 0 0 0 0 0 0 
##$SW_h= 4139.07284768212
##$TD= 32768
##$TD0= 1
##$TE= 0
##$TE2= 300
##$TE3= 300
##$TEG= 300
##$TL= (0..7)
0 120 120 120 120 120 120 120 
##$TP= (0..7)
150 150 150 150 150 150 150 150 
##$TP07= 0
##$TPNAME0= <>
##$TPNAME1= <>
##$TPNAME2= <>
##$TPNAME3= <>
##$TPNAME4= <>
##$TPNAME5= <>
##$TPNAME6= <>
##$TPNAME7= <>
##$TPOAL= (0..7)
0.5 0.5 0.5 0.5 0.5 0.5 0.5 0.5 
##$TPOFFS= (0..7)
0 0 0 0 0 0 0 0 
##$TUNHIN= 0
##$TUNHOUT= 0
##$TUNXOUT= 0
##$USERA1= <user>
##$USERA2= <user>
##$USERA3= <user>
##$USERA4= <user>
##$USERA5= <user>
##$V9= 5
##$VALIST= <valist>
##$VCLIST= <CCCCCCCCCCCCCCC>
##$VD= 0
##$VDLIST= <DDDDDDDDDDDDDDD>
##$VPLIST= <PPPPPPPPPPPPPPP>
##$VTLIST= <TTTTTTTTTTTTTTT>
##$WBST= 1024
##$WBSW= 30
##$XGAIN= (0..3)
0 0 0 0 
##$XL= 0
##$YL= 0
##$YMAX_a= 2242455
##$YMIN_a= -1126826
##$ZGOPTNS= <>
##$ZL1= 120
##$ZL2= 120
##$ZL3= 120
##$ZL4= 120
##$ABSF1= 0
##$ABSF2= 0
##$ABSG= 0
##$ABSL= 0
##$ALPHA= 0
##$AQORDER= 0
##$ASSFAC= 0
##$ASSFACI= 0
##$ASSFACX= 0
##$ASSWID= 0
##$AUNMP= <proc_1d>
##$AZFE= 0.1
##$AZFW= 0.1
##$BCFW= 0
##$BC_mod= 2
##$BYTORDP= 0
##$COROFFS= 0
##$CY= 18.4799938201904
##$DATMOD= 1
##$DC= 0
##$DFILT= <>
##$DTYPP= 0
##$F1P= 9.9274215381318
##$F2P= -0.165520771350173
##$FCOR= 1
##$FTSIZE= 16384
##$FT_mod= 6
##$GAMMA= 0
##$GB= 0
##$INTBC= 1
##$INTSCL= 4.127829e-11
##$ISEN= 128
##$LB= 0.05
##$LEV0= 0
##$LPBIN= 0
##$MAXI= 10000
##$MC2= 0
##$MEAN= 0
##$ME_mod= 0
##$MI= 50
##$NCOEF= 0
##$NC_proc= -5
##$NLEV= 6
##$NOISF1= 3.799351
##$NOISF2= 2.8
##$NSP= 0
##$NTH_PI= 0
##$NZP= 0
##$OFFSET= 16.48848
##$PC= 4
##$PHC0= -263.8463
##$PHC1= 6.301564
##$PH_mod= 1
##$PKNL= yes
##$PPARMOD= 0
##$PSCAL= 4
##$PSIGN= 0
##$REVERSE= no
##$SF= 200.130005582386
##$SI= 16384
##$SIGF1= 3
##$SIGF2= 2
##$SINO= 400
##$SIOLD= 16384
##$SREGLST= <1H.CDCl3>
##$SSB= 0
##$STSI= 16384
##$STSR= 0
##$SW_p= 4139.07284768211
##$SYMM= 0
##$S_DEV= 0
##$TDeff= 32768
##$TDoff= 0
##$TI= <>
##$TILT= no
##$TM1= 0
##$TM2= 0
##$TOPLEV= 0
##$USERP1= <user>
##$USERP2= <user>
##$USERP3= <user>
##$USERP4= <user>
##$USERP5= <user>
##$WDW= 1
##$XDIM= 16384
##$YMAX_p= 432978261
##$YMIN_p= -1803197
$$ End of Bruker specific parameters
$$ ---------------------------------
##NTUPLES= NMR SPECTRUM
##VAR_NAME=  FREQUENCY,     SPECTRUM/REAL,   SPECTRUM/IMAG
##SYMBOL=    X,             R,               I
##VAR_TYPE=  INDEPENDENT,   DEPENDENT,       DEPENDENT
##VAR_FORM=  AFFN,          ASDF,            ASDF
##VAR_DIM=   16384,         16384,           16384
##UNITS=     HZ,            ARBITRARY UNITS, ARBITRARY UNITS
##FACTOR=    0.252644378177508, 1,           1
##FIRST=     3299.83951724647, 0,            0
##LAST=      -839.233330435636, 0,           0
##MIN=       -839.233330435636, -1803197,    0
##MAX=       3299.83951724647, 432978261,    0
$$ Real data points
##PAGE= N=1
##DATA TABLE= (X++(R..R)), XYDATA
$$ [...]
8011C507719p1818m9143j02378J120n561j15088l9282J10258p9815k3282J3761
8000C146491O7323k8496o223L8740j09157M4377j82474P3965r4452P861J346M326
7988B963627N9130L5783m5390n0031q2338q145M4394j22393M617N023q8242P8055
7976B794090L6190o9460r4431M8334k2205Q9370j30748K6786K1238M683J0493
7965B714340o9181M723J12985o8982j2874J2205K8143p8757R152P986k5701M6148
7953B680187k0950k9842n197J15773j10481n7722O1913j5777J2354q8234L8115
7942B580139r635m5223K03084P3159q4972n818K7313L7379R5949j30380L8454
7931B779449l7789J57564j00214Q7008j11730M8536n6361J34847n2144j9579k1561
$$ plain form
8011 3507719 3435901 3386758 3284380 3285500 3279939 3164851 3125569 3235827 3156012 3132730 3146491
8000 3146491 3213814 3185318 3179095 3217835 3108678 3153055 2970581 3044546 2950094 2957955 2959301 2963627
7988 2963627 3022757 3058540 3013150 2963119 2880781 2872636 2917030 2794637 2799254 2804277 2716035 2794090
7976 2794090 2830280 2760820 2666389 2714723 2692518 2781888 2651140 2677926 2699164 2703847 2714340
7965 2714340 2645159 2649882 2762867 2693885 2681011 2693216 2721359 2642602 2651754 2659740 2634039 2680187
7953 2680187 2659237 2629395 2624198 2739971 2629490 2571768 2633681 2617904 2630258 2542024 2580139
7942 2580139 2570504 2525281 2728365 2801524 2716552 2710734 2738047 2775426 2871375 2740995 2779449
7931 2779449 2741660 2899224 2799010 2886018 2774288 2822824 2766463 2901310 2849166 2829587 2808026
7920B808026q631O103N8496l345k21438J18108p1083J56561k5198q8161L201L8510
7908B771149O6916Q4031M6995l7507j05324K9684j0902o05J25777m3154p7324
7897B849736n5755J14053n4752j47028M6237N4758L1896j23996J17849r0238K10294
7886B953054n3895K7224J2995O0028J36047L6555J14256k21536M0126j3544K0353
7875C111663n7590n7266K0053K1286K7529L9119r8101M2451Q5215O0221n2954
7864C141626J03770l7358P2577l1705R0953J09052J15775j60207P0649K7529k2830
7853C479831P31755k48805j16898j15352J03520o4896J09543L2583J11144K1427
7843D043852J37378J11565Q603J29159J08432R0144J32917L10133J93607K07822
$$ plain form
7920 2808026 2799395 2805498 2863994 2860649 2639211 2757319 2686236 2842797 2817599 2729438 2732639 2771149
7908 2771149 2838065 2922096 2969091 2931584 2826260 2855944 2845042 2844437 2970214 2927060 2849736
7897 2849736 2793981 2908034 2853282 2706254 2752491 2807249 2839145 2715149 2832998 2742760 2953054
7886 2953054 2899159 2926383 2939378 2999406 3135453 3172008 3286264 3064728 3104854 3091310 3111663
7875 3111663 3054073 2996807 3016860 3038146 3065675 3104794 3006693 3049144 3134359 3194580 3141626
7864 3141626 3245396 3208038 3280615 3248910 3339863 3448915 3564690 3404483 3475132 3502661 3479831
7853 3479831 4211586 3962781 3845883 3730531 3834051 3769155 3878698 3911281 4022425 4043852
7843 4043852 4181230 4292795 4301398 4430557 4538989 4629133 4762050 5072183 5265790 5473612
7833E473612K70687K46980L05390L23419L33522K14705J80401L08316K49463L86396
7823H292891K83995L81938O9006K7307P5709J87806J8965J57081J33322K35069
7813I863089K589J49761K4832R8093K10076J76861K53169R4877J21136p947o4182
7802A0922354J6153N0964J39511J04105M9273l483j21850k06378Q3298r9970r2230
7791A0841747j44779P3923l5705n964o9324L8111K7446k4834O2240J30235N7022
7780A0950118K37185J60060K18192K78730K48015M74196J87191J64314J72391
7771A3090392J21890J33099N4047J56122m473M4112J06604k5939m2121J13927
7761A3747660q8139R4912j2872K80333L55743K74759M28051L10225K23116J66128
$$ plain form
7833 5473612 5744299 5991279 6296669 6620088 6953610 7168315 7348716 7657032 7906495 8292891
7823 8292891 8576886 8958824 9027830 9055137 9130846 9318652 9337617 9494698 9628020 9863089
7813 9863089 9865678 10015439 10040271 10138364 10348440 10525301 10778470 10873347 10994483 10986536 10922354
7802 10922354 10938507 10989471 11128982 11233087 11282360 11278877 11157027 10950649 11033947 10933977 10841747
7791 10841747 10696968 10770891 10735186 10729222 10659898 10698009 10725455 10700621 10762861 10893096 10950118
7780 10950118 11187303 11347363 11565555 11844285 12092300 12566496 12753687 12918001 13090392
7771 13090392 13212282 13345381 13399428 13555550 13551077 13595189 13701793 13675854 13633733 13747660
7761 13747660 13659521 13754433 13741561 14021894 14377637 14652396 15080447 15390672 15613788 15779916
7751A5779916J34462L27350K17838Q2373l5932k19038l92312m23989n27203l02015
7741A4641450j86598k87072j57196k34053n6857j64463m0669R4445M3178m419
7731A3647746j65024k49544k90687j8505P9669J50640L38528J39498J54323r5728
7721A3690916j62672j13327j89794p2263P7747J26817K69334J27239K61409M32613
7711A4448019M24024N00159M79885N53017N60338P43044Q09413J132984J100866
7702B0751749J253104J677019J866482K432755K765598L621566M306969N202187
7694D3877429N391865N301424M326637L350885K607257K218324K194881K205619
7686G1474321J473617L87428j356863k811680l813782m044660l388108k684906
$$ plain form
7751 15779916 15914378 16241728 16459566 16541939 16506007 16286969 15894657 15470668 14943465 14641450
7741 14641450 14454852 14167780 14010584 13776531 13719674 13555211 13514542 13608987 13652165 13647746
7731 13647746 13482722 13233178 12942491 12923986 13003655 13154295 13492823 13632321 13786644 13690916
7721 13690916 13528244 13414917 13225123 13152860 13230607 13357424 13626758 13753997 14015406 14448019
7711 14448019 14872043 15372202 15852087 16405104 16965442 17708486 18517899 19650883 20751749
7702 20751749 22004853 23681872 25548354 27981109 30746707 34368273 38675242 43877429
7694 43877429 49269294 54570718 58897355 62248240 64855497 67073821 69268702 71474321
7686 71474321 72947938 73335366 71978503 69166823 65353041 61308381 57920273 55235367
7678E5235367j557402l87804R41134K138897L299391M340929M442717M290001
7670G2743230L176591K277883J386796R81680L75959L93494J39988o47362j629752
7661G9198507k959328m335385m984532n168242m968847m354000l668142l010738
7653D5749293k792784k246224k293354k045007j930958j834165j809121j778514
7645B9019166j793431j902212j880476j701503j435889j507082j224154j175444
7637A6398975r60831p80369p45273o48439n39037m87689l79627l56423m04004
7628A1097283l36523k17703j57947l18330k72209j27112q7485m5155p4075m6044
7618I414700j45968K46831N2107J57201J43917J51531K57545L50333J50051n264
$$ plain form
7678 55235367 53677965 53290161 54231295 56370192 59669583 64010512 68453229 72743230
7670 72743230 75919821 78197704 79584500 80566180 80942139 81335633 81475621 80828259 79198507
7661 79198507 76239179 71903794 66919262 61751020 56782173 52428173 48760031 45749293
7653 45749293 42956509 40710285 38416931 36371924 34440966 32606801 30797680 29019166
7645 29019166 27225735 25323523 23443047 21741544 20305655 18798573 17574419 16398975
7637 16398975 15438144 14657775 13912502 13264063 12725026 12237337 11857710 11501287 11097283
7628 11097283 10760760 10543057 10385110 10066780 9794571 9667459 9579974 9534819 9460744 9414700
7618 9414700 9268732 9515563 9567670 9724871 9868788 10020319 10277864 10628197 10778248 10772984
7608A0772984n7267R9157l83560k23987k72189m84357k97494k90698k28733k24611
7598H409245j24053j34996j47531J65984O2836j08210p3539P7019o3991j72937
7588G889827j6855p612k17566J05121M826J80355N0674O0986J02346O8039R2782
7577H312923J19606J19651J36255r7853j5852k47472j76659k07433j05875k24880
7567G612411l3511m5669m6359P8224P4142N1175r9546j52954l3011j06022j32791
7556G166089m01556l07074k58874j00613j88374j43189k37187j15966j0511j03055
7546E299690j66942n7568j20653o6617l1923O8242j35540j1496j7803n7655j04899
7535D596836O2950N9923q3178k7723k9115R3972n7858J8251J03192R5949K00556
$$ plain form
7608 10772984 10715717 10814874 10431314 10207327 9935138 9450781 9153287 8862589 8633856 8409245
7598 8409245 8285192 8150196 8002665 8168649 8231485 8123275 8049736 8126755 8062764 7889827
7588 7889827 7872972 7865360 7647794 7752915 7757741 7938096 7988770 8049756 8152102 8220141 8312923
7577 8312923 8432529 8552180 8688435 8590582 8574730 8327258 8150599 7943166 7837291 7612411
7567 7612411 7578900 7533231 7486872 7565096 7639238 7690413 7590867 7437913 7404902 7298880 7166089
7556 7166089 6764533 6457459 6198585 6097972 5909598 5766409 5529222 5413256 5402745 5299690
7546 5299690 5132748 5075180 4954527 4887910 4855987 4924229 4788689 4777193 4759390 4701735 4596836
7535 4596836 4659786 4719709 4636531 4608808 4579693 4673665 4615807 4634058 4737250 4833199 5033755
7524E033755J13126J81458Q6809R4326k8580L3260K4171Q4970l7773J22852J58335
7513E866709j16296j21038R8028k06541P1727l7989O9071J80216K45114J23813
7503F172814J36705J08442j28152j3938m0917J05170J11911j8126J39637P3749
7493F647295J28565R8500L9270M3470L16317L05598J36703L249J20332l6247J11687
7482G914739R4091K12786M4232O4470J32471J55646J98073O7701J24180J73780
7472I182169J36641J52449J18568J84910J10956J6014Q8557O3207m9779l8074
7462I965618j4290l1521R2048m9053J80425k1494Q3858L0197P6778M8293K40779
7451A0601638K12418N3492K18066M7940K67576O3299k4703j05972j96438k02941
$$ plain form
7524 5033755 5146881 5328339 5415148 5509474 5480894 5514154 5538325 5623295 5585522 5708374 5866709
7513 5866709 5750413 5629375 5727403 5520862 5592589 5554600 5623671 5803887 6049001 6172814
7503 6172814 6309519 6417961 6289809 6275871 6234954 6340124 6452035 6433909 6573546 6647295
7493 6647295 6775860 6874360 6913630 6957100 7273417 7579015 7715718 7718967 7839299 7803052 7914739
7482 7914739 8008830 8221616 8265848 8330318 8462789 8618435 8816508 8884209 9008389 9182169
7472 9182169 9318810 9471259 9589827 9774737 9885693 9901707 9990264 10053471 10003692 9965618
7462 9965618 9951328 9919807 10011855 9962802 10143227 10121733 10205591 10235788 10312566 10360859 10601638
7451 10601638 10814056 10867548 11085614 11133554 11401130 11464429 11439726 11333754 11137316 10934375
7441A0934375j20294k29415j56173j86224q1411j74709j91898j63714k17266k85251
7431I128020k96912l55439k33665k43128j98754l97629l57533k23954k09892k51432
7421F359682k68000j95697k79338j65641j54907q8280p3910j32080l34669j23147
7411D544013k6516j28152j00812n3809j57068n0958p8303n3627j28999j11521
7401C654248O4017j26191k4116k507L6720j16614j77973k2559k1566O1031j19524
7390C204966j04053m4422Q7225M9769m9231M1636k506l9169M7258p1188o32L2977
7378C152630j62657k2145J38696q6103k3507j8888M2902l6033j0066O0211j41494
7367B893546O2635m9315L2335P7321j2477O0695J02999j08615O4341J29731Q6397
$$ plain form
7441 10934375 10814081 10584666 10428493 10242269 10160858 9986149 9794251 9630537 9413271 9128020
7431 9128020 8831108 8475669 8242004 7998876 7800122 7402493 7044960 6821006 6611114 6359682
7421 6359682 6091682 5895985 5616647 5451006 5296099 5207819 5133909 5001829 4667160 4544013
7411 4544013 4517497 4389345 4288533 4234724 4077656 4026698 3948395 3894768 3765769 3654248
7401 3654248 3718265 3592074 3567958 3565451 3602171 3485557 3307584 3285025 3263459 3324490 3204966
7390 3204966 3100913 3056491 3143716 3193485 3144254 3185890 3183384 3144215 3191473 3120285 3119653 3152630
7378 3152630 2989973 2967828 3106524 3020421 2996914 2978026 3020928 2984895 2974829 3035040 2893546
7367 2893546 2956181 2906866 2939201 3016522 3004045 3064740 3167739 3059124 3123465 3253196 3339593
7356C339593J30060J16323P2178R8040J90095K12097J76032J21516M1707J02445
7346D600086J71084J32346K30812K44458K46419L85681L84032L82168M32922M41111
7336G651119M32799M73477O40494O95484P41538O49350Q35971Q84649P87286P18507
7326A4510674O75684N90064O81678O87426M81056M52610J28203K1970j41574k75276
7316A7812515n13056l57669j21962k51057j56375q6454k73818l49446n34398n76033
7306A4592247o15791p02949q46420r21947r32272q73280q59227q76749o80118
7297G283494n00407m00498m00993l70414l26440k62156j73337k71451k79116k01029
7287D097653j51047r9247j67415k91866j48526l5718o2567j15455m9448k7726
$$ plain form
7356 3339593 3469653 3585976 3658154 3756194 3946289 4158386 4334418 4455934 4497641 4600086
7346 4600086 4771170 4903516 5134328 5378786 5625205 6010886 6394918 6777086 7210008 7651119
7336 7651119 8083918 8557395 9197889 9893373 10634911 11284261 12120232 13004881 13792167 14510674
7326 14510674 15186358 15776422 16458100 17145526 17626582 18079192 18207395 18229365 18087791 17812515
7316 17812515 17299459 16941790 16819828 16568771 16412396 16325942 16052124 15702678 15168280 14592247
7306 14592247 13976456 13273507 12427087 11505140 10572868 9699588 8840361 7963612 7283494
7297 7283494 6783087 6382589 5981596 5611182 5284742 5022586 4849249 4577798 4298682 4097653
7287 4097653 3946606 3847359 3679944 3388078 3239552 3203834 3141267 3025812 2976364 2948638
7277B948638j96307j39820N1241O1612q9040q6072l7511j30317J64940j20625
7267B426739j44245j13271M3514j33010R9020p3099r9358j04055L8364p393P216
7256A940422j43312m9647p1487M9591Q8238j13391J10842K3216j74872p0844K156
7245A590912M1695k9109p520m5359m6886K2923K0867j60610R2070K0469n7766
7234A441686M9993O2925K2599j81773j39016O3858J01921K9044j36435J02622
7224A417424L1884O6271l0176l3942r9546L9656o0831K9237n5251o8422Q8819
7213A325123L42k6224l6914q7559Q6725n994N4888p449j14626j4682k1872o4232
7201A087526J12473k6833r4433n9596J35372k4729P7631M55L748Q3289k5801P8247
$$ plain form
7277 2948638 2752331 2612511 2663752 2725364 2636324 2550252 2512741 2382424 2547364 2426739
7267 2426739 2282494 2169223 2212737 2079727 2178747 2105648 2006290 1902235 1940599 1933206 1940422
7256 1940422 1797110 1747463 1675976 1725567 1813805 1700414 1811256 1834472 1659600 1588756 1590912
7245 1590912 1632607 1603498 1595978 1550619 1503733 1526656 1547523 1386913 1478983 1499452 1441686
7234 1441686 1491679 1554604 1577203 1395430 1256414 1320272 1422193 1451237 1314802 1417424
7224 1417424 1449308 1515579 1485403 1451461 1351915 1391571 1330740 1359977 1304726 1236304 1325123
7213 1325123 1325465 1299241 1262327 1174768 1261493 1255499 1310387 1302938 1188312 1173630 1151758 1087526
7201 1087526 1199999 1173166 1078733 1019137 1154509 1129780 1207411 1207866 1211614 1294903 1269102 1347349
7189A347349m8226j39621J63054l3320J13555j51759j8406n8150L8524J8868Q8966
7178A320834q2523m5622p758L8819M4575K3519j2751r5865l3239P7159K5506l1485
7166A221169o0531m8764J01374m8596J6319M8279K7409j3938M6710m8385p5004
7155A166042M0161n3108P9341m3914k1457L8740N7534j9814m5248N4O906R3941
7143A299178l3174M1313L5604j40813M7430m6815K5058j09917p620M2827n6505
7132A096566J20229n9550j2316p78R0111n7038n9215J403j8520J5050J13238o0120
7120A169060j1242r6991J100L8526j2223m9427J00495K6211n9572q161n0719P0045
7108A117102K923M9947j89032J32208j45578J16820m8984o7104R7961r3190M9671
$$ plain form
7189 1347349 1299123 1159502 1322556 1289236 1402791 1251032 1232626 1174476 1213000 1231868 1320834
7178 1320834 1238311 1192689 1184931 1223750 1268325 1291844 1279093 1183228 1149989 1227148 1252654 1221169
7166 1221169 1160638 1111874 1213248 1164652 1180971 1229250 1256659 1242721 1289431 1241046 1166042
7155 1166042 1206203 1153095 1232436 1188522 1167065 1205805 1263339 1243525 1198277 1198331 1205237 1299178
7143 1299178 1266004 1307317 1342921 1202108 1249538 1202723 1227781 1117864 1110244 1153071 1096566
7132 1096566 1216795 1157245 1144929 1144151 1234262 1177224 1118009 1119412 1100892 1115942 1229180 1169060
7120 1169060 1157818 1060827 1061927 1100453 1088230 1038803 1139298 1165509 1105937 1097776 1047057 1117102
7108 1117102 1120025 1169972 980940 1113148 967570 1084390 1035406 968302 1066263 973073 1022744
7097A022744O2351m2635P2586M27r2150M9938L7710P4474n2064j04738L0985J00297
7085A159925J6692p4580q548p8466J46700n6845O3984k2337l3868M4348m4217
7074A112788O3469O1594n4089l1702K1299L9116J29219J4958q6740N4539R6533
7063A420984J53213Q3732K59755K11587J10361J37127k3294k10801j23698k26268
7053A792698P9861k30770K4926k05152J24635j20832m7751J26393p3590J89560
7043A659978j23050O7435Q6202K2145N0988L7682K7117J37000K66527K42153L26627
7032B800804M03385L92705J19191j34411k18758m16060k36443l33930j14700q3882
7022B177901j61217j49143q2414p0803l8721M0191J77342n0776o5686M5190J40262
$$ plain form
7097 1022744 1085095 1042460 1115046 1115473 1023323 1073261 1110971 1185445 1133381 1028643 1059628 1159925
7085 1159925 1176617 1102037 1093489 1015023 1161723 1104878 1168862 1146525 1112657 1157005 1112788
7074 1112788 1176257 1237851 1183762 1152060 1173359 1212475 1341694 1356652 1269912 1324451 1420984
7063 1420984 1574197 1657929 1917684 2129271 2239632 2376759 2353465 2142664 2018966 1792698
7053 1792698 1872559 1641789 1666715 1461563 1586198 1465366 1417615 1544008 1470418 1659978
7043 1659978 1536928 1604363 1690565 1712710 1763698 1801380 1828497 1965497 2232024 2474177 2800804
7032 2800804 3204189 3596894 3716085 3581674 3362916 2946856 2710413 2376483 2261783 2177901
7022 2177901 2016684 1867541 1785127 1714324 1675603 1715794 1893136 1842360 1776674 1821864 1962126
7011A962126o2209J05011j67790K73692N9527P9944L32509R2057J93564p5837
7001B792594o8220k62013j31038r6205p2134j4247j72135o7604j3222K1426j04389
6990A812813L0692j4109n262K9502M0511O1238L511p907j23805J9264J86732n8976
6978A974204J12415j1707l812M2570Q5228m5094j27551K3174k5908r572l0129
6967A983818J14767J7545n5811K4261L4638Q1605J8684P800o0301j2046J04676
6956B259636P5640m7280M0276j902L4942q6455k040R9364J33586j8873n4075j7611
6944B415208J94730o7115L3745Q848r9478R1158L1376M1532J9471o024J9724n5910
6932B627265K01033L5721J3466J22134q380R5832J79648N427J88071J24890R3641
$$ plain form
7011 1962126 1899917 2004928 1837138 2110830 2170357 2250301 2582810 2674867 2868431 2792594
7001 2792594 2724374 2462361 2331323 2235118 2162984 2148737 1976602 1908998 1895776 1917202 1812813
6990 1812813 1843505 1829396 1824134 1853636 1894147 1955385 1958896 1950989 1827184 1846448 2033180 1974204
6978 1974204 2086619 2074912 2071100 2113670 2198898 2153804 2026253 2049427 2023519 2013947 1983818
6967 1983818 2098585 2116130 2060319 2084580 2119218 2200823 2219507 2227307 2167006 2154960 2259636
6956 2259636 2335276 2287996 2328272 2326370 2361312 2274857 2272817 2372181 2505767 2486894 2432819 2415208
6944 2415208 2609938 2542823 2576568 2585416 2485938 2577096 2608472 2650004 2669475 2663451 2683175 2627265
6932 2627265 2828298 2864019 2877485 2999619 2991239 3087071 3266719 3272146 3460217 3585107 3678748
6921C678748J47330K25684K09260J64169Q6216m2085O7272J17560J26971J61309
6911D942434J24071r4005R6460K69138K97105l7555J31010K53649L38836L62360
6901F683503K16141J21998j66975m7945k79942R5458j16966k8246O7610J99823
6891F744459J41544J65057J74834j08890J09711J73853J06636J76056J62319J42972
6881G988551o4909L9533O8587n0571P9701o1627J8498J49577L56891K88071J53769
6870H966071N3401j18367j91853l00041j86938o3479r3918R1600L3671P46r404
6859H181489l779k1948j23614k3876n5813j0080J39818P9609j16169m8504j20423
6848G876710J2904n3261r3348L4010j631R1369N8200J92140J82695M0514m795
$$ plain form
6921 3678748 3826078 4051762 4261022 4425191 4511407 4469322 4536594 4654154 4781125 4942434
6911 4942434 5066505 4972500 5068960 5338098 5635203 5597648 5728658 5982307 6321143 6683503
6901 6683503 6899644 7021642 6854667 6806722 6526780 6622238 6505272 6477026 6544636 6744459
6891 6744459 6886003 7051060 7225894 7117004 7226715 7400568 7507204 7683260 7845579 7988551
6881 7988551 7923642 7963175 8031762 7981191 8060892 7999265 8017763 8167340 8524231 8812302 8966071
6870 8966071 9019472 8901105 8709252 8409211 8222273 8158794 8064876 8156476 8190147 8190893 8181489
6859 8181489 8177710 8155762 8032148 8008272 7952459 7942379 8082197 8161806 8045637 7997133 7876710
6848 7876710 7889614 7836353 7743005 7777015 7775384 7866753 7924953 8117093 8299788 8340302 8335507
6837H335507K59401j40187N8591L7627L4888J11818L9271K21204J16393J41378
6827I215891J01459j10612J92987J55019Q8339K17728J76604K79589L43863K21182
6817A0882049K28330L30394K45481m5057J21354O7441J71700J37596R8249K20181
6807A2457718J10796K90445K05924K13927P5231L96889K15549K52211M54121K24992
6797A4897803L94168M76473M45036M91359M83490M56835M27588N43386M53917
6788A9070055L49366O25380O62408O98572N64989O23189P31270Q55937R54190
6779B5135356J153118J174126J182740J389953J608104J704880J924743K324606
6771C7597626K748328L368888M457550N467093O823165Q561945J0737780J4916594
$$ plain form
6837 8335507 8594908 8454721 8513312 8550939 8585827 8697645 8736916 8958120 9074513 9215891
6827 9215891 9317350 9206738 9399725 9554744 9643083 9860811 10037415 10317004 10660867 10882049
6817 10882049 11110379 11440773 11686254 11641197 11762551 11829992 12001692 12139288 12237537 12457718
6807 12457718 12568514 12858959 13064883 13278810 13354041 13750930 13966479 14218690 14672811 14897803
6797 14897803 15291971 15768444 16213480 16704839 17188329 17645164 18072752 18616138 19070055
6788 19070055 19419421 20044801 20707209 21405781 21970770 22593959 23325229 24181166 25135356
6779 25135356 26288474 27462600 28645340 30035293 31643397 33348277 35273020 37597626
6771 37597626 40345954 43714842 48172392 53639485 60462650 69024595 79762375 94678969
6763I4678969K3097048L6387867M2952618K9680844P393429j4419243k7700979
6756A92070553l0655147k6682281k0478729j4802945j0381034p453041n067640
6749G6549736l037217j638269j97961P57425J860891K924735M350696N758159
6741H7328195P594814R979941J2554017J6308940K1343102L1393485M9590818
6734B36093312P2228383P3974732M6085288M596546l3542010n6031886o0230214
6727B83174151n3225997m2045230l1202613k3301590j7133733j2499323r073818
6720I4691847o643074m455579k869452j476615j38868J259174K841002M245892
6712H7454327O180274P912062J0641988J4848311K2636983L2632908L7643415
$$ plain form
6763 94678969 117776017 154163884 197116502 226797346 234190775 219771532 192070553
6756 192070553 161415406 134733125 114254396 99451451 89070417 81617376 76549736
6749 76549736 73512519 71874250 71676289 72433714 74294605 77219340 81570036 87328195
6741 87328195 94923009 104902950 117456967 133765907 155109009 186502494 236093312
6734 236093312 308321695 382296427 428381715 432978261 399436251 343404365 283174151
6727 283174151 229948154 187902924 156700311 133398721 116264988 103765665 94691847
6720 94691847 88048773 83593194 80723742 79247127 79108259 80367433 83208435 87454327
6712 87454327 93634601 101546663 112188651 127036962 149673945 182306853 219950268
6705B19950268K7013661N647077j5575058k9543980l3437430l0013613k3703275
6698A20337650j7353182j2701701r342000p247380n311701l774768k780200j655987
6690F0170731q02982O1721N03450O53677O41800J11721o06075j388857j951358
6681E7393828k404371k466762k508412k351708j895471j668400j409879q64767
6673D1824058k47293j95N94961Q82207R36254R72732P81678N33460L50451L17531
6663D6945844K57109L03408M26732O22960L92968J44419j54292o06757j201984
6654D7130407j343944j649096j774924k017671k044443j485001j409101j286267
6646C4119960q07795m21759k91547j44708r9392j89710m20347o00767o65337n49603
$$ plain form
6705 219950268 246963929 252611006 237035948 207491968 174054538 144040925 120337650
6698 120337650 102984468 90282767 80940767 73693387 68381686 64606918 61826718 60170731
6690 60170731 59367749 59429470 59932920 60586597 61228397 61340118 60734043 59345186 57393828
6681 57393828 54989457 52522695 50014283 47662575 45767104 44098704 42688825 41824058
6673 41824058 41576765 41576570 42171531 43053738 43989992 44962724 45744402 46277862 46628313 46945844
6663 46945844 47202953 47506361 47933093 48556053 48949021 49093440 48939148 48332391 47130407
6654 47130407 45786463 44137367 42362443 40344772 38300329 36815328 35406227 34119960
6646 34119960 33312165 32890406 32598859 32454151 32354759 32165049 31744702 31143935 30478598 29928995
6636B9928995l98478k61587m9578K38832L86566J57846M7599k20111l89671n22659
6626B8917754n12072q24041n92087p01528o03051o09015n33575o41903l48263
6617B3552219j98915k31811J2758N8330J47029n366J21674J41788J89856K97578
6607B4085140L53846M93701O33523N32571N22052L97960K46388K99256K8620k80043
6597B7313014q1340j62083K12712L28978M35372Q98738Q25013O12109J86557p5328
6587C0493742l66405k26571j48299K54513M38339O37424N66671Q87752Q90491
6578C3427657Q14295M48007L13169M2813l57978m60273m63110k82067J64438P42309
6568C4389260J575581J717405J485434L93381l49502o92640o78023l49053P1223
$$ plain form
6636 29928995 29530517 29268930 29219352 29458184 29844750 30002596 30050195 29830084 29440413 28917754
6626 28917754 28405682 27581641 26989554 26288026 25684975 25075960 24542385 23900482 23552219
6617 23552219 23353304 23121493 23134251 23192581 23339610 23334244 23455918 23597706 23787562 24085140
6607 24085140 24438986 24932687 25566210 26098781 26620833 27018793 27265181 27564437 27593057 27313014
6597 27313014 27231674 27069591 27282303 27611281 28046653 28945391 29770404 30382513 30569070 30493742
6587 30493742 30127337 29900766 29752467 30006980 30445319 31082743 31649414 32537166 33427657
6578 33427657 34241952 34689959 35003128 35045941 34687963 34227690 33764580 33482513 33646951 34389260
6568 34389260 35964841 37682246 39167680 39561061 39211559 38518919 37840896 37491843 37563066
6559C7563066J30071l08j94215m13122l89248j66958j47573k05465J5326j13434
6549C6078140j89462k91591m16895l52701J8707L73611P19066N31254M26977k87292
6539C6609814l0766j39329J35404P43687J272565J707785J564155R71891K2887
6530D2858093q00627j025042j064811j061576j169938r47151r24618q23988o25815
6521C4414527k16383o8887M09351Q01629R12450R64043Q26794P36822O16994N07543
6511C9904883L34398O00239O16147P09010O82031O92982P01865N77657N59786
6502D5378998j45012n97919r34785j097894o67103k64465N47140R89013J331032
6493D4539005J622605J606955J174029O34305l78033j101308j351477j310006
$$ plain form
6559 37563066 37693137 37692829 37498614 37085492 36696244 36529286 36381713 36176248 36191574 36078140
6549 36078140 35888678 35597087 35180192 34827491 34846198 35219809 35938875 36470129 36897106 36609814
6539 36609814 36579048 36439719 36575123 37318810 38591375 40299160 41863315 42835206 42858093
6530 42858093 42057466 41032424 39967613 38906037 37736099 36788948 35864330 35040342 34414527
6521 34414527 34198144 34129257 34538608 35340237 36252687 37216730 38043524 38780346 39397340 39904883
6511 39904883 40239281 40839520 41455667 42164677 42846708 43539690 44241555 44819212 45378998
6502 45378998 45233986 44636067 43701282 42603388 41936285 41671820 42218960 43207973 44539005
6493 44539005 46161610 47768565 48942594 49576899 49198866 48097558 46746081 45436075
6485D5436075j282354o92023n53207P9590J96605N99641N00950L04l76340o60180
6475D3249061j045173p00654n76437m24201J30187M82523O40713Q67490Q20913
6466D3444422O58399P51962Q10147R13320J128556J509594J406813J230371N83392
6457E2436976r2977r22392j358146j540591j450467j049829q18135n97232k79224
6448D4327983J9665L75644O07390P55784J261412J560623J989740K211864K534188
6439E5644293K352644K492944K311294K056932J602383J469249J400282J679658
6431G1009679K112581K160082K467404K473920K569728K883393L326122L815713
6423I2818622M620112N440027O139062O110515N396985L384150J043250j777216
$$ plain form
6485 45436075 44153721 43461698 42908491 42988081 43184686 43784327 44285277 44285581 43909241 43249061
6475 43249061 42203888 41503234 40926797 40502596 40632783 41115306 41756019 42623509 43444422
6466 43444422 44102821 44854783 45664930 46578250 47706806 49216400 50623213 51853584 52436976
6457 52436976 52343999 51421607 50063461 48522870 47072403 46022574 45204439 44607207 44327983
6448 44327983 44347648 44723292 45330682 46086466 47347878 48908501 50898241 53110105 55644293
6439 55644293 57996937 60489881 62801175 64858107 66460490 67929739 69330021 71009679
6431 71009679 73122260 75282342 77749746 80223666 82793394 85676787 89002909 92818622
6423 92818622 97438734 102878761 109017823 115128338 120525323 123909473 124952723 123175507
6415A23175507l619949m596423m719935l951911l063914j937512j193039l61174
6407I9731650J56307P55224J594671K561717L758133M993481N996157O614867
6399A26162207O626012N935477M689699L040902J959860J998593L113729L586215
6391A57112694K941218O09968k525025m841548o864048p420312p634834o907920
6383A24470193o066264m885258l725640k519816j557623o18725L4044K17809O46927
6374A05995647Q17964J048024J515681K037165K307651K224345J158677o40023
6366A16465131k894853m580789o103840o337386o191289n544738m588958l973517
6358G6249761l274207k700364k004361j626069j017764m40702R1708M61766K20473
$$ plain form
6415 123175507 119555558 114959135 110239200 106287289 103223375 101285863 100092824 99731650
6407 99731650 99887957 100643181 102237852 104799569 108557702 113551183 119547340 126162207
6399 126162207 132788219 138723696 143413395 146454297 148414157 150412750 153526479 157112694
6391 157112694 160053912 160663880 158138855 153297307 146433259 139012947 131378113 124470193
6383 124470193 118403929 113518671 109793031 107273215 105715592 105096867 105130911 105348720 105995647
6374 105995647 106813611 107861635 109377316 111414481 113722132 115946477 117105154 116465131
6366 116465131 113570278 108989489 102885649 96548263 90356974 84812236 80223278 76249761
6358 76249761 72975554 70275190 68270829 66644760 65626996 65186294 65278002 65739768 65960241
6349F5960241K71523M45007O76719Q85343J099392R38475P32114M95561R1057
6340G1595432K10496J71497J6678k13508m44259m18271m79436m74308m61146m71842
6330F9031333o19363k67735l81790k68292n4670J39593O85213P87993P94917Q52399
6320G0699598K90851K96284J76228K1128J96419K23581K8751m6499Q0095K61074
6310G2227510K04299K67962K11417K0235J71314K3851j29881n6373p9386P4371
6300G2935319j54252M7530l9971J84029k1328j41132k2325J86378L35880M72072
6290G3782200K36015J46235J19336K74885J79883J42984M08964K41069J25203
6281G5656774J81044j68535k51297p03638r32288j198494j362711j331795j207646
$$ plain form
6349 65960241 66231764 66676771 67353490 68238833 69338225 70276700 71008814 71504375 71595432
6340 71595432 71805928 71977425 71994103 71780595 71336336 70918065 70438629 69964321 69503175 69031333
6330 69031333 68411970 68144235 67762445 67494153 67439483 67579076 68264289 69052282 69847199 70699598
6320 70699598 70990449 71286733 71462961 71484089 71680508 71904089 71932840 71886341 71966436 72227510
6310 72227510 72431809 72699771 72911188 72931423 73102737 73126588 72996707 72940334 72860948 72935319
6300 72935319 72781067 72828597 72788626 72972655 72951327 72810195 72787870 72974248 73310128 73782200
6290 73782200 74018215 74164450 74283786 74558671 74738554 74881538 75290502 75531571 75656774
6281 75656774 75837818 75669283 75417986 74714348 73782060 72583566 71220855 69889060 68681414
6272F8681414j027165r99846p55544l56154j91809R8161L71984M59280K01376
6263F6481697K44621L05049J49564j71994m6577m45886m72785p70883q81414j069345
6253F3322047j303783j400284j243118j160262j273086r34923j036432r24350
6245E4045809p86475m30617r4286P7082L12312J14695l8282l49584p39823m80805
6235E1630026k86717j29267N2135N3106k58973k41984l05350o50264l84687p0944
6225D9407081q2062L37049N44165Q41507R11556J384565J652957K037564K027905
6216E9062287J683814Q35667l1357q05003j062830j177094j034888o51470n06871
6207E6312255n93178n70016o69456m73179o1173K29422M97789P35471N84420P76362
$$ plain form
6272 68681414 67654249 66654403 65898859 65542705 65350896 65449057 65821041 66280321 66481697
6263 66481697 66726318 67031367 67180931 67008937 66962360 66516474 66043689 65272806 64391392 63322047
6253 63322047 62018264 60617980 59374862 58214600 56941514 56006591 54970159 54045809
6245 54045809 53259334 52828717 52734431 52811513 53123825 53238520 53200238 52850654 52110831 51630026
6235 51630026 51343309 51214042 51266177 51319283 51060310 50818326 50512976 49862712 49478025 49407081
6225 49407081 49325019 49662068 50206233 51047740 51959296 53343861 54996818 57034382 59062287
6216 59062287 60746101 61581768 61550411 60745408 59682578 58505484 57470596 56819126 56312255
6207 56312255 55719077 55149061 54479605 54006426 53945253 54174675 54672464 55407935 55992355 56768717
6197E6768717J047222J079169J127474R86106J001349M08366J43610l89496o00533
6188F1571984o50021p25706l87440j87009j80615Q8795J70902L35499K73417M12083
6178F0721889M98524P82166P85318R10778R47193O98194P49521P09869J78725
6169F6982177K5261k94549p44156o76992o98469m06869k70249M5758k69127j56843
6159F3535942k87543m26968m05531n23712m63424m53703m52897m05893l87325
6150E9728946k43339m54674n32397o91411p45868j081378j115007j296592j555652
6141E2012628j542963j635320j426008j264231j054793q82987q56043j005992
6133D2344291j069735r25479q83466o08193n77857j41599j06755j36311n27498
$$ plain form
6197 56768717 57815939 58895108 60022582 61008688 62010037 62418403 62562013 62172517 61571984
6188 61571984 60921963 60196257 59808817 59621808 59441193 59529988 59700890 60036389 60309806 60721889
6178 60721889 61220413 62002579 62787897 63698675 64645868 65344062 66093583 66803452 66982177
6169 66982177 67007438 66712889 65968733 65291741 64593272 64186403 63916154 63961912 63692785 63535942
6159 63535942 63248399 62821431 62415900 61892188 61428764 60975061 60522164 60116271 59728946
6150 59728946 59485607 59030933 58498536 57807125 57061257 55979879 54864872 53568280 52012628
6141 52012628 50469665 48834345 47408337 46144106 45089313 44206326 43350283 42344291
6133 42344291 41274556 40349077 39465611 38857418 38279561 38137962 38031207 37894896 37367398
6124C7367398o14570r88987j038032q41701r15363p99695r51074r31834r25938
6115B9360204p04591n18024m59133r5657J7105p534m7435j80428o3212j88189
6105B7113106L32578O53254J225156J504345J042975L76726o80974j307041j499975
6096B8760150j558181j413411j038019q91922o21691o55540m26308m04988j21551
6087B1628539r753N37J56781r5030K45356R4229J20713K45134L74021L39145N44523
6076B3644195P98819M61327J42288k64277p76978n57347o33002j90829o1286P0235
6066B2633145J87126M7674K04386k2213O4148j5917k88696j64281j35886k29857
6056B2279629j27314K76k16663o81868p75834q34922o21702m33123k88095k13827
$$ plain form
6124 37367398 36752828 35763841 34725809 33884108 32968745 32169050 31217976 30286142 29360204
6115 29360204 28655613 28137589 27678456 27582799 27599904 27592370 27544935 27364507 27301295 27113106
6105 27113106 27445684 28098938 29324094 30828439 31871414 32248140 31567166 30260125 28760150
6096 28760150 27201969 25788558 24750539 23858617 23236926 22581386 22155078 21750090 21628539
6087 21628539 21618786 21619323 21776104 21681074 21926430 22020659 22141372 22386506 22760527 23099672 23644195
6076 23644195 24443014 24904341 25046629 24782352 24005374 23448027 22815025 22624196 22562910 22633145
6066 22633145 22820271 22867945 23072331 23050118 23114266 23098349 22809653 22645372 22509486 22279629
6056 22279629 22152315 22152591 21935928 21254060 20478226 19643304 19021602 18588479 18300384 18086557
6046A8086557j01164Q6547J60942K07018L51608L94949L35955L27733N59986L39624
6036B0749755K93085K07162Q7627j13360L6476j12343k54243n68596o12353p82796
6026A8930414o62686p21848n49517n29346l29909k99531r0812Q1494K22119R892
6016A6060270P3615J02791j47120l13735l81065m33230k36862j08150j21943k00263
6006A4294308R4308j11215j57711k3597q8123k29661J3605o8636N7788l7286j0712
5995A3733068J14906K67020L91825L38537J32693j29103k96674m97112n65258
5986A3489902m03411k50158k36206j64671p8570j27440n9939J13850q316K92892
5976A2567933O3115m3675j13784K4698r8939l8652j22519j85402R1451l43678
$$ plain form
6046 18086557 17985393 18071940 18232882 18439900 18791508 19186457 19522412 19850145 20410131 20749755
6036 20749755 21042840 21250002 21337629 21224269 21260745 21148402 20894159 20325563 19713210 18930414
6026 18930414 18267728 17545880 16996363 16467017 16137108 15837577 15746765 15828259 16050378 16060270
6016 16060270 16133885 16236676 16089556 15775821 15394756 14961526 14724664 14616514 14494571 14294308
6006 14294308 14388616 14277401 14119690 14096093 14007970 13778309 13791914 13723278 13781066 13743780 13733068
5995 13733068 13847974 14114994 14506819 14845356 14978049 14848946 14552272 14055160 13489902
5986 13489902 13086491 12836333 12600127 12435456 12356886 12229446 12169507 12283357 12275041 12567933
5976 12567933 12631048 12587373 12473589 12498287 12399348 12360696 12238177 12052775 12144226 11800548
5966A1800548q0865j70385k58815k37925p7324L7992o611J52119K26244J32494
5956A1517472K73920L85189L16112P7335j91196m24489m07800o91143n82912l60402
5946I912086m75859j55336j98250q2490j92009p3250m2273p3967M9138j1588K08631
5935H864833L70122K15140J92759J70658J25729J71491j3533p9153r4312m01154
5925I522580l20687l70366k52059l02152l67720j96187j92277n5809q7679j81790
5915G195854j10541o0711n8287n965m1599N0018l7133k5583Q7738J502J28218
5904G123511R9080J12869J04455J47308r8032j66851j32642k12241j34187q4512
5894F758758j30435l6774j31271r4104N1564k1278M293q3597r9018J14451M6184
$$ plain form
5966 11800548 11719683 11549298 11290483 11052558 10975234 11013226 11006615 11158734 11384978 11517472
5956 11517472 11791392 12176581 12492693 12570028 12378832 11954343 11546543 10855400 10272488 9912086
5946 9912086 9436227 9280891 9082641 9000151 8808142 8734892 8692619 8618652 8667790 8656202 8864833
5935 8864833 9234955 9450095 9642854 9813512 9939241 10110732 10097199 10018046 9923734 9522580
5925 9522580 9201893 8831527 8579468 8277316 7909596 7713409 7521132 7465323 7377644 7195854
5915 7195854 7085313 7024602 6966315 6960350 6918751 6968769 6931636 6906053 6993791 6995293 7123511
5904 7123511 7222591 7335460 7439915 7587223 7489191 7322340 7189698 6977457 6843270 6758758
5894 6758758 6628323 6591549 6460278 6366174 6417738 6396460 6400753 6317156 6218138 6332589 6378773
5883F378773m3004l9343k6016O8897R0361K6409J80192J69129Q5925J90818K4899
5872G107040j10889j44334m1716j36802j37719l2563j93559m1011p6259L8732
5862F230920n9529J42716j24905n4250R5018m985k5508O1744p5122L0772j004
5851F215867p1813J15104o8601O2565R0572P2491L0574o0020k0432n3019J00729
5840F414017p2416j11050j9171q6134N0518K2012N7607L8200j4942Q7467J2409
5829F378517L8938p4199r640M1110q5227Q9823J2268K5738K4448o0609j116k3535
5817F356516J1265k2411R1382J01438K0864l3894L7235J20529J6831l5089J20626
5806F785292n3645K91702j0151M0909p5070R9404o7925J58593J20088k1288O1860
$$ plain form
5883 6378773 6335769 6296426 6270410 6339307 6429668 6456077 6636269 6805398 6891323 7082141 7107040
5872 7107040 6996151 6851817 6810101 6673299 6535580 6503017 6309458 6268447 6192188 6230920
5862 6230920 6171391 6314107 6189202 6134952 6229970 6224985 6199477 6261221 6186099 6216871 6215867
5851 6215867 6144054 6259158 6190557 6253122 6343694 6416185 6446759 6386739 6366307 6313288 6414017
5840 6414017 6341601 6230551 6211380 6125246 6175764 6197776 6255383 6293583 6278641 6366108 6378517
5829 6378517 6417455 6343256 6333616 6374726 6289499 6379322 6391590 6417328 6441776 6381167 6380051 6356516
5817 6356516 6367781 6345370 6436752 6538190 6559054 6525160 6562395 6682924 6699755 6664666 6785292
5806 6785292 6731647 7023349 7013198 7054107 6979037 7078441 7010516 7169109 7289197 7267909 7329769
5795G329769K0595J75250k4121J35295L7982N2365R71K69977O3010J48312l9606
5784H169799R7275Q123R5882J24042O7853K60617J46961J7707J88248R6976J78685
5773I452168R5877L5292J38553J62625J21671J31461J55924J42776P3009M47K06969
5762A0716772K79884L3745P5172J47753J95390K26144J87569J13195R5268Q8541
5752A2159433J40898K37641K66078P1506J98788J09483K60760L10332Q9806K35658
5742A4080383K04548K2137K24516N8977K85059K08741J05271J00529K47268J40651
5732A5678080J63553R0076N9649J51774K11687J50346K51433N3651K98195q521
5722A7099923K22618J50106K20956J38197J61844J81039K43978K33076K49335
$$ plain form
5795 7329769 7350364 7525614 7501493 7636788 7674770 7727135 7728106 7998083 8061093 8209405 8169799
5784 8169799 8267074 8275197 8371079 8495121 8562974 8823591 8970552 8988259 9176507 9273483 9452168
5773 9452168 9548045 9583337 9721890 9884515 10006186 10137647 10293571 10436347 10509356 10509803 10716772
5762 10716772 10996656 11030401 11105573 11253326 11448716 11674860 11862429 11975624 12070892 12159433
5752 12159433 12300331 12537972 12804050 12875556 13074344 13183827 13444587 13754919 13844725 14080383
5742 14080383 14284931 14307068 14531584 14590561 14875620 15084361 15189632 15290161 15537429 15678080
5732 15678080 15841633 15931709 15991358 16143132 16354819 16505165 16756598 16810249 17108444 17099923
5722 17099923 17322541 17472647 17693603 17831800 17993644 18174683 18418661 18651737 18901072
5713A8901072J11685J97216J77164J92140J06965J74505J12613K00390J30506
5704B0304256J48543K36355K51700J62843J50446K96774J83800L54054J13868
5695B2202639K48510K32546P0712K27014K49400l9188K61816j0131K2249J32640
5685B3598207j6519J3528m364j35740N8121q527L649O5594M0046l8624P7986J67359
5673B3820716J39676K14173R0657J89576J47582J73320K53702L64359K27367K49869
5663B5870997O6208K24621K1109j6659j12507r7393j18466p0149k03948k43727
5653B5320086k35824j87165k39085k07259j94050k21887j10351j45427l8942j07525
5643B3632571J4783K2278n8692N0431k1246J77899J18063J39005O9848J19180
$$ plain form
5713 18901072 19012757 19209973 19387137 19579277 19686242 19860747 19973360 20173750 20304256
5704 20304256 20452799 20689154 20940854 21103697 21254143 21550917 21734717 22088771 22202639
5695 22202639 22451149 22683695 22754407 22981421 23230821 23191633 23453449 23443318 23465567 23598207
5685 23598207 23581688 23595216 23590852 23455112 23513233 23504706 23508355 23573949 23613995 23575371 23653357 23820716
5673 23820716 23960392 24174565 24265222 24454798 24602380 24775700 25029402 25393761 25621128 25870997
5663 25870997 25937205 26161826 26182935 26166276 26053769 25956376 25837910 25767761 25563813 25320086
5653 25320086 25084262 24897097 24658012 24450753 24256703 24034816 23924465 23779038 23740096 23632571
5643 23632571 23647354 23669632 23610940 23661371 23640125 23818024 23936087 24075092 24144940 24264120
5633B4264120J22826K2180J28966p255q9074o360M4695J6366j05163P3191P6774
5622B4541266j12159L556K6937J38052O0088J6783L7819K08226J05942J41970
5612B5168480J54616R0819J87231J06237J43789J77914K42422J78532J78706P4435
5602B6703181J93890L61085M2273K49164J98243J61227K16127K65890J05112J28956
5592B8625148Q8798L42900J94333K98730J76945N8519J67808K59718K50458Q5041
5582C0548398J66057J02760J85106K86794L59992J19805J72118P8070L15810K33659
5572C2568569J46206P9031O0725J17028l2717o681J01486j33715p0874o769j5260
5561C2807029O3461L8318q5305M2891k32458j77158j31580o9458Q551J1249J9333
$$ plain form
5633 24264120 24386946 24409126 24538092 24530837 24441763 24435403 24480098 24496464 24391301 24464492 24541266
5622 24541266 24429107 24432663 24459600 24597652 24657740 24674523 24712342 24920568 25026510 25168480
5612 25168480 25323096 25413915 25601146 25707383 25851172 26029086 26271508 26450040 26628746 26703181
5602 26703181 26897071 27258156 27300429 27549593 27747836 27909063 28125190 28391080 28496192 28625148
5592 28625148 28713946 29056846 29251179 29549909 29726854 29785373 29953181 30212899 30463357 30548398
5582 30548398 30714455 30817215 31002321 31289115 31649107 31768912 31941030 32019100 32334910 32568569
5572 32568569 32714775 32793806 32854531 32971559 32938842 32932161 33033647 32899932 32829058 32822289 32807029
5561 32807029 32870490 32908808 32823503 32866394 32633936 32456778 32325198 32255740 32264291 32275540 32294873
5550C2294873J95351K21882K93645K01896L06378K82806J08761K11858P1805J24136
5540C4313391j35474k97840k4748k88418j86740n09234m70235k15965l18724j47034
5530C1718979j53657p2465o0577k56334p9970m15316l78137k40725m28749k41726
5520B9391323k63837k16971j01388r8053k14016k07133J5478j07902q3802k32836
5510B7880863j95705j10296l48937k20883l90985k73965l56279k23276l23682
5501B5436855k41617j15988k52680k99720L2764n9354M5641P6493j55422k57908
5491B4209064k35438j31643k96263k48935k34686q4787k78841L024k6309O196
5481B2681382j84227J43309j3339K5534r0523O1076M9023j15326Q7779M8601J04509
$$ plain form
5550 32294873 32490224 32712106 33005751 33207647 33514025 33796831 33905592 34117450 34189255 34313391
5540 34313391 34177917 33880077 33855329 33566911 33380171 32870937 32400702 32184737 31866013 31718979
5530 31718979 31565322 31492857 31432280 31175946 31095976 30680660 30302523 30061798 29633049 29391323
5520 29391323 29127486 28910515 28809127 28711074 28497058 28289925 28305403 28197501 28113699 27880863
5510 27880863 27685158 27574862 27225925 27005042 26614057 26340092 25983813 25760537 25436855
5501 25436855 25195238 25079250 24826570 24526850 24559614 24500260 24545901 24622394 24466972 24209064
5491 24209064 23973626 23841983 23545720 23296785 23062099 22977312 22698471 22701495 22675186 22681382
5481 22681382 22497155 22640464 22627125 22652659 22562136 22623212 22672235 22556909 22644688 22693289 22797798
5470B2797798o6207L0668j951P866P2129n8891J14537K7300M6782R9788L132p0888
5458B3002063J6218j44682R0276j49081J5410J29066Q1651L3538J9141K6874k2593
5447B3097881j53272j6142l5971P9473n4584m0185m571J03321j6745r4901l5049
5436B2829255n5571k1932l2574R7526n0166o5403J5775j14380J3254j22250j13624
5425B2379910N5956O0703p6394J3459p5753K2296q2257j51117J2803j21238l7010
5414B2001358j400Q6943M0156m9068p5894j85669J80552j8823J9017J35096K7067
5403B2159335K3993K2499m151n1708p1910O7955J1463L3866J35982P6947J6488
5392B2420759K44782P6936M20580J59629Q8032K05514K66066Q8515K81176K08133
$$ plain form
5470 22797798 22731591 22762259 22760308 22768174 22840303 22781412 22895949 22923249 22970031 23069819 23072951 23002063
5458 23002063 23018281 22873599 22963875 22814794 22830204 22959270 23040921 23074459 23093600 23120474 23097881
5447 23097881 22944609 22928467 22892496 22971969 22917385 22877200 22872629 22975950 22959205 22864304 22829255
5436 22829255 22773684 22751752 22719178 22816704 22766538 22701135 22716910 22602530 22615784 22493534 22379910
5425 22379910 22435866 22496569 22420175 22433634 22357881 22380177 22297920 22146803 22159606 22038368 22001358
5414 22001358 21999958 22086901 22127057 22077989 22002095 21816426 21996978 21978155 21997172 22132268 22159335
5403 22159335 22183328 22205827 22201676 22149968 22078058 22146013 22157476 22191342 22327324 22404271 22420759
5392 22420759 22665541 22742477 23163057 23322686 23410718 23616232 23882298 23970813 24251989 24460122
5382B4460122J41701J51341K64377K94719K00732K82042Q9954K92259J37716K71809
5372B6586772K37915J84570O1956L03870J81490L06097J12971L86587K52532J87635
5362B8802395L32972L36602K88750J39592K75777J79311J57657J26231K00524
5353C0839811J73941J63891N0325J87183J70221K04917m2224K11590n6944j3844
5343C1888867K9831N0358j2627m5734O9783J16450j14072K37610j50236J86339
5333C2256569Q0969J54021J8687O8249M4054N6873L92387P2247L72165L84197
5323C3900418L93945N35531M69242N23516M55500O26319M86119N28597O74330
5314C8593517M62086P58560R89100J118944J264233J439018J824277K236070K798149
$$ plain form
5382 24460122 24601823 24753164 25017541 25312260 25512992 25795034 25884988 26177247 26314963 26586772
5372 26586772 26824687 27009257 27071213 27375083 27556573 27862670 27975641 28362228 28614760 28802395
5362 28802395 29135367 29471969 29760719 29900311 30176088 30355399 30513056 30639287 30839811
5353 30839811 31013752 31177643 31227968 31415151 31585372 31790289 31748065 31959655 31902711 31888867
5343 31888867 31918698 31969056 31956429 31910695 31980478 32096928 31982856 32220466 32070230 32256569
5333 32256569 32337538 32491559 32510246 32578495 32622549 32679422 33071809 33144056 33516221 33900418
5323 33900418 34294363 34829894 35299136 35822652 36278152 36904471 37390590 37919187 38593517
5314 38593517 39055603 39814163 40803263 41922207 43186440 44625458 46449735 48685805 51483954
5305E1483954L340787M168027N799150Q348725J2841494J6134210J3960640P999092
5297A24076079K273798j044533P07645N538878O344623J791080m927520j0566519
5289A24193531j3035194j2237435r772454o844089m494501k496077q45720L40939
5281G4809000R10319J022674J282936J438896K498648L190620M530899O308184
5273I5992176Q673817J2059274J6338205K0133334K1731267K0139115J8057268
5266B13124456J9361070K2562757K4579778K2221225J3280237N182682o513192
5259C13799013k0742234l0868080l5594225l4384853k9049680k2486478j6471112
5252A24202351j1828221q693330o348491m494201k978384j725150r14368L75497
$$ plain form
5305 51483954 54824741 58992768 64791918 73140643 85982137 102116347 116076987 124076079
5297 124076079 126349877 125305344 126012989 131551867 137896490 139687570 134760050 124193531
5289 124193531 111158337 98920902 89148448 82304359 77809858 75313781 74468061 74809000
5281 74809000 75719319 76741993 78024929 79463825 81962473 85153093 89683992 95992176
5273 95992176 104665993 116725267 133063472 153196806 174928073 195067188 213124456
5266 213124456 232485526 255048283 279628061 301849286 315129523 320312205 313799013
5259 313799013 293056779 262188699 226594474 192209621 163159941 140673463 124202351
5252 124202351 112374130 103680800 97332309 92838108 89859724 88134574 87220206 87595703
5244H7595703J630286L017676M773676N931518O918285Q215504J0954886J6059836
5236A45097370K4651530L3284153L4302223K7663478J8154429P072028o540861
5229B83684350j9319537k8157802l1829744l0087308k5238041j9510646j3901431
5222A15639841j0247467q252995p134486o269842n436585m719489l830280l088614
5214F6660083k556359k085825j481581j179944q62424p98996p73313o47536p11764
5205E5562341o25692n46561n64527l82561l32632j64522k61909r1854j98822k31439
5195E2161822k96910n39928n24549p77152m96025n41038n06840m08756l03462
5186D7767162m31622l47270l07852j92195k26747L9213k07506k63553j51304l45118
$$ plain form
5244 87595703 89225989 92243665 97017341 102948859 109867144 118082648 129037534 145097370
5236 145097370 169748900 203033053 237335276 264998754 283153183 290225211 283684350
5229 283684350 264364813 236207011 204377267 174289959 149051918 129541272 115639841
5222 115639841 105392374 97139379 90004893 83735051 78298466 73578977 69748697 66660083
5214 66660083 64103724 62017899 60536318 59356374 58493950 57694954 56921641 56274105 55562341
5205 55562341 54936649 54390088 53825561 53443000 53110368 52945846 52683937 52592083 52393261 52161822
5195 52161822 51864912 51324984 50800435 50023283 49527258 48986220 48479380 48070624 47767162
5186 47767162 47335540 46988270 46680418 46488223 46261476 46300689 46093183 45829630 45678326 45333208
5176D5333208m14767l93470k55954k12883k79117L3045k29308k73983r9154k08825
5166D2998792m1126j00416j96999k2493j19761j28498m2526o7015Q5112O0018
5156D2425088L41836N26225M61801P44430J011177J323657J951173K267424J821709
5147E2874520J476142R99649Q38626P45133J157728K020841L586108N654032P670798
5138G7023577P949990P330178N782190K758710j049306m526881o594247o989897
5130H1684314o275666n144315l858131k734301j870219r00383M7084O62936J172802
5121F2784121J545108J976326K693511L606502M908153O614853Q689424J2616618
5113A05434616J8146288K4387330K6560273K3236674J5367382N266772n162811
$$ plain form
5176 45333208 44918441 44524971 44269017 44056134 43777017 43810062 43580754 43306771 43207617 42998792
5166 42998792 42957666 42857250 42660251 42637758 42517997 42389499 42346973 42279958 42365070 42425088
5156 42425088 42766924 43293149 43754950 44499380 45510557 46834214 48785387 51052811 52874520
5147 52874520 54350662 55350311 56188937 56934070 58091798 60112639 63698747 69352779 77023577
5138 77023577 84973567 92303745 98085935 100844645 99795339 95268458 88674211 81684314
5130 81684314 75408648 70264333 66406202 63671901 61801682 60901299 60948383 61611319 62784121
5121 62784121 64329229 66305555 68999066 72605568 77513721 84128574 92817998 105434616
5113 105434616 123580904 147968234 174528507 197765181 213132563 218399335 213236524
5106B13236524j2210844j6513917j7659763j6275100j3124529j0082476p293874
5099A20076021o100618n668823o135890n750960n222288m092173k686785j129189
5091H3289295O70733K037648L619580N345197P639675J0929954J4704761J8967480
5083A47204323K3589781K5970474K1792022J3648344M113949m830684j1804261
5076B19683948j5187422j5184993j2627241j0319388r546092r607565j0644876
5069A36566371j1556475j1460556j0484577q490657o758458m924608l703993k296957
5061G6890090q63110k55785N42230J442421K956727N360897Q318271J0298357
5053A04690098J1298536J1255108J0317118P222807K265657k269351n581677p028014
$$ plain form
5106 213236524 201025680 184511763 166852000 150576900 137452371 127369895 120076021
5099 120076021 113975403 108306580 102170690 96419730 91197442 87105269 84418484 83289295
5091 83289295 83960028 85997676 89617256 94962453 102602128 113532082 128236843 147204323
5083 147204323 170794104 196764578 218556600 232204944 236318893 231488209 219683948
5076 219683948 204496526 189311533 176684292 166364904 156818812 147211247 136566371
5069 136566371 125009896 113549340 103064763 94574106 87815648 82891040 79187047 76890090
5061 76890090 76026980 75771195 76313425 77755846 80712573 86073470 94391741 104690098
5053 104690098 115988634 127243742 137560860 144783667 147049324 144779973 139198296 132170282
5045A32170282o968078n235642m397783n315822p126758q527241r046632q332834
5037G7219492o847866n292219l916757l068437k256461j662016j220792q72398
5029E2082546q39767k73864j82208M58630Q80123J796205K778634L934226L089367
5020F3723892J895467M41947l89377L1332M88995K7707j028635k323678l057618
5011E9810032l273927k894970k420019j807039j327612j157180o85424n67190
5003D5676671l50543k75304j97111k05236m6126L5436k7302J81937K57991L20588
4993D5371001J49413K91448J95183J29147J06168O8408Q6890j5629K5582l6263
4983D6371348J13687J26271J2120j31362q3405j68198J46734N0614L7272P025
$$ plain form
5045 132170282 125202204 119966562 115568779 110252957 103126199 94598958 85552326 77219492
5037 77219492 70371626 65079407 61162650 58094213 55837752 54175736 52954944 52082546
5029 52082546 51242779 50968915 50786707 51245337 52125460 53921665 56700299 60634525 63723892
5020 63723892 65619359 66061306 65671929 65703261 66192256 66219963 65191328 62867650 59810032
5011 59810032 56536105 53641135 51221116 49414077 48086465 46929285 46243861 45676671
5003 45676671 45326128 45050824 44853713 44648477 44602351 44637787 44610485 44792422 45050413 45371001
4993 45371001 45520414 45811862 46007045 46136192 46242360 46310768 46397658 46382029 46407611 46371348
4983 46371348 46485035 46611306 46623426 46492064 46408659 46240461 46387195 46437809 46475081 46482106
4973D6482106J11907L01715L02155L16776M42796L62765N08303O34592N59471
4964E0022586N24497P06502O65706P56005P34798Q32895O95678P69639N25291
4955E6233597L75328K90327J14034L9371Q9221N2334J37364J30046K1611k17324
4945E7265909j36074q1361O5715J75757L49371N42782O65912R74940J096353J070236
4935F1989540J206596J201952J063416J248711J257974J210328J148152R45526
4927G1272195R63770J079162J193838J118210R62914N11163N4278m4859k73216
4918G6837455j48817K27941M83034Q98890R18867J252579Q40275R22291O43209
4909H2875724O25555M72398J017679J178754J790655K319717K968256L323973
$$ plain form
4973 46482106 46594013 46895728 47197883 47514659 47957455 48320220 48828523 49463115 50022586
4964 50022586 50547083 51253585 51919291 52675296 53410094 54242989 54938667 55708306 56233597
4955 56233597 56608925 56899252 57013286 57052657 57141878 57194212 57331576 57461622 57483233 57265909
4945 57265909 57129835 57048474 57114189 57289946 57639317 58182099 58848011 59822951 60919304 61989540
4935 61989540 63196136 64398088 65461504 66710215 67968189 69178517 70326669 71272195
4927 71272195 72235965 73315127 74508965 75627175 76590089 77101252 77155530 77110671 76837455
4918 76837455 76688638 76916579 77399613 78298503 79217370 80469949 81310224 82232515 82875724
4909 82875724 83501279 83973677 84991356 86170110 87960765 90280482 93248738 96572711
4901I6572711L888115L857093L283153K132295P79806p89512j640879k273247
4893A05809535k224330k045190j607606j102585p33926l16261M03K86689O92470
4884I8759199J032745J165201J693144J873833K145723K539121K812050K987970
4876A15008986K608183J691063M98062q50095j727973k125527k234275j671242
4868A11197182j373064m71697L12503R67012J356794J387108J376791J097852
4860A15850481O91716O69530P64962O56980J123567J677474J808923K058674J917820
4851A27220127J688512J234211O21250J65057k45170j73058m1255N81695J288682
4842A32340051J901164K024982J556984J067396O94887M48040P99288J082225
$$ plain form
4901 96572711 100460826 104317919 107601072 109733367 110513173 109723661 108082782 105809535
4893 105809535 103585205 101540015 99932409 98829824 98095898 97779637 97780040 98066729 98759199
4884 98759199 99791944 100957145 102650289 104524122 106669845 109208966 112021016 115008986
4876 115008986 117617169 119308232 119806294 118956199 117228226 115102699 112868424 111197182
4868 111197182 109824118 109352421 109664924 110631936 111988730 113375838 114752629 115850481
4860 115850481 116542197 117211727 117976689 118633669 119757236 121434710 123243633 125302307 127220127
4851 127220127 128908639 130142850 130764100 130929157 130683987 130510929 130469674 131051369 132340051
4842 132340051 134241215 136266197 137823181 138890577 139585464 140033504 140832792 141915017
4834A41915017J255699R98158M34058k73014r74712j044468j150538r01993r46065
4825A39312142j194716j492065j675399j833258j502390j117311o73906J18052
4817A29941149M96180J404420J806268K491572K914049L262555L594508L723799
4809A49634500L631245L572101L686527L449239L210108K676711J491412N4842
4801A71406685j192091k189496k199287j913665j296210q58199p08929k05952
4793A60842856M46787J159763J696491K010405K354131K446528K576143K179932
4785A75713036J919204J718735J703993K022668K525298L035427L181203K717066
4777A94536630K238974J612327P38073q1851o51724j017848r45065n31187q1080
$$ plain form
4834 141915017 143170716 144168874 144602932 144329918 143355206 142310738 141160200 140258207 139312142
4825 139312142 138117426 136625361 134949962 133116704 131614314 130497003 129823097 129941149
4817 129941149 130437329 131841749 133648017 136139589 139053638 142316193 145910701 149634500
4809 149634500 153265745 156837846 160524373 163973612 167183720 169860431 171351843 171406685
4801 171406685 170214594 168025098 165825811 163912146 162615936 161757737 161048808 160842856
4793 160842856 161289643 162449406 164145897 166156302 168510433 170956961 173533104 175713036
4785 175713036 177632240 179350975 181054968 183077636 185602934 188638361 191819564 194536630
4777 194536630 196775604 198387931 199126004 199044153 198392429 197374581 196429516 195898329 195817249
4768A95817249M92301R71280J444885J876330K168622K424287K394230J695395
4760B09284579J233579P40161Q25905O89455J087392J346761K064466K820559
4752B20092857L190354L717660L064258J831657K64267j386146k856693l912626
4744B24005588m089255l952488l601962l099646k759796k778504k810869k698410
4736A98214658k468385j865193j520951j057281p29813m88036j22200O45336J368649
4727A91976784J749655K021237J573807R26372L30751j8029k00004n79693o33143
4718A97147737r99726j024770o84215l58706j48036K34022Q08683J088132Q97452
4709A96960573O16458K71239R6461J75864K47961r582r10201k222747l558372
$$ plain form
4768 195817249 196309550 197280830 198725715 200602045 202770667 205194954 207589184 209284579
4760 209284579 210518158 211258319 212084224 212773679 213861071 215207832 217272298 220092857
4752 220092857 223283211 227000871 230065129 231896786 232161053 230774907 227918214 224005588
4744 224005588 219916333 215963845 212361883 209262237 206502441 203723937 200913068 198214658
4736 198214658 195746273 193881080 192360129 191302848 190573035 190084999 189962799 190608135 191976784
4727 191976784 193726439 195747676 197321483 198247855 198578606 198560577 198360573 197780880 197147737
4718 197147737 196148011 195123241 194439026 194080320 193932284 194166306 194974989 196063121 196960573
4709 196960573 197577031 197848270 197944731 198120595 198368556 198358974 197448773 195226026 191667654
4700A91667654m790643m999938n189447n069006m583029l735884l255590k761199
4692A57282918k465147k404448k489665k424919k116741j982003j713997j358391
4684A40327607j061302p81563o35807p67345j260760j968449k455286k832415
4676A28564680k716946k670567k472799k393695k577043k590623k577462k490815
4668A08074730k563322k461142k251590k307225k046655k088117j683534j450070
4660I1223075j356615j140808j306351j386700j192789j206479j108697p23073
4652H1801563p09290o53743m59863l03982k24828O1019N2173M1486L3529l36855
4642G9301209m25107o85161o24107j89236k78327K30211K57060K91090O03378
$$ plain form
4700 191667654 186877011 181877073 176687626 171618620 167035591 163299707 160044117 157282918
4692 157282918 154817771 152413323 149923658 147498739 145381998 143399995 141685998 140327607
4684 140327607 139266305 138484742 137848935 137081590 135820830 133852381 131397095 128564680
4676 128564680 125847734 123177167 120704368 118310673 115733630 113143007 110565545 108074730
4668 108074730 105511408 103050266 100798676 98491451 96444796 94356679 92673145 91223075
4660 91223075 89866460 88725652 87419301 86032601 84839812 83633333 82524636 81801563
4652 81801563 81092273 80438530 79978667 79674685 79449857 79510876 79563049 79604535 79638064 79301209
4642 79301209 78876102 78190941 77566834 77377598 77099271 77329482 77586542 77877632 78481010
4633G8481010L89441N32807M74701M10749K81785J13212l4819O8633Q9690J56979
4623H0964188K01003K40348L12350K64276R5487K60543K21772J62897M54130L20292
4613H3497286J49262J32365J67322o7389M0678J78797L54192L93955O02588K95151
4603H5744207M996p51247j367691j752161j976694k021633j759735j486419j113485
4594G3520138p32095q01560p81470p50058j122635r90170j075719j047995q65425
4585F5353011o86611o87550l81103R5857M11844N76665J69191l35480r96499j272144
4575F2247181j289616j287227j212956q38056n51162n30476o33164j044156j293188
4566E3567180j523298j765109j703670j637678j344173j229650r17801o51842
$$ plain form
4633 78481010 78870451 79403258 79877959 80288708 80570493 80683705 80648886 80717519 80807209 80964188
4623 80964188 81165191 81405539 81717889 81982165 82077652 82338195 82559967 82722864 83176994 83497286
4613 83497286 83646548 83778913 83946235 83878846 83919524 84098321 84452513 84846468 85449056 85744207
4603 85744207 85749203 84997956 83630265 81878104 79901410 77879777 76120042 74633623 73520138
4594 73520138 72788043 71986483 71205013 70454955 69332320 68342150 67266431 66218436 65353011
4585 65353011 64666400 63978850 63597747 63693604 64105448 64682113 64851304 64515824 63519325 62247181
4575 62247181 60957565 59670338 58457382 57619326 57068164 56537688 55904524 54860368 53567180
4566 53567180 52043882 50278773 48575103 46937425 45593252 44363602 43445801 42793959
4558D2793959o10422p12662j050363j121271j328577j335859j338000j064746
4550C4232059r30655j002334o35707n99565n56443m76799n74488m45470k50544
4541B8760054l56122j27498k26708k60660l44098l39013l73209l26120n71988
4532B5834638n94760m98067m85487k52527l66732l87104k56433j97280k67412
4523B2528836j80086m21969k76128k98638n05842k94250l60518l27553l82145
4514A9481707j62607l56478j79097k00145k71366k78529j31414k12483n8744k68482
4504A7362362j35078n5113j29493m7873j34282j01843j48223k42536j97318j85763
4494A5984840j40960o321o5510r868j42191j33424j22357j92013q0751j74670
$$ plain form
4558 42793959 42183537 41470875 40420512 39299241 37970664 36634805 35296805 34232059
4550 34232059 33301404 32299070 31663363 31063798 30507355 30030556 29456068 29010598 28760054
4541 28760054 28403932 28276434 28049726 27789066 27444968 27105955 26732746 26406626 25834638
4532 25834638 25239878 24741811 24256324 24003797 23637065 23249961 22993528 22796248 22528836
4523 22528836 22348750 21926781 21650653 21352015 20846173 20551923 20191405 19863852 19481707
4514 19481707 19319100 18962622 18783525 18583380 18312014 18033485 17902071 17689588 17630844 17362362
4504 17362362 17227284 17172171 17042678 16994805 16860523 16758680 16610457 16367921 16170603 15984840
4494 15984840 15843880 15837559 15772049 15762181 15619990 15486566 15364209 15172196 15091445 14916775
4484A4916775l12500l40347j99018j20203o8218j80860k80921k28093p2514j03310
4474A3010791j76488k14880J1992r7727k5401K4047n6742k08683o1661l02217
4464A1903031N8796n7717r6532m5256j5863j02154O6242p1666p4893j34309j30999
4453A1298680j34191J7028j92001J8250j54931j42268j6600o8161n7468m9895
4443A0518443o4247n3756J0467q1776J9121r4121k06930R8349j04007r4272J43182
4432A0090453j8176J28875K461K3154Q0523n4944K11519J37895J77941J49145
4422A0928846J92797J09803k309j1363j23814o8106q0554j8513M9398K20224q714
4411A1187695J08856K84225L7920J28479R9101M3628j3441J36651J68392O3235
$$ plain form
4484 14916775 14604275 14263928 14064910 13944707 13876489 13695629 13414708 13186615 13114101 13010791
4474 13010791 12834303 12619423 12631415 12533688 12508287 12532334 12475592 12266909 12205248 11903031
4464 11903031 11961827 11904110 11807578 11762322 11746459 11644305 11710547 11638881 11563988 11429679 11298680
4453 11298680 11164489 11181517 10989516 11007766 10852835 10710567 10693967 10625806 10568338 10518443
4443 10518443 10454196 10400440 10410907 10329131 10348252 10254131 10047201 10145550 10041543 9947271 10090453
4432 10090453 10072277 10201152 10203613 10226767 10307290 10252346 10463865 10601760 10779701 10928846
4422 10928846 11121643 11231446 11229137 11217774 11093960 11025854 10945300 10926787 10976185 11196409 11187695
4411 11187695 11296551 11580776 11618696 11747175 11846276 11889904 11876463 12013114 12181506 12244741
4401A2244741J01927J43381P3331J5626L39116M86048L76971M48921L77992M43398
4391A5051452J65691J67820Q6243m086J72436K54899K35718M45711K41710M51255
4381A7268849N06390N46324O74539O97985O77564Q28633R15522R81741Q03683
4372B3901230Q68761P56294Q85452O77987M26837R9620k54929j28581m97030o63348
4362B6072293o45403q09365n16049n83483m80283k26208l11078J6167p9946K07013
4352B2643658K30924M01538O64189Q40949J091446J328542J557735J786379J965934
4343C2511294J928718J833046J283712Q29838j09863n60898j296175j419644j604863
4334C3395165j569590j388376j117104j138923q44033o13686m58134l37986q5989
$$ plain form
4401 12244741 12346668 12490049 12563380 12579006 12918122 13404170 13781141 14230062 14608054 15051452
4391 15051452 15217143 15384963 15471206 15467120 15639556 15894455 16130173 16575884 16817594 17268849
4381 17268849 17775239 18321563 18996102 19694087 20371651 21200284 22115806 23097547 23901230
4372 23901230 24769991 25526285 26411737 27089724 27516561 27616181 27361252 27232671 26735641 26072293
4362 26072293 25426890 24617525 24101476 23517993 23037710 22811502 22500424 22516591 22436645 22643658
4352 22643658 22874582 23276120 23940309 24781258 25872704 27201246 28758981 30545360 32511294
4343 32511294 34440012 36273058 37556770 38386608 38276745 37715847 36419672 35000028 33395165
4334 33395165 31825575 30437199 29320095 28181172 27337139 26723453 26265319 25927333 25841344
4325B5841344M6166J6896K21116K56860L47746M30476L27630N56690O20929O20968
4315B9286821O89914M31787L09999P3446k45178n11863o42534r04159q81108r73865
4305B6633260r25774q30538q18207p81323o45076m01834m07541k71072k60020
4296B1291875j28253o8697k8645N9264N7671Q7025K55350J81440K95555J43151
4286B2145736K72959L64032K97568L56851M00800O22336L26231O05352O49288
4277B6041153P10127P99890J079468J073785J240710J250568J408301J711411
4269C5315413J953470K099944K233078K311965J969133J208940O8593j273997
4261D5886539k242242l152587l071158l289876k810834k447471k246035k023301
$$ plain form
4325 25841344 25887510 25904406 26125522 26382382 26730128 27160604 27488234 28044924 28665853 29286821
4315 29286821 29976735 30408522 30718521 30791967 30546789 30034926 29392392 28488233 27607125 26633260
4305 26633260 25707486 24876948 24058741 23277418 22632342 22230508 21822967 21551895 21291875
4296 21291875 21163622 21094925 21066280 21125544 21183215 21270240 21525590 21707030 22002585 22145736
4286 22145736 22418695 22782727 23080295 23437146 23837946 24460282 24786513 25391865 26041153
4277 26041153 26751280 27551170 28630638 29704423 30945133 32195701 33604002 35315413
4269 35315413 37268883 39368827 41601905 43913870 45883003 47091943 47160536 45886539
4261 45886539 43644297 40491710 37420552 34130676 31319842 28872371 26626336 24603035
4253B4603035j846097j655829j454871j150385j050972q37596n73742o87411m51598
4244A4894534n98331n05827m63070n01952l58777m03622k35975k93038j59250
4235A1374692j96869K4233j75508J10353J52534R595J87076J96545P3116o9553
4225A1686214k25335m32569m51007m07469k75972k59591J5724k0333r0523j3804
4215I525335k77336k03849j15769k87112j52199k38637P1291p0790R6737J5846
4205H363517M687j20346Q7011K52175J98926K27511K16230R5469j22774k20500
4195H981906k23737j87065j93166J9885m1066Q9462k9541m2204q011q079m6185
4184H312199p5861q0301r9287j04053m4642o3691m0567J15534k1303P7265K76523
$$ plain form
4253 24603035 22756938 21101109 19646238 18495853 17444881 16607285 16033543 15346132 14894534
4244 14894534 14296203 13790376 13327306 12825354 12466577 12062955 11826980 11533942 11374692
4235 11374692 11177823 11202056 11026548 11136901 11289435 11299030 11486106 11682651 11755767 11686214
4225 11686214 11460879 11028310 10577303 10169834 9893862 9634271 9649995 9629662 9539139 9525335
4215 9525335 9247999 9044150 8928381 8641269 8489070 8250433 8321724 8250934 8347671 8363517
4205 8363517 8368204 8247858 8334869 8587044 8785970 9013481 9229711 9325180 9202406 8981906
4195 8981906 8758169 8571104 8377938 8397823 8356757 8446219 8416678 8374474 8366463 8358384 8312199
4184 8312199 8236338 8156037 8056750 7952697 7908055 7844364 7803797 7919331 7898028 7975293 8251816
4173H251816K92914K81995Q5379j02987l26786k56083k76602r5927j27633J0811
4163G736897j44640q7469m4153m0552p2923m2796j2050k040N9735J08980k6557
4152G432432j55005j62922m5622o0678j90510j69683M1147l6514j32580o7460
4142F452605r2090k45842l04313k60107o2719k02558j32275j04077p150q8105
4132D953369p7000j26358P0710K3659q6283j04953O6745j70749r5254n3602n1255
4121D349029J9722j25025r2266j87406r2206j10087j00408j19859r2779J00013
4111C548728l20921O5178l1933k4028k8545J6119p2926k0344n2401J14197o0829
4100C132295O8435m3512L8629K3929o9933N6227j0670J11098N1236J62026J30608
$$ plain form
4173 8251816 8544730 8826725 8912104 8809117 8482331 8226248 7949646 7853719 7726086 7736897
4163 7736897 7592257 7504788 7460635 7420083 7347160 7304364 7292314 7290274 7350009 7458989 7432432
4152 7432432 7277427 7114505 7068883 7008205 6817695 6648012 6689159 6652645 6520065 6452605
4142 6452605 6360515 6114673 5810360 5550253 5487534 5284976 5152701 5048624 5041474 4953369
4132 4953369 4876369 4750011 4820721 4844380 4758097 4653144 4719889 4549140 4453886 4400284 4349029
4121 4349029 4368751 4243726 4151460 3964054 3871848 3761761 3661353 3541494 3448715 3548728
4111 3548728 3227807 3292985 3261052 3237024 3208479 3224598 3151672 3131328 3078927 3193124 3132295
4100 3132295 3200730 3157218 3195847 3219776 3149843 3206070 3195400 3306498 3357734 3519760 3650368
4089C650368O8522P9955K31566K47608J29218L39487J60472J36068J29748R8636
4079E271648J32625J37493O0296L73385J96309K94545M72510P58017N93145J071476
4069I361449J357914J507178J610387J111380J59474l92706q57906j221113j088094
4060A1547963r48250o37808m47615l24228O9952J68258l2954O7846N2083K7674
4050I542921K66769M20118L82018N35125M36533O17737N04072O21689Q51991J297388
4040A5476361K052905L102660K967618J940637M48991r47433k000536k304569
4032B0736634k384476j964281j727680j265064j055139p51838m57444m03156k02844
4023A0524712k26029j21909L4267K80561K29698L18228N63680L09664Q2324j26455
$$ plain form
4089 3650368 3718890 3798845 4030411 4278019 4407237 4746724 4907196 5043264 5173012 5271648
4079 5271648 5404273 5541766 5602062 5975447 6171756 6466301 6938811 7696828 8289973 9361449
4069 9361449 10719363 12226541 13836928 14948308 15107782 14715076 13857170 12636057 11547963
4060 11547963 10599713 9961905 9514290 9190062 9260014 9428272 9395318 9463164 9515247 9542921
4050 9542921 9809690 10229808 10611826 11146951 11583484 12201221 12705293 13326982 14178973 15476361
4040 15476361 17529266 20631926 23599544 25540181 25989172 25041739 23041203 20736634
4032 20736634 18352158 16387877 14660197 13395133 12339994 11588156 11130712 10727556 10524712
4023 10524712 10298683 10176774 10211041 10491602 10721300 11039528 11603208 11912872 11995196 11868741
4013A1868741n8280K33525K55275P45922R08546Q46313L98776j42941n46054q84663
4003A3625160j023575j095332q33214o56170n34361o49402m99380k50313k69797
3994G813616j13409J2052J714j27931J83049j1575J86395O2909q2184j90887r0560
3983G643189k14166k35434j43536j88144j71204O4476j83567o31J1027Q4293Q5426
3972F751729J78643K13303K67260K10908M36484K86189K43892n0202l14189m72051
3962G751966n78075m50486n26297m18022m15399k58924k02022j96987r1163q4742
3952D529849O196q6651j05775K9322P7412n1648J91888P4389J13508K41200L4289
3941E053979J66449J10038m8074j86622k62164l51390k78042l80540k57784k35676
$$ plain form
4013 11868741 11810461 12043986 12299261 13045183 13953729 14800042 15198818 15055877 14509823 13625160
4003 13625160 12601585 11506253 10673039 10016869 9482508 8833106 8333726 8083413 7813616
3994 7813616 7700207 7712259 7713973 7586042 7769091 7757516 7943911 8006820 7924636 7733749 7643189
3983 7643189 7429023 7193589 7050053 6861909 6690705 6755181 6571614 6570983 6582010 6666303 6751729
3972 6751729 6930372 7143675 7410935 7621843 8058327 8344516 8588408 8538206 8224017 7751966
3962 7751966 7173891 6723405 6197108 5779086 5363687 5104763 4902741 4705754 4614591 4529849
3952 4529849 4536045 4449394 4343619 4372941 4450353 4398705 4590593 4664982 4778490 5019690 5053979
3941 5053979 5220428 5330466 5282392 5095770 4833606 4482216 4204174 3823634 3565850 3330174
3931C330174k44273j60130k32224q7962n5573N0267j34542j18831m3695r6834
3921B206377J056m1283q9376k9715r1105j4969q1162j74727j33098j37043l018
3910A411937M6863j10979r8640j17348L8534N166Q4458j4937k90378p5103K0752
3899I00325P7268n0593r5332m9860J15184o0045M5937j38184o5323O5585o1079
3888F83883O2961j0273p1333j45972R1732K1585K1512j47560l5935Q7288R0954
3877F48842j25385p8926j7301k8527P7446R5159l0484j39884o0908L2768N41n7973
3865C15368k8697j04880O3770J47937m8045r897k6234o0138N632R181L5701J2546
3853C12244o3099m0467m8612K0794P0134n1881L885r8472N3939L1746K7192l9078
$$ plain form
3931 3330174 3085901 2925771 2693547 2605585 2550012 2600279 2465737 2346906 2303211 2206377
3921 2206377 2207433 2166150 2076774 2047059 1955954 1940985 1859823 1685096 1551998 1414955 1411937
3910 1411937 1458800 1347821 1249181 1131833 1170367 1175533 1259991 1245054 954676 879573 900325
3899 900325 977593 927000 831668 781808 896992 836947 882884 744700 679377 744962 683883
3888 683883 746844 736571 665238 519266 610998 632583 654095 506535 470600 557888 648842
3877 648842 523457 444531 427230 398703 476149 571308 540824 400940 340032 372800 373341 315368
3865 315368 286671 181791 245561 393498 345453 335556 309322 249184 254816 263997 299698 312244
3853 312244 249145 208678 160066 180860 250994 199113 202998 104526 158465 190211 217403 178325
3841A78325j07784J53578r5964K0856m9569J2481j5872l5567J77493m7725l2379
3830A57873N783M4797l0284r5765o621J9557q1747P5184J44151q6764n2430k0317
3818G3417K6350L0422j3830P1227k9123N427m7256N8066L2480n2135L7043r0255
3806A01833l8638J77598J858j30932m913P113l1337M9847R5691j23890r4849M31
3794I812R8055k891n2356l5168J45369p3512J67028q8834j40810L8855m637N799
3782F6710p1148p4282J1944q5004J36787j2043M0221j57763K9401M8356M9289
3771a7532r7376M0510k9677J44381n4310K2414l6877m1180l6360N1860N3828l2068
3759c2387k6483n2986j451Q1848J53496j07845p4328q4010R1628L7897j36149
$$ plain form
3841 178325 70541 224119 128155 149011 99442 111923 96051 60484 237977 190252 157873
3830 157873 163656 208453 178169 82404 75783 95340 13593 88777 232928 146164 93734 73417
3818 73417 99767 130189 116359 187586 158463 163890 116634 174700 207180 155045 192088 101833
3806 101833 63195 240793 242651 111719 106806 113919 82582 132429 228120 104230 9381 9812
3794 9812 107867 104976 52620 17452 162821 89309 256337 167503 26693 65548 60911 66710
3782 66710 -4438 -78720 -66776 -151780 -14993 -27036 13185 -144578 -115177 -66821 -17532
3771 -17532 -114908 -74398 -104075 40306 -14004 8410 -28467 -69647 -106007 -54147 -319 -32387
3759 -32387 -58870 -111856 -113307 -31459 122037 14192 -60136 -144146 -52518 -14621 -150770
3748a50770j9328L618O87M5373K9389q5960L2139M3860N7869j96741N3428O3480
3736a22956j0971J1427j6901j8437j0576N3213o0935L7387L750l4351L203J7103
3724a49044Q2990J8324j00176J5091n2884P9506L7994l0248L705m1638k401K397
3712a36384q3202N9620j00485J20423K6550N157K2804n3648j05990j6911j22772
3701c84838J85497k1165J6038M554Q1050N5827q5923o5015J7029j21303O7895
3690b50354O7582R6801l284n0300j11421K6944O1244m0231O0601j08105L2455
3679b18068O1693k4780O8767o9670q0600N6420L2636k6554J09589k15746j19712
3668d26025J25643Q7902l9699J50535j12225N9348j2110q2378K5971Q327k07365
$$ plain form
3748 -150770 -170098 -166480 -165793 -120420 -91031 -176991 -144852 -100992 -43123 -239864 -186436 -122956
3736 -122956 -133927 -122500 -139401 -157838 -168414 -115201 -176136 -138749 -134999 -169350 -166147 -149044
3724 -149044 -66054 -47730 -147906 -132815 -185699 -106193 -68199 -98447 -94742 -136380 -138781 -136384
3712 -136384 -219586 -159966 -260451 -140028 -113478 -108321 -85517 -139165 -245155 -262066 -384838
3701 -384838 -199341 -220506 -204468 -199914 -118864 -63037 -148960 -213975 -196946 -318249 -250354
3690 -250354 -182772 -85971 -89255 -139555 -250976 -224032 -162788 -203019 -142418 -250523 -218068
3679 -218068 -156375 -181155 -112388 -182058 -262658 -206238 -173602 -200156 -90567 -306313 -426025
3668 -426025 -300382 -212480 -252179 -101644 -213869 -154521 -166631 -249009 -223038 -214711 -422076
3657d22076Q9101L6962l6013J04130J36730m0281l5087q5198n5618M6649n9028
3646c19729M5950M1868M5089L2523q6599K4067q1064j1848K4347J950P9207R7276
3634a06963q4592p0983j3144m8558J0787J1809k0932P6575M56k8732J41435j41269
3622b74111m7914J6383p2630M9130N5266p8138K3085P7106l5217k5760R5895j9451
3610b36356n5097k244l7050M6807J55982j2358n5234k8702n5268j77357J98634
3599b58243p5386J3331O0699j6707O6128o1013n7357J0659q5928q315l771N8979
3587c56924M570O8223O6108j57958M7217O5277J01725r0795o7277L9625N5690
3576b24519M6601j25766N704p4908j0236q655J08062K0970j08131R6123P390J7174
$$ plain form
3657 -422076 -332975 -296013 -332026 -227896 -91166 -131447 -166534 -251732 -307350 -260701 -319729
3646 -319729 -273779 -231911 -186822 -154299 -240898 -216831 -297895 -309743 -285396 -283446 -204239 -106963
3634 -106963 -191555 -262538 -275682 -324240 -313453 -301644 -322576 -246001 -245545 -274277 -132842 -274111
3622 -274111 -322025 -305642 -378272 -329142 -273876 -352014 -328929 -251823 -287040 -312800 -216905 -236356
3610 -236356 -291453 -293697 -330747 -283940 -127958 -140316 -195550 -224252 -279520 -456877 -258243
3599 -258243 -333629 -320298 -259599 -276306 -210178 -271191 -328548 -317889 -403817 -412132 -415903 -356924
3587 -356924 -352354 -284131 -218023 -375981 -328764 -263487 -161762 -252557 -319834 -280209 -224519
3576 -224519 -177918 -303684 -297980 -372888 -383124 -391779 -283717 -262747 -370878 -274755 -267365 -250191
3564b50191m7187j5847q6484K9404k9043N1345P9502p7890o2850L4679L7741J4241
3552c22580L0183L7245j9214J11228k05128m0786Q6491l6144l5538J31020q8258
3541c51481j7631N3597N3952q0113n4180p3529J38532M8525P2932j86189J5192
3530c80393l1991N8939l1810J20101j52910m3021R6241o3094K03932M427k14261
3519d33840O5469k8674J1494j9232L2561j47205K92267K8242p3404m0350j34640
3508d47312L5470L2841N5845O603j7711N4570k2172J88169j60273p8245j24923
3497d77138R3945R7143k08878O5417R3239l1024J23003o1854k7583m8156o5408
3486d47294l723J27445l1869k558K6115o873k841L91j08090K6064k0164J8443
$$ plain form
3564 -250191 -297378 -313225 -399709 -370305 -399348 -348003 -268501 -346391 -409241 -374562 -336821 -322580
3552 -322580 -292397 -255152 -274366 -163138 -368266 -409052 -322561 -358705 -394243 -263223 -351481
3541 -351481 -369112 -315515 -261563 -341676 -395856 -469385 -330853 -282328 -209396 -395585 -380393
3530 -380393 -412384 -353445 -385255 -265154 -418064 -461085 -364844 -427938 -224006 -219579 -433840
3519 -433840 -368371 -397045 -385551 -404783 -372222 -519427 -227160 -198918 -272322 -312672 -447312
3508 -447312 -411842 -379001 -323156 -316553 -334264 -279694 -301866 -113697 -273970 -352215 -477138
3497 -477138 -383193 -286050 -494928 -429511 -336272 -367296 -244293 -306147 -333730 -381886 -447294
3486 -447294 -451017 -323572 -355441 -357999 -331884 -338757 -341598 -341207 -449297 -423233 -443397 -424954
3474d24954O0851N9828k6435n4771j28818J66614j34278R3793j40704J44695o8353
3463d52532J35436j4878N2276k4954J4196j36671J35456j23681M6299O6816l2752
3452c34989K0053j22852j05907J17103N8242O648n6557J4204R3172P9242j26011
3441c57652L6641k9694k3392k5861j3414k5115n0045P2233Q7453m4808K6472m5196
3429c92378Q8348j37998J60427j20005L1650K5545K9938m4531j04163j4268P5723
3418d01712P9527L7887r7932l3725l8757R6779J48819k20415Q203Q9942q8883
3407d20267J9115K1359k6929L3445k8638N5681L5116N2003r9404J7612p4745J39415
3395b76237P551j07818M6517j00127J547L5779l2201N0658o5039R5595J1072j0577
$$ plain form
3474 -424954 -364103 -304275 -330710 -385481 -514299 -347685 -481963 -388170 -528874 -384179 -452532
3463 -452532 -317096 -331974 -279698 -304652 -290456 -427127 -291671 -415352 -369053 -302237 -334989
3452 -334989 -314936 -437788 -543695 -426592 -368350 -361702 -418259 -404055 -310883 -231641 -357652
3441 -357652 -321011 -350705 -374097 -399958 -413372 -438487 -488532 -416299 -328846 -373654 -347182 -392378
3429 -392378 -304030 -442028 -281601 -401606 -369956 -344411 -314473 -359004 -463167 -477435 -401712
3418 -401712 -322185 -284298 -382230 -415955 -454712 -357933 -209114 -429529 -421326 -331384 -420267
3407 -420267 -401152 -379793 -406722 -373277 -401915 -346234 -311118 -259115 -358519 -340907 -415652 -276237
3395 -276237 -268686 -376504 -329987 -430114 -428567 -392788 -424989 -374331 -439370 -343775 -332703 -343280
3383c43280N1610j40018L7090k3188J29467q3130K2541K5675P3995j58748l1642
3372d39628k7666J14203k7999J2359R6048j23262P3270p6047J747M3396j6655
3361c70234j14084J29649K2963J12162k3847l8482r4529L4699j49440J14492l994
3350c80645M2015J5826R9246j0326M9372p6977k8435m6166P0848J01979O9588
3339i3675O6490k0276q8636J26115j904Q6523R5424J86371L34577L07920K36138
3328A235067l9171j98995k81566k75394j92890j13056k29111M0505J2421q2699
3318a24889j1076r536j50606J4883J19245q8943P4044j18744p7793P7964N2207
3307b43244j30011l0768m7738M1379M7236j1412Q0186j49321M1854Q6391L965
$$ plain form
3383 -343280 -291670 -431688 -394598 -417786 -288319 -371449 -348908 -323233 -249238 -407986 -439628
3372 -439628 -467294 -353091 -381090 -368731 -272683 -395945 -322675 -398722 -396975 -353579 -370234
3361 -370234 -484318 -354669 -331706 -219544 -243391 -281873 -376402 -341703 -491143 -376651 -380645
3350 -380645 -338630 -322804 -223558 -233884 -184512 -261489 -289924 -336090 -265242 -163263 -93675
3339 -93675 -27185 -47461 -136097 -9982 -11886 74637 170061 356432 691009 998929 1235067
3328 1235067 1195896 996901 715335 439941 247051 133995 -95116 -54611 -42190 -124889
3318 -124889 -135965 -145501 -296107 -281224 -161979 -250922 -176878 -295622 -373415 -295451 -243244
3307 -243244 -373255 -404023 -451761 -410382 -363146 -374558 -294372 -443693 -401839 -315448 -311483
3296c11483R930l0227l5811P2120p7829l459o4557m3603O3699Q3429L3562o4406
3284c68635m8305J32374M890K3012j36672j35673J24324J10927o9441j21207j9759
3273e04165L4894J50954l0438m8005j14750Q9657J8750j2595Q9605J4152j08071
3262d20012L3828m8543n4532m5001j2767M7746O1751J51360J2516j30284j4321
3251d18259j2443Q8903p9728k09857R9368J8860K27944k2030l7181n7455m8131
3240d50009P3756j15469o9023P5895o850L7438m3115J65588m4822o3082N780m3598
3228d77511J1126N8948q3878n8992K42477n6477k8854J9264k592o6692K7954R2914
3216c22313p7692j31135J8658J52317R108j57920J4611P5134m0712J4151K6215
$$ plain form
3296 -311483 -301553 -331780 -367591 -295471 -373300 -376759 -441316 -484919 -421220 -337791 -304229 -368635
3284 -368635 -416940 -284566 -279676 -256664 -393336 -529009 -404685 -293758 -363199 -484406 -504165
3273 -504165 -469271 -318317 -348755 -396760 -511510 -421853 -403103 -415698 -326093 -311941 -420012
3262 -420012 -386184 -434727 -489259 -534260 -547027 -499281 -437530 -286170 -273654 -403938 -418259
3251 -418259 -430702 -341799 -421527 -631384 -532016 -513156 -285212 -307242 -344423 -401878 -450009
3240 -450009 -376253 -491722 -560745 -484850 -491700 -454262 -497377 -331789 -376611 -439693 -433913 -477511
3228 -477511 -466385 -407437 -491315 -550307 -307830 -364307 -393161 -373897 -376489 -443181 -415227 -322313
3216 -322313 -400005 -531140 -512482 -360165 -351057 -508977 -494366 -419232 -459944 -445793 -419578
3205d19578M463j6704K813l2794K4905k370L278k9751q870J54816j32768P4756
3193c77804j15465J20258n6173P215n2915j7302j02890J47035k4549L4205j06871
3182e45256J14405K1959j6640n4104J7494P422q98J8152m3251q6765J11742L8255
3170d17485N8562j37040r0545J18648l7174l1728M1901K7567r7411N9745M8639
3159d56321L4408k2237l2453J03212n4338j2338r7483K9841l8664J09731k4549
3148d61191J6652L4407L5123P861j8246p2591n5279N4856R1414K1554j28959n3078
3136e27477M0076K8582K4263p4805M1152m4576J43553m6865O2634j2612m7707
3125d13782L859q5653O3869k2351k3666m8968O0037N6262p9036P0114n1295o8038
$$ plain form
3205 -419578 -415115 -431819 -429006 -461800 -436895 -439265 -435987 -465738 -474608 -319792 -452560 -377804
3193 -377804 -493269 -373011 -429184 -421969 -474884 -492186 -595076 -448041 -472590 -438385 -545256
3182 -545256 -430851 -408892 -425532 -479636 -462142 -454720 -455618 -437466 -480717 -567482 -455740 -417485
3170 -417485 -358923 -495963 -586508 -467860 -505034 -536762 -494861 -467294 -564705 -504960 -456321
3159 -456321 -421913 -444150 -476603 -373391 -427729 -440067 -537550 -507709 -546373 -436642 -461191
3148 -461191 -444539 -410132 -375009 -367148 -385394 -457985 -513264 -458408 -366994 -345440 -474399 -527477
3136 -527477 -487401 -458819 -434556 -509361 -468209 -512785 -369232 -416097 -353463 -366075 -413782
3125 -413782 -409923 -495576 -431707 -454058 -477724 -526692 -466655 -410393 -489429 -419315 -470610 -538648
3113e38648P3350M6430r1545K3987k3633Q8004K3361j06614K7994J6934q2504
3102e42884Q2388k0745R3942m7088K5707j9548N6951j6869K0070J24383j82621
3091d26314l5282l6996n1557R671j2119R6290J6412O6693j02115Q3907l268j7749
3079d12427j46298O599J54324m2239k8266O7998J4110j15894L8164m46L6705k1387
3067d49057J24206j17331O4477j07791L3813O8112j56090P3900j2245k4773N7902
3056d44877k8374o2653l5040M8387Q0738N1427j63552J29164P4599k8949k1285
3045d00415n6477j462P464o3105L7417R108M0235o6114p9588J57132K2848M7141
3033c45816m9707p1641l0858l4281J63455o8943o8669q7683O6663r725k2149K5735
$$ plain form
3113 -538648 -465298 -418868 -510413 -486426 -510059 -422055 -398694 -505308 -477314 -460380 -542884
3102 -542884 -460496 -481241 -387299 -434387 -408680 -428228 -371277 -388146 -368076 -243693 -426314
3091 -426314 -461596 -498592 -550149 -540478 -552597 -456307 -439895 -373202 -475317 -391410 -394678 -412427
3079 -412427 -558725 -552126 -397802 -440041 -468307 -400309 -386199 -502093 -463929 -464375 -427670 -449057
3067 -449057 -324851 -442182 -377705 -485496 -451683 -383571 -539661 -465761 -478006 -502779 -444877
3056 -444877 -473251 -535904 -570944 -522557 -441819 -390392 -553944 -424780 -350181 -379130 -400415
3045 -400415 -456892 -458354 -450890 -513995 -476578 -467470 -427235 -493349 -572937 -415805 -392957 -345816
3033 -345816 -395523 -467164 -498022 -532303 -368848 -437791 -506460 -594143 -527480 -537205 -559354 -533619
3021e33619L5571P279J23007j03955k5020J11061j51915J9735N176l4407Q4806
3010d62281L0923m8737p1183k9027Q6246l3837j115L4118J09791j26594n7750
2999e69446J50020N6498k3393j30414j29000J35906K6746k1432K1010J9813J2741
2988d50951M5352O0009o2310j7443p6688q2778J54760o7428R5731j0739j13413
2977e25898P8072j0008j7861p6856M4976M7046l200K0101j7350L7904r2473P4420
2965d41127j08452J21058n0612Q2948l3229j05546k8281N3891M3827J6081L7719
2954d11723j65656J46509l6838J85727j26832k7665q9074l994K8174P6197j10785
2943e35960j0610L901O7541l5175J19774l2522K9699q2621O5083j0000r0891L4681
$$ plain form
3021 -533619 -498048 -490769 -367762 -471717 -496737 -385676 -537591 -517856 -512680 -547087 -462281
3010 -462281 -431358 -480095 -551278 -580305 -494059 -527896 -529011 -494893 -385102 -511696 -569446
2999 -569446 -419426 -362928 -386321 -516735 -645735 -509829 -483083 -504515 -483505 -463692 -450951
2988 -450951 -405599 -345590 -407900 -425343 -502031 -584809 -430049 -497477 -401746 -412485 -525898
2977 -525898 -447826 -457834 -475695 -552551 -507575 -460529 -463729 -443628 -460978 -423074 -515547 -441127
2965 -441127 -549579 -428521 -479133 -396185 -429414 -534960 -563241 -509350 -465523 -449442 -411723
2954 -411723 -577379 -430870 -467708 -281981 -408813 -436478 -525552 -529546 -501372 -425175 -535960
2943 -535960 -546570 -542669 -475128 -510303 -390529 -423051 -393352 -475973 -410890 -420890 -511781 -477100
2931d77100J349k0554O9704k5974j27404M2661N1384n2474J20812q8558r937J39028
2919c77063p2941K1376k11110J60984P5302Q151j92792k5311K5828K3984r598
2908e73190P4184j8429P5971O4850j80720J23939k485q0643R5297j94928J03209
2897e12945R643Q5940o2646M386O8267k8665o0523L9681J08660j56826K1620L3968
2885d49440j22713J10772P9196m6959p8517R328J2472l2221K6658n797O093N3835
2873d37293N6374l9966N127l9252j03526Q0878Q2963p1248L319m6831M2725l4127
2861e00857j2259o5212J74288n4411K2913N5496j08486j6140J6866n2964J52687
2850c88079j71880K0690L4154M2541N0514L8205o3041q1314Q9259m8502k8341
$$ plain form
2931 -477100 -475751 -496305 -426601 -452575 -579979 -537318 -485934 -538408 -417596 -506154 -516091 -377063
2919 -377063 -450004 -428628 -639738 -478754 -403452 -395301 -588093 -613404 -587576 -563592 -573190
2908 -573190 -499006 -517435 -441464 -376614 -557334 -433395 -435880 -516523 -421226 -616154 -512945
2897 -512945 -503302 -417362 -480008 -475622 -407355 -436020 -496543 -456862 -348202 -505028 -483408 -449440
2885 -449440 -572153 -461381 -382185 -429144 -507661 -498333 -485861 -518082 -491424 -497221 -491128 -437293
2873 -437293 -380919 -420885 -415758 -455010 -558536 -477658 -394695 -465943 -462624 -509455 -466730 -500857
2861 -500857 -513116 -578328 -404040 -458451 -435538 -380042 -488528 -504668 -487802 -540766 -388079
2850 -388079 -559959 -539269 -505115 -462574 -412060 -373855 -436896 -518210 -428951 -477453 -505794
2839e05794L424M3243J17829j7895o6899o3143m7991M1777k0292L4949J00953
2828c79839q6637R374R2082j52308j214O7959K1039k3514o4211J61274n2930m7784
2816d56709j25812Q4260N4023p628p7604n3175J03801p606P383L7786o0600L6551
2804d65330q0013J39804o5176p0861J07097m3374K4523L9142n8258l3808R2030
2793d14224j20646k4607L9254l8408R8111K0677N3899O497j40731J5512K9780
2782d74886m7956Q4542j41519J76168l7613M6145l0923o6533Q8856l1572n6601
2771d91892p5596o07m721N0815J42405N3637k18488J12258j20587j0624k4676
2760e88076n2642R6873M3142P1531j0357q269o430M7864j09033N2570o3681n5722
$$ plain form
2839 -505794 -502370 -459127 -341298 -359193 -426092 -489235 -537226 -495449 -515741 -480792 -379839
2828 -379839 -466476 -457102 -365020 -517328 -518542 -450583 -429544 -453058 -517269 -355995 -408925 -456709
2816 -456709 -582521 -498261 -444238 -451866 -529470 -582645 -478844 -486450 -479067 -441281 -501881 -465330
2804 -465330 -545343 -405539 -470715 -541576 -434479 -477853 -453330 -414188 -472446 -506254 -414224
2793 -414224 -534870 -559477 -520223 -558631 -460520 -439843 -385944 -379447 -520178 -504666 -474886
2782 -474886 -522842 -438300 -579819 -403651 -441264 -395119 -426042 -492575 -403719 -435291 -491892
2771 -491892 -567488 -568095 -572816 -522001 -379596 -325959 -544447 -432189 -552776 -563400 -588076
2760 -588076 -640718 -543845 -500703 -429172 -439529 -447798 -454228 -406364 -515397 -462827 -526508 -582230
2748e82230M0411Q0630n1290J02582n7692j00095J06612K3118o8955P0994l4474
2737d70389m2892J05022p3068m7350q775Q6812l9496L0257K9438n1992N8827L5950
2725c87656k2291N4580j27307j0014K7490N922m7945q912m9507K846J03107j0068
2713d69755L9341O4223j13896p7726J07930o8849R085m0815K3355P03J22317n0639
2701d54726r255n2449q657o7598R2285p3409P9798L8601J17470j63792m349j8453
2689e24534L205n4698Q3180M8986j06656L8381P5969K6890o327k2234n3759J04463
2677c87134m1940p8729K5395N5271j2036J3821j05436Q7764K4671j43239O5848
2666d95744m8769K30861j49852N5359q7954K9965k2557N1898j96202J31887Q4853
$$ plain form
2748 -582230 -541819 -461189 -512479 -409897 -467589 -567684 -461072 -437954 -506909 -435915 -470389
2737 -470389 -513281 -408259 -481327 -528677 -537452 -450640 -490136 -459879 -430441 -482433 -423606 -387656
2725 -387656 -409947 -355367 -482674 -492688 -465198 -459276 -507221 -516133 -565640 -562794 -459687 -469755
2713 -469755 -430414 -366191 -480087 -557813 -449883 -518732 -509647 -550462 -527107 -526404 -404087 -454726
2701 -454726 -463981 -516430 -525087 -592685 -500400 -573809 -494011 -455410 -337940 -501732 -506081 -524534
2689 -524534 -521329 -576027 -492847 -443861 -550517 -512136 -436167 -409277 -415604 -437838 -491597 -387134
2677 -387134 -429074 -507803 -482408 -427137 -439173 -425352 -530788 -443024 -418353 -561592 -495744
2666 -495744 -544513 -313652 -463504 -408145 -496099 -466134 -488691 -436793 -632995 -501108 -416255
2655d16255l5796k9361j7104J6195J779m7814l5921Q709J62632q9763K6884K6068
2643d29747l3590P6129n2353l1410j5602M8016q7713L0521J6334o1642l3971O0173
2631e14855N273m0053O3134p3505R5640n7838K8917L0638K0169o5150n4063o636
2619e68329J41512L3047n2127j10979J72487q6817K0200K3633n2834L3126m3444
2608d90525P1141o2564o1355O0389M2617r1074O9142m5055J3894m9848k2211P7888
2596d87561P447k4788M451p004K3404J7223J04299j12274k0117k3759J10185k6175
2584d34669j14035J0227J2830Q4537n3299o200N8072n867K4083n1461K484o0430
2572e33728L1434m745O1600l8194l0j67699J18811J09056l6627K100j07912L9705
$$ plain form
2655 -416255 -452051 -481412 -498516 -482321 -480542 -528356 -564277 -555568 -392936 -482699 -455815 -429747
2643 -429747 -463337 -387208 -439561 -470971 -486573 -438557 -526270 -495749 -479415 -541057 -575028 -514855
2631 -514855 -509582 -549635 -486501 -560006 -464366 -522204 -493287 -462649 -442480 -507630 -561693 -568329
2619 -568329 -426817 -393770 -445897 -556876 -384389 -471206 -451006 -427373 -480207 -447081 -490525
2608 -490525 -419384 -481948 -543303 -482914 -440297 -531371 -462229 -507284 -493390 -543238 -565449 -487561
2596 -487561 -480114 -504902 -500451 -507455 -484051 -466828 -362529 -474803 -494920 -518679 -408494 -434669
2584 -434669 -548704 -538477 -525647 -441110 -494409 -500609 -442537 -448404 -424321 -475782 -473298 -533728
2572 -533728 -502294 -507039 -445439 -483633 -483663 -651362 -532551 -423495 -460122 -458022 -565934 -526229
2560e26229M57N0305R3449j03908n3736q8826R0480R6085K561J9658j54997J0836
2548e63865M9631L903K4947K365m0656K5350K9047M8636n961o7432l8953l0629
2536e63617p3808L7909n2480J07560J57333k3646k5470k8281O1584k00538J07051
2525d96403J9107j8321p3126O6678l2876O3679r3778P0173K2922l3758Q3442j15747
2513e38008N9420J9348L1497n9895n2283m8566n621m5802J60474M8445l6872l12
2501d68175j0418J4920n2203K9389l186L0731p6430Q4394j3952n9701J0846o6357
2489e80142M2096M4747k2024l4049P914L2794o7421L9749N8226O1868l6644j32541
2477e85427J00235N8372n4175q3810L0172o7103L2228J96224j04926N1952p3561
$$ plain form
2560 -526229 -525772 -475467 -382018 -485926 -539662 -628488 -538008 -441923 -439362 -419704 -574701 -563865
2548 -563865 -514234 -510331 -485384 -483019 -523675 -498325 -469278 -420642 -426603 -494035 -532988 -563617
2536 -563617 -637425 -599516 -651996 -544436 -387103 -410749 -436219 -464500 -402916 -603454 -496403
2525 -496403 -477296 -495617 -568743 -502065 -534941 -471262 -565040 -494867 -471945 -505703 -422261 -538008
2513 -538008 -478588 -459240 -427743 -487638 -539921 -588487 -594108 -639910 -479436 -430991 -467863 -468175
2501 -468175 -478593 -463673 -515876 -486487 -489673 -458942 -535372 -450978 -464930 -524631 -513785 -580142
2489 -580142 -538046 -493299 -515323 -549372 -541458 -508664 -576085 -536336 -478110 -416242 -452886 -585427
2477 -585427 -485192 -426820 -480995 -564805 -534633 -601736 -569508 -373284 -478210 -426258 -499819
2466d99819j01952J17244j12113Q4719l263j0738j1405L6216p474p8134K3213
2455e63506p5452J36918J08508k9684m0771o5186J2316K8030m753j2771K4728
2444d81623j34824J98137q6488L882K6864n0486l2886k0709q260p922l412J08944
2432d88783M5602j02381J48956j32428k009j18046J51090N9621j5697j34814l6429
2421f25318R2559J15965r645r1251j01441N9295N2164K9238r3866J06597p5115
$$ plain form
2466 -499819 -601771 -484527 -596640 -511921 -515184 -525922 -537327 -501111 -508585 -586719 -563506
2455 -563506 -638958 -502040 -393532 -423216 -463987 -529173 -516857 -488827 -493580 -506351 -481623
2444 -481623 -616447 -418310 -504798 -500916 -474052 -524538 -557424 -578133 -586393 -594315 -597727 -488783
2432 -488783 -443181 -545562 -396606 -529034 -531043 -649089 -497999 -438378 -454075 -588889 -625318
2421 -625318 -532759 -416794 -426439 -517690 -619131 -559836 -507672 -478434 -572300 -465703 -540818
$$ [...]
##END NTUPLES=NMR SPECTRUM
##END=
