##TITLE=abcd
##JCAMPDX= 6.0         $$ Bruker NMR JCAMP-DX V2.0
##DATA TYPE= NMR SPECTRUM
##DATA CLASS= NTUPLES
##ORIGIN= UXNMR, Bruker Analytische Messtechnik GmbH
##OWNER= root
$$ XWIN-NMR		Version 3.5
$$ Thu Nov 20 13:02:28 2025 Russian Standard Time (UT+4h)  servis@DPX200
##.OBSERVE FREQUENCY= 200.131235884673
##.OBSERVE NUCLEUS= ^1H
##.ACQUISITION MODE= SIMULTANEOUS
##.ACQUISITION SCHEME= undefined
##.AVERAGES= 32
##.DIGITISER RES= 18
##SPECTROMETER/DATA SYSTEM= spect
##.PULSE SEQUENCE= zg
##.SOLVENT NAME= Acetone
##.SHIFT REFERENCE= (INTERNAL, Acetone, 0, 16.4885)
##AUDIT TRAIL= $$ (NUMBER, WHEN, WHO, WHERE, WHAT)
$$ ##TITLE= Audit trail, XWIN-NMR		Version 3.5
$$ ##JCAMPDX= 5.01
$$ ##ORIGIN= Bruker BioSpin GmbH
$$ ##OWNER= servis
$$ F:\spectra/data/av/nmr/H1/1/pdata/1/auditp.txt
$$ ##AUDIT TRAIL=  $$ (NUMBER, WHEN, WHO, WHERE, WHAT)
(   1,<2025-11-20 12:53:13.37 +0400>,<servis>,<DPX200>,
      <created by zg, POWCHK disabled, PULCHK disabled
       configuration hash MD5:
       00 E9 B6 7A A2 85 ED C7 34 08 36 98 17 FE 4E 26
       data hash MD5: 32K
       F8 67 33 23 39 33 29 04 9D 1E C4 B5 D1 66 25 08>)
(   2,<2025-11-20 13:02:06.09 +0400>,<servis>,<DPX200>,
      <Start of raw data processing
       efp BC_mod = 2 LB = 0.05 FT_mod = 6 PKNL = 1 PHC0 = -185.3084 PHC1 = 6.301564 SI = 16K 
       data hash MD5: 16K
       6D 62 1E E6 FB 53 BA 56 C3 5B 10 55 8B 50 76 F4>)
$$ ##END=
$$ 
$$ hash MD5
$$ B6 54 2F D8 33 B1 3E A4 33 34 38 96 D3 C1 67 A7
##$RELAX= 
##$RELAX= 
##$RELAX= 
##$RELAX= 
##$RELAX= 
##$RELAX= 
##$RELAX= 
##$RELAX= 
$$ Bruker specific parameters
$$ --------------------------
##$DU= <F:\spectra>
##$EXPNO= 1
##$NAME= <H1>
##$PROCNO= 1
##$TYPE= <nmr>
##$USER= <av>
##$AMP= (0..31)
100 100 100 100 100 100 100 100 100 100 100 100 100 100 100 100 100 100 
100 100 100 100 100 100 100 100 100 100 100 100 100 100 
##$AQSEQ= 0
##$AQ_mod= 1
##$AUNM= <au_zg>
##$AUTOPOS= <>
##$BF1= 200.13
##$BF2= 200.13
##$BF3= 200.13
##$BF4= 200.13
##$BF5= 500.13
##$BF6= 500.13
##$BF7= 500.13
##$BF8= 500.13
##$BYTORDA= 1
##$CFDGTYP= 0
##$CFRGTYP= 5
##$CHEMSTR= <none>
##$CNST= (0..31)
1 1 145 1 1 1 1 1 1 1 1 1 1 1 1 1 1 1 1 1 1 1 1 1 1 1 1 1 1 1 1 1 
##$CPDPRG= <>
##$CPDPRG1= <>
##$CPDPRG2= <>
##$CPDPRG3= <>
##$CPDPRG4= <mlev>
##$CPDPRG5= <mlev>
##$CPDPRG6= <mlev>
##$CPDPRG7= <mlev>
##$CPDPRG8= <mlev>
##$CPDPRGB= <>
##$CPDPRGT= <>
##$D= (0..31)
0 2 0 0 0 0 0 0 0 0.06 0 0 0 0 0 0 0.0002 0 0 0 0 0 0 0 0 0 0 0 0 0 0 
0 
##$DATE= 1763628793
##$DBL= (0..7)
120 120 120 120 120 120 120 120 
##$DBP= (0..7)
150 150 150 150 150 150 150 150 
##$DBP07= 0
##$DBPNAM0= <>
##$DBPNAM1= <>
##$DBPNAM2= <>
##$DBPNAM3= <>
##$DBPNAM4= <>
##$DBPNAM5= <>
##$DBPNAM6= <>
##$DBPNAM7= <>
##$DBPOAL= (0..7)
0.5 0.5 0.5 0.5 0.5 0.5 0.5 0.5 
##$DBPOFFS= (0..7)
0 0 0 0 0 0 0 0 
##$DE= 6
##$DECBNUC= <off>
##$DECIM= 32
##$DECNUC= <off>
##$DECSTAT= 4
##$DIGMOD= 1
##$DIGTYP= 9
##$DL= (0..7)
0 120 120 120 120 120 120 120 
##$DP= (0..7)
150 150 150 150 150 150 150 150 
##$DP07= 0
$$ [...]
##$SUBNAM4= <"">
##$SUBNAM5= <"">
##$SUBNAM6= <"">
##$SUBNAM7= <"">
##$SUBNAM8= <"">
##$SUBNAM9= <"">
##$SW= 20.6817932712277
##$SWIBOX= (0..15)
0 0 3 0 0 0 0 0 0 0 0 0 0 0 0 0 
##$SW_h= 4139.07284768212
##$TD= 32768
##$TD0= 1
##$TE= 0
##$TE2= 300
##$TE3= 300
##$TEG= 300
##$TL= (0..7)
0 120 120 120 120 120 120 120 
##$TP= (0..7)
150 150 150 150 150 150 150 150 
##$TP07= 0
##$TPNAME0= <>
##$TPNAME1= <>
##$TPNAME2= <>
##$TPNAME3= <>
##$TPNAME4= <>
##$TPNAME5= <>
##$TPNAME6= <>
##$TPNAME7= <>
##$TPOAL= (0..7)
0.5 0.5 0.5 0.5 0.5 0.5 0.5 0.5 
##$TPOFFS= (0..7)
0 0 0 0 0 0 0 0 
##$TUNHIN= 0
##$TUNHOUT= 0
##$TUNXOUT= 0
##$USERA1= <user>
##$USERA2= <user>
##$USERA3= <user>
##$USERA4= <user>
##$USERA5= <user>
##$V9= 5
##$VALIST= <valist>
##$VCLIST= <CCCCCCCCCCCCCCC>
##$VD= 0
##$VDLIST= <DDDDDDDDDDDDDDD>
##$VPLIST= <PPPPPPPPPPPPPPP>
##$VTLIST= <TTTTTTTTTTTTTTT>
##$WBST= 1024
##$WBSW= 30
##$XGAIN= (0..3)
0 0 0 0 
##$XL= 0
##$YL= 0
##$YMAX_a= 2666848
##$YMIN_a= -2591016
##$ZGOPTNS= <>
##$ZL1= 120
##$ZL2= 120
##$ZL3= 120
##$ZL4= 120
##$ABSF1= 0
##$ABSF2= 0
##$ABSG= 0
##$ABSL= 0
##$ALPHA= 0
##$AQORDER= 0
##$ASSFAC= 0
##$ASSFACI= 0
##$ASSFACX= 0
##$ASSWID= 0
##$AUNMP= <proc_1d>
##$AZFE= 0.1
##$AZFW= 0.1
##$BCFW= 0
##$BC_mod= 2
##$BYTORDP= 0
##$COROFFS= 0
##$CY= 18.4799938201904
##$DATMOD= 1
##$DC= 0
##$DFILT= <>
##$DTYPP= 0
##$F1P= 9.9274215381318
##$F2P= -0.165520771350173
##$FCOR= 1
##$FTSIZE= 16384
##$FT_mod= 6
##$GAMMA= 0
##$GB= 0
##$INTBC= 1
##$INTSCL= 4.127829e-11
##$ISEN= 128
##$LB= 0.05
##$LEV0= 0
##$LPBIN= 0
##$MAXI= 10000
##$MC2= 0
##$MEAN= 0
##$ME_mod= 0
##$MI= 50
##$NCOEF= 0
##$NC_proc= -1
##$NLEV= 6
##$NOISF1= 3.799351
##$NOISF2= 2.8
##$NSP= 0
##$NTH_PI= 0
##$NZP= 0
##$OFFSET= 16.48848
##$PC= 4
##$PHC0= -185.3084
##$PHC1= 6.301564
##$PH_mod= 1
##$PKNL= yes
##$PPARMOD= 0
##$PSCAL= 4
##$PSIGN= 0
##$REVERSE= no
##$SF= 200.130005582386
##$SI= 16384
##$SIGF1= 3
##$SIGF2= 2
##$SINO= 400
##$SIOLD= 16384
##$SREGLST= <1H.CDCl3>
##$SSB= 0
##$STSI= 16384
##$STSR= 0
##$SW_p= 4139.07284768211
##$SYMM= 0
##$S_DEV= 0
##$TDeff= 32768
##$TDoff= 0
##$TI= <>
##$TILT= no
##$TM1= 0
##$TM2= 0
##$TOPLEV= 0
##$USERP1= <user>
##$USERP2= <user>
##$USERP3= <user>
##$USERP4= <user>
##$USERP5= <user>
##$WDW= 1
##$XDIM= 16384
##$YMAX_p= 331833637
##$YMIN_p= -189912
$$ End of Bruker specific parameters
$$ ---------------------------------
##NTUPLES= NMR SPECTRUM
##VAR_NAME=  FREQUENCY,     SPECTRUM/REAL,   SPECTRUM/IMAG
##SYMBOL=    X,             R,               I
##VAR_TYPE=  INDEPENDENT,   DEPENDENT,       DEPENDENT
##VAR_FORM=  AFFN,          ASDF,            ASDF
##VAR_DIM=   16384,         16384,           16384
##UNITS=     HZ,            ARBITRARY UNITS, ARBITRARY UNITS
##FACTOR=    0.252644378177508, 1,           1
##FIRST=     3299.83951724647, 0,            0
##LAST=      -839.233330435636, 0,           0
##MIN=       -839.233330435636, -189912,     0
##MAX=       3299.83951724647, 331833637,    0
$$ Real data points
##PAGE= N=1
##DATA TABLE= (X++(R..R)), XYDATA
$$ [...]
5611C4326O08K676n66K67J835J148k246L339J875L505N240J921K490M543N039
5596F6000Q028M298O307P868P265L290P46N29n00m145k516K482J39N234M560N549
5580A15134N471M136N369M683L970M129N981O228O010O229M613O263K498M372
5566A85086L639M327N064M697M593K154L925M631L833N157M769M726P756O852
5552B51209O638Q893O495J0569J0442J3082R485R564J0324N855N754O655Q139
5539C63104P045P580R512J1217J0323J2751J2478J2154J0879J2536J3237J6643
5527D99459J4775J5964J4610J3438J3641J4928J4481J3355J5990J8799J8422J8801
5515F86663K1804K2011K0640J6387J9217K2689K5311K5953K9111K8569K8125K8591
$$ y = [34326, 34934, 37610, 37044, 37311, 39146, 40294, 38048, 41387, 43262, 46767, 52007, 53928, 56418, 60961, 66000, 74028, 78326, 84633, 92501, 99766, 103056, 103802, 104331, 103831, 99686, 97170, 99652, 99791, 105025, 109585, 115134, 120605, 124741, 130110, 134793, 138763, 142892, 148873, 155101, 161111, 167340, 171953, 178216, 180714, 185086, 188725, 193052, 198116, 202813, 207406, 209560, 213485, 218116, 221949, 227106, 231875, 236601, 244357, 251209, 257847, 266740, 273235, 283804, 294246, 307328, 316813, 326377, 336701, 342556, 348310, 354965, 363104, 370149, 377729, 387241, 398458, 408781, 421532, 434010, 446164, 457043, 469579, 482816, 499459, 514234, 530198, 544808, 558246, 571887, 586815, 601296, 614651, 630641, 649440, 667862, 686663, 708467, 730478, 751118, 767505, 786722, 809411, 834722, 860675, 889786, 918355, 946480, 975071]
5503I75071L0563K9857K9927L2409L3522L7841L8341L9042M3873M1387M2098M4461
5491A418392M5895M9598N5319O2293O8738P3108Q0083Q7315R2177R9119J02951
5480B234988J07489J15606J26249J38061J54920J66692J82065J92863K14230K31812
5470C864975K58669K85898L25321L69066M24542M91168N77965O84377Q16849J001359
5460I100189J257930J643926K244655L205207M649175O361454P043115M881910
5452D0387561N02009l199616m637862m348935l418022k464239j647913r51641
5444B0221342l36379K34020Q10373J438478K227205L327218N045889P784335J1699571
5435E2452052J5226573J3511529M036147o883122j2489409j2494577j0111981
$$ y = [975071, 1005634, 1035491, 1065418, 1097827, 1131349, 1169190, 1207531, 1246573, 1290446, 1331833, 1373931, 1418392, 1464287, 1513885, 1569204, 1631497, 1700235, 1773343, 1853426, 1940741, 2032918, 2132037, 2234988, 2342477, 2458083, 2584332, 2722393, 2877313, 3044005, 3226070, 3418933, 3633163, 3864975, 4123644, 4409542, 4734863, 5103929, 5528471, 6019639, 6597604, 7281981, 8098830, 9100189, 10358119, 12002045, 14246700, 17451907, 22101082, 28462536, 35505651, 40387561, 40889570, 37689954, 33052092, 28703157, 25285135, 22820896, 21172983, 20221342, 19884963, 20118983, 20929356, 22367834, 24595039, 27922257, 32968146, 40752481, 52452052, 67678625, 81190154, 85226301, 78343179, 65853770, 53359193, 43247212]
5428D3247212p587520n563803m012689k807686j859744j096371m47770J56623
5420B0028252P99531J595508K693402M171290N664395N738418K793011j964659
5412D1519148n460625o400539n673007m489844l426690k605048j984777j519218
5404I959400j173965r16040p24755n85880m86580m09262l53245l06815k70684
5395D732174k37935k15785j93827j81264j64416j54624j41951j30654j19920j15019
5385C076779j10670j06410r9417r5556q8988q6315q3425p9485p4117o6157o2032
5374B124207o1108n5355o0380n8487n5287n6314n0852m7523m5527m2629m4012
5363A546733m2578m1737l8976l7208l7378l6291l2506k9712k7340k5223k8011
$$ y = [43247212, 35659692, 30095889, 26083200, 23275514, 21415770, 20319399, 19871629, 20028252, 20827783, 22423291, 25116693, 29287983, 34952378, 40690796, 43483807, 41519148, 36058523, 29657984, 23984977, 19495133, 16068443, 13463395, 11478618, 9959400, 8785435, 7869395, 7144640, 6558760, 6072180, 5662918, 5309673, 5002858, 4732174, 4494239, 4278454, 4084627, 3903363, 3738947, 3584323, 3442372, 3311718, 3191798, 3076779, 2966109, 2859699, 2760282, 2664726, 2575738, 2489423, 2405998, 2326513, 2252396, 2186239, 2124207, 2063099, 2007744, 1947364, 1888877, 1833590, 1777276, 1726424, 1678901, 1633374, 1590745, 1546733, 1504155, 1462418, 1423442, 1386234, 1348856, 1312565, 1280059, 1250347, 1223007, 1197784, 1169773]
5352A169773k8492k8574k6563k5738k5739k1221k3080k3670k3452k3027k1119
5341H99098k0616k0824j5505k1112j9506j5891j6783j4740j5627j6435j4378j6306
5329F91375j4334j3450j6612j4315j6264j1966j4988j1676j1454r186j3470j4981
5317E28679j3494j0122r666q849q025r934q529j2847q814j4315j2792j3203p873
5304C90216q942p012o531o951q334r755j0167j3133p833j0263n680n994m457m314
5290B80850l417r220r054p098l902l617n663p45k229m984o778r908j1651j3306
5276A89278j0023m462l885j080m75j410j471l391m100j834l70j562m196l843l033
5261A44143l879o415n668q678m023l239k949j711k201o34j56k304o46k299l922
$$ y = [1169773, 1141281, 1112707, 1086144, 1060406, 1034667, 1013446, 990366, 966696, 943244, 920217, 899098, 878482, 857658, 842153, 821041, 801535, 785644, 768861, 754121, 738494, 722059, 707681, 691375, 677041, 663591, 646979, 632664, 616400, 604434, 589446, 577770, 566316, 557130, 543660, 528679, 515185, 505063, 495397, 486548, 478523, 468589, 460060, 447213, 438399, 424084, 411292, 398089, 390216, 381274, 374262, 367731, 360780, 352446, 342691, 332524, 319391, 311558, 301295, 295615, 289621, 285164, 280850, 277433, 268213, 259159, 252061, 248159, 244542, 238879, 238134, 235905, 230921, 224143, 214235, 202584, 189278, 179255, 174793, 170908, 169828, 169353, 167943, 166472, 163081, 158981, 157147, 156777, 155215, 151019, 147176, 144143, 140264, 133849, 128181, 119503, 115480, 112241, 109292, 107581, 105380, 104746, 104590, 102286, 101640, 99341, 95419]
5246I5419r65l461l029m848j479k887k797k381l564J85J972K011n483l085k872
5231F2736K2k830p58l508j145l271j587n733j725j140k978K29Q35k140Q93M14
5215C8314Q63l526j402K5l24M25k616m353j104q08M0k408l824k352j857j236j934
5198A1923O5N18j466p05k077j664o27j581n61k075l03r45J572k918k711J17J50
5181c288k305J234j260J42p3k769M49o27k23l530O02j500j327j266K38qm543L11
5163a9743p94L97j136l59j942L563q26j121k922m68j531K187Om46q15n76j182
5146b7708r20k226l77N52l79J026j673K00k505J405k855J547r79L64M16K33l212
5129c7091p06J081L098q10j079j829r85Q32j072L573j467Q71j828P0k36K18p40
$$ y = [95419, 94454, 90993, 87964, 83116, 81637, 78750, 75953, 73572, 70008, 70193, 72165, 74176, 68693, 65608, 62736, 62758, 59928, 59170, 55662, 54517, 51246, 49659, 43926, 42201, 41061, 38083, 38312, 39147, 37007, 37900, 38314, 39177, 35651, 34249, 34274, 33950, 34375, 31759, 27406, 26302, 25494, 25534, 23126, 19302, 16950, 15093, 13857, 11923, 11988, 12506, 11040, 10335, 8258, 6594, 5967, 4386, 3825, 1750, 1447, 502, 2074, -844, -3555, -3438, -3288, -5593, -4359, -5619, -5477, -5550, -8319, -7870, -8497, -8720, -12250, -11648, -13148, -14475, -15741, -15503, -15511, -20054, -19743, -20537, -20140, -21276, -21635, -23577, -20014, -20840, -21961, -24883, -25351, -26882, -24695, -24689, -25135, -25950, -26526, -27708, -28628, -30854, -31231, -30679, -31058, -30032, -31705, -31505, -34010, -32605, -35460, -33913, -34892, -34528, -34112, -33879, -37091, -37797, -36716, -33618, -34428, -35507, -37336, -38321, -37489, -38561, -34988, -36455, -35584, -37412, -37342, -37578, -37360, -38100]
5112c8100m61j28N20k78P93r52N37o66m74Q87P24J838k465r63J180K209L4m46
5094c6211M4M60l065J035n79J550k16j806Q33p67J868r56l51K48R54l94J260r8
5076c6191K87J117o8K393j270J879k808P3K94N96Q32n61J343Q29j754L59M47j301
5058c3504J463J056j141n18K465j489j732J238K60L105J60j57j84j554K659j695
5042b9568J83K342O49K3J372P80l53K74j380J845j679K064j733L956M8P4j147
5025b2250J860n23J483j836j38J716K831l64p27J64J16J603K82J944J046N14k60
5008a2539m4K037K153Q22L731J407K043n13J0J01J380j637K922J155J300n02K55
4991D081O6M38M58J111J335N17J65k919K139J353J630Q30J849J563J933O99J24
$$ y = [-38100, -38561, -38689, -38169, -38447, -37654, -38606, -38069, -38735, -39209, -38322, -37598, -35760, -38225, -39188, -38008, -35799, -35765, -36211, -36167, -35707, -38772, -37737, -38316, -36766, -36982, -38788, -37955, -38722, -36854, -37810, -38161, -37913, -36959, -37353, -36093, -36191, -35904, -34787, -34855, -32462, -33732, -31853, -34661, -34588, -34294, -33698, -32866, -33427, -32084, -31255, -33009, -32650, -32203, -33504, -32041, -30985, -32126, -32644, -30179, -31668, -33400, -32162, -31902, -28797, -28637, -28794, -28978, -30532, -27873, -29568, -29385, -27043, -26394, -26371, -24999, -24219, -24572, -24298, -25678, -23833, -25512, -23448, -25181, -21225, -21177, -21103, -22250, -20390, -20913, -19430, -21266, -21404, -19688, -16857, -17221, -17948, -17784, -17668, -16065, -15783, -13839, -12793, -12279, -12539, -12583, -10546, -8393, -7571, -3840, -2433, -390, -903, -893, -792, 588, -1049, 1873, 3028, 4328, 3826, 4081, 4147, 4585, 5043, 6154, 7489, 8006, 8171, 5252, 7391, 8744, 10374, 11204, 13053, 14616, 16549, 17248, 17372]
4974A7372J939L090M137M359N906N097M55J324l81l14k494j926j897J419R89J977
4958D1052K043L135L940J20K949L152K118K182J243L535K140L440K809L263O18
4943G7739L008K122K911K510N48J381J355j92K747K737P53M623J117L803L273
4928A10435L027K958K231O352N019N442N505N927L436K528M508K777L458L122
4914A66725M117M081O518M928O802N729O263M488O838O581P462O552O015Q175
4900B51274O952P794O906N789O427Q092Q109R236R080Q104R992Q554Q904J0054
4886C65267J0723J1213J3203J2382J1285J1553J2064J2286J2525J3155J7168J3414
4874E16238J7482J6427J6975J7330J5818J8269J9852J8407K1852K2976K4292K8528
$$ y = [17372, 19311, 22401, 26538, 30897, 36803, 41900, 42355, 43679, 43298, 42984, 40490, 38564, 36667, 38086, 39075, 41052, 43095, 46230, 50170, 50290, 53239, 56391, 58509, 60691, 61934, 65469, 67609, 71049, 73858, 77121, 77739, 80747, 82869, 85780, 88290, 88838, 90219, 91574, 91382, 94129, 96866, 97619, 102242, 103359, 107162, 110435, 113462, 116420, 118651, 125003, 130022, 135464, 140969, 146896, 150332, 152860, 157368, 160145, 163603, 166725, 170842, 174923, 181441, 186369, 193171, 198900, 205163, 209651, 216489, 223070, 230532, 237084, 243099, 251274, 258226, 266020, 272926, 278715, 285142, 293234, 301343, 310579, 319659, 327763, 337755, 346309, 355213, 365267, 375990, 387203, 400406, 412788, 424073, 435626, 447690, 459976, 472501, 485656, 502824, 516238, 533720, 550147, 567122, 584452, 600270, 618539, 638391, 656798, 678650, 701626, 725918, 754446]
4862G54446K5716K8028K7372L1172K9539L3249L4135L5746L7870M2843M3939M5645
4850A169700N0028N1908N4576N7940O3775O6596P7687Q3522R3774J07010J15488
4839A992004J27941J34989J42503J54434J67810J89483K08364K33624K56155K81040
4829C888347L10388L40915L83991M30055M84194N50257O36250P37046Q70612J037964
4819I670019J265546J567046J994187K605116L506073M798028O454796Q004033
4811C9864844Q178941N583488P00501m099278o876116p442439o697472n522992
4803B3689477m370933l386300k608447k005512j556167j221220r75338p90739
4795F774821o53999n46630m63834l99487l44384l00408k63218k33687k07496j87950
$$ y = [754446, 780162, 808190, 835562, 866734, 896273, 929522, 963657, 999403, 1037273, 1080116, 1124055, 1169700, 1219728, 1271636, 1326212, 1384152, 1447927, 1514523, 1592210, 1675732, 1769506, 1876516, 1992004, 2119945, 2254934, 2397437, 2551871, 2719681, 2909164, 3117528, 3351152, 3607307, 3888347, 4198735, 4539650, 4923641, 5353696, 5837890, 6388147, 7024397, 7761443, 8632055, 9670019, 10935565, 12502611, 14496798, 17101914, 20607987, 25406015, 31860811, 39864844, 48043785, 53627273, 54327774, 50228496, 43352380, 35909941, 29212469, 23689477, 19318544, 15932244, 13323797, 11318285, 9762118, 8540898, 7565560, 6774821, 6120822, 5574192, 5110358, 4710871, 4366487, 4066079, 3802861, 3569174, 3361678, 3173728]
4785C173728j66741j50300j34446j25906j18895j12644j03690r8619r0968q3504
4775A988015p9321p3387o8073o7150o1032o0631n8656n7070n4517n1766n0570
4764A305842m6568m2488m3932l9250l7650l6765l5837l3455l5089l3431l0749
4753H90628k8176k6349k5357k3028k2108k1364k2988k1208k3357j8061j7622j7550
4741F23460j6508j6590j4776j5744j4664j4433j4150j2109j1954j3221j2560r113
4729D57638j3763j2079j3667q631j1570q430j1246r551r202j2240j0054j1193
4717C26012o693j0482p133q347r119o903r226p717q001o454p554n192o935o238
4703B20018n834o114n737p424l519m625l873n042l121p179l513n350m271m184
$$ y = [3173728, 3006987, 2856687, 2722241, 2596335, 2477440, 2364796, 2261106, 2162487, 2071519, 1988015, 1908694, 1835307, 1767234, 1700084, 1639052, 1578421, 1519765, 1462695, 1408178, 1356412, 1305842, 1259274, 1216786, 1172854, 1133604, 1095954, 1059189, 1023352, 989897, 954808, 921377, 890628, 862452, 836103, 810746, 787718, 765610, 744246, 721258, 700050, 676693, 658632, 641010, 623460, 606952, 590362, 575586, 559842, 545178, 530745, 516595, 504486, 492532, 479311, 466751, 457638, 443875, 431796, 418129, 409498, 397928, 389498, 378252, 368701, 359499, 347259, 337205, 326012, 319319, 308837, 301704, 293357, 284238, 277335, 268109, 260392, 252391, 245937, 238383, 233191, 226256, 220018, 214184, 208070, 202333, 194909, 191390, 186765, 182892, 177850, 174729, 167550, 164037, 158687, 154416, 150232]
4689A50232k970n297l651o200m002n816p182o179o289l689p223j726l816l689
4675H2503l051m564m766k128k527l549k810j225l059l441l502m238j704k702j381
4660C7856k180M30j096m350k375o632m995n856m992k408j738J288J16p09J334
4645C693j558n94r03r09o98j246m96j873j831j655p46l501n7k482j850m104k39
4628b1049m077o22j051l079q77l373j110l139r45j984j786p83P86k268O1k63o89
4611d6248K269k751R64n3j057j966m44r7j819O82j789O05l457L1j303r01l88J6
4593e7706j107j703n36j723j056k99n61M88j963j566p18K156o86p7j404J551k072
4576f8982n52j158m92J831j468R46k399J212l304k097j95j127J005K98J10k073
$$ y = [150232, 147262, 141965, 138314, 132114, 128112, 122296, 115114, 108935, 102646, 98957, 91734, 90008, 86192, 82503, 79452, 74888, 70122, 67994, 65467, 61918, 59108, 57883, 54824, 51383, 47881, 43643, 41939, 39237, 37856, 35676, 36106, 35010, 30660, 28285, 21653, 16658, 10802, 5810, 3402, 1664, 2952, 3068, 2359, 3693, 2135, 1541, 638, -271, -969, -2215, -2711, -4584, -6415, -8070, -8816, -12317, -12374, -14856, -16706, -20810, -21049, -25126, -25748, -26799, -29878, -30755, -34128, -35238, -38377, -39322, -41306, -43092, -43875, -43089, -45357, -45296, -45559, -46248, -43979, -46730, -45766, -45819, -46876, -48842, -49286, -49383, -51202, -50520, -52309, -51704, -55161, -55130, -56433, -57334, -57722, -57706, -58813, -60516, -61052, -62775, -63831, -64130, -64691, -64203, -66166, -67732, -68450, -66294, -66980, -67057, -68461, -66910, -68982, -69534, -70692, -71184, -69353, -70821, -69875, -72274, -71062, -74366, -76463, -76658, -77785, -76780, -76482, -76372, -78445]
4560g8445o56k235J106l62K398n96J722r02j163n5r6o4L79P83j175j085j276j883
4542h3605o94n29j637o70m19J91q21j044L4N79j17p70n68r10j9M94p55J065k44
4523i0439j14p89l58K51j279l29n44l49q27l68j249l34q15l59m35j600J295m126
4505a02768k9m2J618j076J585r22J49p23N63m65J69N37K4j72Q86j54q67K79J037
4486a00371j079m38j102j449R09k348J838j483J161k040R26j851J14J01q45Q02
4470a07155J811k84q2m47j158L064j211P63K46j537k97q54J495O06k50j92J96
4453a05286k22q55l476J059O05K348j036R14k134l13l50r52l92K286j041J05l81
4436a09121j142R48j158L61n88J288J86M35k305J074q31K641l653K480p45q03
$$ y = [-78445, -79101, -81336, -80230, -80592, -78194, -78790, -77068, -77970, -79133, -79188, -79284, -79348, -78969, -78186, -79361, -80446, -81722, -83605, -84299, -84828, -86465, -87135, -87554, -87363, -88184, -89228, -89194, -88615, -88732, -89502, -90070, -90980, -90999, -90505, -91260, -90195, -90439, -90553, -91342, -91700, -91449, -92728, -93057, -93601, -93950, -94777, -95145, -96394, -96728, -97543, -97902, -98337, -99937, -98642, -102768, -102797, -102839, -101221, -102297, -100712, -101634, -101485, -102208, -101645, -102110, -101941, -101404, -101380, -101552, -100666, -100820, -101687, -101408, -100371, -101450, -101888, -102990, -104439, -103530, -105878, -104040, -105523, -104362, -106402, -105476, -107327, -107213, -107112, -107957, -107155, -105344, -105628, -105710, -106157, -107315, -104251, -105462, -104699, -104453, -105990, -106287, -107141, -105646, -105040, -105290, -105482, -105286, -105508, -106363, -109839, -108780, -108175, -105827, -106863, -105949, -108083, -108396, -108746, -109698, -110090, -107804, -108845, -108740, -109121, -110263, -109315, -110473, -110112, -110700, -109412, -109226, -108791, -111096, -110022, -110853, -108212, -111865, -109385, -110130, -110933]
4420a10933q56K65Q44j179J847q40q89j893K067o73L043k516J568j153m79j116
4404a12893R50j568m96L54J130J462j244j489j56J165J04J379Q46L04M40J84K312
4387a07216j223j347J098l96j135J383o37J034R65P8k218j621N86k42L39Q05L01
4370a09446J196j174Q24l94l3J064J333O78k17J006m72l00M28K587k655O02O53
4353a04320j927K722j172j807J380J666O70J469K0j15n43P9J675Q57J835J642
4337i5869J113o50J334j45PJ736K384J319P41R01r51N223K98N368M482O731J1301
4320e4677J7329K3366K7144J1565j1355j5720j6467q771p495l834k299J503j614
4307d1325K574K471K615O966J0159J0449J7598K4883K2401J3749n338j1229l927
$$ y = [-110933, -111789, -111524, -110680, -111859, -110012, -110852, -111741, -113634, -111567, -112240, -109197, -111713, -110145, -111298, -111777, -112893, -111943, -113511, -114007, -113653, -112523, -111061, -112305, -113794, -113950, -112785, -112681, -111302, -110456, -110152, -109712, -109528, -107216, -108439, -109786, -108688, -109084, -110219, -108836, -109473, -108439, -107474, -107396, -109614, -111235, -110649, -110891, -110552, -109747, -109446, -108250, -109424, -108600, -108994, -109027, -107963, -106630, -105952, -106169, -105163, -105635, -105935, -105507, -102920, -105575, -104973, -104320, -106247, -103525, -104697, -106504, -105124, -103458, -102788, -101319, -101299, -101414, -101957, -101878, -100203, -99346, -97511, -95869, -94756, -95406, -94072, -94217, -94210, -92474, -90090, -88771, -88030, -87129, -88080, -82857, -82559, -77191, -72709, -65978, -54677, -37348, -13982, 13162, 24727, 13372, -2348, -18815, -27586, -35081, -38915, -41214, -39711, -41325, -38751, -36280, -33665, -26699, -16540, -6091, 11507, 36390, 58791, 72540, 67202, 55973, 52046]
4294E2046P544K0283M4422P3349Q0066K3831m4536n9085m9051l6669k2003j8655
4282G1542j0564o474j478l00K772R095J1737J7880K9670M3480O4940P3325L0914
4269C36539l5956n9529m5284k1249K277L3356O5142P0686J3027n2465o3668n3487
4257A89389l7633k8276j6889j3922o662k448k121L374N882J0142J7330K8359M5325
4244A91850O4446P1967K3049m8815o8116n7208l4146j7955j469J2909J5105k389
4232A49228j9748k4967k0282j7089j0345m592l968j319N62J104m63O52K223O355
4218E7351J0465J5886K5897K4632M178k0020k2647j8756j2067r732j589j188O26
4205E3036j168J119k269K598J304K301K786M030q17L172r07j379k68L529K978
$$ y = [52046, 59590, 79873, 124295, 197644, 277710, 301541, 257005, 197920, 148869, 112200, 90197, 71542, 60978, 54504, 53026, 52726, 55498, 64593, 76330, 94210, 123880, 167360, 232300, 305625, 336539, 300583, 241054, 195770, 174521, 176798, 210154, 275296, 345982, 359009, 306544, 242876, 189389, 151756, 123480, 106591, 92669, 86007, 83559, 81438, 84812, 90694, 100836, 118166, 146525, 191850, 256296, 328263, 351312, 302497, 234381, 177173, 143027, 125072, 123603, 136512, 151617, 149228, 129480, 104513, 84231, 67142, 56797, 52205, 48237, 46918, 47480, 48584, 48121, 48773, 50996, 57351, 67816, 83702, 109599, 134231, 138409, 118389, 95742, 76986, 64919, 55187, 53598, 52410, 53036, 51868, 52987, 50718, 53316, 54620, 56921, 59707, 63737, 62920, 66092, 65185, 63806, 63538, 67067, 70045]
4190G0045K058N081M018O790R89J934J060M233L581M948N552L669N879K497M640
4175A26974J287L861O289O598N019M165L051j147l207l452K194L265M901N025
4161A64823P266N833R112R059N620K667N128J0897J1071P808N882N828J240N232
4147B57466K112K586J1521P270Q530J0102N526J291J526m47K136O550P480R882
4133C33531J2360J1317J1400J2786R035R637Q409J6165J3028J3356J0371P689
4121D69084L212M630M665P565J1265J2133J2459J4759J4301J3373J2663O136J0092
4108E96337J4714J6903J6981J6943J9423K0074J5593J6191J8873J9879J7417K2322
4096H11650K1428K0724K1822J7725J8181J9320K2843K5467K2674K8567K9364L1358
$$ y = [70045, 72103, 77184, 81202, 87992, 88981, 90915, 91975, 96208, 99789, 104737, 110289, 113958, 119837, 122334, 126974, 128261, 132122, 138411, 145009, 150028, 154193, 157244, 156097, 152890, 149438, 151632, 154897, 159798, 164823, 172089, 177922, 187034, 196093, 201713, 204380, 209508, 220405, 231476, 239284, 245166, 250994, 252234, 257466, 259578, 262164, 273685, 280955, 289485, 299587, 305113, 306404, 307930, 307483, 309619, 316169, 323649, 333531, 345891, 357208, 368608, 381394, 390429, 400066, 408475, 424640, 437668, 451024, 461395, 469084, 472296, 476926, 481591, 489156, 500421, 512554, 525013, 539772, 554073, 567446, 580109, 586245, 596337, 611051, 627954, 644935, 661878, 681301, 701375, 716968, 733159, 752032, 771911, 789328, 811650, 833078, 853802, 875624, 893349, 911530, 930850, 953693, 979160, 1001834, 1030401, 1059765, 1091123]
4084A091123L2321L0717K9223L2154L2954L8564L9972M2832M3339M3932M4811
4073A501942M7991N2783N3811N7875N9970N9363O4485O9812P9736Q5680R0313
4062B223761R9486J05760J12850J24815J30693J44904J59565J74608J96564K19318
4052C692324K45981K82300L30912L91717M82258O27953Q68680J278016K013139
4043A0213280L314776M932449M664817Q84401k475920l132199k546842j842379
4035A4012383j295799q64296n05713k05231M4649K64268M78153P17803J023841
4026A3670058J471058K162041L255355M574973M622900J721432j478822j923562
4018B8075433m70996J691477M600951Q816209J3452294J2484084J212316q748030
$$ y = [1091123, 1123444, 1154161, 1183384, 1215538, 1248492, 1287056, 1327028, 1369860, 1413199, 1457131, 1501942, 1549933, 1602716, 1656527, 1714402, 1774372, 1833735, 1898220, 1968032, 2047768, 2133448, 2223761, 2323247, 2429007, 2541857, 2666672, 2797365, 2942269, 3101834, 3276442, 3473006, 3692324, 3938305, 4220605, 4551517, 4943234, 5425492, 6053445, 6922125, 8200141, 10213280, 13528056, 18460505, 23125322, 24009723, 21533803, 18401604, 15854762, 14012383, 12716584, 11852288, 11346575, 11141344, 11185993, 11450261, 11928414, 12646217, 13670058, 15141116, 17303157, 20558512, 25133485, 29756385, 31477817, 29998995, 28075433, 27604437, 29295914, 33896865, 42713074, 56165368, 68649452, 69861768, 61113738]
4010F1113738j0361939q348210o108586m416900l128169k050732j162626m40054
4002B5096522J79418P82592J451639K316402L568971N509608Q517182J2087575
3994E9509909J2092438K831665q037312j0186928p038909k914681J483262O803436
3986E4542880J1989155J0517786j032002j0227182j1226479q953383o603533m856851
3978C4150391l518528k407976j495561p57339j19453N07405J201286K104852L408701
3969C3073778N452327Q604189J2186763J1445093P27427j0391786j2115715r114557
3961C9867519n739658k785128J03280K392603J557468k224758m524552m366117
3953B4280657l412767k557551j930858j446400j046487p17760m49768k17112J6152
$$ y = [61113738, 50751799, 42403589, 36295003, 31878103, 28749934, 26699202, 25536576, 25096522, 25275940, 26058532, 27510171, 29826573, 33395544, 38905152, 47422334, 59509909, 71602347, 74434012, 66396700, 56209772, 49170863, 46256182, 47739444, 54542880, 66532035, 77049821, 76017819, 65790637, 54564158, 45610775, 39007242, 34150391, 30631863, 28223887, 26728326, 25970987, 25851534, 26358939, 27560225, 29665077, 33073778, 38526105, 47130294, 59317057, 70762150, 71489577, 61097791, 48982076, 39867519, 34127861, 31342733, 31446013, 33838616, 35396084, 33171326, 28646774, 24280657, 20867890, 18310339, 16379481, 14933081, 13886594, 13168834, 12719066, 12501954, 12518106]
3944A2518106K68208O06545J107604J899471L110002M256434L117414j243046
3936B5640738m352471m366714l311746k381273j753917j309372r67814p11964
3928F485467n35816m18635l37226k81348k47050k16571j95929j74661j57380j42714
3918C778137j33349j21832j14853j10397j00701r8435r3044q2354p6934p1016
3908B775222o8997o6091o6366o7043o4780o4644o3496n7058n2518n0913m9672
3897B103644n2654n1710m6653m6575m5755m0766l8390m3213l7177l7053m0794
3886A622904l9159l6141l9193l4336l0095l0431k5363k2797l0182l1328k5777
3875A278102k7223k3584k3264k0800k1526k3265k6206k4900k5336k3795k0135
$$ y = [12518106, 12786314, 13392859, 14500463, 16399934, 19509936, 23766370, 26883784, 25640738, 21288267, 16921553, 13609807, 11228534, 9474617, 8165245, 7197431, 6485467, 5949651, 5531016, 5193790, 4912442, 4665392, 4448821, 4252892, 4078231, 3920851, 3778137, 3644788, 3522956, 3408103, 3297706, 3197005, 3098570, 3005526, 2923172, 2846238, 2775222, 2706225, 2640134, 2573768, 2506725, 2441945, 2377301, 2313805, 2256747, 2204229, 2153316, 2103644, 2050990, 1999280, 1952627, 1906052, 1860297, 1819531, 1781141, 1737928, 1700751, 1663698, 1622904, 1583745, 1547604, 1508411, 1474075, 1443980, 1413549, 1388186, 1365389, 1335207, 1303879, 1278102, 1250879, 1227295, 1204031, 1183231, 1161705, 1138440, 1112234, 1087334, 1061998, 1038203, 1018068]
3864A018068j7793j7826j8158j5456j8833k1469k6097k0493k0994j9708j4768
3853H06473j5224j0252j1407j2852j4761j1335j3366r865p779q967j2718j2231
3841F65716j4842j5511k1462j7600j1349j2895j1218p245p269n892j1831j4347
3829E14255j3319r632j0549r045n411p363o465p108n080p675n964m855j653o678
3815D13458m455n151q038j2716j2952q272r374q235p371m675m155k714m125n558
3801C15667m514n241k997m552k784m143m083l489o250m810k313l232l305P29k606
3786B62077P3p29K056j724o223q391o766n485n309j063m381j761l004k178k087
3771B15105o12k442J388L23K501L712N767J0460J0172J6624K0714J3439p571k1172
$$ y = [1018068, 1000275, 982449, 964291, 948835, 930002, 908533, 882436, 861943, 840949, 821241, 806473, 791249, 780997, 769590, 756738, 741977, 730642, 717276, 707411, 699632, 690665, 677947, 665716, 650874, 635363, 613901, 596301, 584952, 572057, 560839, 553594, 546325, 540433, 528602, 514255, 500936, 491304, 480755, 471710, 466299, 458936, 452471, 445363, 440283, 432608, 426644, 421789, 420136, 413458, 409003, 403852, 395814, 383098, 370146, 361874, 352500, 344265, 336894, 332219, 328064, 325350, 321225, 315667, 311153, 305912, 302915, 298363, 295579, 291436, 287353, 283864, 277614, 272804, 270491, 267259, 263954, 264683, 262077, 262150, 261421, 263477, 261753, 255530, 247139, 240373, 234888, 229579, 228516, 224135, 222374, 219370, 217192, 215105, 214493, 212051, 213439, 213762, 216263, 219975, 225742, 236202, 246374, 262998, 283712, 297151, 289580, 268408]
3757B68408j7381j4532j1580r686n560l499j924k761P90M41O03L402L924J2571
3743B23216J9366K4197J9477k20j4767q398O39J1765K8987N5831P9523N0072j7898
3730D71790n6124n4284m2451l0352k4222j4667j1350p869k142Q93N117N345J3336
3717B53020K0799L2787N4384P0039N5386j2317n5636n5332l2140r398J8477M9113
3705C89182O8714M1283k9795o3625o1540m3643l2878k4329j9016j3321o406m607
3693B00019q72J588P503J4170K0041L2349N5013O9729M9415k2442o9037o4492
3681B92984m2991k4303j0907N340J2263L310k0276k2865k4605j6924j4126j0050
3669A26850n869o782m969m774j819K483R79L679O518J1967J7502K4263J1677j3287
$$ y = [268408, 251027, 236495, 224915, 215229, 209669, 206170, 204246, 201485, 202275, 202716, 203319, 206721, 210645, 223216, 242582, 266779, 286256, 286036, 271269, 262871, 263510, 275275, 304262, 360093, 439616, 489688, 471790, 415666, 361382, 318931, 288579, 264357, 249690, 238340, 230471, 228329, 229222, 234339, 239684, 253020, 273819, 306606, 360990, 431029, 486415, 474098, 418462, 363130, 330990, 321592, 340069, 389182, 457896, 499179, 469384, 405759, 344219, 300576, 267698, 243369, 224353, 211032, 204626, 200019, 199147, 200735, 208238, 222408, 242449, 274798, 329811, 399540, 448955, 426513, 357476, 292984, 249993, 225690, 214783, 220123, 232386, 235696, 215420, 192555, 167950, 151026, 136900, 126850, 120981, 114199, 109230, 104456, 102637, 105120, 106099, 109778, 116296, 128263, 145765, 170028, 181705, 168418]
3655A68418k4445k2478j6810j1983r147q517n505l850k803m641m50k976o17l625
3641E0571Q16m508n68m98j558n55k114J047M81m91k414K899l935j203N41J56j670
3624C6997R86k008j692J438l241j441m09q27q54j576J122j880O26K46j544j133
3608B4810n93j464J068J236o43q05k09q91N88j054j030j61k6o14J568k496k36
3591A9048l01j190k905RJ54q44o48j750l58o54k22J219j167j177j261J132j219
3574G866M73N9R4j616j225R42j422J143k043J659j725Q50k740J05j382K8l527
3557b461J571M7P17q7q2J668k669J17r80J821m47M45J361Q79j487L8l111p5P69
3538a966m12K55k08p73j8j97j849r98j37K781K66l22R55k109n36j652K75K957
$$ y = [168418, 143973, 121495, 104685, 92702, 83555, 75038, 69533, 65683, 62880, 58239, 57789, 54813, 54196, 50571, 51387, 46879, 46311, 45813, 44255, 43700, 41586, 42633, 43114, 42623, 40209, 43108, 39173, 37970, 38511, 38667, 36997, 37983, 35975, 34283, 35721, 32480, 31039, 30630, 29803, 28949, 27373, 28495, 26615, 27241, 27487, 25943, 24810, 24217, 22753, 23821, 25057, 24414, 23609, 23400, 22509, 23097, 22043, 21013, 20852, 20826, 20212, 21780, 19284, 19048, 18747, 17557, 14652, 14661, 14815, 13971, 13323, 11573, 11215, 10561, 10339, 11558, 10391, 9214, 7953, 9085, 7866, 8339, 8398, 8492, 6876, 5651, 6593, 5171, 6314, 4271, 5930, 4205, 5055, 2315, 2420, 1038, 1066, -2461, -890, -843, -126, -213, -295, 1373, -1296, -1179, -2159, -338, -785, -340, 1021, 1900, 413, 451, -2660, -2735, -1966, -2378, -2123, -2331, -3104, -3122, -3319, -5168, -6166, -6303, -3522, -3256, -3578, -2623, -4732, -5268, -6920, -6645, -3688]
3520c688k065J979K53o39P04j099j472p55l40l49N24M59J53K92j918j440j938
3503a1339J442k15J238K29O42r34O8p18JJ634O07J022p67K772o34m35k016K012
3485e391j272P71r83O05J243o56p07j215j426Q62j042o23m25O66J456k65k59n45
3467i206P11r16R33J190J36j290J572k139K152j269j335Q47q63k09M92j961k66
3450a1421K722j405K83j209K62L11p82R7j115q07P8N67q67l68J497k21m3J38j124
3431a3407N76p01j163Q38l6J532k08Q88k826j036p19k49J065L39K62j946J025
3414a5766l197J291j029k146J373L90j82K08Q29n21q34j609J030k87J835o28k35
3397a9478L24p04j175j018j442j96Q88J058r25j395J244j623j663J59P91j416
$$ y = [-3688, -5753, -3774, -3521, -4160, -3456, -4555, -6027, -6782, -7122, -7471, -6947, -6488, -6335, -6043, -7961, -9401, -11339, -9897, -10112, -8874, -8645, -8003, -8937, -8869, -9587, -9586, -7952, -7345, -6323, -7090, -4318, -4952, -5387, -7403, -5391, -6663, -5892, -6875, -6270, -5027, -5683, -6390, -7605, -9031, -8169, -9211, -9834, -10259, -9593, -8137, -8402, -8661, -9206, -8495, -9411, -8478, -7288, -7152, -8442, -6870, -9009, -6857, -8126, -9461, -8614, -9477, -9686, -9194, -11155, -11421, -8699, -10104, -9821, -11030, -10768, -10457, -11239, -11142, -12257, -13064, -12986, -12419, -13286, -13654, -12157, -12378, -12421, -12283, -13407, -12831, -13532, -14695, -13857, -13893, -12361, -12569, -11681, -14507, -15543, -16262, -16511, -15446, -15107, -14845, -16791, -15766, -18963, -17672, -18701, -20847, -19474, -19084, -19266, -19058, -18229, -18750, -19584, -21193, -20163, -20450, -18615, -19243, -19478, -19154, -19858, -21033, -22051, -23493, -23689, -22801, -21743, -22668, -24063, -22819, -24442, -26105, -25946, -25155, -26571]
3381b6571L258j586J147J20P17n76j115J671j920R68K502r02j044L90k171O11
3365b4501R11n99j596N1K085j622J13j935k31N35R29j250N46J215J47j019J230
3348b4991j563R94M84R75N74o43J386p34q42K35k63o01k469Q60K97j732J153j647
3330b8527j89o12m11k96n03q98M47K04J149J081M3J9r8n7N2N63J45q31J903J97
3310b6619l47j281j06k53j69k919m99j27L19L1j207m40l96r68J300N50Q54k58
3292c2535j62M83M00P07J174J1K79M46o00j072j2j76J318j622j465j39p74k168
3274c5907P80j368j81J405j795n09J012K15j648Q45k95J161L239j241l00J004
3258c3583n53k10p50l99Q04j322O67j655j232K20k808l85j630K064j151P69m2
$$ y = [-26571, -23313, -24899, -23752, -23632, -22915, -23491, -24606, -22935, -24855, -23887, -21385, -22287, -23331, -22941, -25112, -24501, -23590, -24189, -25785, -25734, -23649, -25271, -25158, -27093, -27324, -26789, -25860, -27110, -26564, -25349, -25202, -26221, -24991, -26554, -25560, -25076, -24101, -23527, -24170, -22784, -23518, -24360, -24125, -24388, -24989, -27458, -26598, -26301, -28033, -26880, -28527, -28716, -29328, -29739, -30035, -30538, -31436, -30989, -30785, -29636, -28555, -28512, -28493, -28591, -28648, -28596, -28033, -27888, -28719, -26816, -26619, -26966, -28247, -28353, -28606, -28775, -31694, -32193, -32320, -32001, -31970, -33177, -33617, -34013, -34981, -33681, -33131, -32277, -32535, -32697, -32214, -31814, -31107, -29933, -29922, -29643, -29197, -29797, -30869, -30881, -31057, -29739, -31361, -32826, -32965, -33739, -35907, -35127, -36495, -36676, -35271, -37066, -37575, -36563, -36348, -37996, -37151, -37446, -36285, -33046, -34287, -34587, -33583, -34136, -34346, -35096, -35495, -34691, -36013, -35346, -37001, -38233, -38013, -40821, -41206, -42836, -40772, -41923, -41154, -41196]
3241d1196l17r46O59j696K239q53J594Q41Q2L68k53k023P40J336o51P42k184j176
3223d2694J116n70j276p94o24l15P01n18j54j925J646j630J65N58j074J062j440
3206d7766J535m63J961j682J162j211j94o32O50n11J625r03q31N70j209O40j251
3189d8510k78r46J99K84k158J695j843P57P67k003K146l57q20o16M19K76K9m63
3171e1422M73J80Q14k48p4Q15p40j129M63l70k69J464j444O6q15J316k748K402
3153e1266J19j114n38P97j459n4M34q06K144p85m00o55Q69p11J03k16K247m78
3135e1769p45N1K43R97l13j69p95k56k240L85q22J937j235m6k74p72l6j100o57
3116e7616r7K066l45M47N74l12j146o55j848L217k54L21J210k90J157j412k543
$$ y = [-41196, -41513, -42459, -41800, -43496, -41257, -42110, -40516, -39675, -39593, -39225, -39478, -41501, -40761, -39425, -40076, -39334, -41518, -42694, -41578, -42148, -43424, -44218, -44842, -45157, -44456, -44974, -45128, -47053, -45407, -47037, -46872, -46314, -47388, -46326, -47766, -46231, -46694, -44733, -46415, -45253, -46464, -46658, -47290, -46640, -47151, -45526, -46429, -47260, -46690, -47899, -47259, -48510, -48788, -49734, -49535, -49251, -51409, -49714, -51557, -50800, -50033, -52036, -49890, -50247, -51067, -51683, -51264, -50988, -50959, -51422, -50949, -50769, -49955, -50203, -50277, -49462, -50202, -51331, -50868, -51238, -51507, -50043, -51487, -51421, -52236, -50920, -53668, -51266, -51147, -52261, -52799, -52002, -53461, -53515, -53081, -53887, -51743, -52528, -52928, -53583, -52714, -53425, -53322, -53538, -51291, -51769, -52514, -52463, -52220, -51223, -51536, -51705, -52500, -52756, -54996, -54611, -55433, -53496, -54731, -54777, -55051, -55823, -55859, -56959, -57616, -57713, -55647, -55992, -55545, -54971, -55283, -56429, -57084, -58932, -55715, -55969, -55648, -54438, -54728, -53571, -54983, -57526]
3099e7526m86j372K087J544j968N91k06k707r94p5l95J328K817j009j838K88j725
3082f1646m04K406k43N01M43k55l22J656L19j123N02J698j817j24q35O5n1j148
3064f0378j386k76o44r75K630l824J869l81q55j1P56l67k513Q14K69l16K367P66
3046f2455R2Mm3O77j39lm07j86q04K62q92k214k78j693j305n3j660L60j014K91
3026g1460q22J150j591O72o22R43J286M99N01J749m43O13Q79q29K807k587o10
3009f7865o00J614j723J459k158J084j127k243j086q11q9r08J952j381Q60K41
2993g2781p91r56J844J24J084l12J767Q89k83m52Q4J007M45m34J039K27P18k261
2975f9042j858k45j324j491j46J073k00n60j677j252m45M69r67n79Q29J338Q41
$$ y = [-57526, -58012, -59384, -57297, -55753, -57721, -57130, -57336, -60043, -61037, -61112, -61507, -60179, -57362, -58371, -60209, -59921, -61646, -62050, -59644, -59887, -59386, -58943, -59198, -59520, -57864, -57545, -58668, -58166, -56468, -58285, -58409, -59244, -59179, -59230, -60378, -61764, -62040, -62684, -63659, -61029, -64853, -62984, -63365, -64220, -64231, -63475, -63842, -66355, -65541, -65272, -65588, -63221, -62455, -62363, -62359, -62402, -61725, -61864, -61867, -62274, -62460, -63264, -63002, -63894, -66108, -66386, -68079, -69384, -69437, -71097, -70737, -71751, -71460, -72282, -71132, -72723, -72051, -72673, -71730, -70444, -69945, -69444, -67695, -68138, -67525, -66646, -67475, -64668, -67255, -67865, -68465, -66851, -68574, -67115, -69273, -68189, -69316, -71559, -72645, -73456, -73545, -74453, -72501, -73882, -73022, -72781, -73572, -74528, -72684, -72560, -71476, -71788, -70021, -69132, -69415, -69867, -69783, -68776, -68331, -68765, -67726, -67499, -66781, -69042, -70900, -71145, -72469, -73960, -74106, -73033, -73233, -73793, -75470, -76722, -77167, -76698, -77665, -78244, -77415, -76077, -75236]
2958g5236J016J498k73j49q10J836j220J609j37P85m15j406p52k712Q59j859n88
2941g7954n99J781j571n59k109j366j461K24J048P83J054j686o34J551j406L15
2925h2589L68J521N6M53j691k22l96j536M00j223j476J135N14j890K27j02K65
2908h6186j999J111m91J436j753L30K23n21K2m19J113o3Q47m63Q47o36j324j366
2890h9292O04M27J146K197j026j383j97r12l73J089q98N85J258k27l8R35k571
2873h8676J268k94j528K108K53o87M2l52k054P8j753J211lp47J896j453J916p93
2855h9568l28M59M9Q72M72m09r27k033N97j383j101P77L60R66m08N92j134K45
2837i1902k186j80J525j11j351j17K062j356P41j046j102J095l5J415J063J92
$$ y = [-75236, -74220, -72722, -72995, -73144, -73954, -72118, -73338, -71729, -71866, -71081, -71496, -72902, -73654, -76366, -75507, -77366, -77954, -78553, -76772, -78343, -78902, -81011, -82377, -83838, -83614, -82566, -81783, -80729, -82415, -83049, -81498, -82904, -82589, -82221, -80700, -80644, -80191, -81882, -82104, -82500, -84036, -83636, -84859, -86335, -85200, -84686, -86576, -86349, -86451, -86186, -88185, -87074, -87565, -86129, -87882, -87552, -87329, -87850, -87828, -88247, -87134, -87197, -86350, -86813, -85966, -86602, -87926, -89292, -88688, -88261, -87115, -84918, -85944, -87327, -87524, -88436, -88809, -87720, -88618, -88033, -86775, -87002, -87040, -86105, -88676, -87408, -87702, -89230, -87122, -86869, -87556, -87514, -87866, -89920, -89842, -91595, -90384, -90387, -91134, -89238, -90691, -88775, -89568, -89896, -89437, -89388, -88516, -88044, -88453, -89380, -91413, -90816, -92199, -93300, -92523, -92163, -91197, -91605, -91013, -92147, -91902, -94088, -94268, -92743, -92854, -94205, -94322, -92260, -93616, -92875, -93921, -95023, -93928, -93963, -92548, -91485, -91293]
2821i1293n05p87k280L46j643k8j169P86J809q51k046J587q85j212J254l003O18
2804i9302J859l83O69o87J8R93n57J23l33J020k387J750Q94k92j624J258k377
2787i9358n99K07K18p82M5o91k08J276j095n89j088J636O00j260K131J304J192
2770i7061M47J640j370O52j304k561q06q2J969l786O88j815Q30j280k583L424
2754a02998j701N16m17r96n96J156j264J212K52J022N32p52n72k486n67k04J063
2737a06800R5R65j188Q74k512N64k386m70k139J851n04P00p25M98K00j242p19
2720a12938j734J716N54k184J269L58r49Q29r92j429J447K68k07m43k88N81p07
2703a14849r16K086n85n09n81p62j772J593k145m52J377k83L42j47j272R75p0
$$ y = [-91293, -91798, -92585, -94865, -94519, -96162, -96190, -97359, -96573, -94764, -95615, -97661, -96074, -96959, -98171, -96917, -99920, -99302, -97443, -97826, -97157, -97844, -97826, -96833, -97390, -97267, -97600, -96580, -98967, -97217, -96323, -96615, -98239, -96981, -99358, -99957, -99750, -99532, -100314, -100269, -100960, -101168, -99892, -100987, -101576, -102664, -101028, -100428, -101688, -99557, -98253, -97061, -96614, -94974, -96344, -95692, -96996, -99557, -100363, -100445, -98476, -102262, -101574, -103389, -102559, -103839, -106422, -102998, -104699, -104183, -104600, -105596, -106192, -105036, -106300, -105088, -104836, -103814, -103282, -104034, -104606, -107092, -107659, -107863, -106800, -106705, -105740, -106928, -106054, -108566, -108002, -110388, -110858, -112997, -111146, -111650, -110950, -111675, -111177, -110977, -112219, -112938, -114672, -112956, -112402, -114586, -113317, -112959, -113908, -113079, -114071, -115500, -114053, -113785, -113992, -114435, -114723, -114142, -114849, -115765, -113679, -114264, -114773, -115354, -116116, -117888, -116295, -118440, -118892, -117515, -117798, -117456, -117603, -118875, -117900, -117970]
2686a17970O32j233p5N91l12q34P44r58R28k238K84L61j213j56l05k91j385K143
2668a21287l57r66nK326l501p98j672j06J090j426O77r50J913j196o59j059J322
2651a26654j503P04N87J098Q7l76n56N68j332M87j106j826K356O42J71j046N61
2634a27138P43J247j504L64J142l14J20k219K231n53P79M1j32r0k49k643o39J217
2616a27597k501J035k205p96R08k024J052j223J128J170j440O81n33J299O80K822
2600a27544Q7K307m96j208j366j262k7l60j76M70j129j625n38k518j90r70L44
2583a36201k158L31j793j307O1r89j630K313j117l0k07M66J000K010J398N80j55
2566a37428J160K09Q41M72Q20j301n67q56r82k778L8k216J6M55j864j359l406
$$ y = [-117970, -117338, -118571, -118646, -118055, -118367, -119201, -118457, -119415, -118487, -120725, -120441, -120080, -121293, -121449, -121754, -122045, -123430, -121287, -121644, -122610, -122615, -120289, -123790, -124588, -126260, -126366, -125276, -126702, -126025, -126975, -125062, -126258, -126917, -127976, -126654, -128157, -127453, -126866, -125768, -125681, -126057, -126613, -126045, -127377, -126890, -127996, -129822, -127466, -126824, -126653, -127699, -127138, -126395, -125148, -126652, -126288, -125146, -125460, -125340, -127559, -125328, -125881, -125102, -125061, -125193, -125283, -125532, -128175, -128814, -127597, -130098, -129063, -131268, -132064, -131156, -133180, -132128, -133351, -132223, -131053, -132493, -131812, -132345, -131046, -130366, -127544, -127457, -125150, -125646, -126854, -128220, -129482, -129509, -129869, -130045, -129575, -130704, -132329, -132867, -135385, -135575, -136545, -136201, -138359, -138028, -139821, -141128, -141067, -142056, -143686, -141373, -142490, -142520, -142727, -142261, -141261, -139251, -137853, -137273, -137428, -136268, -136059, -135218, -134746, -133926, -135227, -135794, -136650, -137632, -140410, -140372, -142588, -142572, -142117, -143981, -145340, -148746]
2549a48746N34n86k767O88K943j437J221k038J784L412R98M24P27J114K71K9P16
2532a40713r81Q53N89j625J594j154k39k241j574l45M99k259q47j296m48J357
2516a48830r05n81J053L73j172j507k83J241J611r4p99J613k34m39M49J034n09
2499a47979J291j160K47J055K957Q88j355O90P68n16m602O86o07K455J523J392
2483a42267j408p67k136k244l523J208K33j754K886k29q72m338J701J151K112
2468a50247J884m75J412K351K639l142J535M023K294J225m77j317K282J230j049
2453a35832l118j030o74r55j438l912p55j971j416o97K3j698k10O13J087K420
2437a49563L114j093J466J658K125P61K150J822K406L451r19l143K051Q59l294
$$ y = [-148746, -148212, -148798, -151565, -150877, -147934, -149371, -148150, -150188, -148404, -144992, -143994, -143570, -142843, -141729, -141458, -141429, -140713, -141694, -140841, -140252, -141877, -140283, -141437, -141676, -143917, -145491, -145836, -145337, -147596, -148443, -149739, -150187, -148830, -149735, -150316, -149263, -148890, -150062, -151569, -151852, -150611, -149000, -149094, -149893, -148280, -148514, -148953, -148504, -147470, -147979, -146688, -147848, -147601, -146546, -143589, -142701, -144056, -143366, -142598, -143114, -147716, -147030, -147637, -145182, -143659, -142267, -143675, -144442, -146578, -148822, -152345, -151137, -150904, -152658, -149772, -150001, -150873, -155211, -153510, -152359, -150247, -148363, -148838, -147426, -145075, -142436, -145578, -144043, -140020, -137726, -136501, -136978, -138295, -136013, -134783, -135832, -138950, -139980, -140654, -141609, -143047, -146959, -147714, -149685, -151101, -151798, -151775, -153473, -153683, -153070, -151983, -149563, -146449, -147542, -146076, -144418, -142293, -141532, -139382, -137560, -135154, -131703, -132622, -135765, -133714, -132855, -136149]
2422a36149l9k138j366l219k555l9P02k166o00K08j131Q16M84k961J614N749K434
2405a40356P85j445K041J507J135J918q6L205L418j298j155m82n31j613J232k448
2389a34173j143l048P47M488K57j736o74M46Q37J959J609L52K904O784Q08k669
2373a22252K48N27J111L587K443p86M045K698m008K371n80J829J630K885J989
2358a02263L318O09L359L711N543P512Q97K607O592P769M718K470O897J1263J2025
2343b2973J0527Q538J1521K1564K9585N8751J31756L37840M68535j27168l53031
2332E75445k22244j24961p3349m6220k9676j6917j2401l503p472k083N984O170
2320D8773M057R846J4118J8072J6268J0752J5355K4942L3749N7963J12685K68970
$$ y = [-136149, -136188, -138326, -139692, -142911, -145466, -145505, -144803, -146969, -147569, -147361, -148492, -147676, -147192, -150153, -148539, -142790, -140356, -139571, -141016, -138975, -137468, -136333, -134415, -134501, -131296, -127878, -129176, -130331, -130813, -131344, -132957, -131725, -134173, -135316, -138364, -137617, -133129, -132872, -134608, -135282, -134836, -133999, -132040, -130431, -130079, -127175, -120391, -119583, -122252, -122004, -121477, -120366, -116779, -114336, -115122, -111077, -108379, -112387, -110016, -110596, -108767, -107137, -104252, -102263, -98945, -98336, -94977, -91266, -85723, -78211, -77314, -74707, -68115, -60346, -55628, -53158, -46261, -34998, -22973, -12446, -3908, 7613, 29177, 58762, 117513, 249269, 587109, 1055644, 928476, 575445, 353201, 228240, 154891, 108671, 78995, 62078, 49677, 46174, 38702, 36619, 42603, 48773, 52830, 62676, 76794, 94866, 111134, 121886, 137241, 162183, 195932, 253895, 366580, 635550]
2308F35550P59131R23919m90288o83649m07484k21772j41145r6625o1948l8540
2298A77149k2334j8672j5300r017p038l186O713P630J369K71O472J0015R966L101
2284A47139K0292M1983P8766J49721L52137L69738k21726l23788j97341j10335
2274C06586o0868l9601k9380j7245r672j2882j1605l529J75L144k58j1842n927
2261A07096O449M797O85m18Q602J2174J0240P773P707Q048L747N626J4098J1767
2247B08391J3186J4154N201j0526j6324j9118j3290N050J1367K950O169P540J4110
2234B28860J2183P1j0144p468J2102K0389P760N685J2137J5056K4342J3306R388
2221C43667K4007L2561K4553K0449L5j8184k8165l4887j9951O002J4112R412J1432
$$ y = [635550, 1394681, 2318600, 1828312, 1144663, 737179, 515407, 374262, 277637, 215689, 177149, 154815, 136143, 120843, 111826, 104788, 101602, 108315, 115945, 117314, 117585, 124057, 134072, 144038, 147139, 167431, 209414, 288180, 437901, 790038, 1159776, 938050, 614262, 416921, 306586, 245718, 206117, 176737, 159492, 149820, 136938, 125333, 121804, 121979, 125123, 124865, 113023, 107096, 113545, 118342, 119027, 118609, 127211, 139385, 149625, 157398, 165105, 173153, 176900, 182526, 196624, 208391, 221577, 235731, 240932, 230406, 214082, 194964, 181674, 186724, 198091, 201041, 207210, 214750, 228860, 241043, 241114, 230970, 223502, 235604, 255993, 263753, 269438, 281575, 296631, 320973, 334279, 343667, 367674, 400235, 424788, 445237, 445272, 427088, 398923, 364036, 344085, 350087, 364199, 373611, 385043]
2208C85043L0547L9296K0902j3862j4037J5112K5962J3190J0200K0260J3219O003
2196E51835J5468K1583K1265J7577J6507K0986K4448J2379o35j0114j9499o475
2184F65325J5712K0650J5970J8304L6982M3073K1132J2066J4656J1228N086N2174
2172I32358M6722R154J8985K5616J4445J9143K4768K6880K3729L0464L1897K8891
2160A233052L2221K4913K1508K7234L1764L9902L6951L6995M9478N1696M1015
2149A626729M6847L8351K1935M6114O4805M4498N7419O1884O1671M9835M5666
2138B165754O4934O5863N4819P0975P5640P9108Q2143Q1233Q4472Q7204Q6407
2127B998552J04466J07928J17693J22936J18738J42929J64321J69746K15480K92164
$$ y = [385043, 415590, 454886, 475788, 461926, 447889, 463001, 488963, 502153, 512353, 532613, 545832, 551835, 567303, 588886, 610151, 627728, 644235, 665221, 689669, 702048, 701413, 691299, 671800, 665325, 681037, 701687, 717657, 735961, 772943, 816016, 837148, 849214, 863870, 875098, 880184, 932358, 979080, 988234, 1007219, 1032835, 1047280, 1066423, 1091191, 1118071, 1141800, 1172264, 1204161, 1233052, 1265273, 1290186, 1311694, 1338928, 1370692, 1410594, 1447545, 1484540, 1534018, 1585714, 1626729, 1673576, 1711927, 1733862, 1779976, 1844781, 1889279, 1946698, 2008582, 2070253, 2120088, 2165754, 2230688, 2296551, 2351370, 2422345, 2497985, 2577093, 2659236, 2740469, 2824941, 2912145, 2998552, 3103018, 3210946, 3328639, 3451575, 3570313, 3713242, 3877563, 4047309, 4262789, 4554953]
2117D554953K37017K42797K40897J85187K45711L08131L23287L41688L90765M17157
2107G487590M54501M94930N44572O09953O89596P86710Q98645J040949J289255
2098A4296701J715307J946678J681617K110013L090560M975864R419001J9916271
2090E9152012M3268116P3174160K7919045m8318345n0390036l1783664j8842369
2083E4178919j1802159p972212n007107k703580j185369p87480o48580j27400
2075B3945032L35783P08964J064218J454267K019108L065463L339304L033669
2067C8965808M383092O886424J1704847K2285827M3969725Q0120603J03839624
2060C12155950J9677687n9423040p0178202n5200809l8750765k6950683j9410221
$$ y = [4554953, 4791970, 5034767, 5275664, 5460851, 5706562, 6014693, 6337980, 6679668, 7070433, 7487590, 7942091, 8437021, 8981593, 9591546, 10281142, 11067852, 11966497, 13007446, 14296701, 16012008, 17958686, 19640303, 21750316, 24840876, 29816740, 39235741, 59152012, 102420128, 175594288, 203513333, 155194988, 104804952, 73021288, 54178919, 42376760, 34404548, 29397441, 26693861, 25508492, 24721012, 24072432, 23945032, 24280815, 24989779, 26053997, 27508264, 29527372, 32592835, 35932139, 38965808, 43348900, 50235324, 61940171, 84225998, 128195723, 208316326, 312155950, 331833637, 272410597, 202232395, 147031586, 108280821, 81330138, 61919917]
2053F1919917j2916869p841880m272485l532035l149722k191955j474878r96206
2045B5543887o26472k88619J10560O41776Q72721P69208J158392J962180L608516
2036C3752149P820831J8680095M4872231P3886376J6530321m9742782m6595558
2029I9203663k9622497j8284806j2063338q500747n651693l487235k053986j840059
2021A7699302j722825j319274j030562q56821p43682o55815n54213m84106m23370
2012I908634l75760l51409k96123k85535k96517k34721j78593k31289k08512k58480
2002G191695k81262k10933j89974k15086j92116j78282j71981j58886j46159j45266
1992E301750j37492j33537j24674j28707j28962j11045j14956j06115r0181r6056
$$ y = [61919917, 49003048, 41161168, 36888683, 33356648, 30206926, 28014971, 26540093, 25543887, 24917415, 24628796, 24739356, 25381132, 26253853, 27023061, 28181453, 30143633, 33752149, 41572980, 60253075, 105125306, 179011682, 195542003, 145799221, 99203663, 69581166, 51296360, 39233022, 30732275, 25080582, 21593347, 19539361, 17699302, 15976477, 14657203, 13626641, 12769820, 12026138, 11370323, 10816110, 10332004, 9908634, 9532874, 9181465, 8885342, 8599807, 8303290, 8068569, 7889976, 7658687, 7450175, 7191695, 6910433, 6699500, 6509526, 6294440, 6102324, 5924042, 5752061, 5593175, 5447016, 5301750, 5164258, 5030721, 4906047, 4777340, 4648378, 4537333, 4422377, 4316262, 4226081, 4130025]
1982D130025r0466p7944r6706j08783q2590r3324q1442n5011n2905o1234q4426
1971C245194q4275o3454p0488o8809n9002n8904n5363n6763n7638n5600n9151
1960B555747o0656m3362m2937l9625l4103m6031n0896l5220l1860o0959m5179
1949B064919j4363l0584k4121j7071l8358m7695m2798l2923k3782j4178k2272
1938A756774l0220k9858k2439l8537o7011n6355m0709l3279l4890l2311r723O87
1926A362129k5881k5997j0090o625k1674k5675n374n39k0384l5900k2764j8571
1914A142655k1973r301P25p005j4717r660o965l2848n9399m5520l4023l4380k4447
1901H43142j5760o625J1575J011k117r530m125M209j047m963n931j0774j2790
$$ y = [4130025, 4039559, 3961615, 3864909, 3756126, 3673536, 3580212, 3498770, 3443759, 3390854, 3329620, 3245194, 3160919, 3097465, 3026977, 2958168, 2899166, 2840262, 2784899, 2728136, 2670498, 2614898, 2555747, 2495091, 2451729, 2408792, 2369167, 2335064, 2289033, 2238137, 2202917, 2171057, 2110098, 2064919, 2050556, 2019972, 1995851, 1978780, 1940422, 1892727, 1849929, 1817006, 1793224, 1779046, 1756774, 1726554, 1696696, 1674257, 1635720, 1568709, 1512354, 1471645, 1438366, 1403476, 1371165, 1361442, 1362129, 1336248, 1310251, 1300161, 1293536, 1271862, 1246187, 1240813, 1240274, 1219890, 1183990, 1161226, 1142655, 1120682, 1111381, 1112106, 1105101, 1090384, 1080724, 1073759, 1040911, 981512, 935992, 901969, 867589, 843142, 827382, 820757, 832332, 833343, 831226, 821696, 817571, 821780, 820733, 815770, 809839, 799065, 786275]
1888G86275r395k3564j5758J434l890q647o741p552K561j8504l9146k3729j1484
1875F21860j6811j5578j0150p670N30j556M464m815p001L670Q156j471k494j553
1861E69581j425k855l499j272j084r397m443R22M67k59k888m012J344O696l142
1846E44734m80Q433J4905K3438N0334J42126L90023M27720k47223l41812j95843
1835H16355j10738p0975n0863l2657j7784r634j3667j2754k036k92L549O735L322
1822E08561M298O047J0828J0029R438J4289L3850O0820J25415L00988Q86960P31767
1810B703290o57788o31045l64153k10569j35936r4910o0211m1115k8946j8613
1800D60004j5634j3830j0281k282k992o112R26J675j420M089L820L490J5132L2578
$$ y = [786275, 776880, 753316, 737558, 738992, 735102, 726455, 719714, 712162, 714723, 696219, 657073, 633344, 621860, 605049, 589471, 579321, 571651, 572181, 570625, 575089, 570274, 563273, 566943, 575099, 573628, 571134, 569581, 568156, 565301, 561802, 560530, 559446, 550049, 545606, 546528, 546995, 546736, 543848, 539836, 541180, 547876, 544734, 544254, 552687, 567592, 591030, 641364, 783490, 1173513, 1601233, 1354010, 1012198, 816355, 705617, 634642, 583779, 551122, 533338, 523704, 510037, 497283, 495247, 494955, 498504, 505239, 508561, 512859, 518906, 529734, 539763, 549201, 563490, 597340, 658160, 783575, 1084563, 1971523, 2703290, 2045502, 1414457, 1050304, 839735, 703799, 608889, 548678, 507563, 478617, 460004, 444370, 430540, 420259, 417977, 414985, 408873, 409799, 411474, 410054, 414143, 417963, 421453, 436585, 469163]
1786D69163O5384J70229M18768K77984l12464l04264j75654r9481o5070m5083
1776C99512l2679k1432j4142j0377j1677j1579m975l436o098o692j880l574n281
1763B65690m221R03j905l342n084k911l335l80k632l220n356k809m137j368q97
1748B24996k229r73O83n489l312l165j494j910j773j361j498L726o9j438l193
1733B01501J443j423Q93o84l099J13j404K514k427O22m055q14l924P84l103L16
1717A87253l808J075j485n746l693j448K144j411O66o56K954k280P10j845J79
1702A72609k82M816Q00P12l6r93k676n55m65j646k237j350q29l595j938k705j753
1685A57877j294j238j700k186k463j320N18J475K35J15Q76M03J640R80M27k63
$$ y = [469163, 534547, 704776, 1123544, 1401528, 1089064, 784800, 609146, 509665, 444595, 399512, 366833, 345401, 331259, 320882, 309205, 297626, 292651, 289215, 283117, 276425, 274545, 270971, 265690, 261469, 262372, 260467, 257125, 252041, 249130, 245795, 245415, 242783, 239563, 234207, 231398, 227261, 225893, 224996, 222767, 221794, 222477, 216988, 213676, 210511, 209017, 207107, 205334, 203973, 202475, 206201, 206132, 204694, 201501, 202944, 201521, 202414, 201730, 198631, 198744, 197340, 199854, 197427, 198049, 193994, 193180, 189256, 190040, 186937, 187253, 183445, 184520, 183035, 177289, 173596, 172148, 174292, 172881, 173547, 172891, 175845, 173565, 174275, 172430, 172609, 172327, 177143, 177943, 178655, 178619, 177626, 174950, 174395, 173930, 172284, 170047, 168697, 167868, 164273, 162335, 159630, 157877, 156583, 155345, 153645, 151459, 148996, 147676, 148194, 149669, 149904, 150019, 150895, 151298, 152938, 153918, 154345, 154082]
1669A54082J292N87n55L58m268l238j369l98J503k064k742j274k43k181n340J14
1653A34264j26k738j367j186Q93L5K227j879p57N68L72j842J772L506o74N98k911
1636A30755j237P07k038r32Q91Q93r94J014m42j912k762j595j33O33N4r28j139
1619A20835j591m38n5j636p15J459j934j834j496M74n55j26J261j512K49q41n18
1602A11027r09J972J165J216o73J06L42r32P45K78P33l58j527n17l45j79k014
1585A10130o05j393k255m24j794k174q29J267j022q09o14r72L04N4Q05K479J840
1568A03988J07j715J785k04M83J885J533K97n10k310j699j16p5j924o85j609k9
1551I9202j869j886k639j011o77R05q3N14j714p93K335m08M34Q67K549k744K472
$$ y = [154082, 155374, 155961, 155406, 155764, 151496, 148258, 146889, 146491, 147994, 145930, 143188, 141914, 141671, 139490, 134150, 134264, 134138, 131400, 130033, 128847, 129740, 129775, 132002, 130123, 129366, 129934, 130306, 128464, 130236, 133742, 133068, 133666, 130755, 129518, 130225, 128187, 127255, 128146, 129039, 128045, 129059, 128617, 126705, 123943, 122348, 122215, 122848, 122902, 121974, 120835, 119244, 118806, 118751, 117115, 116400, 117859, 115925, 114091, 112595, 113069, 112514, 112388, 113649, 112137, 112386, 111545, 111027, 110118, 112090, 113255, 114471, 113798, 113904, 114246, 113314, 114059, 114337, 115070, 114712, 113185, 112668, 112323, 112144, 110130, 109525, 108132, 105877, 105453, 103659, 101485, 100656, 101923, 100901, 100092, 99478, 98506, 98810, 98864, 99669, 102148, 103988, 104095, 102380, 104165, 103961, 104444, 106329, 107862, 108159, 107649, 105339, 103640, 103524, 103449, 101525, 100840, 99231, 99202, 97333, 95447, 92808, 91797, 91120, 92025, 91942, 92456, 90742, 89949, 92284, 91876, 92310, 93177, 95726, 92982, 95454]
1534I5454M97J452J002R38j068L96j154o47j436J357j039j667Q05j532L00j874
1518I1784k431k908R45k331l8n27R61j116P30K83P27j017j134J061P71J439q2
1501H7117P22J83j577l34k081r2J65j816m30n72j983P61k030J132k360m35J624
1484G7994k058J049j927m35m17j35R80P10j298m59M07j044j499q21q85O15M67
1467G1244J510J213m1k832j581P67j338J868L77l79M30J264n32J536k55r07l20
1450G2024j492m20P72J053j955J17Q17K99j590m45N68M79m40j92J583R98j323
1433G0853l22R06q07j102oR27j172P61L13j130M87n88P66n55j709K207j823J812
1415F9818j648j454j15K56k252M0M69J155j148l02Q61m64l47j792j00J415Q81
$$ y = [95454, 95951, 97403, 98405, 99343, 98275, 98671, 97517, 96870, 95434, 96791, 95752, 94085, 94890, 93358, 93658, 91784, 89353, 86445, 87390, 85059, 85021, 84494, 85455, 84339, 85069, 85352, 86079, 85062, 83928, 84989, 85760, 87199, 87117, 87839, 88022, 86445, 86111, 84030, 83938, 84103, 82287, 81857, 81285, 79302, 80063, 78033, 79165, 76805, 76370, 77994, 75936, 76985, 75058, 74623, 74206, 74071, 75051, 75761, 74463, 74004, 74411, 73367, 71868, 71047, 70162, 70777, 71244, 72754, 73967, 73926, 71094, 69513, 70280, 68942, 70810, 71187, 70808, 71238, 72502, 71970, 73506, 73251, 72344, 72024, 70532, 70112, 70884, 71937, 69982, 70099, 70916, 71215, 69625, 69180, 69748, 70227, 69787, 69595, 71178, 72176, 70853, 70531, 71437, 70630, 69528, 69522, 70449, 69277, 70038, 70351, 69221, 69708, 69120, 69886, 69331, 67622, 69829, 68006, 69818, 68170, 66716, 66601, 66857, 64605, 64645, 65114, 66269, 65121, 64819, 65680, 65216, 64869, 63077, 62977, 64392, 65273]
1398F5273q63J099J56J022k440M04j446K175j114J96J691J105j276p62J48j572
1382F3796m11k682n11J823J464m83K4k442k1j254K195j092J258O5k56n20R01q76
1364F0978l10J686q04J913k597L19Q04r87m58NR13J58K84O46l180m118J554r89
1346E5817n14m30j74j100J496o85J579k257L45J496j637K842k015M43K090k032
1330E5264j023M25j073J25k524l41j611N74o83o07O88J130k174l66O12o17p20
1313D7079Q6J228M45J253M01j566J86r32O1L8J467j015Q60L34j840L9j169R25
1295D7880j663M63j073J584j138K85k0Q10k08r34m16J306n45J542J64o2J974k493
1277D7456n4k653J441j669K217r47J332p32r53J692q71K96j427L08n51J464q27
$$ y = [65273, 64410, 65509, 65665, 66687, 64247, 64651, 63205, 65380, 64266, 64462, 66153, 67258, 65982, 65220, 65368, 63796, 63385, 60703, 60192, 62015, 63479, 62996, 63020, 60578, 60557, 59303, 61498, 60406, 61664, 61729, 61473, 60953, 61854, 60978, 60668, 62354, 61550, 63463, 60866, 61185, 61989, 61002, 60544, 60549, 61462, 61620, 61904, 62550, 59370, 55252, 56806, 55817, 55303, 54873, 54699, 53599, 55095, 54410, 55989, 53732, 54077, 55573, 53936, 56778, 54763, 55206, 57296, 55264, 54241, 54666, 53593, 53718, 51194, 50853, 49242, 49816, 49133, 48526, 49214, 50344, 48170, 47804, 48416, 47799, 47079, 47165, 48393, 48838, 50091, 50492, 48926, 49112, 48180, 48241, 48279, 49746, 48731, 49591, 49925, 48085, 48124, 46955, 47880, 46217, 46680, 45607, 47191, 46053, 46338, 46318, 47128, 46920, 45986, 45570, 46876, 46331, 47873, 48037, 47975, 49949, 47456, 47402, 44749, 46190, 44521, 46738, 45791, 47123, 46391, 45438, 47130, 46259, 46555, 45128, 45436, 44885, 46349, 45522]
1260D5522L34k16J127n56j144J313o33L79o41j280K38o21L81L69o68R52l59N38
1242D5035j391L77k423R68O89J072r41J247o01j589J398j740M82l68R45j285m39
1225D1436r94K339j130J338j727K0J193j545j137J132q5K446k71J830j359P04
1209D4190k315J548j105J106l85J485P81k22O39o30k77j481r17p3l94J184R79
1192D4113k515J21R4j282Q34j54r92J187J977J074J545j232o06m94J710n64J019
1175D5835o46J910j53k80j933j046p8j608J069j266J480p60j245k597k32j375
1159C7075R55r45O02J934l85K72L61lj286K194k795L326k99M66M01J84k476L7
1141C9618O78j531J120q75k039r32K236l292R9j284n72p58J322p53O88M99j318
$$ y = [45522, 45856, 45640, 46767, 46211, 45067, 46380, 45747, 46126, 45485, 44205, 44443, 43822, 44203, 44572, 43904, 44856, 44497, 45035, 43644, 44021, 41598, 42566, 43255, 44327, 43386, 44633, 44032, 42443, 43841, 42101, 42583, 42215, 43160, 41875, 41436, 40442, 42781, 41651, 42989, 41262, 41282, 42475, 40930, 39793, 40925, 40840, 43286, 43015, 44845, 43486, 44190, 41875, 43423, 42318, 43424, 43039, 44524, 45305, 45083, 45722, 45092, 44815, 43334, 42417, 42344, 41950, 43134, 44113, 41598, 41719, 41813, 40531, 41365, 41211, 40219, 41406, 43383, 44457, 46002, 44770, 44164, 43670, 45380, 44816, 45835, 45189, 47099, 46946, 46666, 44733, 43687, 43609, 42001, 43070, 41804, 43284, 42524, 41279, 38682, 38450, 37075, 38030, 37085, 37687, 39621, 39236, 39508, 39869, 39866, 38580, 40774, 37979, 41305, 41006, 41472, 41873, 42057, 39581, 39618, 40296, 38765, 39885, 39010, 36971, 36039, 38275, 34983, 35082, 33798, 33226, 32468, 33790, 33037, 33725, 34224, 32906]
1124C2906K78j438L94l50J007J177K58J905K86j060M13n81P0J287k13P57o40j697
1106C4759l75o63J604j670j158q54O03J051k587j04j471J450j181M40J042r42
1090B9944J897p76N78K94P90J875j3P95J022q35J123j266r65q03j221P24J370
1073C4533n48o77k922k04k102o23J468j22k71L90r38n00J310q34J193P40J525
1056C1418N83J17r42J007r72M9J38P9N6o21P14j055j035K9j733r53m91j421K447
1037B7414O36k678K464j478M53L72J3j10M06K381j115K406j290j123j100Q30r72
1020B7509J747l35q50N70p59J8j103j765m31J496l01K517j134k30r25L58j168
1003B5214J282N5J109R47n76j023K27n03k55j231J761j74J9Q51l98q90L06j615
$$ y = [32906, 33184, 31746, 32140, 31790, 32797, 33974, 34232, 36137, 36423, 35363, 35776, 35195, 35265, 36552, 36339, 37096, 36456, 34759, 34384, 33721, 35325, 33655, 32497, 31643, 32246, 33297, 30710, 30606, 29135, 30585, 29404, 29844, 30886, 29944, 31841, 31065, 31643, 31937, 32727, 34602, 34589, 35384, 36406, 35571, 36694, 35428, 34463, 33660, 32439, 33163, 34533, 33985, 33308, 30386, 30182, 28080, 27457, 28925, 28803, 28532, 28922, 27984, 27484, 28794, 27960, 29153, 29893, 31418, 32001, 32118, 31176, 32183, 31211, 31260, 31398, 31477, 31533, 30912, 31626, 30571, 29536, 29565, 27832, 26879, 26388, 24967, 27414, 28050, 25372, 27836, 26358, 26811, 27183, 27196, 27086, 27492, 29873, 28758, 31164, 29874, 28751, 27651, 28481, 27509, 29256, 28921, 28071, 28641, 27882, 27900, 26797, 25032, 24601, 26097, 25796, 28313, 27179, 26949, 26024, 26382, 25214, 26496, 26551, 27660, 28607, 28031, 27008, 27235, 26732, 26477, 25246, 27007, 26833, 26852, 27703, 27305, 26415, 26721, 25106]
985B5106K053p91j83j16j608J086L70O01M31j781j607J911j201n33p2j41j339
968B2186J158k008K331j030k6M86M51j171M18m21O08N02L97j93p74N55m23K50
950B3296j834q6J402j342j035k15q38J315n4k45K44j52j177Q08q14J657p09J038
932B1259l45K409p90J79p75J740l51K75k96Q70j378nj791K580j240O02j18k741
914B0084J369k198K272l364J746p2J030l84Q93j192P91J350n99O14Q71L9p73J658
896B4135M33p64M15o67j962Q6p82K015j950J999k928J97j189n78L4O3N4J388o36
877A9363O59j81k20J239j007K054O29k25k04m3j257P01M6n31M84l429K239q26
859A9491m8j150j046j399R70P0p23J161j239J02P06K8k33J131M53M5k64M91K27
$$ y = [25106, 27159, 26368, 26185, 26069, 24461, 25547, 25917, 26518, 26949, 25168, 23561, 25472, 24271, 23738, 23666, 23525, 22186, 23344, 21336, 23667, 22637, 22611, 23097, 23548, 22377, 22795, 22374, 22982, 23484, 23881, 23688, 22914, 23469, 23046, 23296, 21462, 21376, 22778, 21436, 20401, 20186, 19348, 20663, 20609, 20364, 20608, 20456, 19279, 20087, 19273, 20930, 20221, 21259, 20914, 23323, 22533, 22712, 21937, 23677, 23326, 23601, 23305, 24175, 22797, 22792, 21001, 23581, 22341, 22943, 22825, 20084, 21453, 19255, 21527, 18163, 19909, 19837, 20867, 20483, 21376, 20184, 20975, 22325, 21726, 22340, 23211, 23250, 22477, 24135, 24568, 23804, 24219, 23552, 21590, 21676, 20894, 22909, 20959, 22958, 20030, 20227, 19038, 18460, 18494, 18557, 18611, 19999, 19363, 20022, 19841, 19621, 20860, 19853, 21907, 22536, 22311, 22107, 22064, 20807, 21508, 21554, 21023, 21507, 18078, 20317, 19491, 19443, 18293, 17247, 15848, 16818, 16888, 16165, 17326, 16087, 16189, 16895, 16923, 16690, 17821, 18274, 18319, 18055, 18546, 18773]
840A8773P67j96o15m99K65j279K64j229p46m33l85j185O50r07l35j700J312j900
822A0622R49K212j802P72J728j037q55J505k338K420n9O80MR00j034p62j86j801
804A1918Rk217J466N61k20l438M82N38p46q46J234L45K850j817J414R11p20K96
786A2020n22M53R68Q9j73J486r7M04k230O13j716M13j116o91J063k258K503k072
768I137L42j314j159j914L233k23L11J415k116K544l65q69P85Q1N66P59J200j688
750A0725p64J321r50N2J78j85j45O23p66N73l182m12j157O63M83N76K13L1L58
731H235M88l090J776l57J467J758K5l92R20j307M79j153j58m91N08R97o04k023
713G078P1m7j205K9n56K342r58J488j207J337j502l88k28J821k336J226K60m37
$$ y = [18773, 19540, 19344, 18729, 18230, 18495, 17216, 17480, 16251, 15505, 15072, 14687, 13502, 14152, 13245, 12910, 11210, 12522, 10622, 11571, 13783, 11981, 12753, 14481, 13444, 12589, 14094, 11756, 14176, 14117, 14797, 14801, 15701, 14667, 13905, 13719, 11918, 11927, 9710, 11176, 11737, 11517, 8079, 8561, 9099, 8353, 7507, 8741, 9086, 11936, 10119, 11533, 12444, 11724, 12020, 11498, 11951, 12919, 13008, 12835, 14321, 14224, 14628, 12398, 13011, 11295, 11708, 10592, 9901, 10964, 8706, 11209, 9137, 9479, 8165, 7006, 5092, 8325, 8102, 8413, 9828, 7712, 10256, 9891, 9022, 9807, 9888, 10454, 11213, 12413, 10725, 9961, 11282, 10332, 10384, 10562, 10377, 10232, 10855, 10089, 10662, 7480, 7068, 5911, 6574, 7057, 7633, 7846, 7877, 8235, 8723, 5633, 7409, 7052, 8519, 10277, 10302, 9910, 10830, 9523, 10002, 8849, 8691, 8200, 8708, 9705, 9101, 7078, 7149, 7102, 5897, 5926, 5370, 7712, 6754, 8242, 7035, 8372, 6870, 6482, 6254, 8075, 5739, 6965, 7225, 6788]
695F788J41k136m27J56Kq2J135j29L46j196J133k754K416k37K21l08L3J92o37
676D657J704k235J013j02O2l00l51o84j57k079J92k12o29K142p97R15K35p26J29
657B777j317j502p35J374K528j110P08j23j727m73J28J514O33M85J002J582k158
640C586N2p42m90J319J3q69R92n14L71j718n02j025M22J72n81K76K94Q60r3K113
620C936k361J884j173J075M13J068N99M7o29j18l40m23Q91j57R14M9j074j25j061
601C415o41J930m7j068L70K021j521J807k044J486r95J500p28J878r63J216q54
584F762j253M5o17O98K91J221k52J373q16N44j015J312k578J980k724J807J56
567F934m99J207k31ko58J351n18R5L9j85J40M77K54m76R83q49r75n47O80j88J305
$$ y = [6788, 6929, 4793, 4366, 4522, 4524, 4442, 5577, 5448, 5794, 4598, 5731, 2977, 5393, 5156, 5377, 5069, 5102, 5294, 4657, 6361, 4126, 5139, 5037, 5099, 4799, 4448, 3764, 3607, 1528, 1720, 1508, 879, 3021, 2224, 3139, 3374, 2648, 2777, 1460, -42, -777, 597, 3125, 2015, 2723, 2600, 873, 400, 528, 2042, 2675, 3160, 4162, 5744, 3586, 3638, 2896, 2406, 3725, 3738, 2869, 3861, 3347, 3718, 2000, 1498, 473, 895, 1067, 486, 762, 1056, 1916, 1823, 3936, 1575, 3459, 2286, 3361, 3774, 4842, 5441, 5488, 4859, 4741, 4401, 3978, 4869, 4712, 5626, 5675, 4601, 4476, 3415, 2774, 4704, 4657, 3589, 3959, 5980, 4459, 6266, 4222, 5708, 4713, 6213, 5485, 7363, 6400, 7616, 6762, 5509, 5554, 4937, 5635, 5926, 7147, 6895, 8268, 7452, 7996, 6981, 8293, 5715, 7695, 4971, 6778, 6934, 6435, 7642, 7411, 7409, 6751, 8102, 7584, 7679, 7718, 7533, 7673, 8150, 8404, 7928, 8911, 8062, 7087, 6540, 7220, 7032, 8337]
546H337k007N15%k50J165j747m15J704m3L98p79O86n32N7P31L50J373j695o51
527G197J772r49m01l58JJ149k08j598K6Q89N05K85k258M21n1Q92j093M37m29M56
507F685l77k18J26n60J446l40M06q70J545k751J629K80J354r85j890M39O03p30
489E792j59Q73k303J328j380J38j539P55j285o3P36J568Nk95J595j747J416j175
471D260P15K71K49j183Q26j037l74P19J60j292Q08l29q58N10j364l57RK45K134
452D112j022j274Q69J33J73k257K411j38o4M87k18p48J35j297K233j846J252m80
434B461j096J337n69M13q80J360J184J092k319j466R0J592j52r34J534n88K145
417E204j843j29K94k100K60J017P89l22J184M43r59K27l70k39q46J146O97J340
$$ y = [8337, 6330, 6845, 6845, 6595, 7760, 6013, 5598, 7302, 7259, 7657, 6878, 7564, 7032, 7089, 7820, 8170, 9543, 7848, 7197, 8969, 8020, 7619, 7261, 7262, 8411, 8203, 6605, 6631, 7520, 8025, 8310, 6052, 6473, 6422, 7314, 6221, 6658, 6229, 6685, 6308, 6090, 6216, 5656, 7102, 6762, 7168, 6298, 7843, 5092, 6721, 7001, 8355, 7370, 5480, 5919, 6522, 5792, 5633, 6506, 4203, 5531, 4151, 4289, 2750, 3505, 2220, 2157, 2893, 4461, 4466, 4171, 5766, 4019, 5435, 4260, 4975, 5246, 5495, 4312, 5138, 4101, 3727, 4446, 4606, 3314, 4122, 3793, 2935, 3445, 2081, 1724, 1733, 1978, 4112, 3090, 1816, 2685, 2818, 2991, 734, 3145, 3007, 2943, 3430, 3212, 2464, 2599, 1302, 3535, 1689, 2941, 2461, 1365, 2702, 2133, 2546, 1666, 3026, 4210, 5302, 2983, 1517, 1607, 3199, 3047, 2113, 3647, 3059, 5204, 3361, 3232, 3526, 1426, 1686, 2703, 3492, 3170, 4354, 4797, 3838, 4065, 3695, 3456, 2610, 3756, 4453, 5793]
399E793j125m24j813J286j882j50N30Q84N61k889K553l4k753r1J695j74K88J78
381B433Q39J089m2k249k66K36j16O69o12R08q85J436K09j977j168M33P11o33j783
362g68J755o06k07r91j45R15j202K7R31Q95j448J162r13L57J43r32P31P12r55
343e39J939j969K38k03r56K744k345j03l57J208M90j328K8p61j333N13J250n51
325b035q5M80J768j372k3m91k69q68Q78nO59l77j286J801j181m15k001J108J175
306b539p64m43P30l67j360J518K2K48n2Q91j385j743J651l4j188Q32J764k179
288d398J023j86k113j46j40j682J07J977L41k077K70L59m84r63k55K053J529j414
270f199m02J989P61j742l47P10o91L05J083k568O26l69j657p94Q31j018K277o20
$$ y = [5793, 4668, 4244, 2431, 3717, 1835, 1685, 2215, 3099, 3660, 771, 3324, 3290, 537, 446, 2141, 1967, 2255, 2433, 3272, 4361, 4319, 2070, 1804, 2040, 1924, 2593, 1981, 2889, 2004, 3440, 3649, 1672, 504, 937, 1648, 1015, -768, 987, 381, 174, -817, -962, -47, -1249, -1222, -291, 604, -844, 318, -595, -238, -95, -1027, -296, 416, -539, 1400, -569, -331, -534, -1490, 1254, -1091, -1194, -1551, -343, 147, -1181, -1153, -1914, -3247, -2734, -1484, -2035, -2120, -1640, 128, -1244, -1267, -1758, -2027, -2895, -2017, -2022, -1363, -1740, -3026, -1225, -2406, -2821, -4822, -3714, -2539, -3303, -3746, -3016, -3383, -4743, -3225, -3203, -2955, -3007, -2116, -3501, -5244, -3593, -3627, -4815, -3983, -2219, -4398, -3375, -3561, -5674, -5820, -5960, -7642, -7535, -5558, -5217, -7294, -7024, -6665, -7149, -8112, -8367, -6314, -4785, -6199, -6601, -4612, -3851, -5593, -5940, -5230, -5921, -5616, -4533, -7101, -6475, -6844, -8501, -9295, -8464, -9482, -7205, -7825]
252g825R5m77J472l040J716L81K3p33j751K515j291J97l27j3j599K654l004J346
234i661P4m54j026l39J470j339L33n86M94r64P77l27P67p77q90J518J94j62k748
215a3646L307k742k201O3j231o96J359M07j010J623J02r66j400M50N67K52m45
198a6207l31j745J755Q69j928j254J103o44L83N75j120l9k543J67K439k61m21
181a9202k414R94Q95j610p28j57k16J205N28j298J129r44j658J55j715J09K321
164b2606K21L01j876M17j318k080j552M640K416N300m021n187q97j24N1J711k673
147b7277J529j73l30P01k22j817j14j649j616M195L247M602l095n048m691K199
131b9559l126j302M741L812K279j157p452J247K065k168J939k008p34R48p67N8
$$ y = [-7825, -7730, -8207, -6735, -9775, -8059, -7678, -7655, -8388, -10139, -7624, -8915, -8718, -9045, -9058, -10657, -8003, -11007, -9661, -9587, -10041, -11067, -11406, -9936, -11275, -10942, -11528, -11034, -11998, -11221, -11548, -10781, -11558, -12448, -10930, -10736, -10898, -13646, -10339, -13081, -15282, -15219, -16450, -17146, -15787, -15380, -16390, -14767, -14665, -15631, -17031, -16581, -16014, -15762, -16207, -16538, -18283, -16528, -15659, -17587, -18841, -17738, -18382, -17999, -17424, -18544, -18583, -21126, -20959, -18520, -18781, -19202, -21616, -20622, -19727, -21337, -22065, -22222, -22438, -21233, -20705, -22003, -20874, -21818, -23476, -23321, -25036, -24927, -22606, -22385, -22084, -23960, -23543, -24861, -26941, -28493, -23853, -21437, -16137, -20158, -25345, -26242, -26366, -26315, -24604, -27277, -25748, -25921, -26251, -25550, -25772, -27589, -27703, -29352, -30968, -26773, -23526, -18924, -22019, -27067, -31758, -29559, -32685, -33987, -29246, -25434, -23155, -24312, -31764, -30517, -28452, -30620, -28681, -30689, -31423, -30475, -31242, -31184]
115c1184j66j906K283k417k370M686J901M034k074m440k733L717k860j903J319
100c4113J058m50j763K37j25J302k540R84k99M00n01Q3K37J19m55J265j122l001
82c8684J015J429m18j129k131J02R53q2j238Q37k991J26M6J675j326n70N52L54
64d1480k04n68l28j414J189p40j398p40J47k387N00j462M03r15J789j65j986O08
46d9151j107k58J90j008j73q57j265l23p41o94p72q9L66P6q82L86m87j330r2N60
26e7651k070p2p32L59n47r96j163p28p15k55k4J72m91M6j672L56n38q19M91n58
6f7607j111L65j297J44K58j162
0g0410
$$ y = [-31184, -31350, -33256, -30973, -33390, -35760, -31074, -29173, -25139, -27213, -31653, -34386, -30669, -33529, -35432, -34113, -33055, -33505, -35268, -35031, -35156, -33854, -36394, -35410, -35709, -35309, -35810, -35727, -35490, -35371, -35826, -34561, -35683, -38684, -37669, -36240, -36658, -37787, -39918, -39816, -38863, -38945, -40183, -39346, -42337, -42211, -42165, -40490, -41816, -42386, -41834, -41480, -41684, -42252, -42580, -43994, -42805, -43545, -44943, -45683, -45536, -47923, -47423, -48885, -48482, -49397, -47608, -47773, -49759, -49151, -50258, -50516, -50326, -51334, -51507, -52364, -53629, -53952, -54693, -55387, -56159, -56248, -55882, -55806, -56688, -56302, -56789, -58119, -58211, -57651, -59721, -59793, -60525, -60166, -60713, -61709, -62872, -63600, -64315, -64570, -64594, -64422, -64913, -64867, -66539, -66183, -66721, -67540, -67049, -67607, -68718, -68353, -69650, -69506, -69248, -70410]
$$ Imaginary data points
##PAGE= N=2
##DATA TABLE= (X++(I..I)), XYDATA
16383e51034O284N453O221N082M800O143P049L896N182O973O545L155P354N520
16369d71377O161N044M809N769Q465M229N640O337O620M642N133N512M585N940
16355c92491O136O108O068N365L951O288M655N393M249O865N645N053M320O975
16341c15420M428N220N548M968N217P805M507N988N339M663M393N218N172M706
16327b42248O482M214M805N357M203N015N140M173N852N194N579M541M528M251
16313a72914M562N296M584M301N396M968M882N260K988N769L954M993L893N772
16299a06296M436N282N516L677L264M163M074N677L188M411M112M617L661L739
16285d6479M198M976M178K470N826L060N581K913M551K878M848L808L291N174
$$ y = [-551034, -544750, -539297, -533076, -527994, -523194, -517051, -510002, -506106, -500924, -493951, -487406, -484251, -476897, -471377, -465216, -460172, -455363, -449594, -441129, -436900, -431260, -424923, -418303, -413661, -408528, -403016, -398431, -392491, -386355, -380247, -374179, -368814, -364863, -358575, -353920, -348527, -344278, -337413, -331768, -326715, -322395, -315420, -310992, -305772, -300224, -295256, -290039, -282234, -277727, -271739, -266400, -261737, -257344, -252126, -246954, -242248, -235766, -231552, -226747, -221390, -217187, -212172, -207032, -202859, -197007, -191813, -186234, -181693, -177165, -172914, -168352, -163056, -158472, -154171, -148775, -143807, -138925, -133665, -130677, -124908, -120954, -115961, -112068, -106296, -101860, -96578, -91062, -87385, -84121, -79958, -75884, -70207, -67019, -62608, -58496, -53879, -50218, -46479, -42281, -37305, -33127, -30657, -24831, -21771, -16190, -13277, -8726, -5848, -1000, 2808, 6099, 11273]
16271A1273L481L893L951K935L702M203K688M361L652M318L470L543K867L795
16257F2132K654L569L344L722L685K254L134K889K983L645L233K825L981L828
16243A07878J844L724K333K340M577K803K596K904L610K472M161J418L484J883
16229A48027K071L124K303L343J669L013K829K123J553J878M197J656L102K438
16215A83326J912K359K511J829L127J843K624L404O1L338J094K974K363Q26J763
16200B15354K536N59L987J684K20M361M46J046J969J811J881J395L150k7K324
16185B42696J810K055lK767J075K545k6J972J973R95K603o13K969O84J459J104
16169B66065K181L3J851J472J482J114K330l97K085N43J051J577k75L410j644
$$ y = [11273, 14754, 18647, 22598, 25533, 29235, 33438, 36126, 40487, 44139, 48457, 51927, 55470, 58337, 62132, 64786, 68355, 71699, 75421, 79106, 81360, 84494, 87383, 90366, 94011, 97244, 100069, 104050, 107878, 109722, 113446, 115779, 118119, 122696, 125499, 128095, 130999, 134609, 137081, 141242, 142660, 146144, 148027, 150098, 153222, 155525, 158868, 160537, 163550, 166379, 168502, 170055, 171933, 176130, 177786, 180888, 183326, 185238, 187597, 190108, 191937, 195064, 196907, 199531, 202935, 202996, 206334, 207428, 210402, 212765, 213591, 215354, 217890, 218449, 222436, 224120, 224340, 228701, 229147, 230193, 232162, 233973, 235854, 237249, 240399, 240372, 242696, 244506, 246561, 246558, 249325, 250400, 252945, 252919, 254891, 256864, 257859, 260462, 259849, 262818, 263502, 264961, 266065, 268246, 268279, 270130, 271602, 273084, 274198, 276528, 276131, 278216, 278759, 279810, 281387, 281112, 284522, 282878]
16154B82878L664Q4N42N02J676o21J313J000J706Q94J501R97J764j241K708K00
16138B99567M92K046n45J650J270J70J379J301R59k35M81L18O45P13l11K118O08
16121C12626o2J584J66L52L64O99M68k86K692j083K160n57J437K48l9K04J538
16104C22511j243J505p71J342j1Q95O78k71J028R97Q3m67m41Q68R83q71J300L15
16086C28430J271q55Q93j297O20P77j226J070J919q60j46l45N99L69N35M55k45
16069C31964P45K58j332J041L07NM18J144o33J548p40J020q27O64M17j68M75p77
16051C35529k10J17Q4r43J878j292N27j29o08K46L36J45L90P88j008P56R41n37
16033C37010r07J465k81j04J543p46j061P28P08L35j433J487Q21o51Q76k77r95
$$ y = [282878, 286542, 286626, 287168, 287670, 289346, 288725, 290038, 291038, 292744, 293638, 295139, 296136, 297900, 296659, 299367, 299567, 300059, 302105, 301560, 303210, 304480, 304650, 306029, 307330, 308289, 308054, 308535, 308853, 309498, 310211, 309900, 312018, 312626, 312564, 314148, 314314, 314666, 315030, 315729, 316197, 315911, 318603, 317520, 319680, 319123, 320560, 320808, 320769, 320973, 322511, 321268, 322773, 322002, 323344, 323333, 324228, 324906, 324635, 325663, 326660, 326743, 326276, 325835, 326703, 327686, 326815, 328115, 328430, 329701, 328846, 329739, 328442, 329062, 329839, 328613, 329683, 331602, 330742, 330596, 330251, 330850, 331219, 331754, 332209, 331964, 332709, 332967, 331635, 332676, 332983, 332988, 333406, 334550, 333917, 335465, 334725, 335745, 334918, 335582, 335999, 335831, 336306, 335529, 335319, 335436, 335520, 334577, 336455, 335163, 335690, 335561, 334953, 335199, 335535, 335680, 336070, 336858, 335850, 336606, 337547, 337010, 336103, 337568, 337287, 337183, 338726, 337980, 336919, 337647, 338355, 338690, 337257, 338744, 339565, 338914, 339790, 339513, 338518]
16016C38518j12j167J096Q51j184M37J62Q56k115J491j564J192R35k15K66O19
16000C40066O28j481R50k46N41j740M89N57K74q35J91o47K603p58q31J067n05
15983C40323L83K68j26O66p51L97q77J815o94O02K62q17r93j61M13N17j244K209
15965C42192j149O14n75L48p31o57j69K139j6o31Q70n40R76L08l58r14N61j27
15947C42141j26m53P7J5K03J262o86K04j064M01J252j673j576K502J21O05k21
15930C42984j188J003j342J60j244N12k77K507j609J101j254N98L68M74R0J15
15914C42998J138j105R92Q86q03k537R92j218J910j622J978M11j030J132j655
15899C42467J779k114J140j779K731q17p79%L71r63N15q97N67J020j010K325j659
$$ y = [338518, 338406, 337239, 338335, 339186, 338002, 338439, 338601, 339457, 337342, 338833, 337269, 338461, 339396, 339181, 339447, 340066, 340694, 339213, 340163, 339917, 340458, 338718, 339207, 339764, 340038, 339203, 339394, 338747, 341350, 340592, 339761, 340828, 340323, 340706, 340974, 340848, 341514, 340763, 341160, 340283, 342098, 341404, 342006, 342268, 341451, 340458, 340297, 340710, 341227, 339983, 342192, 341043, 341657, 341082, 341430, 340699, 340042, 339873, 342012, 341996, 341365, 342235, 341695, 342671, 342979, 342621, 341707, 342268, 342141, 342015, 341562, 341639, 341654, 341857, 343119, 342433, 342637, 341573, 341974, 343226, 341553, 339977, 342479, 342600, 343205, 342984, 341796, 342799, 341457, 341617, 340373, 340885, 340608, 343115, 341506, 342607, 341353, 341951, 342319, 342793, 342883, 342998, 344136, 343031, 344023, 344909, 344106, 341569, 342561, 341343, 343253, 341631, 343609, 344020, 342990, 344122, 342467, 344246, 342132, 343272, 341493, 344224, 343407, 342628, 342628, 342999, 342036, 342551, 341654, 342221, 343241, 342231, 344556, 342897]
15882C42897L92J971j460J027j31l5Q36L67j329n27j090P4j104Q07M08q35J840
15865C44108n19o95J256j180p33L69J115J247L93N4n25R9J11k361N80R67o01N31
15847C44216J154j604J242l67J76n32J773p7K67r14l42n94r88K85j481J433L68
15830C44015n25R07k44o14O96O81L00M81J652n42Q13J73j387L54j090L54q99Q20
15812C45945K04m63k81M17J082j292j139P55N40k83P57j605K422m50Q7j692K193
15795C47197k252J179p70M90K34J017J875j018J048j225N15k41o01l97R40k721
15779C45270J614j43k8n59q62j292J877j474J480R14L40j082J903l72l76P28L73
15762C48311L02j880M243m647K272k184L23P2K158k501J452K31K2j523N81P6r28
$$ y = [342897, 343289, 345260, 343800, 344827, 344696, 344661, 345497, 345864, 344535, 344008, 342918, 342992, 341888, 342695, 343103, 342268, 344108, 343589, 342894, 344150, 342970, 342237, 342606, 343721, 344968, 345361, 345415, 344890, 344989, 345100, 342739, 343319, 344286, 343685, 344216, 345370, 343766, 345008, 344641, 344817, 344285, 346058, 345981, 346248, 345334, 344992, 344398, 343410, 343695, 342214, 343647, 344015, 343490, 344397, 344153, 343539, 344235, 344916, 345216, 345697, 347349, 346807, 347620, 347793, 346406, 346760, 345670, 346024, 345125, 345945, 346149, 345686, 345405, 345822, 346904, 345612, 344473, 345228, 345768, 345485, 346242, 344637, 347059, 346609, 346696, 345004, 347197, 344945, 346124, 345354, 345844, 346078, 347095, 348970, 347952, 349000, 347775, 348290, 348049, 347448, 347051, 347991, 345270, 346884, 346741, 346713, 346154, 345292, 344000, 345877, 344403, 345883, 346797, 347137, 346055, 347958, 347586, 347210, 347938, 348311, 348613, 346733, 350976, 346329, 348601, 346417, 346740, 346812, 348970, 346469, 347921, 348152, 348174, 346651, 347232, 347308, 346380]
15745C46380J079m23R27l03J203k847J320j116M54L21N42J321p48m54O48R2p01
15728C47695M85n60J764k536J647j025M19J419q81n32R80q61J279M07j173N63
15712C49090j248K62n8N43m05j009J95J174L0r80L55O91n22n25Q89p82J972k151
15694C47521J278J33P66j055J264P08m30J072j546n94Q82L04N8n68j223J398m12
15677C49556O73p5J19j158J132j552J37J285j436J041P0N50K14r53O47j51M86
15660C50585L21p13R4K119j609L92o52p95J385O62j770J163l14K26r88L98J697
15643C52201j012l41Q69j521K12j60p17P5K06J873r57l74O00K25j445M64L85K120
15625C52703p99J090q99n99N71j130L56o98J193k09m53J174j721o06k26J356j71
$$ y = [346380, 347459, 347036, 347963, 347660, 348863, 346016, 347336, 346220, 346674, 346995, 347537, 348858, 348110, 347656, 348304, 348396, 347695, 348180, 347620, 349384, 346848, 348495, 347470, 347889, 349308, 348427, 347895, 348875, 348014, 349293, 349700, 348527, 349090, 347842, 348104, 348046, 348589, 348184, 347175, 347370, 348544, 348574, 347594, 347949, 348640, 348118, 347593, 348482, 347700, 349672, 347521, 348799, 348932, 349698, 348643, 349907, 350615, 350185, 351257, 349711, 349117, 349999, 350303, 350361, 349793, 348570, 349968, 349556, 350229, 350154, 350273, 349115, 350247, 348695, 348832, 350117, 348681, 349722, 349792, 350342, 350556, 349603, 350250, 350099, 350585, 350906, 350193, 350287, 352406, 350797, 351189, 350537, 349742, 351127, 351789, 350019, 351182, 350868, 351094, 350106, 350504, 352201, 351189, 350848, 351717, 350196, 350408, 350248, 349531, 349606, 349812, 351685, 350728, 350354, 350954, 351179, 349734, 350198, 350583, 352703, 351904, 352994, 352095, 351496, 352067, 350937, 351293, 350595, 351788, 351579, 351126, 352300, 350579, 349973, 349747, 351103, 350932]
15608C50932J169k0J376k735J332o69j246J160J332R22pL53k65j295j821k28J381
15591C51671R83P60L2J21o75o21k043J510j834Q52Q7K831L24J93j308l1J058k201
15573C51709J085r14J313j26m61j16O35N93j085J69l73P65n71Q59j079J132j809
15556C51726M81N55O68j011O78J99k18K33n66j483J659K88q00K129j883N61l3
15539C53183j088n51K922k426J360N01Q87j574M76m58J123j354K547j562Q8Q17
15523C54891N6J158k360J059n33j71Q29m23j354J510j28o84J092j365J697l9Q61
15506C56096k327K713j200L36j155O75P92o58N21l9J1k20M48j079J527n80l5m86
15488C55340Q29J166j947J290j693J045j543J218J64L85N04N57j115L96j117L40
$$ y = [350932, 352101, 352081, 353457, 350722, 352054, 351385, 350139, 351299, 352631, 353553, 353546, 353899, 353634, 352339, 350518, 350290, 351671, 352654, 353414, 353446, 353567, 352892, 352271, 350228, 351738, 349904, 350756, 350843, 353674, 353998, 354191, 352883, 352852, 353910, 351709, 352794, 351880, 353193, 353067, 352606, 352490, 353125, 353718, 352633, 352802, 352429, 353194, 352623, 353482, 352403, 353535, 351726, 352207, 352762, 353430, 352419, 353097, 353296, 353078, 353311, 352745, 351262, 352921, 353209, 352409, 354538, 352655, 353216, 353183, 352095, 351544, 354466, 352040, 353400, 353901, 354788, 353214, 353690, 353232, 354355, 353001, 355548, 353986, 354074, 354891, 354947, 356105, 353745, 354804, 354271, 354100, 354929, 354506, 353152, 354662, 354534, 353850, 354942, 353577, 355274, 355235, 356096, 353769, 356482, 355282, 355618, 354463, 355138, 355930, 355272, 355793, 355754, 355765, 355545, 355993, 354914, 356441, 355861, 355826, 355340, 356169, 357335, 355388, 356678, 354985, 356030, 354487, 355705, 355869, 356254, 356758, 357315, 356200, 356596, 355479, 355819]
15472C55819p96J894q15l4J065j058o62J105M23j579J497K21j176L97n46O11n24
15455C55842R06J11m33m10r34M26o86N55Q0O12P50j06o16N54J014j62j241J288
15437C57550p08M01q42K003j79m39o26l09M70R73j125N69p9q34J451K0K02m40
15419C58058j182J456n36m76j285K032q37O25j384J485j535J531J72j151J933
15404C58906k350J320N76K96j421J370p3J74l55M36Q2j382J267l66J351j384J615
15387C60062j302J014j359n13P96N35j290J722k43N33j484J075o85O37j080J753
15371C60171k35j166J719j923J625L90j247O39R26j008J381j699P4o3p58n18J59
15354C58467J302l73o85J669o14q70M29j58m1L96J231p53Q70M54q84J02m35q02
$$ y = [355819, 355023, 356917, 356102, 356068, 357133, 356075, 355413, 356518, 356941, 355362, 356859, 357080, 355904, 356301, 355755, 356366, 355842, 356748, 356859, 356426, 356016, 355082, 355508, 354822, 355377, 355457, 356069, 356819, 356713, 356097, 356651, 357665, 357503, 356262, 357550, 356842, 357243, 356401, 358404, 358225, 357786, 357160, 356851, 357321, 358294, 357169, 357738, 357659, 356825, 358276, 358296, 358498, 358058, 356876, 358332, 357796, 357320, 356035, 358067, 357230, 357855, 356471, 357956, 356421, 357952, 358124, 356973, 358906, 356556, 357876, 358452, 358748, 357327, 358697, 358624, 358798, 358443, 358879, 358961, 357579, 358846, 358480, 359831, 358447, 360062, 358760, 359774, 358415, 357902, 358698, 359233, 357943, 359665, 359422, 359955, 358471, 359546, 358861, 359498, 358418, 360171, 359936, 358770, 360489, 358566, 360191, 360581, 359334, 359973, 360899, 359891, 361272, 359573, 359647, 359584, 358826, 358308, 358467, 359769, 359396, 358711, 360380, 359766, 358896, 359325, 359167, 359126, 359522, 360753, 360000, 360870, 361324, 360440, 360542, 360107, 359305]
15336C59305J143J36J577j297j051j59J090j538k68K40J555J694j881l31M21j313
15320C59323n45M80K76J649p83J233j420J253j864k57J95J438K64M02n4J77j340
15303C60427K37Q13j369K302j61J030j543l92r96L13p65O41o8k97K026J57p51
15286C61604J710j708J56n95q76L559j549J460j880J578r34J56j616M23N92J53
15270C62233nj037K011j761M94N3M81L44N48j520J359m41k95j314N31J011j324
15253C61368J360p25J013l68j8J72L04M7o68R42N81Q7K83P34p60k491M95M63M49
15234C63268l7m43J252j162J699k953K745k246O49J300J371k409Q96J98j006p52
15218C62370m30L17O7J352k18J200j7j302r31R8J462Q38J74R42j726K96K68j847
$$ y = [359305, 360448, 360584, 362161, 360864, 359813, 359654, 360744, 359206, 358938, 359178, 360733, 362427, 360546, 360215, 360636, 359323, 358778, 359258, 359534, 361183, 360400, 361633, 360213, 361466, 359602, 359345, 359540, 360978, 361242, 361644, 361590, 361767, 360427, 360664, 361477, 360108, 362410, 362249, 363279, 361736, 361344, 360348, 360661, 359896, 360537, 360469, 360172, 362198, 362355, 361604, 363314, 361606, 361762, 361167, 360291, 363850, 362301, 363761, 361881, 363459, 362525, 362681, 361065, 361488, 362080, 362233, 362228, 361191, 363202, 361441, 361935, 361988, 362469, 362813, 363361, 361841, 363200, 362759, 362464, 361150, 361681, 362692, 361368, 362728, 362003, 363016, 362648, 362630, 362802, 363106, 363153, 362485, 363427, 364008, 364095, 364378, 365112, 364352, 361861, 362356, 362819, 363268, 363231, 362788, 364040, 362878, 364577, 361624, 364369, 362123, 362772, 364072, 365443, 363034, 363930, 364128, 363122, 362370, 361940, 362257, 362324, 363676, 363458, 364658, 364641, 363339, 362408, 362506, 363968, 364806, 364980, 365922, 364196, 364492, 364760, 362913]
15200C62913P46K80K17P15J11Q68j404p8k158J747J349Q34r99J832p20j359n42
15183C64352j054J044k089L693q60J554n50j100j532O37J55R15Q19O52J515r41
15167C67210n69j228K62r78J024j492J365R36M94k16j452P21j623J983j222K934
15151C68149L37o34j003p53R52r49l71J537J78N17k83j12K88P11k161j92J533
15134C67744P1n34r64J276j567n15n20J541k81l88J979p72N51P17q82q29R79J259
15116C68865m41p94K17K77K43j051M96j84J309k602k24J894j138N21m29L93Q24
15099C68176n34q55L86R90j448J938r39J448j38n72k33j5J7p13J550r82J436O
15081C69518K03j344P78k146J666j820O70J889o16m15n05O47q41k16J566K12j192
$$ y = [362913, 363659, 363939, 364156, 364871, 364982, 365850, 364446, 364368, 362210, 363957, 365306, 366140, 365141, 366973, 366253, 364894, 364352, 363298, 364342, 362253, 365946, 365086, 366640, 366090, 364990, 363458, 364095, 364250, 365165, 365984, 366636, 368151, 367210, 366641, 365413, 365675, 364697, 365721, 364229, 365594, 366530, 367024, 366808, 365356, 366077, 364454, 366437, 365215, 368149, 368486, 367852, 366849, 366096, 367048, 366099, 365728, 367265, 367443, 367960, 367677, 367565, 367853, 368564, 366403, 366211, 367744, 367815, 367281, 366317, 367593, 366026, 365511, 364991, 366532, 366251, 365863, 367842, 367070, 367621, 368338, 367456, 366627, 367606, 368865, 368424, 367630, 367847, 368124, 368367, 367316, 367812, 367628, 368937, 366335, 366111, 368005, 366867, 367388, 366959, 367352, 368176, 367642, 366787, 367173, 368163, 366715, 368653, 367714, 369162, 369024, 368452, 368219, 368204, 368221, 367508, 369058, 368076, 369512, 369518, 369721, 368377, 369155, 367009, 368675, 366855, 367525, 369414, 368798, 368383, 367878, 368525, 367684, 367468, 369034, 369246, 368054]
15064C68054J358M46J68r26q06j171L587k058N29O60O15P4j007m32Q24m49j343
15047C68123P38k23J278K27J490l231J704j414J171l56O97r11J854l11j151J220
15031C70905j069l00Q4P80L04Mq9N02p10Q35j604m45k52J133K68J57L73r72Q80
15012C70784r44J405l62L96n27J583j91m53J93P5k372K077j077Q71K14P84J71
14995C72627K49j709P0l07k76N17m03J179k46p14p88J403j006J705j837J014J325
14978C72803j417R21J71r81N96Q68m2k61q13P58q60P48j9Pj468K22O38r09Q05
14959C71767J085N41j178J167l78k57J359j940m7K026q62K74l41m75M17p79n0
14942C72329o24J481j077J92J072O62j164R46n65q85J532q35p85J444Q73k207
$$ y = [368054, 369412, 369858, 370026, 369100, 368294, 367123, 370710, 368652, 369181, 369841, 370456, 370530, 369523, 369091, 369915, 369466, 368123, 368861, 368638, 369916, 370143, 371633, 368402, 370106, 368692, 369863, 369507, 370204, 369293, 371147, 370836, 369685, 370905, 369836, 369536, 369620, 370400, 370704, 370708, 370619, 371121, 370411, 371246, 369642, 369197, 368945, 370078, 370346, 370503, 370876, 369904, 370784, 369840, 371245, 370883, 371279, 370752, 372335, 372144, 371691, 371884, 371959, 369587, 371664, 370587, 371458, 371672, 372456, 372627, 372876, 371167, 371237, 370930, 370654, 371171, 370768, 371947, 371701, 370987, 370199, 371602, 370596, 372301, 370464, 371478, 372803, 371386, 372307, 372478, 371497, 372093, 372961, 372919, 372658, 371845, 372603, 371743, 372491, 372472, 372479, 371011, 371233, 371871, 370962, 371767, 372852, 373393, 372215, 373382, 373004, 372747, 374106, 372166, 372119, 374145, 373283, 373557, 373216, 372741, 373158, 372379, 372329, 371705, 373186, 372109, 372301, 373373, 374035, 372871, 373817, 373252, 372367, 373899, 373064, 372279, 373723, 374596, 372389]
14926C72389K195r36j00j33l94L65m65l03J262L57P50j790k67k46J149j486J090
14909C73437R5N93N56l4j52k50n2l63K41N25J206L79p85k31n47j155P43O36l8
14890C74804M25q66J195O36j509p80j7j02l02M68K81J837j770J424j370M70L83
14873C75207m7K070o72J005j199N93J109o91K28p20J275o68j453J926j056O34
14857C77541k692J078j43m7l22k43J662O4K62q95R01r82K022k728P94J64J275
14840C77711k54O74j248N28j183J11q0M77J050q39O89n59N38l71l97j306K332
14823C77873p35N29Q44m79N98j670R91q63M75p00O66N22N16j796J861J09j958
14806C76783j74j59o13K230K33L1K56j72O34j156R09O29J307j455M31p04J075
$$ y = [372389, 374584, 373648, 373548, 373415, 373021, 373386, 372921, 372618, 373880, 374237, 374987, 373197, 372930, 372684, 373833, 372347, 373437, 373532, 374125, 374681, 374647, 374495, 374245, 374193, 373830, 374071, 374596, 375802, 376181, 375396, 375165, 374618, 373463, 374206, 374842, 374804, 375229, 374363, 375558, 376194, 374685, 373905, 373888, 373786, 373484, 373952, 374233, 376070, 374300, 375724, 374354, 374824, 375207, 375160, 377230, 376558, 377563, 376364, 376957, 378066, 377375, 377603, 376883, 378158, 377490, 376037, 377963, 376907, 377541, 374849, 375927, 375784, 375737, 375415, 375172, 376834, 376898, 377160, 376265, 377166, 376184, 378206, 375478, 376272, 376436, 377711, 377457, 378131, 376883, 377411, 376228, 376339, 376259, 376736, 377786, 376947, 377636, 377077, 377615, 377244, 376847, 375541, 377873, 377138, 377667, 378511, 378032, 378630, 376960, 377951, 377088, 377563, 376863, 377529, 378051, 378567, 376771, 378632, 378741, 376783, 376609, 376450, 375837, 378067, 378300, 378331, 378587, 378415, 379049, 377893, 378802, 379431, 380738, 379283, 379714, 379010, 380085]
14789C80085j364R7l65M30L65l99n47m90K54Q54p65P16k25J429k374J481M39r6
14771C79525m87J276p27J707p37j073J004N31r42j89p42M02J134j088m3O45j038
14754C79158J189j396K120o21K215k177K48M11o70M76J115j1N88p41m51M17j420
14737C80450K67m29J233n44K53K18n58m23M11k111Q04J825j024j38N17J224j765
14720C80210J613j226M09J807j189N7n60J946j98k409K96j4J212o92J370j233
14704C81399J569j752j35nJ004k97n44O35m1o37j40j89M93N33r38L99J4J124P02
14685C83194n00q96J285J094k335L02o41J124j588K408q23N49k23j410j60Q64
14669C82244J034k034J337O80l44N40o23L5j112J872o42k09R76J752j520P4q63
$$ y = [380085, 378721, 378818, 378453, 378883, 379248, 378849, 378302, 377812, 378066, 378920, 378155, 378871, 378646, 380075, 377701, 379182, 379621, 379525, 379038, 380314, 379587, 381294, 380557, 379484, 380488, 381019, 380077, 379888, 379146, 379548, 380682, 379594, 379551, 380196, 379158, 380347, 378951, 381071, 380450, 382665, 380488, 380736, 381147, 380477, 380953, 382068, 382057, 382645, 381904, 381453, 381870, 380450, 380717, 380288, 381521, 380977, 381230, 381448, 380890, 380467, 380878, 378767, 379571, 381396, 380372, 380234, 380751, 381975, 380210, 381823, 380597, 381006, 382813, 381624, 381681, 381121, 383067, 382869, 380460, 380756, 380742, 381954, 381262, 382632, 381399, 382968, 381216, 381081, 381076, 382080, 381783, 381239, 381874, 381833, 381196, 381056, 380867, 381360, 381893, 380955, 381354, 381368, 382492, 383194, 382694, 381798, 383083, 384177, 381842, 382144, 381503, 382627, 381039, 383447, 382624, 383173, 382950, 381540, 381380, 382244, 383278, 381244, 382581, 383261, 382917, 383457, 382834, 382869, 381757, 383629, 382987, 382778, 383754, 385506, 383986, 384060, 383197]
14652C83197K10P19j90J64J98O66j412n19m59N19q87R55m0J470j893K340j052
14635C83986l75q65K33J516j536J671k79K08q35k17N71O37n68Q83j158J517j971
14618C83418N59N22n67lK685j145M26k57K36M67j253k01J335j296R14j870R78
14601C84948J69n30k54K43P96J184k110J438o50P16o75m63R66J371r91r63j93
14584C85002J517n09r68J294M64Qr43R6R10j239P39m80N79n99j45p04K01Q50M6
14565C86119Q88l61J004l68j164L32K68J96m10K74J133M16j368O00q18k39J291
14548C87793j082O40J750k67q24K23q04J34j760J919j353J548m18J88o93J432
14532C88426k040R09o46j961M106k227K486n69p24n46J275o43P63m51J610j840
$$ y = [383197, 383407, 384126, 383936, 384100, 384298, 384964, 383552, 383033, 382574, 383093, 382206, 383161, 383121, 384591, 382698, 385038, 383986, 383611, 382746, 382979, 384495, 382959, 384630, 384351, 384559, 383724, 383507, 384078, 384715, 384147, 385030, 383872, 385389, 383418, 383977, 384499, 383932, 383929, 386614, 385469, 385895, 385638, 385874, 386341, 385088, 384887, 386222, 384926, 385840, 383970, 384948, 385117, 384587, 384333, 384576, 385372, 386556, 384446, 385884, 385234, 385950, 385275, 384812, 385778, 387149, 386158, 385195, 385002, 386519, 386010, 385042, 386336, 386800, 386808, 385865, 385961, 386871, 385632, 386371, 385891, 386470, 385871, 385726, 385022, 385223, 386073, 386119, 387007, 386646, 387650, 387282, 386118, 386450, 386718, 386914, 386504, 386778, 387911, 388327, 386959, 387559, 386741, 386502, 387793, 386711, 387351, 389101, 388834, 388010, 388233, 387429, 387563, 385803, 387722, 386369, 387917, 387499, 387687, 386994, 388426, 386386, 387295, 386649, 384688, 388794, 386567, 389053, 388484, 387760, 387214, 388489, 387846, 388609, 388158, 389768, 387928]
14516C87928J493j288O75j344J318k151J172J033m28J20r66K794j168j511o55
14501C87022J600J47J36rO41k455J881n29M35j005J962j402J107n35J259j678
14485C88577J600j760N95R79L79o52M74J76K050q08P4k174M82O67j368J176q51
14468C89616J418o50N77j261N0j397L136j145L19N38N20r79j396Q76L74Q3J432
14451C92111j84m97P67j933k83K400J75q64kp77J114m43M71l98j545J732R7l038
14433C88903K070O63j509M29k16R30m41j036R17L80Q07j18j72r3M19L2Q19j324
14415C91460K119j643Q61p75O12J297L67j745P69J17j588J734j843N57J374j154
14399C92519k35P53k328J682l95J057J91L30p44L48J239o1j159J117J48j090J915
$$ y = [387928, 389421, 388133, 388808, 387464, 388782, 386631, 387803, 388836, 388408, 388528, 387562, 390356, 389188, 387677, 387022, 388622, 388769, 388905, 388896, 389537, 387082, 388963, 388434, 388869, 387864, 389826, 388424, 389531, 388996, 390255, 388577, 390177, 388417, 389012, 389991, 390370, 389718, 390192, 390368, 392418, 391610, 391684, 389510, 389992, 390659, 389291, 390467, 389616, 391034, 390384, 390961, 389700, 389750, 388353, 391489, 390344, 390663, 391201, 391721, 390742, 389346, 390222, 390596, 390679, 392111, 391927, 391430, 392197, 390264, 389981, 392381, 392556, 391692, 391690, 390913, 392027, 391584, 392055, 391657, 390112, 391844, 391941, 388903, 390973, 391636, 390127, 390556, 390340, 391270, 390829, 389793, 390710, 391090, 391897, 391779, 391607, 391514, 391933, 391965, 392784, 391460, 393579, 391936, 392797, 392022, 392634, 393931, 394298, 392553, 393322, 393439, 391851, 393585, 391742, 392299, 393673, 392519, 392284, 393037, 390709, 392391, 391996, 393053, 393244, 393574, 392830, 393178, 394417, 394356, 393197, 394314, 394462, 393372, 395287]
14382C95287k030J095J311l530K663m69J6j862Q50k92k59L08j887J535L18n88
14366C92466o6J238J4p48k14p87M55K161j34M9M3o12J460l313P05O51j72K776
14348C95972j374n47K097l926L053n73J428j248J285K33m62K77j692J449J313
14333C97285q10L56j034O78N33j125O44r85K366m511M204l324M468n87j583l31
$$ y = [395287, 393257, 394352, 395663, 392133, 394796, 394327, 394343, 392481, 393331, 393039, 392780, 393088, 391201, 392736, 393054, 392466, 392400, 393638, 393652, 392904, 392690, 391903, 392358, 394519, 394385, 394434, 394477, 393865, 395325, 392012, 392717, 393368, 393196, 395972, 394598, 394051, 396148, 392222, 395275, 394702, 396130, 394882, 396167, 396400, 395938, 396215, 394523, 395972, 397285, 396475, 396831, 395797, 396475, 397008, 395883, 396527, 395542, 397908, 393397, 397601, 394277, 398745, 398158, 396575, 396244]
$$ [...]
##END NTUPLES=NMR SPECTRUM
##END=
