##TITLE=abcd
##JCAMPDX= 6.0         $$ Bruker NMR JCAMP-DX V2.0
##DATA TYPE= NMR SPECTRUM
##DATA CLASS= NTUPLES
##ORIGIN= UXNMR, Bruker Analytische Messtechnik GmbH
##OWNER= root
$$ XWIN-NMR		Version 3.5
$$ Tue Dec  2 17:47:45 2025 Russian Standard Time (UT+4h)  servis@DPX200
##.OBSERVE FREQUENCY= 200.131235884673
##.OBSERVE NUCLEUS= ^1H
##.ACQUISITION MODE= SIMULTANEOUS
##.ACQUISITION SCHEME= undefined
##.AVERAGES= 8
##.DIGITISER RES= 18
##SPECTROMETER/DATA SYSTEM= spect
##.PULSE SEQUENCE= zg
##.SOLVENT NAME= DMSO
##.SHIFT REFERENCE= (INTERNAL, DMSO, 0, 16.4885)
##AUDIT TRAIL= $$ (NUMBER, WHEN, WHO, WHERE, WHAT)
$$ ##TITLE= Audit trail, XWIN-NMR		Version 3.5
$$ ##JCAMPDX= 5.01
$$ ##ORIGIN= Bruker BioSpin GmbH
$$ ##OWNER= servis
$$ F:\spectra/data/av/nmr/H1/1/pdata/1/auditp.txt
$$ ##AUDIT TRAIL=  $$ (NUMBER, WHEN, WHO, WHERE, WHAT)
(   1,<2025-12-02 17:47:19.65 +0400>,<servis>,<DPX200>,
      <created by zg, POWCHK disabled, PULCHK disabled
       terminated by command 'halt'
       configuration hash MD5:
       00 E9 B6 7A A2 85 ED C7 34 08 36 98 17 FE 4E 26
       data hash MD5: 32K
       B2 43 CF A3 8C 5F FB 85 B4 EE AB E9 86 C7 40 D0>)
(   2,<2025-12-02 17:47:21.93 +0400>,<servis>,<DPX200>,
      <Start of raw data processing
       efp BC_mod = 2 LB = 0.05 FT_mod = 6 PKNL = 1 PHC0 = -263.8425 PHC1 = 6.301564 SI = 16K 
       data hash MD5: 16K
       07 D0 C8 4B B9 9A D2 FB 17 B3 42 90 2D A5 16 F9>)
$$ ##END=
$$ 
$$ hash MD5
$$ 34 1D 3A 0B 6C 92 01 3E 47 8F 69 0B 8C AB 4C 5B
##$RELAX= 
##$RELAX= 
##$RELAX= 
##$RELAX= 
##$RELAX= 
##$RELAX= 
##$RELAX= 
##$RELAX= 
$$ Bruker specific parameters
$$ --------------------------
##$DU= <F:\spectra>
##$EXPNO= 1
##$NAME= <H1>
##$PROCNO= 1
##$TYPE= <nmr>
##$USER= <av>
##$AMP= (0..31)
100 100 100 100 100 100 100 100 100 100 100 100 100 100 100 100 100 100 
100 100 100 100 100 100 100 100 100 100 100 100 100 100 
##$AQSEQ= 0
##$AQ_mod= 1
##$AUNM= <au_zg>
##$AUTOPOS= <>
##$BF1= 200.13
##$BF2= 200.13
##$BF3= 200.13
##$BF4= 200.13
##$BF5= 500.13
##$BF6= 500.13
##$BF7= 500.13
##$BF8= 500.13
##$BYTORDA= 1
##$CFDGTYP= 0
##$CFRGTYP= 5
##$CHEMSTR= <none>
##$CNST= (0..31)
1 1 145 1 1 1 1 1 1 1 1 1 1 1 1 1 1 1 1 1 1 1 1 1 1 1 1 1 1 1 1 1 
##$CPDPRG= <>
##$CPDPRG1= <>
##$CPDPRG2= <>
##$CPDPRG3= <>
##$CPDPRG4= <mlev>
##$CPDPRG5= <mlev>
##$CPDPRG6= <mlev>
##$CPDPRG7= <mlev>
##$CPDPRG8= <mlev>
##$CPDPRGB= <>
##$CPDPRGT= <>
##$D= (0..31)
0 2 0 0 0 0 0 0 0 0.06 0 0 0 0 0 0 0.0002 0 0 0 0 0 0 0 0 0 0 0 0 0 0 
0 
##$DATE= 1764683239
##$DBL= (0..7)
120 120 120 120 120 120 120 120 
##$DBP= (0..7)
150 150 150 150 150 150 150 150 
##$DBP07= 0
##$DBPNAM0= <>
##$DBPNAM1= <>
##$DBPNAM2= <>
##$DBPNAM3= <>
##$DBPNAM4= <>
##$DBPNAM5= <>
##$DBPNAM6= <>
##$DBPNAM7= <>
##$DBPOAL= (0..7)
0.5 0.5 0.5 0.5 0.5 0.5 0.5 0.5 
##$DBPOFFS= (0..7)
0 0 0 0 0 0 0 0 
##$DE= 6
##$DECBNUC= <off>
##$DECIM= 32
##$DECNUC= <off>
##$DECSTAT= 4
##$DIGMOD= 1
##$DIGTYP= 9
##$DL= (0..7)
0 120 120 120 120 120 120 120 
##$DP= (0..7)
$$ [...]
##$SUBNAM4= <"">
##$SUBNAM5= <"">
##$SUBNAM6= <"">
##$SUBNAM7= <"">
##$SUBNAM8= <"">
##$SUBNAM9= <"">
##$SW= 20.6817932712277
##$SWIBOX= (0..15)
0 0 3 0 0 0 0 0 0 0 0 0 0 0 0 0 
##$SW_h= 4139.07284768212
##$TD= 32768
##$TD0= 1
##$TE= 0
##$TE2= 300
##$TE3= 300
##$TEG= 300
##$TL= (0..7)
0 120 120 120 120 120 120 120 
##$TP= (0..7)
150 150 150 150 150 150 150 150 
##$TP07= 0
##$TPNAME0= <>
##$TPNAME1= <>
##$TPNAME2= <>
##$TPNAME3= <>
##$TPNAME4= <>
##$TPNAME5= <>
##$TPNAME6= <>
##$TPNAME7= <>
##$TPOAL= (0..7)
0.5 0.5 0.5 0.5 0.5 0.5 0.5 0.5 
##$TPOFFS= (0..7)
0 0 0 0 0 0 0 0 
##$TUNHIN= 0
##$TUNHOUT= 0
##$TUNXOUT= 0
##$USERA1= <user>
##$USERA2= <user>
##$USERA3= <user>
##$USERA4= <user>
##$USERA5= <user>
##$V9= 5
##$VALIST= <valist>
##$VCLIST= <CCCCCCCCCCCCCCC>
##$VD= 0
##$VDLIST= <DDDDDDDDDDDDDDD>
##$VPLIST= <PPPPPPPPPPPPPPP>
##$VTLIST= <TTTTTTTTTTTTTTT>
##$WBST= 1024
##$WBSW= 30
##$XGAIN= (0..3)
0 0 0 0 
##$XL= 0
##$YL= 0
##$YMAX_a= 447116
##$YMIN_a= -200725
##$ZGOPTNS= <>
##$ZL1= 120
##$ZL2= 120
##$ZL3= 120
##$ZL4= 120
##$ABSF1= 0
##$ABSF2= 0
##$ABSG= 0
##$ABSL= 0
##$ALPHA= 0
##$AQORDER= 0
##$ASSFAC= 0
##$ASSFACI= 0
##$ASSFACX= 0
##$ASSWID= 0
##$AUNMP= <proc_1d>
##$AZFE= 0.1
##$AZFW= 0.1
##$BCFW= 0
##$BC_mod= 2
##$BYTORDP= 0
##$COROFFS= 0
##$CY= 18.4799938201904
##$DATMOD= 1
##$DC= 0
##$DFILT= <>
##$DTYPP= 0
##$F1P= 9.9274215381318
##$F2P= -0.165520771350173
##$FCOR= 1
##$FTSIZE= 16384
##$FT_mod= 6
##$GAMMA= 0
##$GB= 0
##$INTBC= 1
##$INTSCL= 4.127829e-11
##$ISEN= 128
##$LB= 0.05
##$LEV0= 0
##$LPBIN= 0
##$MAXI= 10000
##$MC2= 0
##$MEAN= 0
##$ME_mod= 0
##$MI= 50
##$NCOEF= 0
##$NC_proc= -7
##$NLEV= 6
##$NOISF1= 3.799351
##$NOISF2= 2.8
##$NSP= 0
##$NTH_PI= 0
##$NZP= 0
##$OFFSET= 16.48848
##$PC= 4
##$PHC0= -263.8425
##$PHC1= 6.301564
##$PH_mod= 1
##$PKNL= yes
##$PPARMOD= 0
##$PSCAL= 4
##$PSIGN= 0
##$REVERSE= no
##$SF= 200.130005582386
##$SI= 16384
##$SIGF1= 3
##$SIGF2= 2
##$SINO= 400
##$SIOLD= 16384
##$SREGLST= <1H.CDCl3>
##$SSB= 0
##$STSI= 16384
##$STSR= 0
##$SW_p= 4139.07284768211
##$SYMM= 0
##$S_DEV= 0
##$TDeff= 32768
##$TDoff= 0
##$TI= <>
##$TILT= no
##$TM1= 0
##$TM2= 0
##$TOPLEV= 0
##$USERP1= <user>
##$USERP2= <user>
##$USERP3= <user>
##$USERP4= <user>
##$USERP5= <user>
##$WDW= 1
##$XDIM= 16384
##$YMAX_p= 436000538
##$YMIN_p= -1521850
$$ End of Bruker specific parameters
$$ ---------------------------------
##NTUPLES= NMR SPECTRUM
##VAR_NAME=  FREQUENCY,     SPECTRUM/REAL,   SPECTRUM/IMAG
##SYMBOL=    X,             R,               I
##VAR_TYPE=  INDEPENDENT,   DEPENDENT,       DEPENDENT
##VAR_FORM=  AFFN,          ASDF,            ASDF
##VAR_DIM=   16384,         16384,           16384
##UNITS=     HZ,            ARBITRARY UNITS, ARBITRARY UNITS
##FACTOR=    0.252644378177508, 1,           1
##FIRST=     3299.83951724647, 0,            0
##LAST=      -839.233330435636, 0,           0
##MIN=       -839.233330435636, -1521850,    0
##MAX=       3299.83951724647, 436000538,    0
$$ Real data points
##PAGE= N=1
##DATA TABLE= (X++(R..R)), XYDATA
$$ [...]
9587H06135L73708j85027K10954j02072J88556J10296n0216K9511R3755P1381
9577A546981j29034K8805l7215l3289K91378N8256j21013j44442J10182J30617
9567A701226K5295k49645J57054J15577M4582o8537L59815K8494m3061K98181
9557B368981N4303M1626p407n427O84J71336j0485J96038J03979P1716J08038
9546C093382p4580M2313N5608J62704p0062J55371k7039K50916j03660K17596
9536C702549m2635K06335k1401J61207J7973o2128K70184K65445r7704Q9433l4350
9525D454908J90423J84311L1699K98926J76766J04804j55105L99578N0083K16999
9515E953392J21359J29427M2268R2310J17438K88488K14367J50267K03425M24773
$$ y = [806135, 1179843, 994816, 1205770, 1103698, 1292254, 1402550, 1352334, 1381845, 1475600, 1546981, 1417947, 1446752, 1409537, 1376248, 1667626, 1725882, 1604869, 1460427, 1570609, 1701226, 1726521, 1476876, 1633930, 1749507, 1794089, 1725552, 2085367, 2113861, 2070800, 2368981, 2423284, 2464910, 2457503, 2452076, 2452760, 2624096, 2613611, 2809649, 2913628, 2985344, 3093382, 3018802, 3061115, 3116723, 3279427, 3209365, 3364736, 3337697, 3588613, 3484953, 3702549, 3659914, 3866249, 3844848, 4006055, 4024028, 3961900, 4232084, 4497529, 4399825, 4489258, 4454908, 4645331, 4829642, 4861341, 5160267, 5337033, 5441837, 5286732, 5686310, 5736393, 5953392, 6074751, 6204178, 6246446, 6338756, 6456194, 6744682, 6959049, 7109316, 7312741, 7737514]
9505G737514K71315K51968K70558J21883J60458M49279O9175N17770J23975M70809
9495A0444704M09749M14630M15315N70897J45245L71826L00905N75103M32277
9486A4080651M18718K38657O69741M12186O55923P21311O78830R04981Q63631
9477A9644629Q25319J113357J243927J533027J620752J715236J837286J987745
9469C1521278K248811K433270K713286K980031L385264L934084M246311M672972
9461E8135307N409060O697978Q412249J0932698J3976023J8834214K4733007K9757904
9453A76888440K4401998J0704298J692286J307569O464039J5394624K4185529
9446B61038783K1358756O536600p525331j4620201j5027486j1815891j0310212
$$ y = [7737514, 8008829, 8260797, 8531355, 8653238, 8813696, 9262975, 9332150, 9849920, 9973895, 10444704, 10854453, 11269083, 11684398, 12255295, 12400540, 12772366, 13073271, 13648374, 14080651, 14499369, 14738026, 15407767, 15819953, 16475876, 17197187, 17876017, 18780998, 19644629, 20469948, 21583305, 22827232, 24360259, 25981011, 27696247, 29533533, 31521278, 33770089, 36203359, 38916645, 41896676, 45281940, 49216024, 53462335, 58135307, 63544367, 70242345, 78654594, 89587292, 103563315, 122397529, 147130536, 176888440, 201290438, 211994736, 213687022, 214994591, 221458630, 236853254, 261038783, 282397539, 288934139, 281408808, 266788607, 251761121, 239945230, 229635018]
9439B29635018r759008o298202j221246j86025k700724k501976J513658Q816578
9431B17298073J8249950K5134870J8933038M741874p887658j2242703j0244855
9424B53982589o418378n423361j2792741k3060521k8049375k7933243k5151164
9417A25153806k0886439j5958740j1879610r181952p128394n369498m373788l466549
9409D6908836k803175k599941k540571k242617j969796j815671j356074j447814
9401C0133177j422410j451491j252276j189857j307638j039394q32263p58251
9393B0879597j046998n83272n24349q39365r08056m53478n45610o24547m90829
9384A4863093m62565o76517l55180n84866m20288k5939p45299m86760l39640m24899
$$ y = [229635018, 219876010, 213577808, 212356562, 212170537, 209469813, 206967837, 208481495, 217298073, 235548023, 260682893, 279615931, 284357805, 276470147, 264227444, 253982589, 247564211, 242140850, 229348109, 206287588, 178238213, 150304970, 125153806, 104267367, 88308627, 76429017, 67247065, 60118671, 54749173, 50375385, 46908836, 44105661, 41505720, 38965149, 36722532, 34752736, 32937065, 31580991, 30133177, 28710767, 27259276, 26007000, 24817143, 23509505, 22470111, 21637848, 20879597, 19832599, 19249327, 18724978, 17885613, 16977557, 16524079, 15978469, 15353922, 14863093, 14400528, 13724011, 13368831, 12783965, 12363677, 12337738, 11592439, 11105679, 10766039, 10341140]
9374A0341140m47526k24830l72971l76997k63808j37350m60624J8090k23855k70162
9364G581107p8122j86531k44806q8194k75818r8164j38786p8537k12375l49967
9354E829807R0138m68183p7857N859k87793k6063k98634K647l4854j75016O3747
9343D623798o4154k25854j52460r4571J87223k03948l05752o383j31777j87439
9333C438683K3922k02582k35375l6411L6539p9180k1199l90501J28023k22296
9323B439623K21422j91361l4967j39695O0120K9824l63k54054l1852J35994k0651
9312B214040l417n0957j34811J03212n3495r7507m9442p7345j25758j95555j38455
9301A390510J64802N3072l22477L9697k03088K63060j33772r6071j37846J08867
$$ y = [10341140, 9893614, 9668784, 9295813, 8918816, 8655008, 8517658, 8057034, 8075124, 7851269, 7581107, 7502985, 7316454, 7071648, 6983454, 6707636, 6609472, 6470686, 6392149, 6179774, 5829807, 5919945, 5451762, 5373905, 5379764, 5091971, 5065908, 4767274, 4769921, 4735067, 4560051, 4623798, 4559644, 4333790, 4181330, 4086759, 4273982, 4070034, 3764282, 3757899, 3626122, 3438683, 3462605, 3260023, 3024648, 2988237, 3024776, 2945596, 2924397, 2533896, 2661919, 2439623, 2661045, 2469684, 2434717, 2295022, 2355142, 2384966, 2384603, 2130549, 2098697, 2234691, 2214040, 2210623, 2159666, 2024855, 2128067, 2074572, 1977065, 1927623, 1850278, 1724520, 1528965, 1390510, 1555312, 1608384, 1285907, 1325604, 1122516, 1385576, 1251804, 1155733, 1017887, 1126754]
9291A126754m8052p5833l2138J34767m5549j55527L2478K0223J89898j34571p8989
9280I33461J5138j06335N1073j1056j06565K9934r0478j32235Q7198j10616o7344
9269D92175Q8334P8482k3489J7269J20532j80675J98065j27532M0605n576j09745
9258E88445J53479j93058o7984Q0970j09028K76162k85225j3645M559J78903j44957
9247D68621R5237k75055M4725P4359J26245J4905k02862K21637P7657k13745J57819
9236E89543m1907n000J32505j62245J47609J96795j25643k6775P3520j1323m8826
9225G18253j58263J87947J16623j32266K7552k56295j0607j10484R6111k09551
9215B69020R9805O1448K1030j93746o0365p3449R5283o6189P5938m1619j69999
$$ y = [1126754, 1078702, 1002869, 970731, 1105498, 1059949, 904422, 936900, 957123, 1147021, 1012450, 933461, 948599, 842264, 893337, 882281, 775716, 805650, 715172, 582937, 670135, 559519, 492175, 580509, 658991, 635502, 652771, 773303, 592628, 790693, 663161, 703766, 698190, 588445, 741924, 548866, 480882, 561852, 452824, 728986, 443761, 430116, 434675, 613578, 468621, 563858, 288803, 333528, 407887, 534132, 549037, 346175, 567812, 645469, 431724, 589543, 547636, 542636, 675141, 512896, 660505, 857300, 731657, 704882, 778402, 767079, 718253, 559990, 747937, 864560, 732294, 759846, 503551, 492944, 382460, 478571, 269020, 368825, 430273, 451303, 257557, 197192, 123743, 219026, 152837, 228775, 187156, 17157]
9204A7157m2257J62382k33424J91616j15837J13388O1863l3168j07598j72782
9194a58660Q3873j04386J62315O4733K0576r8305L3234j71393R9347L4192J13402
9183G8928m1939L31823l48465L5758r1421L77298k20257K60564k76810K00253
9173C05732o7388O462q5839L9240j81697p1453J10081m280M9974j17610J45068
9162A28290O3964q4783K6863p3367K12885J19604j0593M7327R1988j06874K92105
9151G07409k63725K90973n7395J68876O9786L9383l82480J61743o6145p5156J92662
9140G85931j27792q6362O5710M070p7871L0646j24782J73913J56604j36557J18750
9129G82260K32630r0053j6334K89537Q2332j55328L55415j97496L97924K08658
$$ y = [17157, -25100, 137282, -96142, 95474, -20363, 93025, 154888, 121720, 14122, -158660, -74787, -179173, -16858, 47875, 68451, -29854, 3380, -168013, -68666, -34474, 78928, 36989, 368812, 20347, 56105, -35316, 341982, 121725, 382289, 105479, 305732, 238344, 244806, 158967, 198207, 16510, -54943, 55138, 50858, 100832, -16778, 128290, 192254, 107471, 134334, 60967, 273852, 393456, 382863, 430190, 522178, 415304, 707409, 443684, 734657, 677262, 846138, 915924, 955307, 572827, 734570, 668425, 593269, 785931, 658139, 571777, 637487, 641557, 563686, 594332, 469550, 643463, 800067, 663510, 782260, 1014890, 924837, 908503, 1198040, 1280372, 1125044, 1480459, 1282963, 1680887, 1889545]
9119A889545J07553L64389L10905K52666K41358L88891J40963M39786J56551O3785
9109D356392J88228N7744l13867M7675k8475j67125p2906j38924n5579M2843J40953
9098D056959K10474K92179K4535Q6318L79673M1662L59189J28666M02671M00619
9088F382945L82186J87083K69942n152l14653N95J57989q7364k2900k30920j98233
9077F521518j70410k79516k78536J10487l15176n63599J40182l66070k76880k06216
9067D315784k8626j72305j70591k60672r119J6439J41397r5938J07313j32979
9057C710703l9602N1761k8817n2158k4479m66089j69635l50658j66486l03255
9047B161285k37273k36596m07788p3206J02325j12362l49209j83560N1614J19563
$$ y = [1889545, 1997098, 2361487, 2672392, 2925058, 3166416, 3555307, 3696270, 4136056, 4292607, 4356392, 4544620, 4602364, 4288497, 4336172, 4307697, 4140572, 4067666, 3928742, 3873163, 3916006, 4056959, 4267433, 4559612, 4584147, 4670465, 5050138, 5091800, 5450989, 5579655, 5982326, 6382945, 6765131, 6952214, 7222156, 7217004, 6902351, 6902946, 7060935, 6973571, 6950671, 6719751, 6521518, 6351108, 6071592, 5793056, 5903543, 5588367, 5024768, 5164950, 4798880, 4522000, 4315784, 4287158, 4114853, 3944262, 3683590, 3674471, 3690910, 3832307, 3736369, 3843682, 3710703, 3671101, 3722862, 3694045, 3641887, 3617408, 3151319, 2981684, 2631026, 2464540, 2161285, 1924012, 1687416, 1279628, 1206422, 1308747, 1196385, 847176, 663616, 715230, 834793]
9037H34793j65509k44405o2798L6327j6085r3598m6226q2302Q2610J59104l35164
9026F6747p8166J44640R9963j94659J59854K1120j28463j05830J53331r3916p5874
9015c1253J60415j52302J66256k5017k70497J24473J58082j61813J1284O5018
9005D4646K4200J3499J16653k84488j0588O3768K17357j51378K5347J18310j86153
8994h827K0390N1436j3704R8105N7199j09469P4837K71805l9004k00851N9312
8983B61229J8931j3554J56875n0784K3903J0227O4844k88593J67552k13474L14088
8972D51244k11103Q4192l2833J1525J27519j96853J09088J52846q1731M2622R5264
8961E51780K5927k0813N0741M0249j3278K80175m6127M438o9395P3825R6082L9220
$$ y = [834793, 669284, 424879, 362081, 398408, 382323, 288725, 242499, 160197, 242807, 401911, 66747, -11419, 133221, 233184, 38525, 198379, 219499, 91036, -14794, 138537, 44621, -31253, 129162, -23140, 143116, 118099, -152398, -27925, 130157, -31656, -20372, 44646, 68846, 82345, 198998, -85490, -96078, -32310, 185047, 33669, 59016, 177326, -8827, 11563, 62999, 49295, 147400, 204599, 95130, 169967, 441772, 402768, 201917, 261229, 280160, 266606, 423481, 372697, 396600, 406827, 471671, 183078, 350630, 137156, 451244, 240141, 324333, 291500, 303025, 430544, 233691, 342779, 495625, 413894, 456516, 551780, 577707, 556894, 607635, 647884, 634606, 914781, 868654, 873092, 803697, 877522, 973604, 1012824]
8949A012824k10201K28532q2105K54204m20434J86284K03430j80906O8970J60609
8939A221207k10570P6656P1835L0093J66468L6897j02291K97739j79911J40325
8929A548448J4362O2624N54k5166K84495l03196R7742N4457K50585J22022k23816
8918A883111K67885l5087k820j45964K06843L9500r1249J4582J69558P6200J22509
8907B505068J47647R7313L2312K2965J10441P1952M8869M19181j363J47994J99378
8896C801757J00861K53394J24081L93782M1040J96655L55367L62825J83198L90560
8886F203520K06846K03987K54727K74559J94979K55136L12889L40861K48160M17377
8876H913041L51810M48784P08167P45564Q71801J195052J418874J917814K215283
$$ y = [1012824, 802623, 1031155, 949050, 1203254, 782820, 969104, 1172534, 991628, 1060598, 1221207, 1010637, 1087293, 1159128, 1189221, 1355689, 1392586, 1290295, 1588034, 1408123, 1548448, 1562810, 1625434, 1625988, 1600822, 1885317, 1582121, 1679863, 1734320, 1984905, 2106927, 1883111, 2150996, 2115909, 2113089, 1967125, 2173968, 2213468, 2122219, 2136801, 2306359, 2382559, 2505068, 2652715, 2750028, 2782340, 2805305, 2915746, 2987698, 3036567, 3455748, 3454385, 3602379, 3801757, 3902618, 4156012, 4280093, 4673875, 4714915, 4911570, 5266937, 5629762, 5812960, 6203520, 6410366, 6614353, 6869080, 7143639, 7338618, 7593754, 7906643, 8247504, 8495664, 8913041, 9264851, 9713635, 10421802, 11167366, 12039167, 13234219, 14653093, 16570907, 18786190]
8867A8786190L810509M753210N021883L238466P86554n355J253222K460036N534895
8858D5639610P061911L210942k037264m203317m081115l134678r98797P39633
8850D2196925M19336j806319k791853k657608k499887j645633q02369M16463R89743
8841C1818798J567380K510972L194519N364174P370107Q325960O958586O417727
8833G3528223O019773L431899K502986M879239J0300487J4415604J0183210j731038
8825A23530383r540064j1135014r338024o684366m924324l893731l157998m927956
8817F9928906p381525p783029o562067n253847m096892k508635j520055o13301
8809C4209555K61382J351644K482658M402406O198838N986345K255529n29888
$$ y = [18786190, 22596699, 27349909, 32371792, 35610258, 36396812, 36391457, 37644679, 40104715, 45639610, 52701521, 55912463, 53875199, 49671882, 45590767, 42456089, 41457292, 42196925, 42616261, 40809942, 38018089, 35360481, 32860594, 31214961, 30412592, 30829055, 31818798, 33386178, 35897150, 39091669, 44455843, 51825950, 60151910, 67110496, 73528223, 79547996, 82979895, 85482881, 90362120, 100662607, 115078211, 125261421, 123530383, 113990319, 102855305, 93517281, 86832915, 81908591, 78014860, 74856862, 69928906, 62547381, 54764352, 48202285, 42948438, 38851546, 36342911, 34822856, 34209555, 34470937, 35822581, 38305239, 42707645, 48906483, 54892828, 57148357, 56618469]
8801E6618469n26128J201013M239835P931574Q326739J243305n551715p505879
8793F5977213o912151n241551j829660k8751k418405m985709o093971n893609
8785C2573406n433114m062341l131863k407416j916267j530097j208254q92080
8777A1991974m43365q10206m57577p20031n17692m75455m58412m02541k88024
8768G418671q6414k67732j11011k33221m05258l18999Q1767l68723j16915k78150
8758E314015N8343j62644k63264m0458j07253j10812j49867j75460k14944P4744
8748D222400q3334k64664J23155l66134K5656j92303q5146k13282m299p730q4649
8737C069670p0541j52166Q138j48990j06078J99317k12059j54735j33882q4716
$$ y = [56618469, 56092341, 57293354, 61533189, 69464763, 77791502, 79034807, 73483092, 65977213, 59065062, 53823511, 51993851, 51965100, 49546695, 44560986, 38467015, 32573406, 27140292, 23077951, 19946088, 17538672, 15622405, 14092308, 12884054, 11991974, 11548609, 10738403, 10280826, 9560795, 9043103, 8567648, 8109236, 7706695, 7418671, 7332257, 7064525, 6953514, 6720293, 6315035, 5996036, 6077803, 5709080, 5592165, 5314015, 5372358, 5209714, 4946450, 4905992, 4798739, 4687927, 4538060, 4362600, 4147656, 4222400, 4139066, 3874402, 3997557, 3631423, 3657079, 3464776, 3379630, 3166348, 3162049, 3154319, 3069670, 2999129, 2846963, 2855101, 2706111, 2600033, 2799350, 2587291, 2432556, 2298674, 2213958]
8727B213958Q1550l1618K6549k6167p9902j85683P3039M5928j52572Q6475j24294
8716A927263J45097j38933J64691r8446j15319J61488m1274k8324j78682m3238
8706A754323q4882P7163L1529m233j79761j62843Q161J01425N0717j58200J19384
8695A552783k15212J64939j36847K70997l184m0595M5941K13451J7554j27346
8685A742481m2463J45569j58394k6098J57716q7162k24225J02476K02916p9469
8675A733347R2134q1660j9434J32748j63293J02049J9959J72944K90744N944J18834
8664B404316J53142K52050R1946m4407J21699L18715R0759J56076L06338O8924
8654C919558L65571M04231L46771N02715P33311J255016J509373K424724M063049
$$ y = [2213958, 2295508, 2263890, 2290439, 2264272, 2184370, 1998687, 2071726, 2117654, 1965082, 2051557, 1927263, 2072360, 1933427, 2098118, 1999672, 1884353, 2045841, 2004567, 1976243, 1797561, 1754323, 1669441, 1746604, 1778133, 1773900, 1594139, 1431296, 1439457, 1540882, 1591599, 1433399, 1552783, 1337571, 1502510, 1365663, 1636660, 1633476, 1592881, 1638822, 1852273, 1869827, 1742481, 1700018, 1845587, 1687193, 1661095, 1818811, 1731649, 1507424, 1609900, 1812816, 1733347, 1825481, 1743821, 1724387, 1857135, 1693842, 1795891, 1815850, 1988794, 2279538, 2285482, 2404316, 2557458, 2809508, 2901454, 2857047, 2978746, 3297461, 3388220, 3544296, 3850634, 3919558, 4285129, 4689360, 5036131, 5538846, 6272157, 7527173, 9036546, 11461270, 15524319]
8645A5524319M879827J536330j896916l102514k961083k863062k691664j380946
8637G044291q71554o64738n40099l95560k12592j34620j59042j61508r0625M4586
8627C858539k41680r449l1537J65244j86673Q7298j78590J05833O4560L1343r1895
8616C572993r796Q6489J44796J19659j06459M3228K04078o344K47628j78352J79554
8605D297474L02289r5132k4218k8435J38340l9286K05658j3221J55597k0475J01114
8594D979705J0782J30581K45896M5077J5523J20459J71931J49129j65191M82455
8584F186347Q1189Q0079p4947L63633L510K00042N8954L39293J65013J66042M9428
8573G618583L94308L01765K45403K24743k6796J61476M07285K83214M90522L89271
$$ y = [15524319, 20404146, 21940476, 20043560, 16941046, 13979963, 11116901, 8425237, 7044291, 6172737, 5507999, 4967900, 4572340, 4359748, 4225128, 4066086, 3904578, 3813953, 3858539, 3616859, 3607410, 3575873, 3741117, 3554444, 3641742, 3463152, 3568985, 3633545, 3664888, 3572993, 3563197, 3649686, 3794482, 3914141, 3807682, 3850910, 4054988, 4048644, 4296272, 4117920, 4297474, 4599763, 4504631, 4480413, 4451978, 4590318, 4551032, 4756690, 4743469, 4899066, 4878591, 4979705, 4990487, 5121068, 5366964, 5412041, 5427564, 5548023, 5719954, 5869083, 5703892, 6186347, 6267536, 6347615, 6272668, 6636301, 6639811, 6839853, 6898807, 7238100, 7403113, 7569155, 7618583, 8012891, 8314656, 8560059, 8784802, 8758006, 8919482, 9326767, 9609981, 10100503, 10489774]
8563A0489774K40788N55486L84952M21588P50906P39042K02558R74366R10770
8554A5670230N70490R28537R64265J076758J392715J436565J579009J428762J617920
8545B6665251K015641K529805K774496L557419L817376M565433O173518P992746
8537F0091685J0729816J4819608K1107049K8660983L1423784J7942882K214770
8530A86990577r637345r641789n296766k024438o998408j2887383j4560692j2987806
8522A12955950j0417152o495375k073810K014029O351508J1665544J7019061J7329746
8514A48349501J0203206M661612O275180J3189386J9919510J3948213j739414
8507B14807194j2221090j3301696p812403R96249R370915R300301p88364j2502935
$$ y = [10489774, 10730562, 11286048, 11671000, 12092588, 12843494, 13582536, 13785094, 14759460, 15670230, 16240720, 17169257, 18133522, 19210280, 20602995, 22039560, 23618569, 25047331, 26665251, 28680892, 31210697, 33985193, 37542612, 41359988, 45925421, 52098939, 60091685, 70821501, 85641109, 106748158, 135409141, 166832925, 184775807, 186990577, 177353232, 167711443, 162414677, 160390239, 153391831, 140504448, 125943756, 112955950, 102538798, 96043423, 93969613, 95983642, 102335150, 114000694, 131019755, 148349501, 158552707, 163214319, 169489499, 182678885, 202598395, 216546608, 214807194, 202586104, 189284408, 181472005, 182468254, 191839169, 201139470, 200351106, 187848171]
8499A87848171j6197329j3509044q274888n753768q886217j1946896j2357763
8492A10922266j0923758q581210n123463j103712K477056O712938J1471930J0628674
8484A16480721M599588J516112L169871Q635781J3549922Q796205k160692j4469857
8476A40117651j9734210k0770574j8335104j4962945j0684062q130686n981547
8469D1518523m315506l589342k451422k150562j908980j650541j387206j284353
8461B2780611j141848r52921j037360p26758q73364q05584l61834q92463m59410
8452A5529069p11719l66328n48153m22563l41269o01792l73973m49213l97067
8443A1316992k12890l76201k17481m80530l88528j26587n05582k33143j85342
$$ y = [187848171, 171650842, 158141798, 149866910, 144113142, 135226925, 123280029, 110922266, 99998508, 91417298, 86293835, 85190123, 87667179, 94380117, 105852047, 116480721, 121080309, 122596421, 125766292, 134402073, 147951995, 156748200, 154587508, 140117651, 120383441, 99612867, 81277763, 66314818, 55630756, 47500070, 41518523, 37203017, 33613675, 31162253, 29011691, 27102711, 25452170, 24064964, 22780611, 21638763, 20685842, 19648482, 18921724, 18048360, 17242776, 16880942, 15988479, 15529069, 14817350, 14451022, 13902869, 13480306, 13139037, 12537245, 12163272, 11714059, 11316992, 11104102, 10727901, 10510420, 10029890, 9641362, 9514775, 9009193, 8776050, 8590708]
8434H590708l03516j81156k71515k6818m25233q0023m00030j15773j54455L2049
8424F664238l36716j77000n41588J16814k9703k93767q4118j81260o9206j07452
8414D960242q6993j76058J53057m52560j52695J33655j29339M053j75355j32604
8404C945403k85637m5185k7309J26599m7536L4459j59054l0478M00943k28346
8394C683859j45277q550J62135k95428J37624k73686O5476j70723M0134M8156
8384C243720O114k33709j99100k3648j77857k8920L4337l14776j22517L2886K8709
8373B245239j26808K64104k46324o2475L8846l7752J80383k73191J80272J58524
8363B320818k79218Q58o5106K6n2806l32617K23430J18265j13743J95623R8530
$$ y = [8590708, 8287192, 8106036, 7834521, 7807703, 7382470, 7302447, 6902417, 6786644, 6632189, 6664238, 6327522, 6150522, 5608934, 5725748, 5696045, 5402278, 5318160, 5136900, 5067694, 4960242, 4873249, 4697191, 4850248, 4397688, 4244993, 4378648, 4249309, 4253362, 4078007, 3945403, 3659766, 3614581, 3587272, 3713871, 3666335, 3700794, 3541740, 3511262, 3912205, 3683859, 3538582, 3530032, 3692167, 3396739, 3534363, 3260677, 3326153, 3155430, 3195564, 3243720, 3249834, 3016125, 2817025, 2793377, 2615520, 2586600, 2620937, 2306161, 2183644, 2216530, 2245239, 2118431, 2382535, 2136211, 2073736, 2112582, 2074830, 2255213, 1982022, 2162294, 2320818, 2041600, 2042458, 1977352, 1977378, 1924572, 1591955, 1815385, 1933650, 1819907, 2015530, 2114060]
8352B114060P0704J23447K24066o305K16929N5711J83277k2742Q8232q1225k53323
8341B712831J62842L6848j58624m06967j52584r7436L7222l24263r3921l23047
8331A392901Q5488j26161q5712q6121L2783l57316J71730P1734l4289J92699k79551
8320I78185j41688J74136p8641j3864N0073J03843j12220J72762j85581m9629
8310H97376j24709p7191Q394O0171O5429m55049M14824k96684L08338k58614L06143
8299H48428k57996J50189P7044N2562Q9634k00477J49059k79360K57061Q9161
8289I75305l0318k3375J92733J6444R2322J51693J18704J10797J77604J78878
8279A960787j47003J36243k49696P894k09567j75828J38406k33793j10192j13730
$$ y = [2114060, 2184764, 2308211, 2532277, 2525972, 2742901, 2798612, 2981889, 2959147, 3047379, 2966154, 2712831, 2875673, 2912521, 2753897, 2346930, 2194346, 2096910, 2134132, 1809869, 1715948, 1392901, 1478389, 1352228, 1266516, 1180395, 1213178, 855862, 1027592, 1099326, 1065037, 1257736, 978185, 836497, 1010633, 931992, 918128, 968201, 1072044, 959824, 1132586, 947005, 897376, 772667, 695476, 703870, 764041, 829470, 374421, 789245, 492561, 800899, 542285, 848428, 590432, 740621, 817665, 870227, 959861, 759384, 908443, 629083, 886144, 975305, 944987, 921612, 1114345, 1130789, 1223111, 1374804, 1493508, 1604305, 1781909, 1960787, 1813784, 1950027, 1700331, 1708225, 1498658, 1322830, 1461236, 1227443, 1117251, 1003521]
8269A003521j08707k59425N7170o4734j03060j5329j88018l6367K31485j48346
8259C68190j94446J94789j47308O126N5569r1742L504o5771J36489k29945R2930
8248A28385M0677j03825M5408j43973J6989K75514k62417J37962j50885o4302
8238h0467J11320J15871k69353O095K45558j14455n165O2861j7845l854N7250
8227A07816l5410j17838J63507j32589J00019Q1913J19909j24868p7801M6815
8217A31473j59041J95911J95037k55435J1449J85306M3582J44569M7860m0150
8207E00561K80853n9314j16840Q1314O9898M1057j61112J87499q2272j0394l14329
8196D16921j54978P5797m0508k30068k7401M90545K41718j07596q1097M9571J85174
$$ y = [1003521, 894814, 635389, 692559, 627825, 524765, 509436, 321418, 285051, 516536, 368190, 173744, 368533, 221225, 227351, 282920, 191178, 194682, 128911, 265400, 35455, 128385, 169062, 65237, 110645, -33328, -16339, 259175, -3242, 134720, -16165, -80467, 30853, 146724, -122629, -116534, 129024, 14569, 9404, 72265, 54420, 50566, 107816, 72406, -45432, 118075, -14514, 85505, 167418, 287327, 162459, 84658, 131473, -27568, 168343, 363380, 107945, 119394, 304700, 348282, 492851, 540711, 500561, 781414, 722100, 605260, 686574, 756472, 797529, 636417, 823916, 741644, 731250, 416921, 261943, 337740, 297232, 67164, 39763, 530308, 772026, 664430, 583333, 632904, 818078]
8185H18078o6545l1954J74449j73834L29495j59305k10443J78138M0354j04897
8175G93536J95046j86724R338j09690J3652J10338k80758k27372Q7306j10000
8165B94672j87970Q7719j47356N1409J31558n4817R1932J33662O0412M2925r7654
8154D06492K9407P4543k09477K30415j32545j03379J6518k46071k8508l444j36833
8143a02882q1077O3034j7105q727j01307j30235K67415L3271k05307q08K29515
8132e4213j43072P6116J9194j68133j2338M8678o4925K44972k27794N6480j19000
8121c44035K54075k51365J1060K6588j22300M7791j05140J40059j46468K64188
8111b25547k17047J54113r5786l4649J63274r5431J07453j19968M729K1716k3995
$$ y = [818078, 751533, 719579, 894028, 720194, 1049689, 890384, 679941, 858079, 898433, 793536, 988582, 801858, 811196, 701506, 715158, 825496, 544738, 317366, 404672, 294672, 106702, 194421, 47065, 98474, 230032, 175215, 267147, 400809, 461221, 504146, 406492, 435899, 510442, 300965, 531380, 398835, 295456, 311974, 65903, 37395, 33951, -102882, -183959, -120925, -138030, -146757, -248064, -378299, -110884, -77613, -282920, -283728, -54213, -197285, -121169, -101975, -270108, -282446, -233768, -298693, -53721, -281515, -225035, -344035, -89960, -341325, -330265, -303677, -425977, -378186, -483326, -343267, -489735, -225547, -442594, -288481, -384267, -418916, -255642, -351073, -243620, -363588, -358859, -337143, -361138]
8100c61138k5262J17851j47845k1047p8198n5170J00321P6306N2270k68423J01749
8089e08586K7590J06117j24687k4315K2039k19313L87426o1182j52364M2757p5109
8078e79627K372J93810j02777O8101o4289N8747p9044J28638j70522n1849R3096
8067e03344N2377r3599J85069n6645J4361o2215l5019K11982j60176J39418j73661
8056d81452j4485n5818j93713L05728P4412j29060J02178k26229L39368j88496
8046d67567j1282J48705j15690m4819j1468P4292K8513k27847K26494j41875K35133
8035c07411q897j77582K67374q0720j17263j15671K55250n0424J08145j92221
8025d19420M1069J30318P7462j63111j31419J16365m68j36649K22886j64074J30515
$$ y = [-361138, -386400, -268549, -416394, -437441, -515639, -570809, -470488, -394182, -341912, -610335, -508586, -480996, -374879, -499566, -523881, -501842, -721155, -333729, -394911, -547275, -504518, -579627, -577255, -383445, -486222, -418121, -482410, -423663, -502707, -374069, -544591, -596440, -503344, -450967, -544566, -359497, -416142, -401781, -463996, -499015, -287033, -447209, -307791, -481452, -495937, -551755, -745468, -439740, -365328, -494388, -392210, -618439, -279071, -467567, -478849, -330144, -445834, -490653, -502121, -427829, -399316, -627163, -400669, -542544, -307411, -316308, -493890, -226516, -307236, -424499, -540170, -284920, -335344, -227199, -419420, -378351, -248033, -170571, -333682, -465101, -348736, -349204, -485853, -262967, -427041, -296526]
8014b96526j72347L4105J6584j737L5828L8882M0931j34396J40696N9601j90132
8003d28511m6477J54181k77076J96213l9091J18069l8991o0943j9470L1256J03138
7992c07702l12051K24804M8066m5197K1798M4011k50272q1350Q6127J39469M1475
7981c90822O5607j03832P4690k9464J02652j78056N1143n529j12520J00800J01914
7970c23417j84022j41821K03861J07370p0435j44446j8813K71124l39715K03593
7960d36721L0429j01002N0642P4975j74489O4612R8302n3735R8111j32724J16610
7949c64990j07282m7611J45122K7822l9009p5120j86935K29923j15183J494n7371
7938e89140M245R7522k3520J66584n0507q9576j03180K07893q9461J8403J5227
$$ y = [-296526, -468873, -434768, -418184, -419921, -384093, -345211, -304280, -438676, -297980, -238379, -428511, -474988, -320807, -597883, -401670, -440761, -322692, -361683, -422626, -442096, -410840, -307702, -619753, -394949, -346883, -392080, -370282, -326271, -576543, -657893, -571766, -432297, -390822, -325215, -429047, -354357, -383821, -281169, -459225, -408082, -413611, -526131, -425331, -323417, -507439, -649260, -445399, -338029, -408464, -552910, -571723, -300599, -640314, -436721, -406292, -507294, -456652, -381677, -556166, -491554, -393252, -446987, -348876, -481600, -364990, -472272, -519883, -374761, -346939, -385948, -461068, -648003, -418080, -533263, -531769, -589140, -584895, -487373, -510893, -344309, -394816, -484392, -587572, -379679, -469140, -450737, -435510]
7927d35510N1310J19566j74910Q7264q7495o2382K9448J328j54183J49569k3665
7916d99660J32737j3702K0726o2585j20416M0647j09256O9265P2097L7922o0222
7905d92447R9166r7845J71009j27487j04729N6170Q7139j65874K5765N9596j21270
7894f10807J81950k39753K08551n9924M9052n594j19422L4924P4821l9450J14559
7883d11093j3382j39605K34706q6254j23160K14981j8190k0761k48234K52735
7873c58257j08128J36399k15534R9952n667M4054j78300q34K49890j20718Q0302
7862c76841k86730J03984j4434J85786k28954J0055O4363j15093N3277l2536J942508
7851A305385j455306p6495o8202j8969m0328r4680j8891q1022L7664J17879Q5483
$$ y = [-435510, -384200, -264634, -439544, -352280, -439775, -502157, -472709, -471381, -625564, -475995, -499660, -366923, -380625, -359899, -422484, -542900, -502253, -611509, -542244, -470147, -432225, -492447, -393281, -491126, -320117, -447604, -552333, -496163, -409024, -574898, -549133, -489537, -610807, -428857, -668610, -460059, -519983, -470931, -476525, -595947, -561023, -486202, -525652, -411093, -424475, -564080, -329374, -415628, -538788, -323807, -341997, -362758, -610992, -358257, -466385, -329986, -545520, -445568, -451235, -407181, -585481, -586315, -336425, -457143, -376841, -663571, -559587, -574021, -388235, -617189, -607134, -542771, -657864, -604587, -637123, 1305385, -149921, -226416, -294618, -313587, -353915, -448595, -467486, -548508, -510844, -392965, -307482]
7840c07482k0789k79980K60803L3342r1120J16858j64178R4905j30054K60362
7830b27333k90520l6440N1589P2028q586j21694O6804j1856m346j38672K33547
7819d15479K5956j55935q137J26340J3945M7152O6554k06398Q1359o5486J47236
7808c42893m3023K6861k45178J08751J98360j74558L7076k1082K50610r670k64940
7797d79686P4774N1981o6407J21039j35352q5039J34799j10532j47223K53565
7787c88081J7557k02486R1779J32481K0341k77722J18317J31696O6617j86450
7777d75951l7246N2862l497n4671J77499j37584j24857K47695O125j47039M8317
7766d48347L4715j6998J464K6889r5289j13965K53614k13277K06181j00157J06852
$$ y = [-307482, -328271, -608251, -347448, -314106, -405226, -288368, -452546, -357641, -487695, -227333, -517853, -554293, -502704, -430676, -439262, -560956, -494152, -506008, -510354, -649026, -415479, -389523, -545458, -553595, -427255, -413310, -366158, -299604, -506002, -424643, -490129, -342893, -385916, -359055, -604233, -495482, -297122, -471680, -434604, -455686, -205076, -214746, -479686, -404912, -352931, -419338, -298299, -433651, -518690, -383891, -494423, -641646, -388081, -370524, -573010, -481231, -348750, -328409, -606131, -487814, -356118, -289501, -475951, -513197, -460335, -463832, -518503, -341004, -478588, -603445, -355750, -349625, -496664, -448347, -413632, -430630, -429166, -402277, -497566, -611531, -357917, -571194, -365013, -465170, -358318]
7755c58318k29281R0829q3929J92904J4575k958k34468J5177J46466k44354R9093
7744e94264n984J07992Q639J19088K5488n6813J04708l0606r6775j37187M862
7733e50852j19882J55256Q0630r7780J46467Q513j17840k4208J44205j77868J22668
7722d30691K5937j26646J85182m0107k06923Q5307j73710M93098j89011J08210
7712b69354J9806k83097j07078K59447n8430K28019l58447K05087j32871J86486
7702c10432j38367m843j06671R8399M7568l8798J45956r5274M9663k09398L40382
7691b21815j56666j07081L0005J73864k17101P5626k3443o1953K31083n4811q0149
7680d12441j90961L18289o5081j55189J48201k7994m6155N900O9637K8624j40460
$$ y = [-358318, -587599, -496770, -580699, -387795, -373220, -376178, -610646, -595469, -449003, -693357, -594264, -600248, -492256, -483617, -364529, -339041, -395854, -291146, -321752, -418527, -555714, -550852, -670734, -515478, -434848, -532628, -386161, -377648, -495488, -519696, -375491, -553359, -430691, -404754, -531400, -346218, -386325, -593248, -507941, -681651, -188553, -377564, -269354, -249548, -532645, -639723, -380276, -438706, -210687, -569134, -364047, -496918, -310432, -448799, -453642, -560313, -461914, -414346, -453144, -307188, -402462, -352799, -562197, -221815, -378481, -485562, -455557, -281693, -498794, -423168, -446611, -508564, -277481, -332292, -412441, -603402, -285113, -350194, -505383, -357182, -385176, -431331, -425431, -355794, -327170, -467630]
7669d67630j9139J42216p3138j55620j20389L00272l8920o4398o4223J16960K4721
7658d19288Q4837j24510Q3765J2236p8996M8021L3433J87364k84423R2062L4727
7647c30772k8694P0345j04246j0469j9022O0967j3458j85266J52204m7580J6997
7636d38994N3524J05114Q5827k68430J36614l8516K3193r3501Q5366r8367M4780
7625d03390j27684p8934K29529l8563l6595j33327K8150K54954r7106J07046k50369
7614e46289j9254K67112k87958K20668j43952K47203K7102j64740J036q8185Q5137
7603d02120q5627J46057J1860j06084O8945R842j19064K5820M7696L4488j58680
7592e26867K88910l36929K09763J6253j04235q8918J83423p2015Q7963j83880
$$ y = [-467630, -486769, -344553, -417691, -573311, -693700, -393428, -432348, -496746, -560969, -444009, -419288, -334451, -458961, -375196, -362960, -441956, -393935, -360502, -173138, -457561, -365499, -330772, -359466, -289121, -393367, -403836, -422858, -361891, -375349, -560615, -408411, -455991, -438994, -385470, -280356, -194529, -462959, -326345, -364861, -341668, -435169, -349803, -448170, -403390, -531074, -610008, -380479, -419042, -455637, -588964, -560814, -305860, -402966, -295920, -546289, -565543, -298431, -586389, -365721, -509673, -262470, -235368, -400108, -399072, -487257, -402120, -487747, -341690, -329830, -435914, -366969, -357127, -476191, -450371, -402675, -368187, -526867, -237957, -574886, -365123, -348870, -453105, -542023, -358600, -430615, -342652, -526532]
7582e26532K20119R1185j80046J91321l75947L26124n5755Q285j57287J94158
7572b64375j16215N5865r0801O4251j61104J45054J7426l2110J44873k18288l9372
7561d94796J58752m1509J00473N9527j63920J99999l00570P6435P1086k51022
7551e85545J21065L6067j53373J1739L49150q9747k06750J61317L8015j62243
7541d80305J28238n4842j9751J3718j39065K06747j00231K50408K5621j65757
7531c35219r3322L42026k60484q8179J38080P7908N0969j80062m4106j13028n3338
7520e58755L00075o0773k48429J16490J30549l6193m7571Q0926N8815q9890p094
7509c61850j04236K00101k54514M3253L9929K81092l09492J99319j32225K91992
$$ y = [-526532, -306413, -215228, -395274, -203953, -579900, -253776, -309531, -301246, -458533, -264375, -380590, -324725, -415526, -351275, -512379, -367325, -349899, -382009, -237136, -455424, -494796, -336044, -377553, -277080, -217553, -381473, -181474, -482044, -405609, -334523, -585545, -464480, -428413, -581786, -570047, -220897, -310644, -517394, -356077, -318062, -480305, -352067, -406909, -426660, -412942, -552007, -345260, -445491, -195083, -169462, -335219, -428541, -86515, -346999, -435178, -297098, -219190, -168221, -348283, -392389, -505417, -558755, -258680, -319453, -567882, -451392, -320843, -357036, -404607, -323681, -264866, -354756, -361850, -466086, -265985, -520499, -477246, -437317, -156225, -465717, -266398, -398623, -106631]
7499a06631j99858J66218m383j40569K0157M3927o3684P1945r8454M8441j94703
7488d57594J59147Q9738j90193n215J7252R5218j20827K77658j19525M6047j07845
7477c16139J50416j33412O7222J42039l57350J31124K2838j60563J20304J103
7467c32418m4781M2619r9369m7059K85678J40537k72611j6062j72276J61214J62385
7456a92143j55135R3434j12969R693j43735K26907R8067l83568L70852r7602j13176
7445c99375N594J17553r4049J15566r5280K98634k90008q4241M2665J44263o8835
7434c07513J36222j34920J21239M9205j63176n3861O4290P8308R5231j40718L665
7423b52028l5813P2154J38195j77812l0936o738o6186M5331p4458J81220J19874
$$ y = [-106631, -306489, -140271, -144654, -285223, -265066, -221139, -284823, -212878, -311332, -262891, -457594, -298447, -208709, -398902, -404117, -386865, -291647, -412474, -134816, -254341, -208294, -316139, -165723, -299135, -231913, -89874, -447224, -316100, -293262, -453825, -333521, -332418, -377199, -334580, -433949, -481008, -195330, -54793, -327404, -343466, -515742, -354528, -192143, -347278, -253844, -366813, -357120, -500855, -273948, -175881, -559449, -188597, -286199, -399375, -393781, -276228, -370277, -254711, -349991, -51357, -341365, -425606, -382941, -238678, -307513, -171291, -306211, -184972, -135767, -298943, -352804, -288514, -210206, -114975, -255693, -252028, -287841, -215687, -77492, -255304, -286240, -292978, -359164, -313833, -388291, -207071, -87197]
7412h7197j46574n9849j2445Q1014N7867n9260k6885L1760R0385j11773p4561
7401c17518J18959n3123Q7707q4601q572O3685P1096j31594L0846q4301Q5169
7390b22247K3160L3605k70855J94964N1883k6054J15255k68729J52304j21623
7380c38337J13987M9161l2134j55095J42343m358J5685j6916L8868m9533O3954
7369a72375j42181M1080J2050p8850J14745r9202J67206r5859K79861l30026J62357
7358a41194q5100n6381q9709K7417L46695l94411O9541K24312j80615J08641k25270
7347c96074J97847l70958K91501O8231n8895K8726j16644O8403R4952l4603J60484
7336f7030j93445J89625j92283j16883K2005J20001n5310J46795P380j97415J91853
$$ y = [-87197, -233771, -293620, -306065, -225051, -167184, -226444, -253329, -221569, -131184, -242957, -317518, -198559, -251682, -163975, -248576, -257148, -193463, -122367, -253961, -223115, -307416, -222247, -199087, -165482, -436337, -241373, -189490, -215544, -100289, -369018, -216714, -338337, -224350, -175189, -207323, -362418, -220075, -224433, -208748, -225664, -186796, -236329, -172375, -314556, -273476, -261426, -340276, -225531, -324733, -157527, -253386, 26475, -303551, -141194, -226294, -282675, -372384, -344967, 1728, -392683, -323142, -98830, -279445, -170804, -396074, -198227, -569185, -277684, -209453, -268348, -239622, -356266, -287863, -192911, -227514, -67030, -260475, -70850, -263133, -380016, -358011, -238010, -293320, -146525, -139145, -336560, -144707]
7325a44707O6395j74804K9786M6227Q2108r3861r5095K37817k04064J47588J83322
7314H0712j23496j09026q4346M5317o6517P8473R5132P6357j75353L4429Q7617
7303f0701j88243L5571J00508o569K0559J09089o8279K02889j26421k02854O4645
7292a19806m4178L0394K55665p3017j70089J47149k0140J72010k86588P9731p1550
7281a00419m7898K18413j18423J39486l5637J53175j43284K0627k6554J4686M6041
7270A20213m5875j60428K68905j1728r2584l6618O161j58208K5579J41593O088
7259F3098o3220O0377J9939l0723O8799R9495j2477Q7719r9767j37524L56938
7248D12654k02029k03672N6899J42964q4626J83162j16500j26266M1323L1087
$$ y = [-144707, -78312, -253116, -223330, -177103, -94995, -188856, -283951, -46134, -250198, -102610, 80712, -42784, -151810, -236156, -190839, -257356, -178883, -83751, -7394, -182747, -148318, -60701, -248944, -213373, -112865, -119434, -98875, 10214, -58065, 144824, 18403, -184451, -119806, -163984, -133590, 122075, 49058, -121031, 26118, 5978, 177988, -108600, -28869, -100419, -148317, 70096, -48327, 91159, 55522, 208697, 65413, 86040, 59486, 74172, 120213, 74338, -86090, 182815, 171087, 78503, 41885, 48046, -110162, -84583, 57010, 63098, -122, 60255, 80194, 49471, 118270, 217765, 205288, 293007, 193240, 55716, 412654, 210625, 6953, 63852, 206816, 122190, 305352, 188852, 62586, 103909, 134996]
7238A34996l4802l0775M9915J26735P222p3977J60080j9528j19343j34210R4687
7227A61000n6718o799L9309J93725p3605l9933l1909J17925n4775J38439k37588
7216A49071M7635K6723L4228k77496L42005o2454j5838O9653j34824L5279j7598
7205A96384k6932r297q7787M21046j40593L0151j54273p788J99057j87464R5620
7194C28124q1567O757k10405L76273k41165J65996j60090K12986j13284J46282
7184D29907o1384J52531j10651J09428k19821J29336j09794Q1345k25632J31984
7174C07249j0596L1218N2388q8546J12281P5809r9842m8619R278L9935R3488j83701
7162B90342J97268k82387K69071J52914k76774P8722N263k8090m4224J91331j21564
$$ y = [134996, 100194, 69419, 119334, 246069, 253291, 179314, 339394, 319866, 200523, 66313, 161000, 104282, 97483, 136792, 330517, 256912, 216979, 185070, 302995, 248220, 386659, 149071, 196706, 223429, 257657, -19839, 322166, 259712, 243874, 313527, 178703, 213982, 196384, 169452, 160155, 72368, 493414, 352821, 382972, 228699, 220911, 419968, 232504, 328124, 246557, 253314, 42909, 419182, 178017, 344013, 183923, 396909, 283625, 429907, 368523, 521054, 410403, 519831, 300010, 429346, 319552, 400897, 175265, 307249, 296653, 327871, 380259, 291713, 403994, 479803, 379961, 331342, 340620, 380555, 474043, 290342, 487610, 205223, 474294, 627208, 350434, 429156, 434419, 406329, 362105, 553436, 431872]
7151D31872L7139J06452q854r9631J61203k1458j43760K2591J51675j46973J26943
7140F17199K0678K2786o6686o9534K10900j07190n1547k4933J70805j21921L3634
7129F34191J54204m4767p4128K05977o7199O614j14525K10985j27748K05292p4219
7118I14677j59903J3903J73448M3817R1843k5872k83499J72899k5845J06115N0828
7107A072411j67536L59289j33760j20392j67174L16061j22320P0136k3955J07836
7097A190596n5655l8760N4622N7454J9486Q5884j12576K2680K7578j44633J96273
7086A302949p1118j7113K7608j8859l9427J18924l7761J31293j57630N9673K8047
7075A326586p1404J97795j44151K19225j64835J2915O3567n1903Q4745m4516K59
$$ y = [431872, 469011, 575463, 566609, 466978, 628181, 606723, 462963, 485554, 637229, 490256, 617199, 637877, 660663, 593977, 524443, 735343, 628153, 576606, 551673, 722478, 600557, 634191, 788395, 743628, 669500, 875477, 808278, 814892, 700367, 911352, 783604, 988896, 914677, 754774, 768677, 942125, 985942, 1077785, 1051913, 768414, 941313, 915468, 1021583, 1072411, 904875, 1264164, 1130404, 1010012, 842838, 1158899, 1036579, 1106715, 1082760, 1190596, 1134941, 1096181, 1150803, 1208257, 1227743, 1313627, 1201051, 1223731, 1251309, 1106676, 1302949, 1231831, 1214718, 1242326, 1223467, 1184040, 1302964, 1265203, 1396496, 1238866, 1298539, 1326586, 1255182, 1452977, 1308826, 1528051, 1363216, 1376131, 1439698, 1387795, 1472540, 1428024, 1428283]
7064A428283Q7782k4693N2826j54807J60516l3485j0618j67344K16047j58415
7054A396092J79960n1064J63853p2947P3837j38847J70192J03493j67522N2805
7044A709852J2907q2951M1863l5300J07652j59115J74560L2421o5903J23750M0868
7033A900604K6859P286j44948J80973p3741J9828R4487Q149q3630J15629j98345
7022A853151J69831j8403Q1953K0417O5262J34451J2876j80052l9193P6912Q0728
7011B257933J0531k17660J53108K12595q016m14009K09989K13504P6024j61416
7001B332583J27677j16972L41790l1297k80771p4603J28715J82856n0681j01635
6991B457662J69760l3566j05371L32712j35642J44982n2541Q5695l0856J05881
$$ y = [1428283, 1516065, 1491372, 1544198, 1389391, 1549907, 1516422, 1505804, 1338460, 1554507, 1396092, 1576052, 1524988, 1688841, 1615894, 1689731, 1550884, 1721076, 1824569, 1657047, 1709852, 1722759, 1639808, 1681671, 1646371, 1754023, 1594908, 1769468, 1801889, 1735986, 1859736, 1900604, 1927463, 1934749, 1789801, 1970774, 1897033, 1916861, 2011348, 2019497, 1935867, 2051496, 1853151, 2022982, 2004579, 2086532, 2106949, 2172211, 2306662, 2319538, 2139486, 2100293, 2177205, 2257933, 2268464, 2050804, 2203912, 2416507, 2408491, 1994482, 2204471, 2417975, 2493999, 2332583, 2460260, 2343288, 2685078, 2653781, 2373010, 2298407, 2427122, 2609978, 2559297, 2457662, 2627422, 2593856, 2488485, 2821197, 2685555, 2830537, 2777996, 2863691, 2832835, 2938716]
6981B938716j28909L3115m0772K79297k05894j53496J22844R9486P7113J03035
6971C124535j72996K01954J3571O0539P4425j5440n2557M11J4533J66346m9555
6960C365766J53465P7415L0550j26191J47551K6026L9759J38444j19619L45508
6950D078674p7835J1581M8987j13367K35650M6893M958k5905J00261k0741K27034
6939D516190j82152J37921L9087J77409J88171j26704J43360O2633J86588j71737
6929D970766R4796Q5012J92803j20271K3811L12948j97279J25764J15323k2214
6919E581459J07336o5225J16047J31555n8281L161K39203r393K32646M620L6349
6908F319477J78255j35391K14503j706K07324L8514j38803M82600l75011K94658
$$ y = [2938716, 2809807, 2842922, 2802150, 3081447, 2875553, 2722057, 2844901, 2944387, 3021500, 3124535, 2951539, 3153493, 3167064, 3227603, 3302028, 3286588, 3234031, 3234442, 3248975, 3415321, 3365766, 3519231, 3596646, 3627196, 3501005, 3648556, 3674582, 3714341, 3852785, 3733166, 4078674, 4000839, 4012420, 4061407, 3948040, 4183690, 4230583, 4235541, 4209636, 4309897, 4289156, 4516190, 4334038, 4471959, 4511046, 4688455, 4876626, 4749922, 4893282, 4955915, 5142503, 4970766, 5065562, 5150574, 5343377, 5223106, 5246917, 5559865, 5362586, 5488350, 5603673, 5581459, 5688795, 5623570, 5739617, 5871172, 5812891, 5816052, 6055255, 6045862, 6278508, 6283128, 6319477, 6497732, 6362341, 6576844, 6575138, 6782462, 6820976, 6682173, 7164773, 6789762, 7084420]
6898G084420P5595l7254K67091j03627K45069j26985K07476K44871j17605K47632
6888G986683r795J19717J48445K6785J34121p35J62262Q4603J04946O8494J40843
6877H966369J16431K16982p4858K19573J09774K24336L2960j4591M09757j48509
6867A0058224J12462J18132K54433J90002J6726K36939n242J85599J90804J11145
6857A1469224M29573M7820K5999L48456N8486k3727L51812K82338K6376K77321
6847A3293678J81744R0241N56977r1232L11424J15059O7627M36445Q6352m4131
6837A5004184L85712J98714L26875K91592P3280K43382K98931L08813L15363K07250
6827A7654096J40358R5052N18809L18591L15819J16374L01499M17434K44668K40536
$$ y = [7084420, 7160015, 7122761, 7389852, 7286225, 7531294, 7404309, 7611785, 7856656, 7739051, 7986683, 7976888, 8096605, 8245050, 8271835, 8405956, 8405221, 8567483, 8652086, 8757032, 8825526, 8966369, 9082800, 9299782, 9224924, 9444497, 9554271, 9778607, 9811567, 9796976, 10206733, 10058224, 10170686, 10288818, 10543251, 10733253, 10749979, 10986918, 10981676, 11167275, 11358079, 11469224, 11898797, 11946617, 11972616, 12321072, 12379558, 12355831, 12707643, 12989981, 13016357, 13293678, 13475422, 13565663, 14122640, 14031408, 14342832, 14457891, 14525518, 14961963, 15048315, 15004184, 15389896, 15588610, 15915485, 16207077, 16280357, 16523739, 16822670, 17131483, 17446846, 17654096, 17794454, 17889506, 18408315, 18726906, 19042725, 19159099, 19460598, 19878032, 20122700, 20363236]
6817B0363236L30985K41669L19556N01862K71587L46852J93561M68633L02361
6808B3340302M16227N30329K40508M55322M68962L92669M33034L46853M51112
6799B7075318N57877O05799K25328O10224M37901M53278M59180P58120M13981
6790C1597006N22359O58640M93587Q90294L75168Q05452P31158M17653P77967
6781C7269284O82478P96873O08158O61042O87806R30627N91951J005651O34695
6772D3868565P90532J022212Q13687R61477Q62325J070088Q63906J247042Q93385
6763E2393219J110199J170088J083453J049732J096103J328896J415102R62316
6755F1609108J468620J204783J571111J323953J465402J718545J756530J468373
$$ y = [20363236, 20694221, 20935890, 21255446, 21757308, 22028895, 22375747, 22569308, 23037941, 23340302, 23756529, 24286858, 24527366, 24982688, 25451650, 25844319, 26277353, 26624206, 27075318, 27633195, 28238994, 28464322, 29074546, 29512447, 29965725, 30424905, 31183025, 31597006, 32119365, 32778005, 33271592, 34161886, 34537054, 35342506, 36073664, 36491317, 37269284, 37951762, 38748635, 39356793, 40017835, 40705641, 41636268, 42228219, 43233870, 43868565, 44659097, 45681309, 46494996, 47456473, 48318798, 49388886, 50252792, 51499834, 52393219, 53503418, 54673506, 55756959, 56806691, 57902794, 59231690, 60646792, 61609108, 63077728, 64282511, 65853622, 67177575, 68642977, 70361522, 72118052, 73586425]
6747G3586425J809223J720483J861272K028481J919754J878381K355714J921855
6739H9081588K313004K350609K505421K203669K625850K851077K781150K943935
6731A09656303K882225L414190L190965L343139L541988L704898M058495L956543
6723A37748746M390501M306379M499143M665122M957875N118628N311236N679994
6715A76677624N876157N888495O542484O315159O861325O872902P286589P712058
6707B30032793P610592P879957Q299560Q865316Q506420Q792674R227053R149836
6699B98364201R532495R433417R743374R544607R572939R624915R375951Q901424
6691C74093323Q969198Q374425P879183P259254P021707N668577N329843M148294
$$ y = [73586425, 75395648, 77116131, 78977403, 81005884, 82925638, 84804019, 87159733, 89081588, 91394592, 93745201, 96250622, 98454291, 101080141, 103931218, 106712368, 109656303, 112538528, 115952718, 119143683, 122486822, 126028810, 129733708, 133792203, 137748746, 142139247, 146445626, 150944769, 155609891, 160567766, 165686394, 170997630, 176677624, 182553781, 188442276, 194984760, 201299919, 208161244, 215034146, 222320735, 230032793, 237643385, 245523342, 253822902, 262688218, 271194638, 279987312, 289214365, 298364201, 307896696, 317330113, 327073487, 336618094, 346191033, 355815948, 365191899, 374093323, 383062521, 391436946, 399316129, 406575383, 413597090, 419265667, 424595510, 428743804]
6683D28743804L363330K298006J467244J28154q08204j540018l019852l895913
6675D26736551m201211n856393o156365o906892p612937q107855q531077q735860
6667C70627961q814315r276314r351841r359252r197531r293987r117960r191747
6659B97025014q576192q821823q356453q019944q072297p558077p329222p236832
6651B33054174o985735p002251o460357o351874o135864n926531n415415n633803
6643A83142344n279975m914291n073080m831812m489855m634707m202657m294996
6635A45420971m098335m096452l549353l576026l407614l643728l217617l209491
6627A16622355k839871k790511k597331l036887k284204k375234k349420k634699
$$ y = [428743804, 432107134, 434405140, 435872384, 436000538, 435192334, 433652316, 430632464, 426736551, 422535340, 416678947, 410522582, 403615690, 396002753, 387894898, 379363821, 370627961, 361813646, 352537332, 343185491, 333826239, 324628708, 315334721, 306216761, 297025014, 288448822, 279626999, 271270546, 263250602, 255178305, 247620228, 240291006, 233054174, 226068439, 219066188, 212605831, 206253957, 200118093, 194191562, 188776147, 183142344, 177862369, 172948078, 167874998, 163043186, 158553331, 153918624, 149715967, 145420971, 141322636, 137226184, 133676831, 130100805, 126693191, 123049463, 119831846, 116622355, 113782484, 110991973, 108394642, 105357755, 103073551, 100698317, 98348897, 95714198]
6619I5714198k101837k010990k040526k152378j727816k016993j541585j802592
6611H0319481j832148j474383j391412j665805j120618j402049j361140j291121
6603F8780805j045751q43048r94667j203494r51976j208801q45884j222920r51318
6594E9512946j080788j121906r58671o93515q03804j293706q80328j141302p68839
6585E0770087j316043n07649j213246j048291q14975o71702p78058p82565q61099
6576D2776459n77073n11420n13440q57045n20894o37251m65372n13645n01127
6567C7679192n54473n22990l03059p25682l89703l92440l96805m41023q4625m29380
6557C3439012m38249m43273m79942k05945m10050l16868o6955l50902l06953l73001
$$ y = [95714198, 93612361, 91601371, 89560845, 87408467, 85680651, 83663658, 82122073, 80319481, 78487333, 77012950, 75621538, 73955733, 72835115, 71433066, 70071926, 68780805, 67735054, 66892006, 65897339, 64693845, 63741869, 62533068, 61687184, 60464264, 59512946, 58432158, 57310252, 56351581, 55658066, 54854262, 53560556, 52680228, 51538926, 50770087, 49454044, 48946395, 47733149, 46684858, 45869883, 45198181, 44420123, 43637558, 42776459, 42199386, 41687966, 41174526, 40317481, 39796587, 39159336, 38693964, 38180319, 37679192, 37124719, 36601729, 36298670, 35572988, 35183285, 34790845, 34394040, 33953017, 33868392, 33439012, 33000763, 32557490, 32077548, 31871603, 31461553, 31144685, 31077730, 30726828, 30419875, 30046874]
6547C0046874r2370l46890k23929k00474l06871q174m06838k7245p3619k53826
6537B8106638l65898J86604k89054J49710l01666R3543l60899j5640k17024K20280
6527B7206594m2498l9693J29540k6006q9391M8634K63980K58857l8838Q9724K68837
6516B8029740L85322K3758K85434M39653N52238K32679N82936N19170N70339O65669
6506C2286938R68928O16355Q88282Q30776J115032J251319J378170J639569J669265
6497D2644634J920217K189855K371688K779526L090309L471241M049335M466792
6489F6983597N493112N861469O804137P491757P974772Q563814Q514437P824512
6481A25511607O769865N445434L561348K204524J303531O11905N09163Q16377
$$ y = [30046874, 29954504, 29607614, 29383685, 29183211, 28876340, 28868166, 28461328, 28434083, 28360464, 28106638, 27740740, 27927344, 27638290, 27788000, 27486334, 27579877, 27218978, 27203338, 26986314, 27206594, 27164096, 27124403, 27253943, 27227937, 27138546, 27187180, 27451160, 27710017, 27671179, 27760903, 28029740, 28415062, 28438820, 28724254, 29163907, 29716145, 29948824, 30531760, 31050930, 31621269, 32286938, 33255866, 33872221, 34760503, 35591279, 36706311, 37957630, 39335800, 40975369, 42644634, 44564851, 46754706, 49126394, 51905920, 54996229, 58467470, 62516805, 66983597, 72476709, 78338178, 85142315, 92634072, 100608844, 109172658, 117687095, 125511607, 132281472, 137726906, 141288254, 143492778, 144796309, 145408214, 145917377, 146733754]
6473A46733754J357013J938038K621003L468882M164284M390739M785483M641385
6465A74100581M295826L337478K709934J888058N85286J43724j079411j733640
6457A84247836k288650l237285m200461m054600m400212m341216l704443l344172
6449A54676797k305369j916059j288063o24860l44923m79393q54326k211110l664020
6440A40988674n368994o930704q296070q667782q978051q682935q025728p318086
6432G8720324o435727n761384m960062m404592l930012l198517l071466k568298
6424D4390266k352478k314670j855322j545145j359183j525651j488993q95446
6416C1053378j344771q49606q87748q14670r69142m91576r88189o84868n70831
$$ y = [146733754, 148090767, 150028805, 152649808, 156118690, 160282974, 164673713, 169459196, 174100581, 178396407, 181733885, 184443819, 186331877, 186917163, 187060887, 185981476, 184247836, 181959186, 178721901, 174521440, 170466840, 166066628, 161725412, 158020969, 154676797, 152371428, 150455369, 149167306, 148542446, 148197523, 147718130, 146863804, 144652694, 140988674, 135619680, 128688976, 120392906, 111725124, 102747073, 94064138, 86038410, 78720324, 72284597, 66523213, 61563151, 57158559, 53228547, 50030030, 46958564, 44390266, 42037788, 39723118, 37867796, 36322651, 34963468, 33437817, 31948824, 31053378, 29708607, 28859001, 27971253, 27156583, 26187441, 25695865, 24707676, 24022808, 23451977]
6407B3451977p31875n44758o49178n64574n00984l59474n66772k02924l12246
6398A9019192m05255n69086o3629l85529k09373m77024k83765l17576m471j48146
6388A6155338j03386j15332j85453k56701j34076l42278q7192n04641k41476m42533
6378A3742270m24255j78655j18921m88943j80118k54520l90349J18663k23329
6369A1601843r5255p2880j05822j28618m8320j88939N0254l75480q1658J5839
6359A0570964O7082j90056K09035j10365k6315R2500N1862K74447o6200k08616
6349A0664338J34469l05687j3947l79095k03915j23680k48386j12352J9071l64078
6339I066738K7319K81817j92540j50783K565j63177J92315m59783J4675k06684
$$ y = [23451977, 22720102, 22175344, 21526166, 20961592, 20460608, 20101134, 19534362, 19331438, 19019192, 18613937, 18044851, 17981222, 17595693, 17386320, 16909296, 16625531, 16307955, 16303484, 16155338, 16051952, 15936620, 15751167, 15494466, 15360390, 15018112, 14930920, 14426279, 14184803, 13742270, 13318015, 13139360, 13020439, 12531496, 12351378, 12096858, 11706509, 11825172, 11601843, 11506588, 11433708, 11327886, 11199268, 11150948, 10962009, 11012263, 10636783, 10555125, 10570964, 10638046, 10447990, 10657025, 10546660, 10520345, 10612845, 10664707, 10939154, 10872954, 10664338, 10798807, 10493120, 10479173, 10100078, 9896163, 9772483, 9524097, 9411745, 9430816, 9066738, 9094057, 9375874, 9183334, 9032551, 9035116, 8871939, 9064254, 8604471, 8619146, 8412462]
6329H412462l36751k06139k02015k02347J58791l08290j17682N4838P3514j72507
6319G153874R0631m433k00114J05894j66481j39264j88088j30644o5335J36430
6309F592470K25957m9831j36616J58763n8567L9933k8764m0193L5972q1271K33406
6298F891259k0622J87521k18466j82441j60422j83413j09730k11011l30624J22387
6288E784438k99347J59574j22642k5311J29114j24205l8822j23888j63240j52665
6278E023006j47428n2145l5730k92570K3522j09354j46439k0156m0846J07417
6268D309277j17469M783o8555j43479J23380k36353q5451K5662m6556p1889p8969
6257C614381j20756r6734J49392j42088M9149j0326q5286J03233l5764k88262
$$ y = [8412462, 8075711, 7869572, 7667557, 7465210, 7624001, 7315711, 7198029, 7252867, 7326381, 7153874, 7244505, 7240072, 7039958, 7145852, 6979371, 6840107, 6652019, 6521375, 6456040, 6592470, 6818427, 6768596, 6631980, 6790743, 6732176, 6772109, 6743345, 6703152, 6739124, 6657853, 6891259, 6870637, 7058158, 6839692, 6657251, 6496829, 6313416, 6203686, 5992675, 5662051, 5784438, 5485091, 5644665, 5522023, 5496712, 5625826, 5501621, 5462799, 5338911, 5175671, 5023006, 4875578, 4823433, 4787703, 4495133, 4518655, 4409301, 4262862, 4242706, 4201860, 4309277, 4191808, 4196591, 4128036, 3984557, 4107937, 3871584, 3786133, 3811795, 3765239, 3693350, 3614381, 3493625, 3396891, 3546283, 3404195, 3453344, 3443018, 3357732, 3460965, 3425201, 3136939]
6247C136939K11097k95q3113J57821r286j61598Q4582J18353n8611o8606p4956
6236C252327m983J05494j22512R1575L7446l24214P9070l4304m1216l759K05595
6225C240519j16293K40949j57214p5524J0518J53354N723L4148J21635J50055
6215C607870j74138K18449K1915L41886Q9869J30820K40011J18177j61180o0709
6205D372970o2073k52071q7455l2236p8297L0170J0351K94698k28149P2052J93573
6194D233533M4209J63786L36980K4988J42329Q6758q5908K87036l2463r7472m96469
6183D607307k45816N4747j71798M548q8598p1356P6401k0251q6012K06420m2062
6172D223530K52863J01795n0306j02830K20787k95828j09124K1225j55816j70966
$$ y = [3136939, 3348036, 3347741, 3264628, 3422449, 3413163, 3251565, 3336147, 3454500, 3395889, 3327283, 3252327, 3247344, 3352838, 3230326, 3321901, 3359347, 3035133, 3114203, 3079899, 3038683, 3034924, 3240519, 3124226, 3365175, 3207961, 3132437, 3142955, 3296309, 3302032, 3336180, 3457815, 3607870, 3433732, 3652181, 3674096, 4015982, 4105851, 4236671, 4476682, 4594859, 4433679, 4372970, 4310897, 4058826, 3971371, 3939135, 3860838, 3891008, 3901359, 4196057, 3967908, 4039960, 4233533, 4277742, 4441528, 4778508, 4803496, 4945825, 5032583, 4946675, 5233711, 5201248, 5103776, 4607307, 4361491, 4416238, 4244440, 4248988, 4160390, 4089034, 4165435, 4145184, 4059172, 4265592, 4223530, 4476393, 4578188, 4527882, 4425052, 4645839, 4350011, 4240887, 4262112, 4106296, 3935330]
6162C935330q4008q9740p7609q8410J39791j79985P5524j4784P4590q3762j58478
6151C448459M5105o1748R6372k32694K23524j08919l3299l1770L5098N2349J20404
6140C552881J68768r8191J15323j14146j2598N5835j31679j10409L18326j29706
6130C614404K94232j18418M8489j09301m953J42534J948J17360n1422K23400m5358
6119D112915J69419J37953O8013K09339J71871M53135K92130J19349M54515Q9634
6109F278273L80793j19547L14166j35931J33795K51295k22419J20905k36310l18952
6099F446068M34739j30345K71362K2972J0123k6850L32020K47787j81985L5017
6089G460908p7484j0066N1557J24036k82267o0666j79617j24145K3378P5514k68191
$$ y = [3935330, 3851322, 3761582, 3683973, 3595563, 3735354, 3555369, 3630893, 3616109, 3690699, 3606937, 3448459, 3493564, 3431816, 3528188, 3295494, 3519018, 3410099, 3376800, 3345030, 3380128, 3432477, 3552881, 3721649, 3623458, 3738781, 3624635, 3612037, 3667872, 3536193, 3425784, 3744110, 3614404, 3908636, 3790218, 3838707, 3729406, 3724453, 3866987, 3868935, 3986295, 3934873, 4158273, 4112915, 4282334, 4420287, 4488300, 4697639, 4869510, 5322645, 5614775, 5734124, 6188639, 6278273, 6659066, 6539519, 6853685, 6717754, 6851549, 7102844, 6880425, 7001330, 6765020, 6446068, 6880807, 6750462, 7021824, 7044796, 7054919, 7028069, 7360089, 7607876, 7425891, 7460908, 7383424, 7373358, 7424915, 7548951, 7266684, 7206018, 7026401, 6902256, 6925634, 7001148, 6732957]
6078F732957j52679j6342j22079r1168k10213j18795l8298R2655M2446j02724
6068F015760K23657k15269l16124k92445n1257l59063o30791n1703n331l23945
6058C993489k20173k78185P462l93123K39083j69079k2479K4142J4386l70604
6048B824919m3663p9596K1151j70303N0915q8007Q6156j02842j44494m4919N2529
6037B361846j40962p9619K80852k24777K963J60086p233l9894o2864N8077k00714
6026B107761J81230j97733J18861j25182j41614J59955n1183Q6538L7556p2994
6016B103195J07714K38138n0464q2966J19691M9080k17766J97965k11142j22895
6006B130550j35072J01026j10252p790k07171J40036q8062K29896K7782K5499
$$ y = [6732957, 6580278, 6563936, 6441857, 6350689, 6140476, 6021681, 5983383, 6076038, 6118484, 6015760, 6239417, 6024148, 5708024, 5415579, 5364322, 5005259, 4374468, 4322765, 4317434, 3993489, 3773316, 3495131, 3502593, 3109470, 3348553, 3179474, 3156995, 3181137, 3195523, 2824919, 2781256, 2701660, 2722811, 2552508, 2603423, 2515416, 2601572, 2498730, 2354236, 2309317, 2361846, 2220884, 2141265, 2422117, 2197340, 2200303, 2360389, 2353156, 2313262, 2250398, 2308475, 2107761, 2288991, 2091258, 2210119, 2084937, 1943323, 2103278, 2052095, 2138633, 2176189, 2103195, 2210909, 2449047, 2398583, 2315617, 2435308, 2484388, 2266622, 2464587, 2253445, 2130550, 1995478, 2096504, 1986252, 1978462, 1771291, 1911327, 1823265, 2053161, 2080943, 2106442]
5996B106442k10924L77602j53547k592J27573n6474k81402k469K27999j70361
5986A961847j77028P6524j24722j76224l9538J94707K69445k27481L2855j33152
5976A657233J28530n2568J36188j73120K42024o3476J03755k55637J9307n8487
5966A683749O0666j73460K2602K43198j73489n8243J71960M6040j40130J58175
5956A841068j5852J9423K094O3269l5817q5016K5086P581k27478Q8766j05154
5945A577970L9406q4823m1662N9902J4611j12356J02799J43707m3410j78046K58726
5934A736824r8765J66736j1933k2712n5400m0439Q5938j85512K8817j75800J4773
5923A442527l0067K1608j03375j215m6975j47996J87664M0700P1098J7289Q2306
$$ y = [2106442, 1895518, 2273120, 2119573, 2116981, 2244554, 2188080, 1906678, 1904209, 2132208, 1961847, 1784819, 1861343, 1736621, 1560397, 1520859, 1715566, 1985011, 1757530, 1790385, 1657233, 1785763, 1733195, 1869383, 1696263, 1938287, 1874811, 1978566, 1722929, 1742236, 1683749, 1744415, 1570955, 1593557, 1836755, 1663266, 1605023, 1776983, 1823023, 1682893, 1841068, 1825216, 1844639, 1846733, 1910002, 1874185, 1789169, 1814255, 1821836, 1594358, 1683124, 1577970, 1617376, 1532553, 1490891, 1550793, 1565404, 1453048, 1555847, 1699554, 1656144, 1478098, 1736824, 1638059, 1804795, 1792862, 1770150, 1714750, 1674311, 1760249, 1574737, 1603554, 1427754, 1442527, 1412460, 1434068, 1330693, 1329478, 1282503, 1134507, 1322171, 1362871, 1433969, 1451258, 1533564]
5912A533564j27928n3165J56469k41709r329p2530l6231N0562j57278M8064N8551
5901A149040j22403J74041j31371j28301J12642P6063J830J58648j76944O4337
5891A177582q756J52141j10503J6081O5272j9784L70705l6664j71247K6587j43228
5880A318186J35207k74886R986k01964L5965o1812J82575j37817L85502j51259
5870A239683K01140k5927K78471o1899k13978o8013L2316l04429q6713n1576R5001
5859A034076R3843k19624K36349k68968m2109O1754J48088o1419K58146j24858
5849A115278l2319O0717l6715j90753J70823J30897k08517K38142j73859J25499
5839A199193L0144j0980j54577K79408j51594k6562q4277P0646J50888q4435o3550
$$ y = [1533564, 1405636, 1352471, 1508940, 1267231, 1257902, 1185372, 1149141, 1199703, 1042425, 1090489, 1149040, 1026637, 1200678, 1069307, 941006, 1053648, 1129711, 1131541, 1290189, 1113245, 1177582, 1168826, 1320967, 1210464, 1226545, 1291817, 1272033, 1642738, 1606074, 1434827, 1461414, 1318186, 1453393, 1178507, 1188493, 986529, 1022494, 960682, 1143257, 1005440, 1390942, 1239683, 1440823, 1414896, 1693367, 1631468, 1417490, 1349477, 1381793, 1077364, 990651, 939075, 1034076, 1127919, 908295, 1144644, 875676, 833567, 895321, 1043409, 981990, 1240136, 1115278, 1082959, 1143676, 1106961, 916208, 1087031, 1217928, 1009411, 1247553, 1073694, 1199193, 1229337, 1218357, 1063780, 1343188, 1191594, 1165032, 1080755, 1151401, 1302289, 1217854, 1154304]
5828A154304N4676K43760j70559M2870p9933J33895j32715K81859p460j35830
5818A384867K3398J0680J07510j12134p6494J14973J67555j06615R4112j56485
5808A451367J91803p5773J1365J93652k9388J94027l83970K68697j33105J56060
5798A844735Q9176j15736K2557J26956L07632j40996l5531J33132j12186R9491
5788B219230o683K14721l6562J20289N6522k79739K37908Q1252m4403N7599M07096
5777C027230J16052J57229J39495m2345K64039l14259L8326P6138r1146j54842
5767C215917m024J48839O2874j39815K22728j28961J17130K70171L5710M8492
5757C849061M4646J83057J28264J33003J24208L99564Q4181J13527J67393L5572
$$ y = [1154304, 1208980, 1452740, 1282181, 1325051, 1245118, 1379013, 1246298, 1528157, 1520697, 1384867, 1408265, 1418945, 1526455, 1414321, 1337827, 1452800, 1620355, 1513740, 1607852, 1451367, 1643170, 1567397, 1578762, 1772414, 1743026, 1937053, 1553083, 1821780, 1688675, 1844735, 1933911, 1818175, 1840732, 1967688, 2275320, 2134324, 2098793, 2231925, 2119739, 2219230, 2212547, 2427268, 2390706, 2510995, 2567517, 2287778, 2525686, 2606938, 2562535, 2620134, 3027230, 3143282, 3300511, 3440006, 3397661, 3661700, 3347441, 3385767, 3461905, 3370759, 3215917, 3211893, 3360732, 3423606, 3283791, 3506519, 3377558, 3494688, 3764859, 3800569, 3849061, 3893707, 4076764, 4205028, 4338031, 4462239, 4861803, 4945984, 5059511, 5226904, 5262476]
5747E262476R5503J35644j86498q1182j1358K10327J49844K47389J81199k2438
5737E980906j8046N72153n2798K47456J79864K96517L10258K16241J68938J06385
5727H007874K66517P8956J14412J66486K05223K11799N67761q6037O59141J76725
5717A0368857M23012O22736L91883N54550O96854O87230O98245Q74750Q46605
5708A6164722R63726R74092J471269J301923J858945J860225K394219K231507
5700B9220628K743960K708986K575556K744422J907541J895574J280638M77427
5692D5554732P75502J23111K03268L82289P12103R07009J496951J538636J711372
5683E3404973J822682K062255J838160J641752J315460Q87178P69346N51157M34626
$$ y = [5262476, 5357979, 5493623, 5307125, 5225943, 5214585, 5424912, 5574756, 5822145, 6003344, 5980906, 5962860, 6535013, 6482215, 6729671, 6909535, 7206052, 7516310, 7732551, 7901489, 8007874, 8274391, 8353347, 8467759, 8634245, 8839468, 9051267, 9619028, 9532991, 10192132, 10368857, 10791869, 11414605, 11806488, 12361038, 13057892, 13745122, 14443367, 15318117, 16164722, 17128448, 18102540, 19573809, 20875732, 22734677, 24594902, 26989121, 29220628, 31964588, 34673574, 37249130, 39993552, 41901093, 43796667, 45077305, 45554732, 46330234, 46453345, 46656613, 47038902, 47751005, 48658014, 50154965, 51693601, 53404973, 55227655, 57289910, 59128070, 60769822, 62085282, 62972460, 63741806, 64292963, 64727589]
5674F4727589o482k68698n66858o75175o01704j071332j326902j368851j517484
5665E7324103j218006j139754q66974n40267j84390q5664K66708K20765J12448
5656E3888969k74872r51735r79317j896727j987104k166647j953894k129567k055416
5647C9493690j080289q76668m40508Q9188P73408J470306K141360L129278M746499
5638D9446264P675558J1729044J3937567P793123k977665q966730j0151927r598702
5630E8886532p869991n343223l286573j594753j85816P52716K290663L983910
5622D7633465O179812R582921J4496411J4160966M665922n997961j1136565j1758569
5614F7826402j0939819r204059o586596m512928l097566k129652j640904q39907
$$ y = [64727589, 64721107, 64452409, 63885551, 63210376, 62608672, 61537340, 60210438, 58841587, 57324103, 56106097, 54966343, 54099369, 53559102, 53374712, 53289048, 53555756, 53776521, 53888969, 53614097, 52662362, 51683045, 49786318, 47799214, 45632567, 43678673, 41549106, 39493690, 38413401, 37536733, 37096225, 37185413, 37958821, 39429127, 41570487, 44699765, 49446264, 57121822, 68850866, 82788433, 90581556, 87603891, 78637161, 68485234, 58886532, 51016541, 45673318, 42386745, 40791992, 40606176, 41358892, 43649555, 47633465, 53813277, 63396198, 77892609, 92053575, 96719497, 90721536, 79584971, 67826402, 56886583, 47682524, 41095928, 36583000, 33485434, 31355782, 29714878, 28874971]
5606B8874971m33432k04141K71346L21812M10532R18011J078775J761975K013310
5597C5013159K399787K953954M237400N576904P515096J1024566J6685172K4085611
5589A09491649K3765101Q406332q965694j6818275j7523718j6509328j2954943
5582F8891124q190305m417452k681041m9028K020424M215699P497282J1605369
5574G8892072J8935469K5905011K0632481J541137j4782923k0147923k0449828
5567I0525496j8412204j4722388j0295959o806675n217483m127810k758668k559702
5559B5624607j513096j408760j311382q63538p33890o39451l21475j85695J11558
5550A8758878k97516l62814o37625p47911o66691m48484l09432o80689k95247
$$ y = [28874971, 28441539, 28237398, 28508744, 28830556, 29241088, 30159099, 31237874, 32999849, 35013159, 37412946, 40366900, 44604300, 50181204, 57696300, 68720866, 85406038, 109491649, 133256750, 141663082, 132697388, 115879113, 98355395, 81846067, 68891124, 60700819, 56283367, 53602326, 53553298, 55573722, 59789421, 67286703, 78892072, 97827541, 123732552, 144365033, 145906170, 131123247, 110975324, 90525496, 72113292, 57390904, 47094945, 40288270, 35070787, 30942977, 28184309, 25624607, 24111511, 22702751, 21391369, 20527831, 19793941, 19154490, 18833015, 18647320, 18758878, 18461362, 18098548, 17460923, 16713012, 16046321, 15597837, 15288405, 14607716, 14312469]
5541A4312469R1014m85726l36899j98352k23061Q7900k45601j41234J02849j14227
5531A2849132p2753K65291J20740J38619j42869j79092m33067j93749k59180L4750
5521A2127822k18085m05214l5934j38849j22555k7163o8120J69047k6596j48137
5511A1106216P1337K16705J72224N5152K15389M65152k8022L22701K51105M04885
5501A3252844l5554M28783J79434L08828L86530N00826O33273N32984P86898P00336
5491A7675182R31824J076301J076505J759275J755630J976836K524685L431855
5483C2208093M108348N680351P864969J1841825J7298895K0675829J6391219N373555
5475A21443084o698697j4331401j6379270j4868652j1752082q397727n771110
$$ y = [14312469, 14403483, 13917757, 13580858, 13382506, 13159445, 13247345, 13001744, 12860510, 12963359, 12849132, 12776379, 13041670, 13162410, 13301029, 13158160, 12979068, 12546001, 12352252, 12093072, 12127822, 11909737, 11504523, 11468589, 11329740, 11207185, 11180022, 11111902, 11280949, 11254353, 11106216, 11177553, 11394258, 11566482, 11621634, 11837023, 12302175, 12274153, 12596854, 12847959, 13252844, 13217290, 13646073, 13825507, 14134335, 14520865, 15021691, 15654964, 16187948, 16974846, 17675182, 18607006, 19683307, 20759812, 22519087, 24274717, 26251553, 28776238, 32208093, 36316441, 41996792, 49861761, 61703586, 79002481, 99678310, 116069529, 121443084, 114744387, 100412986, 84033716, 69165064, 57412982, 49015255, 43244145]
5468D3244145l578233k672930j577068q47848o3413L21634J312924J452725K457041
5459D0048977L134681M238538O168201Q802017J3351538J9772666K3632662J9702135
5451A38851415P418351o931080j7116804j9806131j8299153j5078198j1111430
5444E7926970p578011m918251l640941k151663j054505o32393l01522P20505J091148
5435C9461337K496654L880536O401500R319091J0017719O974374P56205n326304
5427G3981112p901321q204379o996174n407090l320321k275821j293768m46567
5419C8135671o2865K18814M16937J245464J368569J673885K374608K858315L720925
5410E1950323N145376P282045J0525009J4544496J5764691J1831387L507758m479107
$$ y = [43244145, 39665912, 36992982, 35415914, 34568066, 34504653, 34826287, 36139211, 37591936, 40048977, 43183658, 47422196, 53590397, 62392414, 75743952, 95516618, 119149280, 138851415, 146269766, 139338686, 122221882, 102415751, 84116598, 69038400, 57926970, 50348959, 45430708, 41789767, 39638104, 38583599, 37951206, 37649684, 38370189, 39461337, 41957991, 45838527, 52240027, 61559118, 71576837, 78551211, 79307416, 73981112, 66079791, 57875412, 50879238, 45472148, 42151827, 39876006, 38582238, 38135671, 38072806, 38291620, 38708557, 39954021, 41322590, 42996475, 45371083, 48229398, 51950323, 57095699, 64377744, 74902753, 89447249, 105211940, 117043327, 120551085, 116071978]
5402A16071978q667727r153294p484958m740980j942160O11625K712194M130608
5394I1537286N284902O394730P491796P523597P181514O599349N165204L450842
5386A40629220K174670R21621K13602m74936n8783K48605P87604J409711K024139
5377A47875453K918519L345702L917072M067374M285290L666115L446744K969266
5369A76491535J700368J147104m29848j323403k338778l529277m048754m675412
5361A62993535m559092m726876m416790l719644l285406k852146j906077j124701
5353A36402803p93652k49292k23429o91955j869817k839452m697397n975763p062327
5344A11999719p616840p910844p677309o944485o491156o180688n012747m341400
$$ y = [116071978, 107404251, 98250957, 90765999, 86025019, 84082859, 84694484, 87406678, 91537286, 96822188, 103216918, 110708714, 118232311, 125413825, 132013174, 137178378, 140629220, 142803890, 143725511, 143939113, 143464177, 143405394, 143653999, 144441603, 145851314, 147875453, 150793972, 154139674, 158056746, 162124120, 166409410, 170075525, 173522269, 176491535, 178191903, 179339007, 178909159, 177585756, 175246978, 171717701, 167668947, 162993535, 158434443, 153707567, 149290777, 145571133, 142285727, 139433581, 137527504, 136402803, 135609151, 135359859, 135136430, 134444475, 132574658, 129735206, 125037809, 119062046, 111999719, 104382879, 96472035, 88794726, 81850241, 75359085, 69178397, 64165650, 59824250]
5336E9824250m123629l328357l035945k597745k456657k219876j834986j740392
5328C8486663j465984r91224p88449j136697o89213r63076q37488k77874k68600
5319C1068058L04051j62949n69961o47014n18108o66822n241n3361o60269q94281
5309B7194103r12760p20011m02124m99673k07501o18322l49569n38527l03920
5300B2641696k46946j41966n08913j34465o07127k11361q4756k0071K01057J86116
5290B1073264L24230N11126K20394L16144M63323N87180O00676Q17215J068408
5281B5981960J412598K125169L012891M456035N877029N816200J458942j403051
5273D8737773k390831j882425j483975j3477K289849L916927O318884N743530
$$ y = [59824250, 55700621, 52372264, 49336319, 46738574, 44281917, 42062041, 40227055, 38486663, 37020679, 36029455, 35241006, 34104309, 33415096, 32452020, 31614532, 31336658, 31068058, 31372109, 31209160, 30639199, 29992185, 29474077, 28807255, 28802014, 28748653, 28088384, 27194103, 26281343, 25561332, 25159208, 24659535, 24452034, 23833712, 23484143, 22945616, 22641696, 22394750, 22252784, 21743871, 21609406, 21002279, 20790918, 20706162, 20686091, 20887148, 21073264, 21397494, 21908620, 22129014, 22445158, 22908481, 23495661, 24096337, 24913552, 25981960, 27394558, 29519727, 32532618, 36988653, 42865682, 48681882, 50140824, 48737773, 46346942, 44464517, 42980542, 42967065, 45256914, 49173841, 55492725, 61236255]
5265F1236255K566742P65224J257437M175248O990873O517184J329987l852267
5257H0986683n616054m798178l026338k46505M489685R602339J2885318Q052323
5249A02329273J28877o054037p195085n920271k565228P95312N52540q7862p02580
5240H1280939k566291l670929j744395K052983O356711Q214523M864436l259025
5232I1528952p981433r034654q006792n696794k562602J545371M943173M378369
5224F9113590P26139m258997n212975m316817k638390p43598j920915l737429
5216D7010608m243320l622187l223693j918037j242379J157881K320810K906685
5208C9146368N73032k398750l707206l837371l554845k763562k291805j406901
$$ y = [61236255, 63802997, 64568221, 65825658, 70000906, 76991779, 83508963, 84838950, 80986683, 75370629, 70572451, 67546113, 67299608, 71789293, 81391632, 94276950, 102329273, 102458150, 96404113, 89209028, 83288757, 80723529, 81518841, 82071381, 81983519, 81280939, 78714648, 75043719, 73299324, 75352307, 81709018, 89923541, 94787977, 91528952, 83547519, 74512865, 66506073, 60809279, 58246677, 59792048, 64735221, 69113590, 69839729, 65580732, 60367757, 56050940, 53412550, 52668952, 50748037, 47010608, 42767288, 39145101, 35921408, 34003371, 32760992, 33918873, 36239683, 39146368, 39719400, 37320650, 33613444, 29776073, 26221228, 23457666, 21165861, 19758960]
5200A9758960j057298q86829p42002o37054n23426m13193m69399n68399j84548
5191A4276812k56447J20491m71994L3223j07408k58806q6672k65930j09490K01247
5181A3075026p697j16608K16741J01841J80897N9976J85890L722J94815n0792
5171A3843811J64947M02290R6357O64157L81943K52443J75918L91124L27926M79009
5161A7179925O57780N99866J012598P87586J043035J274504J354233J664523J430197
5152B7004247K328723K094438K685960K780714K847237K706887K474812J897049
5144D6820067J396068Q05423R8420m113k44972O7310J62666K53790O38978J038242
5134E1031879Q51171J649656J384067J562125J314132J509801Q54464J107647
$$ y = [19758960, 18701662, 17814833, 17072831, 16435777, 15912351, 15499158, 15029759, 14461360, 14276812, 14020365, 14140856, 13668862, 13702085, 13594677, 13335871, 13249199, 12983269, 12873779, 13075026, 13067329, 12950721, 13167462, 13269303, 13450200, 13510176, 13696066, 13699788, 13894603, 13843811, 14008758, 14411048, 14507405, 15171562, 15553505, 15805948, 15981866, 16372990, 16700916, 17179925, 17837705, 18437571, 19450169, 20237755, 21280790, 22555294, 23909527, 25574050, 27004247, 29332970, 31427408, 34113368, 36894082, 39741319, 42448206, 44923018, 46820067, 48216135, 49021558, 49119978, 49115865, 48870893, 48938203, 49100869, 49354659, 49993637, 51031879, 51883050, 53532706, 54916773, 56478898, 57793030, 59302831, 60157295, 61264942]
5126F1264942L12023P25909P8377m44446l61288o42293j230051j625266j495438
5117E6582469j930387j986185j790921j554407j382016j097305q69451n90888
5109D5380909m6117n1018k21548k31683l76393r98736j585560j839378k258597
5100C7771879k353213k612673k631198k061198k240391j774573j849334j276547
5092B0972752j310113j025204r85590r87466p24301o59955o52751l92316o88996
5083A3546060n20093j96886n16859j45917m01693l71560j22916l02724l60116
5074A0607296k36524j09074k60706l69411k45037j31913j71187q0120j45705k38678
5064H618941K736K9313n00571P5905o6240l5421m04677O9494k40396q800l30877
$$ y = [61264942, 61576965, 62302874, 62381251, 61936805, 61575517, 60933224, 59703173, 58077907, 56582469, 54652082, 52665897, 50874976, 49320569, 47938553, 46841248, 45971797, 45380909, 45334792, 45283774, 45062226, 44830543, 44454150, 43455414, 41869854, 40030476, 37771879, 35418666, 32805993, 30174795, 28113597, 25873206, 24098633, 22249299, 20972752, 19662639, 18637435, 17651845, 16664379, 15940078, 15280123, 14627372, 14235056, 13546060, 13025967, 12829081, 12312222, 12166305, 11764612, 11393052, 11270136, 10967412, 10607296, 10370772, 10261698, 10000992, 9631581, 9386544, 9254631, 9083444, 9003324, 8857619, 8618941, 8621677, 8650990, 8150419, 8226324, 8160084, 8124663, 7719986, 7789480, 7549084, 7540284, 7209407]
5053G209407K12059l10646j74276j15950O8667j24638j16842K09037k05811m2078
5043F608929J20531j58032K42297j62636J72254k09730j82890J13236J7261k8579
5033F532641o0199o6642N7562J27789K12147r9922N46L4152K40229K38958n6970
5022G160291J49146j76867N7070K39065j17313J37614O0548l1120L70971K28822
5012H078227K13756j03802N56744J49695J96033K23960M45844L53544L90746M27285
5002A0932032N04419N38786N75757O05180P42751J054549Q00645J224372J509595
4993A8488086J290937K009876K461548K915839L621535N283561P249511J0309358
4985E3630251J5382455J7955395J3647778M065086o312104j1236438j1959973
$$ y = [7209407, 7421466, 7110820, 6936544, 6820594, 6889261, 6764623, 6647781, 6856818, 6651007, 6608929, 6729460, 6571428, 6813725, 6651089, 6823343, 6613613, 6430723, 6543959, 6561220, 6532641, 6472442, 6405800, 6463362, 6591151, 6803298, 6703376, 6703922, 6738074, 6978303, 7217261, 7160291, 7309437, 7132570, 7189640, 7428705, 7311392, 7449006, 7509554, 7478434, 7849405, 8078227, 8291983, 8188181, 8744925, 8894620, 9090653, 9314613, 9760457, 10114001, 10504747, 10932032, 11436451, 11975237, 12550994, 13156174, 13898925, 14953474, 15754119, 16978491, 18488086, 19779023, 21788899, 24250447, 27166286, 30787821, 36071382, 43320893, 53630251, 69012706, 86968101, 100615879, 104680965, 98368861, 87132423, 75172450]
4978G5172450r933633p360176m495513j486449J133365K852307N526597Q785734
4970G0194682J3611661J9895875K2192278K0907857J6970932J2279580K806632
4963A78859497r028815k0534492k3581857k1921557j7394597j3765607q992498
4956F3640074n201071k253926M25630L155010O602977J1217008J7000109J6226933
4948A10812744Q328580m569433j3505536j6744456j5653797j3418437j0454626
4941D4795039p073769n272307l894466k782240k203600j735033j286879j208953
4933A9337792j095081p71854r41281o26955n14232n20784m37317n46430m41180
4924A3442678n55204n6001l35937l52840j79686k54403l13871l30724K12229n79830
$$ y = [75172450, 65238817, 57878641, 53383128, 51896679, 53030044, 55882351, 61408948, 70194682, 83806343, 103702218, 125894496, 146802353, 163773285, 176052865, 178859497, 169830682, 149296190, 125714333, 103792776, 86398179, 72632572, 63640074, 58439003, 56185077, 56610707, 59765717, 66368694, 77585702, 94585811, 110812744, 119141324, 114571891, 101066355, 84321899, 68668102, 55249665, 44795039, 37721270, 32448963, 28554497, 25772257, 23568657, 21833624, 20546745, 19337792, 18242711, 17470857, 16529576, 15902621, 15388389, 14867605, 14430288, 13883858, 13442678, 12887474, 12831473, 12495536, 12142696, 11963010, 11708607, 11394736, 11064012, 11276241, 10696411]
4914A0696411J09392m92857m13164k7028l19443j68605j10153j30613k20329J9307
4904H942918J220j69k27609k08705m6269j50603r9218n0729p2361Q6327j84079
4893G990723j61296K68178k26220m9332k17309L07689k36578M4510k991K24187
4883G941561r8795K00961j25943k3421J77527k06038J18017J22438j26602O6178
4873H045883n6992Q6864M249k6466K68366Q0635k11779M04799M8074J22885K07161
4862H973679J64295J50789L21476q8701J73504M20207K28290K76839L99843N09425
4852A1529646M30368N72175O94763O22139P61814P65974Q30767J007725Q62738
4843A8078109J594264J374058J822794K473309K520315K904241M050585N070132
$$ y = [10696411, 10805803, 10312946, 9899782, 9872754, 9553311, 9384706, 9274553, 9143940, 8923611, 8942918, 8944138, 8943969, 8716360, 8507655, 8461386, 8310783, 8211565, 8160836, 8088475, 8174802, 7990723, 7829427, 8097605, 7871385, 7822053, 7604744, 7912433, 7675855, 7720365, 7717374, 7941561, 7842766, 8043727, 7917784, 7894363, 8071890, 7865852, 7983869, 8106307, 7979705, 8045883, 7988891, 8075755, 8080004, 8053538, 8321904, 8402539, 8190760, 8595559, 8643633, 8766518, 8973679, 9137974, 9288763, 9610239, 9521538, 9695042, 10115249, 10343539, 10620378, 11020221, 11529646, 11960014, 12532189, 13226952, 13849091, 14610905, 15376879, 16207646, 17215371, 18078109, 19672373, 21046431, 22869225, 25342534, 27862849, 30767090, 34817675, 39887807]
4835C9887807O648910R202020J3688294J9576317K3796932J7695979L385566q451920
4827A25429905j2628265j1529379p743964k336605N213386J3676758J8632316
4820A28714152J2375101j736055j1435933j3512516j1488960p876188r99589P392942
4812A01432954J2210440Q413996k314737j0556125j2147428j0872324p922595
4805G8244181l196444K796212R506761J2347000O687120m511279j1952193j4124190
4797G5797168j3683964j1662020r063645o362185m603895l196354k821250j973387
4789B2430468j481460j524245j045902r18826j019606p29278p36286n85753l96678
4780A3992434n43902k72724l79201m20100n72014m06236j86476k17339k71230
$$ y = [39887807, 46536717, 55738737, 69427031, 89003348, 112800280, 130496259, 133881825, 125429905, 112801640, 101272261, 93528297, 91191692, 96405078, 110081836, 128714152, 141089253, 139353198, 127917265, 114404749, 102915789, 95039601, 94040012, 101432954, 113643394, 122057390, 119742653, 109186528, 97039100, 86166776, 78244181, 75047737, 77843949, 87350710, 99697710, 106384830, 101873551, 89921358, 75797168, 62113204, 50451184, 41387539, 35025354, 30421459, 27225105, 24403855, 22430468, 20949008, 19424763, 18378861, 17460035, 16440429, 15711151, 14974865, 14389112, 13992434, 13448532, 13175808, 12796607, 12376507, 11804493, 11398257, 11211781, 10994442, 10723212]
4771A0723212k29619l10883j50971L8392m84583k36627k64654j09406l53111J13966
4761H735716n6146j09901P1376J78410K14763J18319k0512j05341L27125k3056
4751I330753K73507M99852J70099o4005J70601j9144k40679J58758M33638K33143
4741A0946523J24631j02367m55456m38719m59385j12805k20174k584l00628l54211
4731H624825m25052n27370m17762l07420m09602n9012l55520l83079k96095m45685
4721D998228r2047k33459m41008n6328j71706k40345R5421J15415l41359j17162
4711C515650j11847O0149k25042m5993R2886l79639K93825j68395p3869P0723
4701C028448J43893j11085M9003J98034k21941j34093p4669r4344j15292j52701
$$ y = [10723212, 10493593, 10182710, 10031739, 10070131, 9585548, 9348921, 9084267, 8974861, 8621750, 8735716, 8679570, 8569669, 8641045, 8819455, 9034218, 9152537, 9132025, 9026684, 9353809, 9330753, 9604260, 10104112, 10274211, 10210206, 10380807, 10361663, 10120984, 10279742, 10713380, 10946523, 11071154, 10968787, 10513331, 10074612, 9615227, 9502422, 9282248, 9279664, 8979036, 8624825, 8199773, 7672403, 7254641, 6947221, 6537619, 6478607, 6123087, 5740008, 5443913, 4998228, 4906181, 4672722, 4231714, 4175386, 4003680, 3763335, 3858756, 3974171, 3632812, 3515650, 3403803, 3463952, 3238910, 3192917, 3285803, 2906164, 3199989, 3031594, 2957725, 3028448, 3172341, 3061256, 3110259, 3308293, 3086352, 2952259, 2877590, 2783246, 2667954, 2515253]
4691B515253r2587O0658k03549K57694l24354J66007l6374n190j56078J1381J3682
4680B206543q1284m5449Q3936m01674L30790k22409M1618o60j226j84208L55267
4669B081244j28516j04963r4177L7357n6953j00772j3723K1278n4303N0678j30301
4658A506849m4031l4419R9602p3810N7262m2621m5814J73404k9862m8977N75L9087
4646A557245p9908m3577O7842l63677J79331J7129N2682R3785l09j73937K43164
4635A549770j55455K39057j03927j4472K30991O0756j62569l7348m5795o6176
4625A494832j21536N0425J07716q4660l102j99236J16563K8550Q8371K15950m1625
4614A652248K76195O5224J63440l67546L6971j5233j8990J3425k56246k32931
$$ y = [2515253, 2422666, 2483324, 2279775, 2537469, 2213115, 2379122, 2342748, 2337558, 2181480, 2192861, 2206543, 2125259, 2079810, 2163746, 1762072, 2092862, 1870453, 1912071, 1911411, 1910185, 1725977, 2081244, 1952728, 1847765, 1753588, 1790945, 1733992, 1633220, 1619497, 1640775, 1586472, 1637150, 1506849, 1462818, 1428399, 1528001, 1454191, 1511453, 1468832, 1423018, 1596422, 1566560, 1517583, 1518158, 1557245, 1477337, 1433760, 1501602, 1137925, 1317256, 1334385, 1387067, 1480852, 1480543, 1306606, 1549770, 1394315, 1633372, 1529445, 1514973, 1745964, 1806720, 1644151, 1606803, 1561008, 1494832, 1373296, 1423721, 1531437, 1446777, 1443675, 1244439, 1361002, 1389552, 1477923, 1693873, 1652248, 1928443, 1993667, 2157107, 1789561, 1826532, 1811299, 1792309, 1805734, 1549488, 1316557]
4604A316557l4998k5847k07246k4087K50355J2449J37553R8239o9697J53955j5519
4593A591714j0306j81450j40801J33220j71741k02957j33184K43831j51862J73726
4583A150190P0041j69655k14019K70143r5315p7195j54086K58108r1586k9634
4573I16992j72887J71628j27844J37090r9544j4574n1273Q4548p0843j6294K03947
4562I60946j90959J12744j81622j06395K12597j15331j20690J20577P4977m5851
4552G20993k62633K84673j63431R5262j7797j8016Q5803K14473k21609j01343
4542F16375k8145O5386n2554P157J6495K01020j5194j68838J57825K5361l1040
4531G93848j50675L51768j06812m3578j43387J06049j00223J65371l7120j683
$$ y = [1316557, 1281559, 1255712, 1048466, 1024379, 1274734, 1287183, 1424736, 1522975, 1453278, 1607233, 1591714, 1581408, 1399958, 1259157, 1392377, 1220636, 1017679, 884495, 1128326, 976464, 1150190, 1220231, 1050576, 836557, 1106700, 1011385, 934190, 780104, 1038212, 946626, 916992, 744105, 915733, 787889, 924979, 825435, 810861, 759588, 844136, 773293, 756999, 960946, 769987, 882731, 701109, 594714, 807311, 691980, 571290, 691867, 766844, 720993, 458360, 743033, 579602, 674864, 657067, 639051, 724854, 939327, 717718, 616375, 588230, 653616, 601062, 608219, 624714, 825734, 810540, 641702, 799527, 824888, 793848, 643173, 994941, 888129, 844551, 701164, 807213, 706990, 872361, 835241, 833558]
4521H33558j2572p7172J03689R981j84746J47975N3565m1649J18328k38452K65986
4510I78491k00748K70923j89810k90850J75855K1713J1817O7878n3372J46819
4500I38716l85148J92990L4541J94361j98854P2186P9220r2173j9584p1720m4058
4489G00477L0121L18332l10796J24650J19582J2217J856K57312p9208J72583N5848
4478A402974J05737j93295P913m9041o807j25937K47773k04175M47849R514l66604
4467A275901O5489l27543J48793J06558j20313J93965Q1278M7489L2899j83530
4457A320986k70344J34296k72923J79364K29446M8291q0407l0636J16258j08909
4447A265422p8750j45056q4963o033j38232K7401P173m2196Q3164j54577p7299
$$ y = [833558, 820986, 743814, 847503, 857484, 672738, 820713, 874278, 832629, 950957, 712505, 978491, 777743, 1048666, 858856, 568006, 743861, 765574, 777391, 845269, 791897, 938716, 553568, 746558, 781099, 975460, 776606, 848792, 928012, 835839, 816255, 744535, 700477, 730598, 1048930, 738134, 862784, 982366, 994583, 996439, 1253751, 1174543, 1347126, 1402974, 1508711, 1315416, 1323329, 1274288, 1267481, 1141544, 1389317, 1185142, 1632991, 1642505, 1275901, 1341390, 1013847, 1162640, 1269198, 1148885, 1342850, 1424128, 1471617, 1504516, 1320986, 1050642, 1184938, 912015, 1091379, 1320825, 1369116, 1288709, 1258073, 1374331, 1265422, 1186672, 1041616, 956653, 950620, 812388, 839789, 846962, 804766, 887930, 733353, 656054]
4436F56054J10255l2433M2132j56994J32549o7867P4215k44449J25788n5396j33464
4425D50390K24141j02170K892O2306l4564J63055k3597J104j84819J8015R8510
4414F75263l1703o7378n450K49582j97939m6896J6052L5191j9669j49577K33848
4403F91324J51318m16497K91083p9668R771R415N3684m5480J29052J79186k11873
4392G61315l362k5211l7756J17474Q5406k65653K3349J59544k65328K33077j4667
4381G68188Q1156L7551j87550j4992K10676O6940j57015q7817Q1279j65702K06303
4370H39017K3195K8516p3091J03117K82031j80654j16213J17526J0899l6424J8126
4359A016045R0873k23719K79220N2253N4010j55514J15994J02462P5652j25254
$$ y = [656054, 766309, 733876, 776008, 619014, 751563, 683696, 757911, 513462, 639250, 583854, 450390, 674531, 572361, 575253, 637559, 602995, 766050, 742453, 743557, 558738, 576753, 675263, 643560, 576182, 570732, 820314, 622375, 575479, 591531, 626722, 607053, 457476, 691324, 842642, 426145, 717228, 637560, 647331, 656746, 710430, 664950, 794002, 973188, 761315, 757953, 732742, 694986, 812460, 897866, 632213, 655562, 815106, 549778, 782855, 768188, 849344, 886895, 699345, 684353, 895029, 961969, 804954, 717137, 798416, 632714, 839017, 862212, 890728, 817637, 920754, 1202785, 1022131, 905918, 1023444, 1034343, 997919, 1016045, 1106918, 883199, 1162419, 1214672, 1268682, 1113168, 1229162, 1331624, 1407276, 1282022]
4349A282022J64250j44078K27982K05306j38306Q5163O1061K67958J28959J219
4339B141536L92777J11827K10054Q5491L02590K51748M56025M54055M39854N22103
4329E368060J149231J196306J873772K463940K946616L854759K860777J55036
4321B1868497j773306k844232k835148k814530k177445j790333r78505r02231
4313E752767p39176m91592l04213k04490o05086p7921m48302P5867k01245J4833
4303B771442j42228j4689j17922k7635K36213j91847K39022q7847o3238j64513
4293B436758k2057j16012J48681l86145K05171J71346N9285j18688K60984k53151
4283B386172K93106K37185K22286l3825J13056M4961J9025O2325J27749J88044
$$ y = [1282022, 1446272, 1302194, 1530176, 1735482, 1597176, 1682339, 1743400, 2011358, 2140317, 2141536, 2534313, 2646140, 2856194, 2941685, 3244275, 3496023, 3952048, 4406103, 4845957, 5368060, 6517291, 7713597, 9587369, 12051309, 14997925, 18852684, 21713461, 21868497, 20095191, 17250959, 14415811, 11601281, 9423836, 7633503, 6654998, 5752767, 5013591, 4521999, 4217786, 4013296, 3408210, 3330289, 2881987, 2957854, 2756609, 2771442, 2629214, 2614525, 2496603, 2468968, 2705181, 2513334, 2752356, 2664509, 2601271, 2436758, 2414701, 2298689, 2447370, 2061225, 2266396, 2437742, 2497027, 2378339, 2639323, 2386172, 2679278, 2916463, 3138749, 3104924, 3217980, 3262941, 3281966, 3344291, 3472040, 3660084]
4273C660084p0994K81537K84471K66798L91495M50346N52173Q58343Q92157J352827
4263H919237J596719K207029K793424L269533K772148Q72971j268966k148057
4255A9014038k558622k792957k509217j870483j636696j188803r93092n43903
4247D920265m78395n16802l91276r2705m01147r5234j99617j11823r6980k51181
4237B285105k8445j35958j66095k9116j41655J2928j75286L3050j41979J80182
4227A692731q943j89916j35665K25221l90298q491J65384J30622j72067q550k56930
4216A043098J87498k25122k509N109J5127j09691k4942M8990R8640r2933k25552
4205G17713J98149j69846J47442K38782k75319j32838o176k1465k047K1315R6995
$$ y = [3660084, 3589090, 3870627, 4155098, 4421896, 4813391, 5263737, 5815910, 6674253, 7566410, 8919237, 10515956, 12722985, 15516409, 18785942, 21558090, 22431061, 21162095, 19014038, 16455416, 13662459, 11153242, 9282759, 7646063, 6457260, 5464168, 4920265, 4441870, 3925068, 3533792, 3441087, 3039940, 2944706, 2745089, 2633266, 2536286, 2285105, 2256660, 2120702, 1954607, 1925491, 1783836, 1796764, 1621478, 1654528, 1512549, 1692731, 1683788, 1493872, 1358207, 1583428, 1193130, 1184639, 1350023, 1480645, 1308578, 1300028, 1043098, 1230596, 1005474, 1002965, 1008074, 1023201, 913510, 888568, 937558, 1036198, 943265, 717713, 915862, 746016, 893458, 1132240, 856921, 724083, 717907, 696442, 694395, 715710, 812705]
4194H12705J4320k41289K28275j01854o0239n361N4142J7240l3332q973k2232
4183F53402R3977p7898P9055l3375j93185J20509J6j665p1698l8406J69045p5037
4171F24740J5166l0441n4973n7951J34746k14408O8031r227K35003k18239N2718
4160E45165J20081j34501K06295m35674M20305m4486j41452r2356j13083K18750
4150E49044p6188L6531l1538l3012Q1213R846m6261J7437O5592m9521N6416j20643
4138D58916J22217q4172j23889J16090n5321k0139K27343j65572m9455J20234
4128E46252k70084L28916j06869J09130P1564q7214j63193m2405n4246K08119
4118E39970p5956q9115o6228J1478R4561K0784K65241k38212O6117j45899k5808
$$ y = [812705, 827025, 585736, 814011, 712157, 651918, 646557, 700699, 717939, 684607, 675634, 653402, 747379, 669481, 748536, 715161, 521976, 642485, 642501, 640836, 569138, 530732, 699777, 624740, 639906, 609465, 554492, 496541, 631287, 416879, 484910, 475683, 710686, 492447, 545165, 665246, 530745, 737040, 301366, 721671, 677185, 535733, 443377, 330294, 549044, 472856, 509387, 477849, 444837, 526050, 535896, 489635, 507072, 572664, 523143, 579559, 458916, 581133, 496961, 373072, 489162, 433841, 413702, 641045, 475473, 426018, 546252, 276168, 605084, 498215, 607345, 678909, 591695, 428502, 386097, 331851, 539970, 464014, 374899, 308671, 320149, 414710, 435494, 700735, 462523, 528640, 382741, 356933]
4107C56933N6313o5837l058J38439J8747l8143R5418n2342o504N1723j19646K3773
4095D55816j54341J51102L0605o9421p1780l1691Q0855J27132j06681p7022Q8268
4084D22842j88728J33478J5712J5130j28171K80896j73476l1758M7389J0640m3028
4073C60926J03316n6001K6962o7827R2378j42638m7971K17669n0135J94506k56161
4062C75024J50375k44947J89486m6238N4570J04671k63925q9272J07134R7681
4052D34559L8248k46170J89342q519j09057j00078K38113k9985O5168k24734K20043
4041D66930J34303j05042j85478o4841J91478R9830k19226J66496K2257k08292
4031B98415P2544J00530k04595K60233k29368K5006J78309j23052j37994K11023
$$ y = [356933, 413246, 347409, 344351, 482790, 501537, 463394, 558812, 506470, 499966, 551689, 432043, 455816, 301475, 452577, 483182, 413761, 341981, 310290, 391145, 518277, 411596, 334574, 422842, 234114, 367592, 383304, 398434, 270263, 551159, 377683, 345925, 393314, 403954, 360926, 464242, 408241, 435203, 367376, 459754, 317116, 269145, 486814, 436679, 631185, 375024, 525399, 280452, 469938, 423700, 478270, 582941, 319016, 229744, 336878, 434559, 472807, 226637, 415979, 407460, 298403, 198325, 436438, 406453, 471621, 246887, 466930, 601233, 496191, 310713, 245872, 437350, 537180, 317954, 484450, 506707, 298415, 370959, 471489, 266894, 527127, 297759, 322765, 501074, 378022, 240028, 451051]
4021D51051r6362n4445L5946P8464p2160Q419N191m1788J13992Q491n7183n6919
4009C22697J16322L5940R2392L2487m6566j28044K08931l02648J53823k36633
3999B48701J27499R8596l0892l43561M36317j48335J721R2060j37585K969r7898
3988B49592K30118j14890j0046j880J1222l9052L7128n2743O8025n3405j0379
3977C13690R5079n2260j3921p0631J369J69024j7933j35893j09725J35331j37215
3966A76915J9465K79976k18455J00739J37776L1363o6667j01989M6192j4444J45374
3955E36245o8681j62453j17167K94140J09807k09338N6208k602n2654Q6373J7854
3944D87732k15923K68178o2269l8417j77014K3054J48658j86300K43200N306n9352
$$ y = [451051, 354689, 300244, 336190, 414654, 342494, 350913, 356104, 314316, 428308, 436799, 379616, 322697, 439019, 474959, 567351, 599838, 553272, 425228, 634159, 331511, 485334, 248701, 376200, 474796, 443904, 100343, 536660, 388325, 390046, 482106, 344521, 347490, 249592, 479710, 364820, 354774, 352894, 364116, 325064, 362192, 309449, 377474, 324069, 313690, 408769, 356509, 342588, 271957, 273326, 442350, 424417, 288524, 178799, 314130, 176915, 196380, 476356, 257901, 358640, 496416, 527779, 461112, 359123, 405315, 390871, 536245, 467564, 305111, 187944, 482084, 591891, 382553, 438761, 436159, 383505, 469878, 487732, 271809, 539987, 477718, 439301, 262287, 285341, 433999, 247699, 490899, 496205, 436853]
3933D36853o1705M2545J02940l8435m3914q2272K11876k03824R859O022J57812
3922E37757l9741r0664R2662j57105K67613k28739J11866O643j49897P2705J05694
$$ y = [436853, 375148, 417693, 520633, 482198, 438284, 356012, 567888, 364064, 373923, 379945, 537757, 498016, 407352, 500014, 342909, 610522, 381783, 493649, 500292, 350395, 423100, 528794]
$$ [...]
##END NTUPLES=NMR SPECTRUM
##END=
