##TITLE=abcd
##JCAMPDX= 6.0         $$ Bruker NMR JCAMP-DX V2.0
##DATA TYPE= NMR SPECTRUM
##DATA CLASS= NTUPLES
##ORIGIN= UXNMR, Bruker Analytische Messtechnik GmbH
##OWNER= root
$$ XWIN-NMR		Version 3.5
$$ Tue Dec  2 17:54:54 2025 Russian Standard Time (UT+4h)  servis@DPX200
##.OBSERVE FREQUENCY= 200.131235884673
##.OBSERVE NUCLEUS= ^1H
##.ACQUISITION MODE= SIMULTANEOUS
##.ACQUISITION SCHEME= undefined
##.AVERAGES= 16
##.DIGITISER RES= 18
##SPECTROMETER/DATA SYSTEM= spect
##.PULSE SEQUENCE= zg
##.SOLVENT NAME= CDCl3
##.SHIFT REFERENCE= (INTERNAL, CDCl3, 0, 16.4885)
##AUDIT TRAIL= $$ (NUMBER, WHEN, WHO, WHERE, WHAT)
$$ ##TITLE= Audit trail, XWIN-NMR		Version 3.5
$$ ##JCAMPDX= 5.01
$$ ##ORIGIN= Bruker BioSpin GmbH
$$ ##OWNER= servis
$$ F:\spectra/data/av/nmr/H1/1/pdata/1/auditp.txt
$$ ##AUDIT TRAIL=  $$ (NUMBER, WHEN, WHO, WHERE, WHAT)
(   1,<2025-12-02 17:54:25.18 +0400>,<servis>,<DPX200>,
      <created by zg, POWCHK disabled, PULCHK disabled
       terminated by command 'halt'
       configuration hash MD5:
       00 E9 B6 7A A2 85 ED C7 34 08 36 98 17 FE 4E 26
       data hash MD5: 32K
       0E 3F B0 18 10 60 19 58 47 ED C9 F4 F7 12 0C 36>)
(   2,<2025-12-02 17:54:26.84 +0400>,<servis>,<DPX200>,
      <Start of raw data processing
       efp BC_mod = 2 LB = 0.05 FT_mod = 6 PKNL = 1 PHC0 = -263.8425 PHC1 = 6.301564 SI = 16K 
       data hash MD5: 16K
       A9 10 46 CC C5 B6 A4 0C 75 CE E1 0C CE 42 DF 46>)
$$ ##END=
$$ 
$$ hash MD5
$$ 14 2C 8C 52 0A 63 33 AF 72 52 7A 50 0F F3 F0 32
##$RELAX= 
##$RELAX= 
##$RELAX= 
##$RELAX= 
##$RELAX= 
##$RELAX= 
##$RELAX= 
##$RELAX= 
$$ Bruker specific parameters
$$ --------------------------
##$DU= <F:\spectra>
##$EXPNO= 1
##$NAME= <H1>
##$PROCNO= 1
##$TYPE= <nmr>
##$USER= <av>
##$AMP= (0..31)
100 100 100 100 100 100 100 100 100 100 100 100 100 100 100 100 100 100 
100 100 100 100 100 100 100 100 100 100 100 100 100 100 
##$AQSEQ= 0
##$AQ_mod= 1
##$AUNM= <au_zg>
##$AUTOPOS= <>
##$BF1= 200.13
##$BF2= 200.13
##$BF3= 200.13
##$BF4= 200.13
##$BF5= 500.13
##$BF6= 500.13
##$BF7= 500.13
##$BF8= 500.13
##$BYTORDA= 1
##$CFDGTYP= 0
##$CFRGTYP= 5
##$CHEMSTR= <none>
##$CNST= (0..31)
1 1 145 1 1 1 1 1 1 1 1 1 1 1 1 1 1 1 1 1 1 1 1 1 1 1 1 1 1 1 1 1 
##$CPDPRG= <>
##$CPDPRG1= <>
##$CPDPRG2= <>
##$CPDPRG3= <>
##$CPDPRG4= <mlev>
##$CPDPRG5= <mlev>
##$CPDPRG6= <mlev>
##$CPDPRG7= <mlev>
##$CPDPRG8= <mlev>
##$CPDPRGB= <>
##$CPDPRGT= <>
##$D= (0..31)
0 2 0 0 0 0 0 0 0 0.06 0 0 0 0 0 0 0.0002 0 0 0 0 0 0 0 0 0 0 0 0 0 0 
0 
##$DATE= 1764683664
##$DBL= (0..7)
120 120 120 120 120 120 120 120 
##$DBP= (0..7)
150 150 150 150 150 150 150 150 
##$DBP07= 0
##$DBPNAM0= <>
##$DBPNAM1= <>
##$DBPNAM2= <>
##$DBPNAM3= <>
##$DBPNAM4= <>
##$DBPNAM5= <>
##$DBPNAM6= <>
##$DBPNAM7= <>
##$DBPOAL= (0..7)
0.5 0.5 0.5 0.5 0.5 0.5 0.5 0.5 
##$DBPOFFS= (0..7)
0 0 0 0 0 0 0 0 
##$DE= 6
##$DECBNUC= <off>
##$DECIM= 32
##$DECNUC= <off>
##$DECSTAT= 4
##$DIGMOD= 1
##$DIGTYP= 9
##$DL= (0..7)
0 120 120 120 120 120 120 120 
##$DP= (0..7)
$$ [...]
##$SUBNAM4= <"">
##$SUBNAM5= <"">
##$SUBNAM6= <"">
##$SUBNAM7= <"">
##$SUBNAM8= <"">
##$SUBNAM9= <"">
##$SW= 20.6817932712277
##$SWIBOX= (0..15)
0 0 3 0 0 0 0 0 0 0 0 0 0 0 0 0 
##$SW_h= 4139.07284768212
##$TD= 32768
##$TD0= 1
##$TE= 0
##$TE2= 300
##$TE3= 300
##$TEG= 300
##$TL= (0..7)
0 120 120 120 120 120 120 120 
##$TP= (0..7)
150 150 150 150 150 150 150 150 
##$TP07= 0
##$TPNAME0= <>
##$TPNAME1= <>
##$TPNAME2= <>
##$TPNAME3= <>
##$TPNAME4= <>
##$TPNAME5= <>
##$TPNAME6= <>
##$TPNAME7= <>
##$TPOAL= (0..7)
0.5 0.5 0.5 0.5 0.5 0.5 0.5 0.5 
##$TPOFFS= (0..7)
0 0 0 0 0 0 0 0 
##$TUNHIN= 0
##$TUNHOUT= 0
##$TUNXOUT= 0
##$USERA1= <user>
##$USERA2= <user>
##$USERA3= <user>
##$USERA4= <user>
##$USERA5= <user>
##$V9= 5
##$VALIST= <valist>
##$VCLIST= <CCCCCCCCCCCCCCC>
##$VD= 0
##$VDLIST= <DDDDDDDDDDDDDDD>
##$VPLIST= <PPPPPPPPPPPPPPP>
##$VTLIST= <TTTTTTTTTTTTTTT>
##$WBST= 1024
##$WBSW= 30
##$XGAIN= (0..3)
0 0 0 0 
##$XL= 0
##$YL= 0
##$YMAX_a= 555308
##$YMIN_a= -740102
##$ZGOPTNS= <>
##$ZL1= 120
##$ZL2= 120
##$ZL3= 120
##$ZL4= 120
##$ABSF1= 0
##$ABSF2= 0
##$ABSG= 0
##$ABSL= 0
##$ALPHA= 0
##$AQORDER= 0
##$ASSFAC= 0
##$ASSFACI= 0
##$ASSFACX= 0
##$ASSWID= 0
##$AUNMP= <proc_1d>
##$AZFE= 0.1
##$AZFW= 0.1
##$BCFW= 0
##$BC_mod= 2
##$BYTORDP= 0
##$COROFFS= 0
##$CY= 18.4799938201904
##$DATMOD= 1
##$DC= 0
##$DFILT= <>
##$DTYPP= 0
##$F1P= 9.9274215381318
##$F2P= -0.165520771350173
##$FCOR= 1
##$FTSIZE= 16384
##$FT_mod= 6
##$GAMMA= 0
##$GB= 0
##$INTBC= 1
##$INTSCL= 4.127829e-11
##$ISEN= 128
##$LB= 0.05
##$LEV0= 0
##$LPBIN= 0
##$MAXI= 10000
##$MC2= 0
##$MEAN= 0
##$ME_mod= 0
##$MI= 50
##$NCOEF= 0
##$NC_proc= -6
##$NLEV= 6
##$NOISF1= 3.799351
##$NOISF2= 2.8
##$NSP= 0
##$NTH_PI= 0
##$NZP= 0
##$OFFSET= 16.48848
##$PC= 4
##$PHC0= -263.8425
##$PHC1= 6.301564
##$PH_mod= 1
##$PKNL= yes
##$PPARMOD= 0
##$PSCAL= 4
##$PSIGN= 0
##$REVERSE= no
##$SF= 200.130005582386
##$SI= 16384
##$SIGF1= 3
##$SIGF2= 2
##$SINO= 400
##$SIOLD= 16384
##$SREGLST= <1H.CDCl3>
##$SSB= 0
##$STSI= 16384
##$STSR= 0
##$SW_p= 4139.07284768211
##$SYMM= 0
##$S_DEV= 0
##$TDeff= 32768
##$TDoff= 0
##$TI= <>
##$TILT= no
##$TM1= 0
##$TM2= 0
##$TOPLEV= 0
##$USERP1= <user>
##$USERP2= <user>
##$USERP3= <user>
##$USERP4= <user>
##$USERP5= <user>
##$WDW= 1
##$XDIM= 16384
##$YMAX_p= 448964726
##$YMIN_p= -1331565
$$ End of Bruker specific parameters
$$ ---------------------------------
##NTUPLES= NMR SPECTRUM
##VAR_NAME=  FREQUENCY,     SPECTRUM/REAL,   SPECTRUM/IMAG
##SYMBOL=    X,             R,               I
##VAR_TYPE=  INDEPENDENT,   DEPENDENT,       DEPENDENT
##VAR_FORM=  AFFN,          ASDF,            ASDF
##VAR_DIM=   16384,         16384,           16384
##UNITS=     HZ,            ARBITRARY UNITS, ARBITRARY UNITS
##FACTOR=    0.252644378177508, 1,           1
##FIRST=     3299.83951724647, 0,            0
##LAST=      -839.233330435636, 0,           0
##MIN=       -839.233330435636, -1331565,    0
##MAX=       3299.83951724647, 448964726,    0
$$ Real data points
##PAGE= N=1
##DATA TABLE= (X++(R..R)), XYDATA
$$ [...]
13353A338666J6276P3820J47584j07089J07738n5254J02082J14247j03460K8989
13343A663599Q5686R2647p8403J11345m6201q7770J39458n2772J00361J54431
13333B082381o7601R8014J10876l6931O3576j387N3819J77443j73653L51921j03970
13322B554488j9887J5760L6381K24708q7907R5945J36216m330Q3424p0904J71749
13311C135643R2433l9949J14712M4767J13521K2797J00428Q4033J02609J03426
13301C874420Q681J54340j0608N3724J94734n698K34388q0170R2185K13676o2544
13290D667128P8488J72395R1704R6951K38309K19541l7328K3484L19495Q2074
13280E952241J45497J98529Q3209L06411O0959J92436K14101K45852J39414J62740
$$ plain form
13353 1338666 1354942 1428762 1576346 1469257 1576995 1521741 1623823 1738070 1634610 1663599
13343 1663599 1749285 1841932 1763529 1874874 1828673 1740903 1880361 1827589 1927950 2082381
13333 2082381 2014780 2112794 2223670 2186739 2250315 2248928 2302747 2480190 2306537 2658458 2554488
13322 2554488 2534601 2550361 2586742 2811450 2723543 2819488 2955704 2951374 3034798 2963894 3135643
13311 3135643 3228076 3188127 3302839 3347606 3461127 3483924 3584352 3668385 3770994 3874420
13301 3874420 3883101 4037441 4026833 4080557 4275291 4269593 4503981 4423811 4515996 4729672 4667128
13290 4667128 4745616 4918011 5009715 5106666 5344975 5564516 5527188 5550672 5870167 5952241
13280 5952241 6097738 6296267 6379476 6685887 6746846 6939282 7153383 7399235 7538649 7701389
13270G701389L46206J21908K73972K56104J76885K90880K66717K51661L59878
13261A0045600N23276J88014O05643K61712N14604M06268N59897M65698K42341
13252A3813053N92168M22176M16043L74200M04646P32658M28143O32806P28961
13243A8544854P15702O66593J020623J186215J064080J499816J683284J480382
13235B7861549J818995J564879J936371K289010K624223K949320L125932L467053
13227D7637332L535145L933904M705121N074567O428733P897770J0216852J3262184
13219A02691608J7902972K4420380L0085161K7343695J3474848J36312j793405
13212B14261571N372449J5755247K4944859K4530106R915507p929343j6761134
$$ plain form
13270 7701389 8047595 8169503 8443475 8699579 8876464 9167344 9434061 9685722 10045600
13261 10045600 10568876 10756890 11362533 11624245 12138849 12545117 13105014 13570712 13813053
13252 13813053 14405221 14827397 15243440 15617640 16022286 16754944 17183087 17815893 18544854
13243 18544854 19260556 19927149 20947772 22133987 23198067 24697883 26381167 27861549
13235 27861549 29680544 31245423 33181794 35470804 38095027 41044347 44170279 47637332
13227 47637332 51172477 55106381 59811502 64886069 71314802 79212572 89429424 102691608
13219 102691608 120594580 145014960 175100121 202443816 215918664 216054976 214261571
13212 214261571 219634020 235389267 260334126 284864232 294779739 286850396 270089262
13205B70089262j6094360j1688801r565720r927773p874454k695192O42342k018881
13197B10866423m386804j256263P487780J8358828K6332138K2953023P115024
13190B87470149q753513j4496254j1039965n345962l632052j0190474k2583989
13183B11427940l0310858k9554317k5422994k1078478j6880947j2917761r553237
13176F5709348p249607n642715m717655l594666l031756k730779k287709k043143
13168C4411318j807545j751646j735244j484779j229730j326461j265326j234111
13160B2576476j097999j040116q58793p34543q69012q37197p91360n45699o28781
13151A5172976m92142n74768n88017n66471l57679m45129l98974l30389m31034
$$ plain form
13205 270089262 253994902 242306101 232740381 222812608 214938154 212242962 212885304 210866423
13197 210866423 206479619 205223356 212711136 231069964 257402102 280355125 287470149
13190 287470149 278716636 264220382 253180417 247834455 244202403 234011929 211427940
13183 211427940 181117082 151562765 126139771 105061293 88180346 75262585 65709348
13176 65709348 58459741 52817026 48099371 44504705 41472949 38742170 36454461 34411318
13168 34411318 32603773 30852127 29116883 27632104 26402374 25075913 23810587 22576476
13160 22576476 21478477 20438361 19579568 18845025 17976013 17138816 16347456 15801757 15172976
13151 15172976 14680834 14106066 13518049 12951578 12593899 12148770 11749796 11419407 10988373
13142A0988373l38705k10808m32869l06720k32263l46103k72904l26877j18958
13133H402166m28433p3771k91217j47203j59179k69083l34582k3974j75865r5189
13123F403670j07702m01836P172j57153k06362J23915m53050R7113j49347l36131
13113D820289n644j09702k6450l30218l9084j9616k60964k475K0224j69065j75138
13102C702157j52738L830n4663k73856o8421l0104O1541k16739j01011l883r0459
13091B775654j49762n6012n6314j39300R8470j17856n5889j51119o5579J03950
13081B186243k24422J6497l6588n2642p2786j6870j27992o4970M2461j1644j64228
13070A473059j8781m988K370j20839Q0872j03605j07358n2767k7472r4455q6863
$$ plain form
13142 10988373 10649668 10438860 10005991 9699271 9467008 9120905 8848001 8521124 8402166
13133 8402166 7973733 7899962 7608745 7461542 7302363 7033280 6698698 6674724 6498859 6403670
13123 6403670 6295968 5894132 5901304 5744151 5537789 5661704 5208654 5305767 5156420 4820289
13113 4820289 4814645 4704943 4678493 4348275 4309191 4289575 4028611 4026136 4046360 3877295 3702157
13102 3702157 3549419 3553249 3498586 3224730 3156309 3126205 3187746 2971007 2869996 2866113 2775654
13091 2775654 2625892 2569880 2513566 2374266 2472736 2354880 2298991 2147872 2082293 2186243
13081 2186243 1961821 1978318 1941730 1889088 1816302 1799432 1671440 1606470 1648931 1637287 1473059
13070 1473059 1454278 1449290 1451660 1330821 1411693 1308088 1200730 1147963 1120491 1026036 939173
13059I39173J32516Q3022j53222j47704O2787K3242K1538j68024M8261K4265o261
13048H59593j61965J28852o3910L2984M7664l01246N8370J32446k10667J09434
13038F31555k94584J41120J36549k00194P9364m4449Q334r0985Q0568K9400k50360
13027B26318J6833K8529O1455r5520O6693l7398J21977j36149J08075K7142q8904
13016B99051r6824J02580j7242j18140O6722O2814m7991m4238m381O1409j98004
13005F5756J95374n309k112P4247j30442Q5797k33234K6813N6226o6939K03792
12994B69969m8648J42833p6114q4125K76860j05391k2971J09112J7737M4506l1634
12983D92134Q5293q8759K5266L9623m464M8152j55520l973j31007O650m7754l338
$$ plain form
13059 939173 1071689 1154711 1001489 853785 916572 939814 961352 793328 841589 865854 859593
13048 859593 697628 826480 762570 795554 843218 541972 600342 732788 522121 631555
13038 631555 336971 478091 614640 414446 493810 449361 457695 366710 447278 476678 226318
13027 226318 243151 271680 333135 237615 304308 266910 388887 252738 360813 387955 299051
13016 299051 202227 304807 287565 169425 236147 298961 250970 206732 202351 263760 65756
13005 65756 261130 255821 253709 327956 197514 283311 50077 76890 133116 66177 269969
12994 269969 221321 364154 288040 203915 480775 375384 352413 461525 479262 523768 492134
12983 492134 577427 488668 513934 553557 549093 597245 441725 437752 306745 313395 265641 262303
12971B62303J4928l7606k6523R4391k43419M5183j3491n5554K2785O8064p3683
12960E7378m389j5326l0429M1431r0801J7358n6433m2976K60724K6935j36806
12949B6666J22571N469P7765j11578R5961J5205r8061Q1177J14604m1639p3542
12938B14598O8018k34152Q2107k0581J21435j35004O203J07223k08405J36175
12928A37617j03024n9306K4655R0397J65244p7225r6518K45707o5664M7250J53873
12917D63006j4280J07547K6704P024j03896K42321L2411J33226N562P1634j21470
12906H49789n8334j52848P1983R729j06906R1074n7822p7495j1002J47711J00243
12895H06122j2685N2860M1491J2837J30907n5074L05541J39198P9878J17287N2024
$$ plain form
12971 262303 277231 239625 213102 307493 64074 109257 95766 40212 62997 131061 57378
12960 57378 52989 37663 7234 48665 -42136 -24778 -81211 -124187 136537 163472 26666
12949 26666 149237 154706 232471 120893 216854 232059 133998 215175 329779 288140 214598
12938 214598 282616 48464 130571 109990 231425 96421 102624 209847 1442 137617
12928 137617 34593 -24713 -58 90339 255583 178358 81840 327547 261883 309133 463006
12917 463006 448726 556273 582977 590001 486105 728426 760837 894063 899625 971259 849789
12906 849789 791455 638607 710590 720319 613413 704487 646665 569170 558168 705879 806122
12895 806122 793437 846297 887788 900625 1031532 976458 1281999 1421197 1501075 1618362 1670386
12884A670386K57679J44892K00804J34578M27506L78396K21024L23158K74885
12875D033308K15021L15486K05483J09359Q1681j63685m1521j72200j97111r2424
12865D293397N239j8449O411k5494K33312J88423J16458K32355K18812J91140
12855E441604K55525L53634K22790L62419L60268K00663R2348L97911j21206n7028
12845G508928j31814j05389M995k48708j72920j68595k61028j57144l54545j93265
12835E720515k79396k15379l26558j32783j56179j60330k10238j23313j47446
12826C968893j37581P483p7761j96053J94545K71339R737j84386J1766o6770j97403
12815C603809q9670k09304l14577l20459l58956l18335n5127k09945l09475j03281
$$ plain form
12884 1670386 1928065 2072957 2273761 2408339 2835845 3214241 3435265 3758423 4033308
12875 4033308 4248329 4563815 4769298 4878657 4960338 4796653 4755132 4582932 4385821 4293397
12865 4293397 4298636 4280187 4286598 4261104 4494416 4682839 4799297 5031652 5250464 5441604
12855 5441604 5697129 6050763 6273553 6635972 6996240 7196903 7289251 7687162 7565956 7508928
12845 7508928 7377114 7271725 7276720 7028012 6855092 6686497 6425469 6268325 5913780 5720515
12835 5720515 5441119 5225740 4899182 4766399 4610220 4449890 4239652 4116339 3968893
12826 3968893 3831312 3838795 3761034 3564981 3759526 4030865 4040602 3856216 3867982 3801212 3603809
12815 3603809 3514139 3304835 2990258 2669799 2310843 1992508 1937381 1727436 1417961 1314680
12805A314680q8768j41873L7829j46826O9458j65724r1164j89277J87870j88743
12795E97462l5l417q5454K990m957l7900O2753l551m6341r2454J50093j49397
12783C89792M6934q9684n0719R3462m8461M9687l2602Q7835j71473k5005M4327
12772B94093J0744N0216j64418L7623J41848n1320o325o2233r629R553l4147L398
12760B19403J92549j79233J69604J6990r0673J52314j09903j6072J12429j46014
12750C21394J3912J48563N922k5342j04085j6272M1516R1907j3015K1475O897
12739D92872K8418r804O9605M2516j23957J01712j06167J29890O2321j9773L7791
12728G05424K6644j64525N7211r3197K22009j1057K5497j5719J51634j13777P7294
$$ plain form
12805 1314680 1225912 1084039 1121868 975042 1044500 878776 787612 598335 786205 597462
12795 597462 597427 594010 508556 511546 506589 468689 531442 527891 481550 389096 539189 389792
12783 389792 436726 347042 296323 389785 341324 391011 358409 446244 274771 249766 294093
12772 294093 304837 355053 190635 228258 370106 318786 312461 250228 240599 250152 216005 219403
12760 219403 411952 232719 402323 419313 328640 480954 371051 354979 467408 321394
12750 321394 335306 483869 489791 464449 360364 344092 385608 477515 464500 485975 492872
12739 492872 521290 511486 581091 623607 499650 601362 495195 625085 687406 667633 705424
12728 705424 732068 567543 624754 531557 753566 742509 768006 752287 903921 790144 867438
12717H67438j8634K6923J47242k6141J13709Q471j23358R8946j38046J52880l7678
12706A071752O0965n6759K43486m1306l4965m2477J83533j30512K79679l9785
12696A493611j10188J26750M738k8807p6027L02017N2835K8268L8976Q0332q7952
12685A824553L6970J15778J53336R0529l1817l9620K24564k1279K2797N9868J56233
12674B591912L5653q34p1980J44843J15987p743J29909J38886J98981J85022j54555
12663C306081K05078L9884L3881L03323k0670L34204J80906J94548K32833J99439
12653E009507K68110M49266R6987M00736M28427M17762K14728M50797K09756L25030
12643H271106M83609L47879L33964O15258K71029M16847M37919Q56194P68338
$$ plain form
12717 867438 848804 875727 1022969 996828 1110537 1119008 995650 1094596 956550 1109430 1071752
12706 1071752 1132717 1075958 1319444 1278138 1243173 1200696 1384229 1253717 1533396 1493611
12696 1493611 1383423 1510173 1514911 1486104 1410077 1712094 1764929 1793197 1832173 1912505 1824553
12685 1824553 1861523 1977301 2130637 2221166 2189349 2149729 2374293 2353014 2375811 2435679 2591912
12674 2591912 2627565 2626731 2554751 2699594 2815581 2807838 2937747 3076633 3275614 3460636 3306081
12663 3306081 3511159 3551043 3584924 3888247 3867577 4201781 4382687 4577235 4810068 5009507
12653 5009507 5277617 5726883 5823870 6224606 6653033 7070795 7285523 7736320 7946076 8271106
12643 8271106 8754715 9102594 9436558 10051816 10322845 10739692 11177611 12033805 12802143
12634A2802143J189227J017045J634394K329814L157394M685822N647212L953314
12626C6416365P32123n31768M84572K576667N208209P234839N175716j203610
12618E6093113n239519m804695l283025r15794R74433R27140j336761l223879
12610C9191013l116383k453689j754726r53811M8051P48097J653475K085324L239023
12601C8686374M658256O774775Q375829P596533O340802N497986M200684K154525
12593H4285764L722143R189102J4646023J3218231J435506j0315929j3193123
12586A02987717r989389n961763m251694l858220l526899m490960p021213q325813
12578E5561766p283945n557695l920891k776978j823899k78432j6607P02337K044060
$$ plain form
12634 12802143 13991370 15008415 16642809 18972623 22130017 26815839 32463051 36416365
12626 36416365 37148488 36616720 37101292 39677959 44886168 52121007 57296723 56093113
12618 56093113 50853594 46048899 42765874 41850080 42824513 43751653 42414892 39191013
12610 39191013 36074630 33620941 31866215 30912404 30960455 31708552 33362027 35447351 38686374
12601 38686374 43344630 50119405 58495234 66091767 72432569 77930555 82131239 84285764
12593 84285764 88007907 97197009 111843032 125061263 126496769 116180840 102987717
12586 102987717 92998328 87036565 82784871 78926651 75399752 70908792 63887579 55561766
12578 55561766 48277821 42720126 38799235 36022257 34198358 33919926 33903319 34605656 36649716
12569C6649716M146025O108642O680528L426418q15949j542984N26935L873209
12561E9052540P943806R211342L811539n471195q930712p573205m786319k018179
12553E1239617M8758j136828n043824o941870o156915n086779m271838l267930
12545A9382391k366935k018520j425621j160568r13056q22721o87245o05848m69653
12536H912224m23842m34307l06922l99197l47759k35759l95903o6371l45283r2352
12526E864529k54946r6919k15710r0305l07794M7232j11660k06844q3287j88768
12516D355528j43242j7437j82544j73053j13832p5134R3442k85357k5954l7216
12506C395201j31098q1384l9958r697M992l02333K2304j03528j77597J90372p45
$$ plain form
12569 36649716 40795741 46904383 53584911 57011329 56195380 54652396 55179331 59052540
12561 59052540 66996346 76207688 80019227 74548032 65617320 58044115 53257796 51239617
12553 51239617 51288375 50151547 45107723 38165853 32008938 26922159 22650321 19382391
12545 19382391 17015456 14996936 13571315 12410747 11497691 10674970 9987725 9381877 8912224
12536 8912224 8488382 8054075 7747153 7347956 7000197 6764438 6368535 6302164 5956881 5864529
12526 5864529 5609583 5512664 5296954 5206649 4898855 4946087 4834427 4627583 4544296 4355528
12516 4355528 4212286 4194849 4012305 3839252 3725420 3650286 3743728 3458371 3432417 3395201
12506 3395201 3264103 3182719 3142761 3133064 3138056 2835723 2858027 2754499 2576902 2767274 2766529
12495B766529r5908P1491l90090Q2568p6404R0368n9344j4919p3134P9776j83366
12484B197567J21281k33936j5386J99878o7040p9373j10467n3070O6803l9014
12474A987243R4925j01189o9299K1141n0248k1972j85529J77885j06389K6656
12464A773224N5861m67J10925k57897M5084R7996M815N0296q9897P7862o7864
12453A799938J0717K3783l8885j12786J52542k4596m9774J75949j5493m671l8811
12442A877913J8220K4769q3045K35828R6831j508r2561Q7378J07947l3795K18153
12431B456130j58001K32666j5106J14787K58370q4502J06001J98539R2933J78286
12421C380103J32144R4955J34655M15565J35270M18660L85404M43845P09626J128253
$$ plain form
12495 2766529 2670621 2742112 2352022 2434590 2358186 2448554 2389210 2374291 2301157 2380933 2197567
12484 2197567 2318848 2084912 2069526 2269404 2202364 2122991 2012524 1959454 2026257 1987243
12474 1987243 2082168 1980979 1911680 1932821 1882573 1860601 1675072 1852957 1746568 1773224
12464 1773224 1829085 1828618 1939543 1681646 1726730 1824726 1829541 1879837 1789940 1867802 1799938
12453 1799938 1810655 1834438 1795553 1682767 1835309 1810713 1760939 1936888 1921395 1916724 1877913
12442 1877913 1896133 1920902 1837857 2073685 2170516 2169008 2076447 2163825 2271772 2237977 2456130
12431 2456130 2298129 2530795 2515689 2630476 2888846 2804344 2910345 3108884 3201817 3380103
12421 3380103 3512247 3607202 3741857 4157422 4292692 4711352 5096756 5540601 6250227 7378480
12411G378480J443466K304281L871862M987431L076160j752955l955486l340945
12403A4012294k673252k096224j788014j094142o07879o63558l39304l91997j48052
12394D209872k41900k0660q7436l5894M6771j00314j6545l4253N5421R2587m8932
12383C818717J34340r6374Q3594j92893K00945N3231j15953L6770Q3143K41667
12373D247187j68776O3006M5411J62490p8843m9331K85791l4518R249J06902Q1352
12362D669920Q8188J68813R0820R1379J66268J88210j3240J39891j36931J83689
12352E637007K55386P4777L8348J73432j092K72468J31362J14946K20376P9113
12342F996123K37454J99779J60270K24020K56601Q8814K70131J83216J72192M18079
$$ plain form
12411 7378480 8821946 11126227 14998089 19985520 23061680 21308725 17353239 14012294
12403 14012294 11339042 9242818 7454804 6360662 5752783 5089225 4749921 4357924 4209872
12394 4209872 3967972 3947312 3859876 3823982 3870753 3770439 3753894 3719641 3775062 3867649 3818717
12383 3818717 3953057 3856683 3940277 3747384 3948329 4001560 3885607 3922377 4005520 4247187
12373 4247187 4078411 4141417 4186828 4349318 4270475 4221144 4506935 4472417 4481666 4588568 4669920
12362 4669920 4758108 4926921 5017741 5109120 5275388 5463598 5450358 5590249 5453318 5637007
12352 5637007 5892393 5967170 6005518 6178950 6177858 6450326 6581688 6696634 6917010 6996123
12342 6996123 7233577 7433356 7593626 7817646 8074247 8163061 8433192 8616408 8788600 9206679
12332I206679K16493J70581M84161K11978L45638M07810N54791N00415M50968
12323A2549514L38780O73622P90725M25900P79624R69367O97074J109211J116431
12314A9450248J032229J263732J227828J623711J656234J833942K047402K288353
12306C2423679K537803K927822L624828M437455N405640P315776R627972J3859584
12298H2160559K0024702K8163569L2991735K4636668L945381j1695278j2343009
12291A67884327n318187j2138l913731j2906117j6750039j4177296j0643782p083660
12283I7079377l416257Q18529N535732J0844060J6523827J8757935J2153760L791682
12275A62088645L607020J1782627K0728355J9109848K270437j4308658j6920318
$$ plain form
12332 9206679 9423172 9593753 10077914 10289892 10635530 11043340 11598131 12098546 12549514
12323 12549514 12888294 13561916 14352641 14778541 15558165 16527532 17224606 18333817 19450248
12314 19450248 20482477 21746209 22974037 24597748 26253982 28087924 30135326 32423679
12306 32423679 34961482 37889304 41514132 45951587 51357227 58673003 68300975 82160559
12298 82160559 102185261 130348830 163340565 187977233 191922614 180227336 167884327
12291 167884327 162566140 162554002 158640271 145734154 128984115 114806819 104163037 97079377
12283 97079377 93663120 94481649 100017381 110861441 127385268 146143203 158296963 162088645
12275 162088645 165695665 177478292 198206647 217316495 219586932 205278274 188357956
12268A88357956r548386J163358R833816J1144687K021718j2203444j8464703
12261A72305002j5044463q400382m262547p274824j2646794j4024280j1464697
12254I9187015q739573n531130k534509J580978O092002J0857872J1947305O521205
12246A19381165L45302J276848Q021551J4209200J2899786L59299j3521107k1479317
12238A21492727k1415902j8283137j4840090j1783439q771564o058042m676386
12231C5664167l662033k992438k405642j901624j529157j281812j034058j010410
12223A9846993r41103p86382r01995p52091m98739n83521o87101m02725n22220
12214A3771116m97226n27953n03019l44020o41342k54501l99913l06966m17369
$$ plain form
12268 188357956 178809570 179972928 189806744 200951431 202973149 190769705 172305002
12261 172305002 157260539 148860157 144597610 137322786 124675992 110651712 99187015
12254 99187015 90447442 84916312 82381803 83962781 90054783 100912655 112859960 119381165
12246 119381165 119726467 121003315 129024866 143234066 156133852 156493151 142972044 121492727
12238 121492727 100076825 81793688 66953598 55170159 46398595 40340553 35664167
12231 35664167 32002134 29009696 26604054 24702430 23173273 21891461 20857403 19846993
12223 19846993 18905890 18119508 17217513 16465422 15966683 15383162 14696061 14293336 13771116
12214 13771116 13273890 12745937 12242918 11898898 11257556 11003055 10603142 10296176 9878807
12205I878807j88341m53022l44720l38303j85856k52087j54078j98203l90390
12196G373807q3958l17112j34397Q2763j07798l41915j11560l65502r8236j49801
12186E746291k12445n1216j98372j19599n4973k42658j13486j35949j75637j02953
12176D339003J14832k31308r7986K9578k15511j6605m5013j48231j40939j19972
12166C467848R7636n9005j16928j09230j855q5622m6802j32653j46377J39306
12156C006318j70324J35880j21758r7505P1896J0946L1166l6750J19304j23428
12146B825745n4729N2743k10620p5552l3862M6305j66087L695j02233j30737k40871
12135A913797J26650j94532J0553p8298k4867K310l5332j6561j36333J53563O9778
$$ plain form
12205 9878807 9690466 9237444 8892724 8554421 8368565 8116478 7962400 7764197 7373807
12196 7373807 7289849 6972737 6838340 6921103 6813305 6471390 6359830 5994328 5896092 5746291
12186 5746291 5533846 5482630 5284258 5164659 5109686 4867028 4753542 4617593 4441956 4339003
12176 4339003 4453835 4222527 4124541 4154119 3938608 3922003 3876990 3728759 3587820 3467848
12166 3467848 3565484 3506479 3389551 3280321 3278466 3192844 3146042 3013389 2867012 3006318
12156 3006318 2835994 2971874 2850116 2752611 2824507 2835453 2866619 2829869 2949173 2825745
12146 2825745 2771016 2823759 2613139 2537587 2503725 2550030 2383943 2387638 2285405 2154668 1913797
12135 1913797 2040447 1845915 1856468 1778170 1753303 1755613 1720281 1703720 1567387 1720950 1790728
12124A790728q5353k3337j62650K126R9242r6458R5367K6648J23452N5489m3456
12113A781798J12185J22380K64144O3778J11606J26863j31506J39794R6040j19327
12103B567755j00968o1222j48798j79084j33308j78078j20464j96866N7417k61708
12093A244676J8739k35732R647p5386q6285O0460o3605k2813J35370k02835O2073
12082H44309M746j9299j63978m3056J26303j50680n0053J40017k9772k7139r9773
12071E31625l918J12333j81858J44312j77045R944K05036j30239N6247n4130K6352
12060E38659j10563K72303j50346K03725p591M2442n3527m6758J8764J01819o6464
12049G42463J42850J82521j3903R2014K74640J37064J22506K057M6650n171O8609
$$ plain form
12124 1790728 1705375 1682038 1519388 1521514 1620756 1524298 1619665 1646313 1769765 1825254 1781798
12113 1781798 1893983 2016363 2280507 2344285 2455891 2582754 2451248 2591042 2687082 2567755
12103 2567755 2466787 2405565 2256767 2077683 1944375 1766297 1645833 1448967 1506384 1244676
12093 1244676 1263415 1027683 1037330 961944 875659 936119 872514 849701 985071 782236 844309
12082 844309 849055 829756 665778 622722 749025 598345 548292 688309 658537 631398 531625
12071 531625 527707 640040 458182 602494 425449 435393 640429 510190 566437 512307 538659
12060 538659 428096 700399 550053 753778 746187 788629 735102 688344 707108 808927 742463
12049 742463 885313 1067834 1053931 1145945 1420585 1557649 1680155 1682212 1728862 1723691 1792300
12038A792300r9942K591k16243M3444j97958j80425j16622j10859j46759r8732
12028F70795j17670k4424k29065N4989j3048l8173j40021N4049R3258j77110j4983
12017A18597P5162o2537k7853K824k9223k7372k9865J08672p935j80456N6528
12006c458P8462N9098j05211N1583o5265o2452M3028j7326O3016m9192o3919j0728
11994h2364q7261K18813J4213J0626m8038J07700j06504J30067r4753n316L1996
11983H9179M4195q0101O5678r7052J29412j18114K5814J5135J31163J410K01894
11972D08613J5477J14498j01716J75164L4222J0329J09181j74275J99930j87030
11962F04393l7308k0920j77244m8497J22094q2259o882l1339K6215O3290J28946
$$ plain form
12038 1792300 1692358 1694949 1478706 1522150 1324192 1143767 1027145 916286 769527 670795
12028 670795 553125 528701 299636 354625 341577 303404 163383 217432 310690 133580 118597
12017 118597 193759 131222 103369 106193 76970 49598 19733 128405 120470 -59986 -3458
12006 -3458 75004 134102 28891 80474 15209 -47243 -4215 -21541 41475 -7717 -71636 -82364
11994 -82364 -169625 49188 63401 74027 25989 133689 27185 157252 62499 57183 89179
11983 89179 133374 53273 118951 21899 151311 33197 59011 74146 205309 206719 408613
11972 408613 424090 538588 436872 612036 646258 656587 765768 591493 791423 604393
11962 604393 567085 546165 368921 320424 442518 360259 353377 322038 348253 411543 540489
11951E40489J39363k916J1236P4987N1689J33391j4425j16224O7287O8850j51931
11940H01796Q3369J7471j13437p7449J20435j08647K3793j30451n8850r3197j79735
11929B85098N2844r3078j08620O1271Q4193j5600J525K39538J3623p9483N8744
11918E00055j72499K30674J3096P4j09901j46683L2203j47192m8373m1297o9836
11907D0321L4638j12504j1054J6118k18579J03080j90363J91752J914p8637O6029
11896a57285Q776J33756j01078O470j88259O8133j7319j30351J49641p9650Q2659
11885b24507j1850k0196L5391j5135K9293k49313J77575Q0514k59372J83644q9747
11874c63703J7893O7137Q0213N2143j26382j11757K2685J13982O202o0873K1828
$$ plain form
11951 540489 679852 676936 688172 763159 814848 948239 933814 817590 884877 953727 801796
11940 801796 885165 902636 789199 711750 832185 723538 747331 616880 558030 464833 285098
11929 285098 337942 244864 136244 197515 281708 266108 267633 507171 520794 441311 500055
11918 500055 327556 558230 571326 571400 461499 314816 347019 199827 151454 110157 40321
11907 40321 74959 -37545 -48599 -32481 -251060 -147980 -338343 -146591 -144677 -223314 -157285
11896 -157285 -148509 -14753 -115831 -109361 -297620 -229487 -246806 -377157 -227516 -307166 -224507
11885 -224507 -236357 -256553 -221162 -236297 -207004 -456317 -278742 -198228 -457600 -273956 -363703
11874 -363703 -345810 -278673 -198460 -146317 -272699 -384456 -361771 -247789 -241587 -302460 -280632
11863b80632j08808J8450P2737M5644L7286q1304j6172j8384N9195n3944M7394
11852b78538j14663J02220n0240p350K1348q974M3149n4570J58981K4357j55173
11841c19453Q4161r5874J46667j72690J39696j48275j5043l0769Q3520k9425k2603
11830c80088K58032k24629j24336J70163m8366l4491J6451R9514j11982M8007
11820c31725L6301q0501K8689k1607n0242L9853k3836j6515R1245j46126J68994
11809c05470p5194R7511k2152j9647l4257j854K8041l2094k1316Q8278j25739
11798d23893k23J81931j78328N8022m8137P013R9112r9753Q5514p24J8037R697
11786b91732n7323p7990L6538J19624j35751Q5400m338j21587J92891n0599p3893
$$ plain form
11863 -280632 -389440 -370990 -298253 -252609 -215323 -296627 -312799 -331183 -271988 -325932 -278538
11852 -278538 -393201 -290981 -341221 -348571 -327223 -336197 -293048 -347618 -188637 -164280 -319453
11841 -319453 -235292 -331166 -184499 -357189 -217493 -365768 -380811 -411580 -328060 -357485 -380088
11830 -380088 -122056 -346685 -471021 -300858 -349224 -383715 -367264 -267750 -379732 -331725
11820 -331725 -295424 -375925 -347236 -368843 -419085 -379232 -403068 -419583 -328338 -474464 -305470
11809 -305470 -380664 -283153 -305305 -324952 -359209 -361063 -333022 -365116 -386432 -298154 -423893
11798 -423893 -424116 -242185 -420513 -362491 -410628 -403615 -304503 -404256 -318742 -319466 -301429 -291732
11786 -291732 -349055 -427045 -390507 -270883 -406634 -321234 -325572 -447159 -254268 -304867 -378760
11775c78760J41409r1968q583j6127p349R3527p1674q7341J52919j84685K77581
11764a81051j65909K3690j22762N2788J01036j2409L1201p1693n8594O9310K3501
11753c10892O2383L9736r1637l9250j0552j6056M274J45010j16680k6086L786
11742c55964j33938J41873j5560J28142p2594O850n2615l1963k2668m7198M8031
11731d07604O727J21011j93440J10843O5470l3606r3136M897R8366L4670j01457
11720c87259P4474j28838K9542Q184Q7542j10877p7398K71847k1278o1860m6888
11709c62809j9869k6659J09770k1743j51862J32028J0864m9678M903q9752Q8955
11698c75852Q5957q7379q6845N7772J4777l5689L3970N3511j21232n5752Q9661
$$ plain form
11775 -378760 -237351 -329319 -337902 -354029 -361378 -267851 -339525 -426866 -273947 -458632 -181051
11764 -181051 -346960 -323270 -446032 -393244 -292208 -304617 -273416 -345109 -403703 -334393 -310892
11753 -310892 -248509 -208773 -300410 -339660 -350212 -366268 -361994 -216984 -333664 -359750 -355964
11742 -355964 -489902 -348029 -363589 -235447 -308041 -301191 -353806 -385769 -408437 -455635 -407604
11731 -407604 -400877 -279866 -473306 -362463 -296993 -330599 -423735 -418838 -320472 -285802 -387259
11720 -387259 -312785 -441623 -412081 -403897 -316355 -427232 -504630 -232783 -254061 -315921 -362809
11709 -362809 -382678 -409337 -299567 -321310 -473172 -341144 -330280 -379958 -375055 -464807 -375852
11698 -375852 -289895 -377274 -464119 -406347 -391570 -427259 -393289 -339778 -461010 -516762 -427101
11687d27101M168J753K04353k22536L3363n546Q174J13564j83576N180P8071L9037
11675c51096q6357M3879m6328J39719q5491O8047k6208R4981p1065j17840K08924
11664b28835j43215L4509j18380R3619M1134K5240p0122l1508o3313J32961j05282
11653d33192j1563L7911Q838O4691m4569K62476l37394n4744O9983Q8581k4587
11642c73569K9283k0710O8375p5113m7352J11263q0043k9667J52225j81006n7479
11631e03793J56592j0710L3758k4866Q2223j94980r69J76108k27348J88601j09412
11620d34796P0706Q6268p4651l484K1225P6179O6210r4747j07908O3406R4182
11609b37410j12847o7583J12084P2656j71929J00302m0875M6475q5652J7435L8315
$$ plain form
11687 -427101 -422933 -421180 -216827 -439363 -406000 -411546 -403372 -289808 -473384 -468204 -390133 -351096
11675 -351096 -437453 -393574 -439902 -300183 -385674 -317627 -343835 -248854 -319919 -437759 -228835
11664 -228835 -372050 -337541 -455921 -362302 -321168 -295928 -366050 -397558 -460871 -327910 -433192
11653 -433192 -444755 -406844 -398006 -333315 -377884 -115408 -452802 -507546 -437563 -348982 -373569
11642 -373569 -344286 -364996 -296621 -371734 -419086 -307823 -387866 -417533 -265308 -446314 -503793
11631 -503793 -347201 -357911 -324153 -349019 -266796 -461776 -462745 -286637 -513985 -325384 -434796
11620 -434796 -364090 -277822 -352473 -355957 -334732 -258553 -192343 -287090 -394998 -331592 -237410
11609 -237410 -350257 -417840 -305756 -233100 -405029 -304727 -345602 -299127 -384779 -367344 -329029
11598c29029j2340j2745q4635J38467K469j50418R053j3110J27187j45319J78291
11587b92129j52994Q3912P3480j78082O3804M3643J18683k9079j57724J13235
11577c13251l183p695R5482j49380q4729M5546n4065L5115J15109l6085L2846
11566c24290p6963o6812P8231J1970J8420m951l6569Q0584j89932J52798K6453
11555c31061k4350L873m6880n7872R6417Q9090k14357J81308N381j29149j5142
11544d42742M1877M657J37889p6925M048L4811j1900k5985n4374r7480J22179
11533c63945Q8045r2819J88304j93785j6644j31065L84712j99055L7507q2538
11523c81283K6589o0735J74264j60381Q6379M5246Q0694j51013o0975L0348n4252
$$ plain form
11598 -329029 -341369 -354114 -438749 -300282 -297813 -448231 -439178 -452288 -325101 -470420 -292129
11587 -292129 -445123 -361211 -287731 -465813 -402009 -358366 -239683 -268762 -426486 -313251
11577 -313251 -316434 -324129 -228647 -378027 -462756 -417210 -471275 -436160 -321051 -357136 -324290
11566 -324290 -401253 -468065 -389834 -377864 -359444 -364395 -400964 -320380 -510312 -357514 -331061
11555 -331061 -355411 -351538 -398418 -456290 -359873 -270783 -485140 -303832 -298451 -427600 -442742
11544 -442742 -400865 -396208 -258319 -335244 -331196 -296385 -308285 -334270 -388644 -486124 -363945
11533 -363945 -275900 -368719 -180415 -374200 -390844 -521909 -137197 -336252 -298745 -381283
11523 -381283 -354694 -415429 -241165 -401546 -315167 -269921 -189227 -340240 -401215 -370867 -425119
11512d25119J09043l2568K3893N2967k7303l5733J2872M8697k4776n3054K9399
11501c21682Q9271j45709k1550J08189m4289m3908n8612R5914o9007J73079j93855
11490d32159K85379j21017j64363R1479p6217L7510J48399q1648k85j23565J07708
11479c28779Q3476q3134l8468J23074j72542P4940P2318o9066j40806P6495N8864
11468c43628l7639n9035R8983M9079q1524q0153Q9709l0174k1355J79154q0161
11457c16744k728N4270k9212p8270N2771q2773J47819L7336j48485K1689J7585
11446c26742N513q3351L0065r6470M4228J5782J75138j07632K7700m5971Q1801
11435b79939J8441J06680k32078k4215K7903q2881J16199J02835j34775L2988
$$ plain form
11512 -425119 -316076 -348644 -324751 -271784 -299087 -334820 -321948 -273251 -298027 -351081 -321682
11501 -321682 -232411 -378120 -399670 -291481 -335770 -379678 -438290 -342376 -411383 -238304 -432159
11490 -432159 -146780 -267797 -432160 -340681 -416898 -379388 -230989 -312637 -312922 -436487 -328779
11479 -328779 -245303 -328437 -366905 -243831 -416373 -341433 -269115 -338181 -478987 -402492 -343628
11468 -343628 -381267 -440302 -341319 -292240 -373764 -453917 -364208 -394382 -415737 -236583 -316744
11457 -316744 -319472 -265202 -294414 -372684 -319913 -402686 -254867 -217531 -366016 -344327 -326742
11446 -326742 -321229 -404580 -374515 -470985 -426757 -410975 -235837 -343469 -315769 -361740 -279939
11435 -279939 -261498 -154818 -386896 -411111 -383208 -466089 -349890 -247055 -381830 -348842
11425c48842J15264j2685M2810j32235J2922N3740P254n2543o3031J9341L3683
11414c24322L8616j57749K04650m7396J24667j66464n569Q7429k1767l6747l2770
11403c37422L2014j38262O9078J02314p0614N9667o2910J0213J04807J1170j84484
11392d04429R1407o3232K0905N6700K881k6965r7088P2526O7873R2580o4777j03686
11380c55305j12200J70321R4418k13919J25243j00094R442J41744l5165k9745
11370c05260l4255P8513P677j741q4349Q6819p9715J21324j46877J39215r2616
11359c11265m410j2129J11401j02320p866R1899N7811j30238K00288k12809O1660
11348b57978O3142j46716J29262r967p8773J1669N8523N6062j27033k3115L0025
$$ plain form
11425 -348842 -233578 -246263 -203453 -335688 -322766 -269026 -261772 -314315 -377346 -358005 -324322
11414 -324322 -285706 -443455 -238805 -286201 -161534 -327998 -333567 -246138 -267905 -304652 -337422
11403 -337422 -305408 -443670 -374592 -272278 -342892 -283225 -346135 -335922 -231115 -219945 -404429
11392 -404429 -313022 -376254 -355349 -298649 -295768 -322733 -419821 -347295 -279422 -186842 -251619 -355305
11380 -355305 -467505 -297184 -202766 -416685 -291442 -391536 -382094 -240350 -275515 -305260
11370 -305260 -339515 -261002 -253325 -255066 -339415 -252596 -332311 -210987 -357864 -218649 -311265
11359 -311265 -315675 -327804 -216403 -318723 -326589 -234690 -176879 -307117 -106829 -319638 -257978
11348 -257978 -194836 -341552 -212290 -222257 -301030 -289361 -230838 -174776 -301809 -324924 -294899
11337b94899n9628R6746r6833J02722j09491J22972J20976k50235J81662l6081
11327b22089l3983L5772r8809P3391P0955j05861J9304M2353O3529q2510N405
11316b32543Q0804j15480Q914o5900k4139J08919l8966l9528j2705q8658P2906
11305c46376L617P9730L2308j07678K0562J28692q6869J30853q4892j3562j05049
11294c48664L6895j6982K7062M6590R920r8362K25763j25212j9223M0332k9576
11283b51457L4915k7068k5242P2776j35764K00741j71182K5475J15413m2659j24088
11272c28140J10451j46851J94500m9223M5735j86329M0562P0786m4634Q8168L0086
11261a74889j05437n3661J63544K6469j01822P2093l2548l459R9384n2526p4981
$$ plain form
11337 -294899 -354527 -257781 -354614 -251892 -361383 -238411 -117435 -367670 -186008 -222089
11327 -222089 -256072 -220300 -319109 -245718 -174763 -280624 -261320 -218967 -155438 -237948 -232543
11316 -232543 -151739 -267219 -258305 -324205 -348344 -239425 -278391 -317919 -330624 -419282 -346376
11305 -346376 -342759 -263029 -230721 -338399 -317837 -189145 -276014 -145161 -230053 -243615 -348664
11294 -348664 -311769 -328751 -301689 -255099 -245179 -343541 -117778 -242990 -262213 -221881 -251457
11283 -251457 -216542 -243610 -268852 -196076 -331840 -131099 -302281 -276806 -161393 -204052 -328140
11272 -328140 -217689 -364540 -170040 -219263 -173528 -359857 -319295 -248509 -293143 -204975 -174889
11261 -174889 -280326 -333987 -170443 -143974 -245796 -173703 -206251 -209710 -110326 -162852 -237833
11250b37833Q6539j62581J85819q9235m232Q0848p9774p0770M6823K3214l8671
11239b59853N7828K4390j2917O9491k03944J05517R4280o7903q6427N0734k8285
11228b57089L1628M509m0486J00502M6201R208p738n3745N3346o6978R5527J1643
11216g3472j31613R4473j01128j7688n7114K0R1560J6472J6582n4123L1444J13089
11204g1498l3913R541j31956J92749l61573K09237P9387j51663R4976J17420l3744
11193h1037l3141n7774Q2470m3583J9363n8313O5161j0287l0185P3135k1718r6768
11181a92677J20304k3266j31099J86038j85906J47800j7890r3996O1524P4866
11171e4302j54843L9331K25395l31925J46050o4457M8368M0811k924Q5374m5485
$$ plain form
11250 -237833 -151294 -313875 -128056 -217291 -221523 -140675 -220449 -291219 -244396 -221182 -259853
11239 -259853 -202025 -177635 -190552 -121061 -325005 -219488 -125208 -193111 -279538 -228804 -257089
11228 -257089 -225461 -220952 -261438 -160936 -114735 -105527 -113265 -167010 -113664 -180642 -85115 -73472
11216 -73472 -205085 -110612 -211740 -229428 -286542 -286522 -194962 -178490 -161908 -216031 -184587 -71498
11204 -71498 -105411 -95870 -227826 -35077 -396650 -187413 -108026 -259689 -164713 -47293 -81037
11193 -81037 -114178 -171952 -89482 -133065 -113702 -172015 -106854 -117141 -147326 -74191 -95909 -192677
11181 -192677 -72373 -95639 -226738 -40700 -226606 -78806 -96696 -190692 -129168 -54302
11171 -54302 -209145 -169814 55581 -276344 -130294 -194751 -146383 -105572 -108496 -23122 -68607
11160f8607P7478p8246j41393N6861M589J49455m8294k6123n1645K8078j02382
11149b00229J97407J8637O038j5136K8970m7977n9724n5878R2372j27618J43516
11138a9622J0475k58676K15524r0547K1602r367J25091p0711p1369J13719K0276
11127a3605j8233o0621N6456M2072P0050q1305o3829n4491J09253R0430k24327
11116a48150N9828q5889J49439n8363m719O5882o5404N2726Q5288q4253J0424
11105b3191M1131M5445j65649l0775J95956j8545j85506N1160J09368L7314J5985
11094G2693o3572m3495n3800J19963Q847j91583J57911j62197J38916o9598Q3737
11083b178O758k04315J83740O8229m853K6365K6955j08277Q4918j36985J60885
$$ plain form
11160 -68607 8871 -69375 -210768 -153907 -149318 137 -48157 -74280 -125925 -97847 -200229
11149 -200229 -2822 15815 21853 6717 35687 -12290 -72014 -127892 -35520 -163138 -19622
11138 -19622 -9147 -267823 -52299 -142846 -121244 -130611 -5520 -76231 -147600 -33881 -13605
11127 -13605 -31838 -92459 -36003 6069 76119 -5186 -69015 -123506 -14253 76177 -148150
11116 -148150 -88322 -174211 -24772 -83135 -87854 -21972 -87376 -34650 50638 -33615 -23191
11105 -23191 17940 63385 -102264 -133039 62917 44372 -141134 -89974 19394 56708 72693
11094 72693 9121 -34374 -88174 31789 40636 -150947 6964 -155233 -16317 -85915 -2178
11083 -2178 4580 -199735 -15995 52234 47381 73746 100701 -7576 77342 -59643 101242
11072A01242j87982J49581R7535Q1945k84251R4203j960O9102j06799J19870j18590
11061A3896K62718k70912J09395J51704k08025R5107N5542j06455P1412o2879
11051A11503R0484M8512j89221K8149J12600j49172J51678j30797N4167k2092
11041A05811L9680J0840J80775k52832j7733O9337O9039n0572n7195J04166r2021
11030A09295J54118n8883L1226q3750P7357k10598N1929J52370o8070o1350M3705
11019A37349q1644O72O0443j17820J94610R2453L9090p3203j6859J909n759r0693
11007A40548R0262J23462j48133o25k8931R8345r3335J09334j25563J30166q9635
10996B05895J52110j7272r158k02167J21199J84730j06654P3580r3521p0280J34861
$$ plain form
11072 101242 -86740 62841 160376 242321 -41930 52273 50313 119415 12616 132486 13896
11061 13896 276614 5702 115097 266801 58776 153883 209425 102970 174382 111503
11051 111503 201987 250499 61278 89427 202027 52855 204533 73736 127903 105811
11041 105811 145491 156331 337106 84274 66541 135878 204917 154345 97150 201316 109295
11030 109295 263413 204530 235756 152006 229363 18765 70694 223064 154994 93644 137349
11019 137349 55705 56377 116820 -1000 193610 286063 325153 251950 235091 237000 231241 140548
11007 140548 230810 354272 206139 205514 176583 274928 181593 290927 165364 295530 205895
10996 205895 358005 340733 331575 129408 250607 435337 328683 402263 308742 238462 373323
10985C73323q6546J12392p3210K2552l5435K508J10932l9113m1658M3539J4017
10974D03301k56J46514k24385L0314L2328J16480j17307o5276R1098K5356Q2736
10963E20903o254j51454K37558r3231l9083m8035l3357P9041l1444k5259O2268
10952D71653J03895j0532j2747O6997M2719j36657k7929k8364p5686J77745q3642
10941D87452N8839p0955J10755P4439j45821N1167j10391J42231m2815J77548
10931G32449k20804J89673j30254R1275l2175J03733j96467R0214K5655j9804
10921F33495J16219l6517j6268L0802q1995P6013J00263n6877j57522J16558M5350
10910G69521N1337l0206r19J6644Q5004j61082J17993n8798J0155n518o9094P2889
$$ plain form
10985 373323 286777 399169 325959 348511 313076 315584 426516 387403 345745 389284 403301
10974 403301 403045 549559 325174 355488 387816 504296 386989 321713 412811 438167 520903
10963 520903 514649 363195 600753 507522 468439 420404 387047 466088 434644 409385 471653
10952 471653 575548 565016 552269 619266 661985 525328 497399 469035 393349 571094 487452
10941 487452 546291 475336 586091 660530 514709 565876 455485 597716 554901 732449
10931 732449 511645 701318 571064 662339 630164 733897 537430 627644 653299 633495
10921 633495 749714 713197 696929 727731 645736 721749 822012 765135 607613 724171 769521
10910 769521 820858 790652 789733 806377 891381 730299 848292 789494 799649 794131 725037 797926
10898G97926j30727J08839M8084r789J274P487L1850j6238j06982J04716M379
10887H40819p158P3740O2720N7806j78550P4178K20644j48793r7312L4007R9185
10876A031286j7096m518R2487J5190k4561l7517O2101j03873J50216n7811N4432
10865A160336j41766K85725k12094J35869n1605k6061m4303k7285Q097K09023
10855A295936L0513p9819J5854Q2308O5188k33534K03453j40659J01706p4561
10845A266385J44066j56633N2371n1695J00746L0128L0940M1607K4509k09006
10835A273418J53152R0606m4226J09222O9028k18888P876P8742M0842p5686J08584
10824A592670k2049J01900m5771K63047k55181r8965J26552n8743N2753J30461
$$ plain form
10898 797926 667199 776038 824122 814333 815607 823094 854944 838706 731724 836440 840819
10887 840819 833661 907401 970121 1027927 849377 923555 1144199 995406 898094 932101 1031286
10876 1031286 1014190 1009672 1102159 1117349 1092788 1055271 1117372 1013499 1163715 1105904 1160336
10865 1160336 1018570 1304295 1092201 1228070 1176465 1150404 1106101 1078816 1086913 1295936
10855 1295936 1326449 1246630 1262484 1344792 1409980 1176446 1379899 1239240 1340946 1266385
10845 1266385 1410451 1253818 1306189 1254494 1355240 1385368 1416308 1457915 1482424 1273418
10835 1273418 1426570 1517176 1472950 1582172 1651200 1432312 1440188 1518930 1559772 1484086 1592670
10824 1592670 1570621 1672521 1626750 1889797 1634616 1535651 1662203 1603460 1656213 1786674
10814A786674k0695q043m6819J54057M943j64748j8430J31599K62709k05063k5572
10803A850612M4359O73P4928Q8437l2562p9069j5109K06785r9961R9779J05358
10792B244230k3669K3324j92413K25651o4550N8586J07785j87782J70289p6854
10782B284597J39711j9701M5255p0545J06544J26771o0013m6976Q8007j23144
10772B470506J75691k1851K2903n3537J6824J38957M3495j2259O0805j91450J42996
10761B793080M656O7655J08246J42978j18862l038o1972Q9442Q8066j6834r915
10750C083502N0448m859J27481R2384n8037J94100q4249k5179K9761Q9999L8674
10739C534025n4747o021M3354P6326Q5441j30363J21693K06533j98641l6845K30814
$$ plain form
10814 1786674 1765979 1757936 1711117 1865174 1870117 1705369 1686939 1818538 2081247 1876184 1850612
10803 1850612 1894971 1895644 1970572 2059009 2026447 1947378 1932269 2139054 2039093 2138872 2244230
10792 2244230 2220561 2243885 2051472 2277123 2212573 2271159 2378944 2191162 2361451 2284597
10782 2284597 2424308 2404607 2449862 2379317 2485861 2612632 2552619 2505643 2593650 2470506
10772 2470506 2646197 2624346 2647249 2593712 2610536 2749493 2792988 2780729 2841534 2650084 2793080
10761 2793080 2797736 2865391 2973637 3116615 2997753 2994715 2932743 3022185 3110251 3093417 3083502
10750 3083502 3133950 3129091 3256572 3348956 3290919 3485019 3400770 3375591 3405352 3495351 3534025
10739 3534025 3479278 3473257 3516611 3592937 3678378 3548015 3669708 3876241 3677600 3640755 3871569
10728C871569j04474J96772p656R4101j45308J32462Q6236j8555Q9325J00408
10718D294880q4515k022J62293J06563L3489M7774l921Q8933m2549O5369Q9384
10707D755678j7923K58270j23995o6660J42933k2086J32494M4134k6292J96187
10697E272740K6825P3941K5694O3980j1375K13813q230J44937N97j35966K42160
10686E909116J5788N7007O5025l793R9823N6772O3236J31842N0172P2052O1224
10675F578264j2222P6385K77964j02176K02396P2241l7634l7776J27782R5764
10665G240988R9824O2074J04861J21220J23533L8036J49453R6566J8618j4443
10655H040730J76848J97947o4072J44703N8776J70974L6821Q8503L8649J73146
$$ plain form
10728 3871569 3767095 3963867 3956211 4050312 3905004 4037466 4123702 4105147 4194472 4294880
10718 4294880 4210365 4208343 4370636 4477199 4510688 4558462 4554541 4643474 4600925 4666294 4755678
10707 4755678 4737755 4996025 4872030 4805370 4948303 4926217 5058711 5102845 5076553 5272740
10697 5272740 5299565 5373506 5399200 5463180 5451805 5665618 5657388 5802325 5802922 5666956 5909116
10686 5909116 5924904 5981911 6046936 6043143 6142966 6199738 6262974 6394816 6444988 6517040 6578264
10675 6578264 6566042 6642427 6920391 6818215 7020611 7092852 7055218 7017442 7145224 7240988
10665 7240988 7340812 7402886 7507747 7628967 7752500 7790536 7939989 8036555 8055173 8040730
10655 8040730 8217578 8415525 8351453 8496156 8554932 8725906 8762727 8851230 8889879 9063025
10645I063025J85496R8587Q2440J33368J33364Q8221Q0190P9388P8830J73856
10635A0196765L01215Q4115M9122K6202K03859K00341k9767J80770K76660j07379
10625A1381903L79356M23K55851J4965K19845J48468o083L06153K76821O0199
10615A3037901K12650J48436K54695O8810K59669K70494K74511J94673m4258K84458
10605A4962039K3625L47615J81757K79192J55175K43557O8696L50717K40039J93386
10595A7045798L73856N3463L58495K06706J46704K91971J22023N25548K67828
10586A9392392K38111K11677M51883J51363L80256L05624M37176J95491L86065
10577B2150038L98473K48975L96332K98577K23878M24455J99125M97721M19509
$$ plain form
10645 9063025 9248521 9347108 9429548 9562916 9696280 9784501 9864691 9944079 10022909 10196765
10635 10196765 10497980 10582095 10631217 10657419 10861278 11061619 11031852 11212622 11489282 11381903
10625 11381903 11761259 11761682 12017533 12032498 12252343 12400811 12394728 12700881 12977702 13037901
10615 13037901 13250551 13398987 13653682 13722492 13982161 14252655 14527166 14721839 14677581 14962039
10605 14962039 14985664 15333279 15515036 15794228 15949403 16192960 16261656 16612373 16852412 17045798
10595 17045798 17419654 17473117 17831612 18038318 18185022 18476993 18599016 19124564 19392392
10586 19392392 19630503 19842180 20294063 20445426 20825682 21131306 21568482 21763973 22150038
10577 22150038 22548511 22797486 23193818 23492395 23716273 24140728 24339853 24837574 25257083
10568B5257083M18845L43105L84431M60411N49876K48547M93725M49145M22193
10559B9027361N17450N24600M30564O38691M18604N50806N98538M77823O34287
10550C3818724P74982N10125O43836N75366P66186O74183O37413P26231O86499
10541C9813545O80494P00819Q36502P40440P69577P76779R00691Q79873Q55415
10532D6954135R50993R22269R43010R97276J018633J109254J023940J050801J095690
10523E6066001J133243J255551J126631J272004J270211J404377J283988J454029
10515F6266035J391121J621177J629462J431548J773413J591663K013322J733797
10507G9451538J717140K040712J973494K252940K196864K297285K248204K280115
$$ plain form
10568 25257083 25675928 26019033 26403464 26863875 27413751 27662298 28156023 28605168 29027361
10559 29027361 29544811 30069411 30499975 31138666 31557270 32108076 32706614 33184437 33818724
10550 33818724 34593706 35103831 35747667 36323033 37089219 37763402 38400815 39127046 39813545
10541 39813545 40494039 41194858 42031360 42771800 43541377 44318156 45218847 46098720 46954135
10532 46954135 47905128 48827397 49770407 50767683 51786316 52895570 53919510 54970311 56066001
10523 56066001 57199244 58454795 59581426 60853430 62123641 63528018 64812006 66266035
10515 66266035 67657156 69278333 70907795 72339343 74112756 75704419 77717741 79451538
10507 79451538 81168678 83209390 85182884 87435824 89632688 91929973 94178177 96458292
10499I6458292K584386K599915K726861K645090L016289K958652L267952L287008
10491A19544445L396047L590679L727795L602830M249441M308898M294172M514834
10483A51229141M719963N022569N114505N243880N666612N781893N942359O453091
10475A95174013O416145O775495O955079P320858P548423P767753Q008891Q460712
10467B54427369Q663693Q880763Q983031R259159R533241R592038J0059916R821026
10459C29220236J0043631J0053847J0026786R749944R638424R372070R065163
10452C97170101Q679000Q048618P507827O632567N901066N224614L865269K972385
10444D46001447K079635Q83644k29990j520574k549008l641578m528801n450323
$$ plain form
10499 96458292 99042678 101642593 104369454 107014544 110030833 112989485 116257437 119544445
10491 119544445 122940492 126531171 130258966 133861796 138111237 142420135 146714307 151229141
10483 151229141 155949104 160971673 166086178 171330058 176996670 182778563 188720922 195174013
10475 195174013 201590158 208365653 215320732 222641590 230190013 237957766 245966657 254427369
10467 254427369 263091062 271971825 280954856 290214015 299747256 309339294 319399210 329220236
10459 329220236 339263867 349317714 359344500 369094444 378732868 388104938 397170101
10452 397170101 405849101 413897719 421405546 428038113 433939179 439163793 443029062 446001447
10444 446001447 448081082 448964726 448734736 447214162 444665154 441023576 436494775 431044452
10436D31044452o460279p184106p805818q455798q855036r374317r466455r853386
10428C63589257r960618r874017r832950r888742r841557r498002r302009r289071
10420B86102291r133186q662270q446265q174724p788984p675874p218635p241065
10412B21761288o977000o538636o739032o141648n917531n729973n500703n397454
10404A72819311n054476m895734m832015m711409m462628m272514m283381m008695
10396A36298459l777292l698671l577854l320877l377465l026287k984530l039584
10388A09495899k866800k480764k584660k437146k407669k336058k198600k052263
10380I0131939k223249j904530j897992j732777j913277j541774j604741j614900
$$ plain form
10436 431044452 424584173 417400067 409594249 401138451 392283415 382909098 373442643 363589257
10428 363589257 353628639 343754622 333921672 324032930 314191373 304693371 295391362 286102291
10420 286102291 276969105 268306835 259860570 251685846 243896862 236220988 229002353 221761288
10412 221761288 214784288 208245652 201506620 195364972 189447441 183717468 178216765 172819311
10404 172819311 167764835 162869101 158037086 153325677 148863049 144590535 140307154 136298459
10396 136298459 132521167 128822496 125244642 121923765 118546300 115520013 112535483 109495899
10388 109495899 106629099 104148335 101563675 99126529 96718860 94382802 92184202 90131939
10380 90131939 87908690 86004160 84106168 82373391 80460114 78918340 77313599 75698699
10372G5698699j487725j264089j543338j264226j296006j094219j209155q99583
10364F5640358j105658r71805j091768j074242r80548j205524r44717j043640
10356E7222456j079407q62277j016098p84275r33402q92654r46591j076034j035618
10347D8596100r41786r42742r55708q94375p38055q34106p74810o79619o73940
10338D1160959o66223o54302o23932m97855n91871m96837p56938l25076o63592
10329C5884333l24120o32898l44062l36785n81991l55711l94230l05863m97693
10320C2110980l13992m80426m66188k1565m54866k27817l09041l13526j78176
10311B9345383l36270k71770k17779k90694j11115j96325j74897p2254k03223
$$ plain form
10372 75698699 74210974 72946885 71403547 70139321 68843315 67749096 66539941 65640358
10364 65640358 64534700 63562895 62471127 61396885 60416337 59210813 58266096 57222456
10356 57222456 56143049 55280772 54264674 53480399 52546997 51654343 50707752 49631718 48596100
10347 48596100 47654314 46711572 45755864 44861489 44123434 43289328 42514518 41834899 41160959
10338 41160959 40494736 39840434 39216502 38718647 38126776 37629939 36873001 36547925 35884333
10329 35884333 35560213 34927315 34583253 34246468 33664477 33308766 32914536 32608673 32110980
10320 32110980 31796988 31316562 30850374 30828809 30373943 30146126 29837085 29523559 29345383
10311 29345383 29009113 28737343 28519564 28228870 28117755 27921430 27746533 27674279 27471056
10302B7471056l47588P3885j53284q5997j48129j63940l6946j19561k7118K9283
10292B6491661J5794j8785O1320l7332Q0833L0320M0674K09972k7601K59516M8057
10281B7154429J32573K38057L51930K71143M92111K40213L89341N26502M61043
10272C0257342N34877N37289N96441P86308R20194Q76211R73951J096966J235272
10263C7814851J402713J466135J953978J763821K366281K180682K833784L021554
10255E4803799L587651L787846M409528N124477N926408O548821P264302Q115434
10247I9568266Q576055Q737044Q307828P209582N854650M220745K384540J467349
10239A46326059N71744M07210O48183J024390J919013K297898L206470L732519
$$ plain form
10302 27471056 27123468 27197353 27044069 26958072 26809943 26646003 26609057 26489496 26462378 26491661
10292 26491661 26507455 26488670 26549990 26512658 26593491 26623811 26664485 26874457 26846856 27106372 27154429
10281 27154429 27287002 27525059 27876989 28148132 28640243 28880456 29269797 29796299 30257342
10272 30257342 30792219 31329508 31925949 32712257 33632451 34508662 35482613 36579579 37814851
10263 37814851 39217564 40683699 42637677 44401498 46767779 48948461 51782245 54803799
10255 54803799 58391450 62179296 66588824 71713301 77639709 84188530 91452832 99568266
10247 99568266 108144321 116881365 125189193 132398775 138253425 142474170 144858710 146326059
10239 146326059 146897803 147305013 147953196 148977586 150896599 153194497 156400967 160133486
10231A60133486M412818M687012M753187M600998L747810K978612J851945R72478
10223A88138346J57123o56231j376352k382089l138144l987341m745444m498536
10215A67511332m538826m112603l513195k869960k230351j561646o88876m09651
10207A47586224k35621o62127j698605l207191m954529o785964q284930q881897
10199A12875360r156162q719422q534421p634057o635790o090004n376021m586757
10191E6142726m064859l598799k933485k632848k519644j996152k047009j597477
10183C4752453j610792j528853j245296j190376j082406r47717r24130r86119
10175B5236764p73830o39662p75681o75166o83781o01264n34163n82391l12816
$$ plain form
10231 160133486 164546304 169233316 173986503 178587501 182335311 185313923 187165868 188138346
10223 188138346 188295469 187639238 186262886 183880797 180742653 176755312 172009868 167511332
10215 167511332 162972506 158859903 155346708 152476748 150246397 148684751 147995875 147586224
10207 147586224 147350603 146688476 144989871 141782680 136828151 130042187 121757257 112875360
10199 112875360 103719198 94999776 86465355 78831298 72195508 66105504 60729483 56142726
10191 56142726 52077867 48479068 45545583 42912735 40393091 38396939 36349930 34752453
10183 34752453 33141661 31612808 30367512 29177136 28094730 27147013 26222883 25236764
10175 25236764 24462934 23823272 23047591 22372425 21688644 21087380 20553217 19970826 19658010
10166A9658010p21876k97093l85093m68232j78669m62766l77347l73886l64290
10157A6028758j10084l51040K7913k26440j93518n9125j97187j08315Q625n6083
10147A4763504k16529l19169j19304l13822l96749m97397l09498l11598k14080
10138A2065358k87826j67496j89642k44687j54364j33626k8300l58841J14174
10129A0614750j95847p9522p412l18936k0084O4893k63736K56248k9173o9484
10119I951697k2796R1357m6103K84327n3156M8634L4650j21094K0156j91877k63836
10108I731959k70345j50396k36017n2797l02829N3217l700j04054J48287k93542
10098H519783O0282J2513k64712j42340k05627j64960r6987k81351r3932k95676
$$ plain form
10166 19658010 18936134 18639041 18253948 17785716 17607047 17144281 16766934 16393048 16028758
10157 16028758 15918674 15567634 15595547 15369107 15175589 15116464 14919277 14810962 14819587 14763504
10147 14763504 14546975 14227806 14108502 13794680 13397931 12900534 12591036 12279438 12065358
10138 12065358 11777532 11610036 11420394 11175707 11021343 10887717 10859417 10500576 10614750
10129 10614750 10418903 10339381 10331969 10013033 9992949 10057842 9794106 10050354 10021181 9951697
10119 9951697 9928901 10020258 9974155 10258482 10205326 10253960 10288610 10167516 10187672 9995795 9731959
10108 9731959 9461614 9311218 9075201 9022404 8719575 8772792 8769092 8665038 8813325 8519783
10098 8519783 8580065 8592578 8327866 8185526 7979899 7814939 7717952 7436601 7342669 7046993
10088G046993p7315j19144L875m2944p3287L4165N6530q8937j89821q109o2632
10077F479374j10667j04653k09548J86619R208N8766N0190j7236R6116k2801J7463
10066F432831k0742J9879J34352p9152j1552o3736J77056p3415j63865j08629
10056F243027k12716k11999q3714j10422k23572k4744j6530m2361k19878J98499
10046E295590j69887P1309j46752q2113l36455j07458n1307j87610M0730j21129
10036D204918n3938j07951L7747j4887j02736j36120J02699q9224j13422K8348
10026C755434M5439p0701l3046r1762K2052j59053j81428n790J6378K1457n3627
10015C265353o0710J24523j22031r0110L7004J38644j36576j14959K44454j59027
$$ plain form
10088 7046993 6969678 6850534 6854409 6811465 6738178 6772343 6828873 6739936 6550115 6542006 6479374
10077 6479374 6368707 6264054 6054506 6241125 6250333 6309099 6359289 6342053 6438169 6415368 6432831
10066 6432831 6412089 6431968 6566320 6487168 6475616 6411880 6588936 6515521 6351656 6243027
10056 6243027 6030311 5818312 5734598 5624176 5400604 5375860 5359330 5316969 5097091 5295590
10046 5295590 5125703 5197012 5050260 4968147 4631692 4524234 4472927 4285317 4326047 4204918
10036 4204918 4150980 4043029 4080776 4065889 3963153 3827033 3929732 3840508 3727086 3755434
10026 3755434 3800873 3730172 3697126 3605364 3627416 3468363 3286935 3281145 3297523 3318980 3265353
10015 3265353 3204643 3329166 3207135 3117025 3154029 3292673 3156097 3041138 3285592 3126565
10005C126565m5629O9561j04427j3524N8375k4544K4963j0795M1434j32343j6160
9994B973476k0514o8700M3538p3629n3597J75580j15145J40012P212J2002J27525
9983C147760n8950n5151K01447l1292J42134M0280Q6297L4658P1629J75396P6200
9972C830408J49386K68147K5218j707O7525l78874r1696q9544K8329p9802M3802
9961C771192q1340J0627J728K9479L16741J91108k4585L68529J50138J37897Q8770
9950D960284o5536P5014l05615j94910j00528l05967k8108M5603j5591k40236
9940C824410J05502J4024K7048j44215J06180J53670J39618J34591J21823j16729
9930D365922j1884m35922Q1553j2372j88176l7012k7178r5776q4310j32763R3845
$$ plain form
10005 3126565 3080936 3150497 3046070 3032546 3090921 3066377 3091340 3080545 3121979 2989636 2973476
9994 2973476 2952962 2884262 2927800 2854171 2800574 2976154 2861009 3001021 3008233 3020235 3147760
9983 3147760 3088810 3033659 3235106 3203814 3345948 3386228 3472525 3507183 3578812 3754208 3830408
9972 3830408 3979794 4247941 4273159 4271452 4338977 3960103 3868407 3778863 3807192 3727390 3771192
9961 3771192 3689852 3700479 3702207 3731686 4048427 4239535 4214950 4583479 4733617 4871514 4960284
9950 4960284 4894748 4969762 4664147 4469237 4368709 4062742 4034634 4080237 4064646 3824410
9940 3824410 3929912 3943936 3970984 3826769 3932949 4086619 4226237 4360828 4482651 4365922
9930 4365922 4354038 3918116 3999669 3987297 3799121 3762109 3734931 3639155 3554845 3422082 3515927
9919C515927Q098j06091M060J16301o4542j51253J35755j23877N6181j42746p1615
9908C176198J34738J57308j86362J3065R0357M2983J2281O2415m9957K50867l4873
9897C669020j71463M6617K44567o5975r5482K62974k45008R844J71294R4032q433
9886C911987K25973M1534r0889J55463Q2227K37943j3167K58169J90435L93808
9876E393483M4900M15521K52466K76900J79401J65814K03283o7425M9207j12732
9866F800818J17328J0434P1341j06720P1179R1145p432J21786J357J58057P6376
9855G405669J32468k5795j4215J3392R5371j57342R5791m2819j26475k34252n7077
9844G084716j06434j0074k90331j23405k3782l56086j5767J3270j0736j34361
$$ plain form
9919 3515927 3524025 3417934 3421994 3538295 3473753 3322500 3458255 3334378 3390559 3247813 3176198
9908 3176198 3310936 3468244 3281882 3294947 3385304 3428287 3440568 3502983 3453026 3703893 3669020
9897 3669020 3497557 3544174 3788741 3722766 3627284 3890258 3645250 3655094 3826388 3920420 3911987
9886 3911987 4137960 4179494 4088605 4244068 4326295 4564238 4551071 4809240 4999675 5393483
9876 5393483 5438383 5853904 6106370 6383270 6562671 6728485 6931768 6864343 6913550 6800818
9866 6800818 6918146 6928580 6999921 6893201 6964380 7055525 7048093 7169879 7171236 7329293 7405669
9855 7405669 7538137 7512342 7498127 7511519 7606890 7449548 7545339 7502520 7376045 7141793 7084716
9844 7084716 6978282 6968208 6677877 6554472 6530690 6174604 6158837 6172107 6161371 6027010
9834F027010J2401N5233J13665j54721j11175k43048k90170j85656k27225m06805
9824D589509k28725k49656k30893j19106r6812k69891j28591K6408p9133j7224
9814C195886l42154J42087k39884j2086k6125j52686p6140N5412P0170l64187
9804B250293m5980J39550j56236m1223P9323j76261J27074N2603n4241K8612P1350
9793B274864j07394j0714q8596K139n701r1904O9968q7330P3826j56079N1991
9782A925070J01190p5125N8614J4535R4467r8382J03688J27958M4266R736p8027
9771B227990L0129j38834k5101r1230K4018j70402j17066J04320P8301o4130Q9957
9760A947952j21623P8564l9594K06990K2962j70474J07989k3408J3674q0949p4521
$$ plain form
9834 6027010 6039411 6094644 6208309 6053588 5942413 5699365 5409195 5223539 4996314 4589509
9824 4589509 4360784 4111128 3880235 3761129 3664317 3394426 3265835 3292243 3213110 3195886
9814 3195886 2853732 2995819 2755935 2743849 2717724 2565038 2488898 2544310 2614480 2250293
9804 2250293 2204313 2343863 2187627 2146404 2225727 2049466 2176540 2229143 2174902 2203514 2274864
9793 2274864 2167470 2156756 2068160 2070299 2064598 1972694 2042662 1955332 2029158 1873079 1925070
9782 1925070 2026260 1951135 2009749 2024284 2118751 2020369 2124057 2252015 2296281 2306017 2227990
9771 2227990 2258119 2119285 2094184 2002954 2026972 1856570 1739504 1843824 1922125 1857995 1947952
9760 1947952 1826329 1904893 1865299 2072289 2095251 1924777 2032766 2009358 2023032 1942083 1867562
9749A867562j80692K9770Q3707l10784J39020J22851j32536R1012k5162p6785
9739A607963J21539J13611N1535j50051K5483j26282R9520l0480l32215K36292
9729A616915J6862k1570j1023l2440j9168M6968P6419q229J32265J33894k92152
9718A638741L17461j42429n0666q575J26125q0264K04147k78882j00496J19821
9708A744983r5094j47847m4454J21365J9941J3619J684J6015L9747N7608m2708
9697A684859J55319J47081R3429P1721j63599j52713j8964p4812j22428q7393
9687A532500N8272k10182n548J30825n7925j13076j7766k8076R8492L14082j56153
9676A545445L6624r0449N0241p7502k06698K7384L4994j75490K25616k20422K57983
$$ plain form
9749 1867562 1686870 1716640 1800347 1489563 1628583 1751434 1618898 1709910 1684748 1607963
9739 1607963 1729502 1843113 1894648 1744597 1770080 1643798 1743318 1712838 1380623 1616915
9729 1616915 1633777 1612207 1601184 1568744 1549576 1596544 1672963 1664734 1796999 1930893 1638741
9718 1638741 1956202 1813773 1763107 1754532 1880657 1800393 2004540 1725658 1625162 1744983
9708 1744983 1649889 1502042 1457588 1578953 1598894 1612513 1614197 1630212 1669959 1727567 1684859
9697 1684859 1840178 1987259 2080688 2152409 1988810 1836097 1817133 1742321 1619893 1532500
9687 1532500 1590772 1380590 1375042 1505867 1447942 1334866 1317100 1289024 1387516 1701598 1545445
9676 1545445 1582069 1491620 1541861 1464359 1257661 1285045 1320039 1144549 1370165 1149743 1407726
9665A407726j16401j01950m5700k2892j10037J85878m7936J38903j93278K01041
9655A295354j68219J03782n901O5303n6062R7961P9318Q5471K67959j87411Q2372
9644A659927n5870j86587k2342j19437j5621K2589o8523N5667l4001Q5256j6134
9633A304924J50900O8291J73136J35953o8238j71779j19850m1425k0630j15398
9623A295884l9002j59701M0887r1136K06027j46977K09372k12850J22677k6793
9613A198388L1845r6847J01934k8043K6959q2515M0109K7937N1322k5875N4145
9602A299359j38312J05802J9287M6904o4468J28158J5481m5118J9391k9775Q7241
9591A443950k1078J3908o4768Q1530n0307o3552Q8578N9031O0477K9862j21799
$$ plain form
9665 1407726 1291325 1189375 1143675 1120783 1010746 1196624 1148688 1287591 1094313 1295354
9655 1295354 1127135 1230917 1225016 1290319 1234257 1332218 1411536 1497007 1764966 1577555 1659927
9644 1659927 1604057 1417470 1395128 1275691 1260070 1282659 1214136 1269803 1235802 1321058 1304924
9633 1304924 1455824 1524115 1697251 1833204 1764966 1593187 1473337 1431912 1411282 1295884
9623 1295884 1256882 1097181 1138068 1046932 1252959 1105982 1315354 1102504 1225181 1198388
9613 1198388 1230233 1133386 1235320 1207277 1234236 1151721 1191830 1219767 1271089 1245214 1299359
9602 1299359 1161047 1266849 1286136 1333040 1268572 1396730 1412211 1367093 1386484 1356709 1443950
9591 1443950 1422872 1436780 1372012 1453542 1403235 1339683 1428261 1487292 1547769 1577631 1455832
9580A455832L730J08353L3403L8411J4542n5492J06041K1928N6210k3606q7758
9569A671594J00314J06626m9719l0225N1677J00910r5893K21864m1950j5338n4223
9558A965637L591L38484k12782J18304j0818p7694J27287K31784j37153K4254
9548B370894P6522Q1074N4933J11564J9914J11192O4573Q2419K05626K44603L6123
9537C459437K02609K7732r2648M0551j23820K3389J35037k08920K21124m9079
9527C635412o3642R4149R3551j28771J39889L13458j1923K41963J10252J04811
9517D529149L33725J54006J95971K14471J56823P0500J18770j81926M5209J21279
9507E757977j20521m8402K45726n80J40132J71662J83046K96507R0156K55325
$$ plain form
9580 1455832 1459562 1567915 1601318 1639729 1654271 1598779 1704820 1726748 1782958 1759352 1671594
9569 1671594 1771908 1878534 1828815 1798590 1850267 1951177 1855284 2077148 2035198 2019860 1965637
9558 1965637 1969228 2307712 2094930 2213234 2202416 2124722 2252009 2483793 2346640 2370894
9548 2370894 2447416 2528490 2583423 2694987 2714901 2826093 2890666 2973085 3178711 3423314 3459437
9537 3459437 3662046 3689778 3597130 3637681 3513861 3537250 3672287 3463367 3684491 3635412
9527 3635412 3571770 3665919 3759470 3630699 3770588 4084046 4072123 4314086 4424338 4529149
9517 4529149 4862874 5016880 5212851 5427322 5584145 5654645 5773415 5591489 5636698 5757977
9507 5757977 5637456 5589054 5834780 5834200 5974332 6145994 6329040 6625547 6715703 6971028
9497F971028J40221L19148K50296L94525P4446K87948J17828J67510j3347J83839
9487H893442K47980K10051K70705K16703L93965K56520N87363K36145M80258N26852
9477A2319984O10106P24519O67746O39685R17625P31728J125543J092992J256083
9468B0086011J575877K021173J718802K315135K359388K498729K629650K696755
9460C7901520K740950K099606J901699J247630Q41309L76419L27818J80166L77606
9451D7994723N28011J080489J131511J671498J655232J957895J898435J875114
9443E9792908J782602J476314Q93260Q46676N84371Q3244O9286n5904m23260n33402
9433F4516095p30297j146460j287901j543345j342394j395141j337302r37626
$$ plain form
9497 6971028 7111249 7430397 7680693 8075218 8149664 8437612 8555440 8722950 8709603 8893442
9487 8893442 9141422 9351473 9622178 9838881 10232846 10489366 11076729 11312874 11793132 12319984
9477 12319984 12930090 13654609 14322355 14962040 15879665 16611393 17736936 18829928 20086011
9468 20086011 21661888 23683061 25401863 27716998 30076386 32575115 35204765 37901520
9460 37901520 40642470 42742076 44643775 45891405 46732714 47109133 47436951 47617117 47994723
9451 47994723 48522734 49603223 50734734 52406232 54061464 56019359 57917794 59792908
9443 59792908 61575510 63051824 63945084 64791760 65376131 65459375 65528661 65472757 65049497 64516095
9433 64516095 63785798 62639338 61351437 59808092 58465698 57070557 55733255 54795629
9425E4795629o54281l26865J41758K56723M53678J22869r7351p82175j061591
9416E2848394j811221k175153k144642k361987k011539j830488j533049r97895
9408C7982420o41467q5705N11086J170078J837275K999329M606825P114204J1668057
9399F7162102J4458377J0214510j062464j0391950j1411789r249411p445023n746248
9391D6528104l745055j924616o28419N70742J979514L451440N791905R395510
9383F1419125J4205707J6073695P894881n246160j3148886j2693307j0401759
9376E8103296q704765p009800m862435l248714k265598j511609j390762o64406
9368B8445207j55630O1974M08162O80230O96628J079637J417899J884046K418070
$$ plain form
9425 54795629 54141348 53814483 53956241 54212964 54666642 54789511 54692160 53909985 52848394
9416 52848394 51037173 48862020 46717378 44355391 42343852 40513364 38980315 37982420
9408 37982420 37340953 37255248 37766334 38936412 40773687 43773016 48379841 55494045 67162102
9399 67162102 81620479 91834989 90772525 80380575 68968786 59719375 52274352 46528104
9391 46528104 42783049 40858433 40230014 40800756 42780270 46231710 52023615 61419125
9383 61419125 75624832 91698527 99593408 94347248 81198362 68505055 58103296
9376 58103296 49398531 42388731 37526296 34277582 32011984 30500375 29109613 28445207
9368 28445207 28289577 28351551 28759713 29439943 30136571 31216208 32634107 34518153 36936223
9359C6936223K918065L719902N005729P141649J0504609J5856926K3534524K6318633
9351A31936260J3294822q014055j9634590j9323652j5164677j2279124r285920
9344F1529064n455751k736773p61664R23425L486816O394390J1129428J8474714
9336I2983649K6178309K4793382O223038j5142156k3433456k1059487j7022248
9329G3521031j4044054j1009064p828850n347652m115140l312306k614209j987447
9321B3262309j652408r76119q38608q15891l54552n83104k90022k32939k9440
9312A7489226j64701o64975m53915p04626m74436n01905l30593m58950l44070
9303A3391055k06412j72248r4868j68932L4858n3998k42229M5522R1382k63349
$$ plain form
9359 36936223 39854288 43574190 48579919 55721568 66226177 82083103 105617627 131936260
9351 131936260 145231082 137217027 117582437 98258785 83094108 70814984 61529064
9344 61529064 56073313 53336540 52574876 53498301 56985117 63379507 74508935 92983649
9336 92983649 119161958 143955340 150178378 135036222 111602766 90543279 73521031
9329 73521031 59476977 48467913 40639063 35291411 31176271 27863965 25249756 23262309
9321 23262309 21609901 20633782 19795174 18979283 18624731 18041627 17751605 17518666 17489226
9312 17489226 17324525 16659550 16205635 15501009 15026573 14524668 14194075 13735125 13391055
9303 13391055 13184643 13012395 12917527 12748595 12783453 12729455 12487226 12532748 12624130 12360781
9293A2360781J66225K37151J60880R997k02659j73746k77938l01858p4631j98052
9283A1706150K5250j14498j1151l9775r0057K6407q473r3878J18804N2020N5690
9272A1626489R1488L51713M4295K77057J83775J99232K35097K11221K33639M60013
9262A3914019L07407M09717M74335M96250M31629P79999N54121Q45174Q44612
9253A9057263R23919J204773J532894J510753K083931K452155K941728L612206
9245C5319622N240683P357842J1359380J6925385K1461236J8776900P728793n970024
9237A18199817j5515048j6933364j4611755j1679343q920640o129222m138535
9230D0271910k707221j853314j017774m56873K21465J219566J642795K109474
$$ plain form
9293 12360781 12527006 12764157 12925037 12935034 12732375 12558629 12280691 11978833 11904202 11706150
9283 11706150 11731400 11616902 11605751 11565976 11475919 11502326 11493853 11399975 11518779 11570799 11626489
9272 11626489 11717977 12069690 12113985 12391042 12574817 12774049 13009146 13220367 13454006 13914019
9262 13914019 14221426 14631143 15105478 15601728 16033357 16813356 17367477 18212651 19057263
9253 19057263 19981182 21185955 22718849 24229602 26313533 28765688 31707416 35319622
9245 35319622 40560305 47918147 59277527 76202912 97664148 116441048 124169841 118199817
9237 118199817 102684769 85751405 71139650 59460307 50539667 44410445 40271910
9230 40271910 37564689 35711375 34693601 34236728 34458193 35677759 37320554 39430028
9222C9430028K794529L744789N290887Q201319J2659823J9109805K4777344K2577199
9214A38585723J0380802o337117j8019316k0971374j8415771j4713472j1420675
9207E9088800q054834n484688l758875k411339j471447r46300j1169N25743J204853
9198C8680744K190474L721575O036521R191519J0695835P928173J889685m975616
9190G5358910q470276q420987o595254n187161l828520k608594j379546n97856
9182C8270716j72795K7891O70745J018038J283435J855316K089382K665621L624214
9173E1332563M514774O593734J0017131J4357181J6747219J3831237M988780m273458
9165A18109161r696556r786945p173129m704556k347478L26574K151213L716106
$$ plain form
9222 39430028 42224557 45969346 51260233 59461552 72121375 91231180 116008524 138585723
9214 138585723 148966525 142629408 124610092 103638718 85222947 70509475 59088800
9207 59088800 51033966 45549278 41790403 39379064 37907617 36961317 36950148 37475891 38680744
9198 38680744 40871218 44592793 50629314 59820833 70516668 78444841 80334526 75358910
9190 75358910 66888634 58467647 51872393 46685232 42856712 40248118 38868572 38270716
9182 38270716 38097921 38125812 38796557 39814595 41098030 42953346 45042728 47708349 51332563
9173 51332563 55847337 62441071 72458202 86815383 103562602 117393839 122382619 118109161
9165 118109161 108412605 98625660 91452531 86747975 84400497 84727071 86878284 90594390
9157I0594390N078503O278601P161883P738819P685865P172832N941575M140468
9149A41792936K530386J069562N2701k45721j24676k2127M61816J179701K054918
9140A48749496K413170L115021L532805M115862M231374L884728L781003L106305
9132A76929764K236841J423688J8212j238241k097997l326861l951513m831488
9124A65162405m858722m803826m640025m216997l601854k921574k206054j467392
9116A36445961p29432l92867k97264l73236j175216k651648m226229n516497p001891
9107A14081681p844407q195016p785940p521168o887298n969358n499397m812620
9099E9566477m164453l585242l102769k792614k490210k267929j941611j811882
$$ plain form
9157 90594390 95672893 101951494 109113377 116852196 124538061 131710893 137652468 141792936
9149 141792936 144323322 145392884 145445585 145199864 145075188 145053061 145514877 146694578 148749496
9140 148749496 151162666 154277687 157810492 161926354 166157728 170042456 173823459 176929764
9132 176929764 179166605 180590293 180608505 179370264 177272267 173945406 169993893 165162405
9124 165162405 160303683 155499857 150859832 146642835 143040981 140119407 137913353 136445961
9116 136445961 135716529 135323662 135026398 134653162 133477946 130826298 126600069 121083572 114081681
9107 114081681 106237274 98042258 90256318 82735150 75847852 69878494 64379097 59566477
9099 59566477 55402024 51816782 48714013 45921399 43431189 41163260 39221649 37409767
9091C7409767j456589j192202r24759o66372r11421r96372n77559n67472j02583
9082C0014438L7892L8080l34320j043938o27465n28950K0355o7153j69718r27567
9072B6411654j067105p43031l78853m9888k86014l29446p35878n91350k46591
9063B1983498o8064q7376l10728l32370l44417k73455k94326K59177L1335J96501
9053B0759775M67726L07926L88840L88309N25695M04294N75635P64890Q23695
9044B5406785J486515J939518K839481M304572O086495N943423K742634j669713
9036D9079710k883110k250741j028072m8220J481141L793687N883887O556714
9028F0584996L193842Q4944L83762L618419P412450P758669K536837l841541o739050
$$ plain form
9091 37409767 35953178 34760976 33836217 33169845 32258424 31262052 30684493 30117021 30014438
9082 30014438 30052330 30090410 29756090 28712152 28084687 27555737 27576092 27508939 27339221 26411654
9072 26411654 25344549 24601518 24222665 24172777 23886763 23557317 22821439 22230089 21983498
9063 21983498 21915434 21828058 21517330 21184960 20840543 20567088 20272762 20531939 20563274 20759775
9053 20759775 21227501 21535427 21924267 22312576 22838271 23242565 23818200 24583090 25406785
9044 25406785 26893300 28832818 31672299 35976871 42063366 48006789 50749423 49079710
9036 49079710 46196600 43945859 42917787 42869567 44350708 48144395 54028282 60584996
9028 60584996 63778838 63863782 64247544 67865963 75278413 83037082 85573919 81732378 74993328
9019G4993328n461280l066863l06795L622676Q916610J2809922J0595425J086019
9011A03189042o734109q561008o028975k202598O77391J264204l84911j079898
9003H0139138k749033l998484k452006J457892O069249R300694O134032j581708
8995I2319774r001593j0217686p999485n799288k676339R09641M717642N377331
8987F7629997J527002m196081o116469m934560k395086l42587q94655l698686
8979D6578875m824493m472584l147630j941446j031523O46291K168856L536344
8971C7512690J636132k586254m350267l945769l207698k801937k109496j380742
8963A8766659j397796o77974p19573o73811n57314m90178l19985k44143j69176
$$ plain form
9019 74993328 69532048 66465185 66158390 69781066 78697676 91507598 102103023 103189042
9011 103189042 96454933 87893925 81864950 79662352 80339743 81603947 81219036 80139138
9003 80139138 77390105 73391621 70939615 72397507 78466756 87767450 93901482 92319774
8995 92319774 83318181 73100495 65101010 59301722 56625383 57535024 62252666 67629997
8987 67629997 69156999 64960918 58844449 53909889 51514803 51172216 50277561 46578875
8979 46578875 41754382 37281798 34134168 32192722 31161199 31807490 33976346 37512690
8971 37512690 39148822 36562568 32212301 28266532 25058834 22256897 20147401 18766659
8963 18766659 17368863 16690889 15971316 15297505 14740191 14250013 13930028 13685885 13516709
8954A3516709k42662k43423j05144l17694l8111j56233L0752O7922l1744j90119
8944A2290253Q2722M5570J47908J44193M0230L10204o014N6824L0015J66956L24829
8933A3633690K73779N31623M97531J72644K48530L80267K28182L52774N07856
8924A6826876P56347P09959Q70369Q70474J157172J105511J255200J602754J792773
8915B6947435K094215K131638K662210K722602L050479K721241K715204J877049
8907D6922073J564525R72444K47379j41961k35164k31900L81602R1111L93380
8898D9963489R82701J225800J360761J472815J522538J481446J209195J187461
8890F0406206J013405P92949M44942J33036k20565n40073q53104j060930j563567
$$ plain form
8954 13516709 13274047 13030624 12925480 12607786 12569675 12413442 12444194 12512116 12480372 12290253
8944 12290253 12372975 12418545 12566453 12710646 12750876 13061080 13055066 13111890 13141905 13308861 13633690
8933 13633690 13907469 14439092 14936623 15109267 15357797 15738064 15966246 16319020 16826876
8924 16826876 17583223 18293182 19163551 20034025 21191197 22296708 23551908 25154662 26947435
8915 26947435 29041650 31173288 33835498 36558100 39608579 42329820 45045024 46922073
8907 46922073 48486598 49459042 49706421 49564460 49329296 49097396 49478998 49570109 49963489
8898 49963489 50946190 52171990 53532751 55005566 56528104 58009550 59218745 60406206
8890 60406206 61419611 62212560 62657502 62790538 62569973 62029900 61176796 60115866 58552299
8881E8552299j615891j790662k061999j903093j692819j516422j207273r33552
8873D5830588m29247l65123O771n2468j52390m96620r08889j515871j792014k275562
8863C7849175k678447k620221k368456k478833k089573j877916j838616j349596
8855B0547517j507529r96801j015037p96020q27364q45178n89383n13564n95346
8846A2861295m27651m30703l31284j97366m12293j30838l52000l84564k77896
8837I916700j38004j97162k37602l12008k82666j05573j13185k72516L793k34841
8827H026936k10473k6383N3590j05830j05754k11947l6724r0915k09282j11984
8817F971234l3688N6366p5395k24482p1586O1168j32130j14440k6069l2326L4565
$$ plain form
8881 58552299 56936408 55145746 53083747 51180654 49487835 47971413 46764140 45830588
8873 45830588 45401341 45036218 45042989 44990521 44838131 44341511 43432622 41916751 40124737 37849175
8863 37849175 35170728 32550507 30182051 27703218 25613645 23735729 21897113 20547517
8855 20547517 19039988 18043187 17028150 16232130 15404766 14559588 13970205 13456641 12861295
8846 12861295 12433644 12002941 11671657 11474291 11061998 10931160 10579160 10194596 9916700
8837 9916700 9778696 9581534 9343932 9031924 8749258 8643685 8530500 8257984 8261777 8026936
8827 8026936 7816463 7790080 7843670 7737840 7632086 7420139 7383415 7292500 7083218 6971234
8817 6971234 6937546 6993912 6918517 6694035 6622449 6683617 6551487 6437047 6410978 6378652 6413217
8806F413217j1992r2973N9206j3270J9656K6030k9792M4159J3448J9120J03709
8795F550518J270k5284J9848J90377m8736K0976n78N6039M614l5573M01314m546
8783G130239J20330J99844Q485K35260q0208J23558K37023L08469K57892K45066
8773H785958J46616J09337K61431M11570L75902L52309M89341N53678M64875M95465
8763A2446482O75462Q11548O92933P75071J070745J043642J345514J369583J857009
8754B2087989K073801K715058L468813M716324O766679R879815J4908096J8761764
8746H5378339J5769733O087847o007462j2689173j2466891r649793p351023m849732
8738E4221845k321037J08471K280033M675646Q075430J2761385J9188600K3163621
$$ plain form
8806 6413217 6401225 6308252 6367458 6354188 6373844 6399874 6370082 6414241 6427689 6446809 6550518
8795 6550518 6551788 6526504 6546352 6736729 6687993 6708969 6708391 6764430 6769044 6733471 7134785 7130239
8783 7130239 7250569 7450413 7458898 7694158 7613950 7737508 7974531 8283000 8540892 8785958
8773 8785958 8932574 9041911 9303342 9714912 10090814 10443123 10932464 11486142 11951017 12446482
8763 12446482 13121944 13933492 14626425 15401496 16472241 17515883 18861397 20230980 22087989
8754 22087989 24161790 26876848 30345661 35061985 41828664 51708479 66616575 85378339
8746 85378339 101148072 107235919 101228457 88539284 76072393 66422600 59071577 54221845
8738 54221845 51900808 52009279 54289312 58964958 67040388 79801773 98990373 122153994
8730A22153994K2020786J8224144J2780488M835257p116892j9638805k5470908
8723A27788064k2816007j7679342j3442100r660897o348822l208772l25452K275246
8715E6581918N857240J0938224J6887749J8534182J0569243k620349j4401252
8708A02346955j7865080j5871916j2824857j0389716p851806n744190l990657
8701B7808733k965076k590624j858950j476693j170316q29362p41178r08009n45183
8692A4723342p15603n17050l81774n68903k45793n47814k50746k11169m04351
8683A0880139r7201m05584k38758l4173k30147j63448l23110j39511k01908k18319
8673H827980o5284O7707m6641l47058j46989j46225P7603k93616k1221q8413k0679
$$ plain form
8730 122153994 144174780 162398924 175179412 180014669 172897777 153258972 127788064
8723 127788064 104972057 87292715 73850615 64189718 57840896 54632124 54306672 56581918
8715 56581918 62439158 73377382 90265131 108799313 119368556 116748207 102346955
8708 102346955 84481875 68609959 55785102 45395386 37543580 31799390 27808733
8701 27808733 24843657 22253033 20394083 18917390 17747074 16917712 16176534 15268525 14723342
8692 14723342 14007739 13490689 13108915 12540012 12294219 11746405 11495659 11284490 10880139
8683 10880139 10782938 10377354 10138596 10104423 9874276 9710828 9387718 9248207 9046299 8827980
8673 8827980 8762696 8830403 8783762 8436704 8289715 8143490 8221093 7927477 7906256 7817843 7797164
8662G797164j7630k4477k23533P6996j3582j47479M2892Q3434l8036n5342r5831
8651G384576L3029l5330P1270o1010Q0642R0458q243M210J49743o6936O3573k5383
8639G680599K8434j1073R2325O7210j26940J61454J49615O2014O5742K15387L07087
8628H691854J92891k0387L7384R4785L78059K91819J91770K02603K48721L34112
8618A0643611K33902M36967L47634P81487O17851O42484P08581O17425O74033
8609A5703975R11670R63121J202551J328072J484871J788812K032313K298288
8601B7713673K737395L449891M501638O288118Q839191J2879577J9231097K4215657
8593A09856237K1051703N946068r101769j4888174j2330103p650674k597466M168268
$$ plain form
8662 7797164 7779534 7755057 7531524 7608520 7594938 7447459 7490351 7573785 7535749 7480407 7384576
8651 7384576 7417605 7382275 7453545 7392535 7473177 7563635 7555392 7559602 7709345 7642409 7705982 7680599
8639 7680599 7709033 7697960 7790285 7857495 7730555 7892009 8041624 8103638 8169380 8384767 8691854
8628 8691854 8884745 8864358 8901742 8996527 9374586 9666405 9858175 10060778 10309499 10643611
8618 10643611 10877513 11314480 11662114 12443601 13061452 13703936 14412517 15029942 15703975
8609 15703975 16615645 17578766 18781317 20109389 21594260 23383072 25415385 27713673
8601 27713673 30451068 33900959 38402597 44690715 53529906 66409483 85640580 109856237
8593 109856237 130907940 136854008 127752239 112864065 100533962 92883288 90285822 94454090
8585I4454090J2691344J8969558J5151701P13827j2673101j5897800j2350406
8578A01059213p073949j248699O332110J2489472J0646458n00745j1553284j4278579
8570I5871997j1476235p727255l090748K153179Q602074J3019198R211427l141895
8562A03421742j2979105j5653043j3568267j0665823r100692o706774n067276
8555B9680762l602115k918965k175336j765923j636260r94862q31714p99825o97469
8546A4258293p41552l98095o96928m88774l30307l34721m25166j82795k95293
8537A0364662m84766k90165o8231l67623l29828j02573P21667q81542k62941k27967
8527H070693k15921N3229m2416r9374n5701J37620R9097K52028Q6261j9923J13673
$$ plain form
8585 94454090 107145434 126114992 141266693 141980520 129307419 113409619 101059213
8578 101059213 93985264 92736565 99068675 111558147 122204605 121703860 110150576 95871997
8570 95871997 84395762 76668507 73577759 75730938 84333012 97352210 106563637 103421742
8562 103421742 90442637 74789594 61221327 50555504 41454812 34748038 29680762
8555 29680762 26078647 23159682 20984346 19218423 17582163 16587301 15755587 14955762 14258293
8546 14258293 13516741 13118646 12421718 11932944 11602637 11267916 10842750 10659955 10364662
8537 10364662 9879896 9589731 9521500 9153877 8824049 8721476 9443143 8561601 8298660 8070693
8527 8070693 7854772 7908001 7865585 7766211 7710510 7848130 7947227 8199255 8285516 8265593 8379266
8516H379266O1301p492K62395L01363M90348L24955O9602j20095j99039J56818
8506I719422K61349K41189K18880l5935l35197n69821k24707m55594j08593o8297
8496H642696j57642l75550m77463l48847l93898m65791O990m01551k50708n14519
8486E263717k78698m26891j59499k72049k93404j20632o8588l26277R7006j53852
8476C260833K1477k20916j6786j85664n0448l1463J5175j25756p807J0555o1580
8465B607620q3474N8056J7858K412P4310J1674N1286p7079k20504j7599k99899
8454B124661m3326o1257r4447J07151p4269m078n4369k14571J29260j91926O7057
8443A689886N401k2289J097l8615n0399j16743M3788J4281P7363r1902K2132r5339
$$ plain form
8516 8379266 8440567 8433075 8695470 8996833 9487181 9812136 9881738 9761643 9562604 9719422
8506 9719422 9980771 10221960 10440840 10404905 10069708 9499887 9275180 8819586 8710993 8642696
8496 8642696 8485054 8109504 7632041 7283194 6889296 6423505 6430495 6028944 5778236 5263717
8486 5263717 4985019 4558128 4398629 4126580 3833176 3712544 3643956 3317679 3414685 3260833
8476 3260833 3282310 3061394 3044608 2858944 2808496 2777033 2792208 2666452 2658645 2669200 2607620
8465 2607620 2524146 2582202 2600060 2602472 2676782 2688456 2739742 2662663 2442159 2424560 2124661
8454 2124661 2081335 2020078 1925631 2032782 1958513 1954435 1900066 1685495 1814755 1622829 1689886
8443 1689886 1695287 1672998 1674095 1635480 1585081 1468338 1512126 1526407 1603770 1511868 1534000 1438661
8431A438661j68943J26422Q2420m2304j38290J92924j98988j77360K32543N4877
8421A401962o4296k8690o7586J5190p5323q084p2332L3908J00289o1414j19844
8410A053780J97126k3243k30514R8769J35933j34428N8863L4696p1934r381J74096
8399A283763k48357R4387M1229P1072J40886J9392J2243j5923j2924j3592j29289
8388A242887k8736j29699K13823k09572Q067O1624L5190j43410J63877J57924
8378A371975J85432J55036j9834J07105p0658j03434j63091o6947P9592j41197
8368A333979l04722p8218N8026P1913K1195o4285P1165q5232K14426K562J9493
8357A260302J2809p0138j87529K9707j32859l4908j8387j4012p0187R7044j03140
$$ plain form
8431 1438661 1269718 1396140 1478560 1436256 1297966 1490890 1291902 1114542 1347085 1401962
8421 1401962 1337666 1308976 1241390 1256580 1181257 1173173 1100841 1134749 1235038 1173624 1053780
8410 1053780 1250906 1227663 997149 1095918 1231851 1097423 1156286 1190982 1119048 1109667 1283763
8399 1283763 1035406 1129793 1171022 1242094 1382980 1402372 1414615 1398692 1385768 1372176 1242887
8388 1242887 1214151 1084452 1298275 1088703 1096770 1158394 1193584 1050174 1214051 1371975
8378 1371975 1557407 1712443 1692609 1799714 1729056 1625622 1462531 1395584 1475176 1333979
8368 1333979 1029257 951039 1009065 1080978 1102173 1037888 1109053 1023821 1238247 1240809 1260302
8357 1260302 1273111 1202973 1015444 1045151 912292 877384 858997 844985 774798 871842 768702
8346G68702K9961j03631P9807J6545M2778O1005r6802j05645n452k3483n1316
8335F12469J37681p4089r3846j13727K02062j27448M4525o4223R6460J36168k35966
8324E20066L2721m1837O0274J66865j6925j7721j52514j1841Q4034n3530J5637
8313E85229o6794R8749m4770L2060p2924J10917q8857j02388O0K07314k27076
8302D31520O1397O604N2644q2356J47549j9469j23691L0467N6806J70765k32616
8291D99620K8164J40052j65179K7894m8196R6306p6699R865r5804J69810n2538
8280E33295n368J20517r3426Q137J21080J63924j32289L9831j65539k8421J26082
8269F87823j77951J84573j38986L2487o493n0313l2261P5536j6782Q7705q0824
$$ plain form
8346 768702 798663 695032 774839 791384 834162 895167 798365 692720 687268 663785 612469
8335 612469 750150 676061 582215 468488 670550 543102 587627 523404 619864 756032 520066
8324 520066 552787 510950 571224 738089 721164 703443 550929 539088 623122 569592 585229
8313 585229 518435 617184 572414 604474 531550 642467 553610 451222 451282 658596 431520
8302 431520 492917 499521 552165 469809 617358 597889 474198 504665 561471 732236 499620
8291 499620 527784 667836 502657 530551 482355 578661 501962 511827 416023 585833 533295
8280 533295 527927 648444 555018 563155 684235 848159 715870 755701 590162 561741 687823
8269 687823 509872 694445 555459 587946 581453 531140 498879 574415 557633 645338 564514
8258E64514j51588O4301J22485m7557j8904m2660P7312M6011J36309M8585M8502
8247H47310n0798J9823L24479R971J75633l5410j91334J9945P5499j29708j9969
8236A045441p1751J65499l403J22787M042K922l7446k66023P6922M9534q5406
8225A003118J47808p7967J96899q5443j33053k75872L17465p0440r3316M7140
8215I76339K03366m966m6206n255r9870O5831p5736k87546R0300m2412q6119J52694
8203H40420j01803k07519J49969j83603k1491J62029r1669r7502L2878K72849
8193G54558J30136l16608K0286j65853J45638j3177J83566r4335j80747K21035
8183F84499J2216k09376J32791Q356p7655p0553p2136K53521j81044Q2785k9055
$$ plain form
8258 564514 412926 477227 599712 552155 533251 490591 567903 613914 750223 798808 847310
8247 847310 796512 816335 1140814 1150785 1326418 1291008 1099674 1119619 1195118 1065410 1045441
8236 1045441 973690 1139189 1135786 1258573 1262615 1265537 1228091 962068 1038990 1088524 1003118
8225 1003118 1150926 1072959 1269858 1184415 1051362 775490 1092955 1022515 929199 976339
8215 976339 1179705 1174739 1128533 1123278 1023408 1089239 1013503 725957 816257 773845 687726 840420
8203 840420 738617 531098 681067 497464 475973 638002 546333 448831 481709 754558
8193 754558 884694 568086 588372 422519 568157 554980 738546 644211 463464 684499
8183 684499 696715 487339 620130 628486 550831 480278 408142 661663 480619 563404 534349
8172E34349J63152p2024n6464p781N4897j05151Q7669N1763j27997N9530p9106
8161E02837J19196j15085Q5196R494j0719J3005L0107m1067n6812n2665J91371
8150F74858R6588j43203K4242p9405J20609K6483l3802r9761J56642l5893k6852
8139F80506L0894Q532J11009j35565R5060R665R1291j11063J45685r8297P6439
8128I04156q9921L3410j9433Q1328K270Q242J22198L3409k6900j61511K57187
8117A144435Q3742j06470o6789J59534Q362P1721m4145K75028Q9612J30684N3236
8106A798950K9811P3709J36235J21943J78527J55550K51037J50909L11432L42557
8096C550660L10018K34183N53897Q14897P81799J061994J672771K424562L235194
$$ plain form
8172 534349 697501 625477 569013 561232 616129 510978 598647 650410 522413 581943 502837
8161 502837 622033 506948 592144 601638 590919 603924 634031 592964 536152 483487 674858
8150 674858 771446 628243 652485 573080 693689 720172 686370 586609 743251 707358 680506
8139 680506 711400 719932 830941 695376 790436 800101 891392 780329 926014 827717 904156
8128 904156 814235 847645 828212 909540 911810 920052 1042250 1075659 1048759 887248 1144435
8117 1144435 1228177 1121707 1054918 1214452 1222814 1294535 1250390 1525418 1615030 1745714 1798950
8106 1798950 1828761 1902470 2038705 2160648 2339175 2494725 2745762 2896671 3208103 3550660
8096 3550660 3860678 4094861 4648758 5463655 6245454 7307448 8980219 11404781 14639975
8087A4639975L914181L256810P84356j975688l101798l004047k667918k194006
8079I651865j678324j496557r49253n59797o32369m34574j97204k77580j61343
8070C264864l38470k14430j6577r983j84862K2077j33846O0517N0360J64233n0111
8059B613772j7017j34875O8738j74968k24403J04288J06177q7403r4820K3927
8049B183416J02270J07442j7305L7513L29904J50805J07463R4926K3677J50938
8039C271049j28058J27006L0151K75406M0100L07764L19539K80079O19184K83776
8029E425996O32793Q20377J085468J526954J900617K716902L256598L135376K105801
8020B2606882j44432j937271k955999k761589k548521k156128j729063j497585
$$ plain form
8087 14639975 18554156 21810966 22595322 20619634 17517836 14513789 11845871 9651865
8079 9651865 7973541 6476984 5527731 4967934 4335565 3900991 3703787 3426207 3264864
8070 3264864 2926394 2711964 2695387 2685404 2500542 2522619 2388773 2449290 2499650 2663883 2613772
8059 2613772 2596755 2461880 2530618 2355650 2131247 2235535 2341712 2254309 2159489 2183416
8049 2183416 2285686 2393128 2375823 2413336 2743240 2894045 3001508 3096434 3120111 3271049
8039 3271049 3142991 3269997 3300148 3575554 3615654 3923418 4242957 4523036 5142220 5425996
8029 5425996 6058789 6879166 7964634 9491588 11392205 14109107 17365705 20501081 22606882
8020 22606882 22462450 20525179 17569180 14807591 12259070 10102942 8373879 6876294
8012F876294r43248p54259o90350n21915l10742m74471n2555l02834k46992r0212
8002B488716j30881k65120j07914m5387j94597N2323j48234r9471M3864l5242
7992A558057l302k9202q7263r6572j62342L4616p4910j05871K7178L6316m8803
7981A047902r5228j9862Q243n3625j8493l0196k1976N836J1068k5398p0616J9477
7969G57132r2412j1107O0615N0992n8452p5817M4415N1807j43174m0164Q3825
7958F27660j05673J43282k09966N5824L3954Q2533r6864J7313k5518o6838O1148
7947E16855R8621j08204j29064J05674j36930J71537j00039j5769K014J15540
7937E20235k7127N7622l4787j06104M1585j00653J06991o0172j948o087J3275
$$ plain form
8012 6876294 5933046 5178787 4488437 3966522 3655780 3181309 3128754 2825920 2578928 2488716
8002 2488716 2357835 2092715 1984801 1939414 1744817 1797140 1648906 1549435 1593299 1558057
7992 1558057 1554755 1525553 1438290 1341718 1179376 1213992 1139082 1033211 1060389 1096705 1047902
7981 1047902 952674 932812 941055 887430 868937 838741 816765 822601 833669 808271 737655 757132
7969 757132 664720 653613 714228 765220 706768 630951 675366 727173 583999 543835 627660
7958 627660 521987 665269 455303 511127 545081 627614 530750 548063 522545 455707 516855
7947 516855 615476 507272 378208 483882 346952 518489 418450 402681 404695 520235
7937 520235 493108 550730 515943 409839 451424 350771 457762 397590 395642 389555 402830
7926D02830J5172Q64M4006l652J4866j07670P6206p1796O2355o7590N710P0364
7914D41665j25816L5363n5215R1320Q9082N413j64687J80118j62354J21940j4110
7903D42719j28001J6116m71m8462k0802J7594n2053P1361M4896j24232O6010j5794
7891B68881J72094j99826Q4047M0552j09799j13275M7712R6609p7277k167O8957
7880B76508J39283r2026J2245J2054m719o0871P4333j61473j2517R839J03802
7869B96458o7156M403q7305O9440o3605J06912j922K2893k4633k7636J1204j06481
7857A32572O256J48103o7400k53201m24731J465047o80507K8738j79086K94142
7847D69933j51497q9598L1860n0303j3755M5834L7914P3823j09832P8720j24340
$$ plain form
7926 402830 418002 418866 462872 459220 474086 366416 442622 370826 433181 365591 371301 441665
7914 441665 315849 351212 295997 387317 476399 481812 317125 497243 334889 456829 442719
7903 442719 314718 330834 330363 281901 261099 278693 226640 298001 342897 218665 284675 268881
7891 268881 440975 241149 325196 365748 255949 142674 190386 286995 209718 207551 276508
7880 276508 415791 323765 336010 348064 343345 282474 356807 195334 182817 192656 296458
7869 296458 229302 233705 146400 215840 152235 259147 257225 280118 255485 227849 239053 132572
7857 132572 138828 286931 219531 -33670 -458401 1006646 326139 354877 175791 469933
7847 469933 318436 228838 260698 210395 196640 242474 280388 354211 244379 323099 198759
7836A98759J00602R172j40618J80853j32064L5973K9219n9646P1083J60893N3620
7825E07846j72697K2902J3126j11857P5239p0856j9561R8689m8010l0781j43363
7814A20677J98557j6389M3680j04592O3004m3433J2428j9062N0901p4362J40166
7803C71575r8144o6398O1024m8321J15868n094o9987m0119M1386P2666L2951r1578
7791B75829N6682J25005r2597j06898M0162K3015J5650j15009J04359p5578k6168
7780B24452j3771M2849J7704m1119N2569P0961k2717m5471M2360N7266Q9737j47288
7768C27532M0510J8615P7554j0907j9749M8824j42049J41751j66335j1159N288
7757C09875n2285n3325J11241J05293n1843P1910r5541N380n3044O6736j17234
$$ plain form
7836 198759 299361 308533 167915 348768 216704 252677 281896 222250 293333 454226 507846
7825 507846 335149 358051 371177 259320 334559 263703 244142 342831 294821 264040 120677
7814 120677 319234 302845 346525 241933 304937 261504 273932 254870 305771 231409 371575
7803 371575 273431 207033 268057 219736 335604 330510 260523 220404 261790 334456 367407 275829
7791 275829 332511 457516 364919 258021 298183 321198 336848 221839 326198 250620 224452
7780 224452 210681 253530 271234 230115 282684 353645 330928 285457 327817 385083 474820 327532
7768 327532 368042 386657 464211 453304 433555 482379 340330 482081 315746 304587 309875
7757 309875 257590 204265 315506 420799 368956 440866 345325 350705 297661 364397 247163
7746B47163P1498j33278N8862K0532n5920J4529N189J15989o9306J15882j03985
7735B87155l3305J18124j07470O172K691n5108K9342O151K205K5063o8788R3865
7723C06097K552K9276M5909o6295K4326m0239Q8830o443j91934O4813J51975j15679
7711B93188p0099k0634J77283j05211N5197o2505K22929k08371Q1033m9780j28578
7700A84452J11355j9500Q3268k2720O9472j21016J14537j39852R5166J2634k6714
7689C41082j17848L6824O0965m9907J16318o0977j15180K20221j01330l9508O757
7678B97417j440K00266k03942O8161j36124O7557m4202L1619J78991j31674L9665
$$ plain form
7746 247163 318661 185383 244245 264777 208857 223386 228575 344564 275258 391140 287155
7735 287155 253850 371974 264504 270676 273367 218259 247601 253752 255957 281020 212232 306097
7723 306097 308649 337925 383834 317539 341865 301626 390456 384013 192079 256892 408867 293188
7711 293188 223089 202455 379738 274527 329724 267219 490148 281777 362810 313030 184452
7700 184452 295807 276307 359575 336855 406327 285311 399848 259996 355162 367796 341082
7689 341082 223234 260058 321023 271116 387434 326457 211277 431498 330168 290660 297417
7678 297417 295977 496243 292301 360462 224338 291895 247693 279312 458303 326629 366294
$$ [...]
##END NTUPLES=NMR SPECTRUM
##END=
