##TITLE=abcd
##JCAMPDX= 6.0         $$ Bruker NMR JCAMP-DX V2.0
##DATA TYPE= NMR SPECTRUM
##DATA CLASS= NTUPLES
##ORIGIN= UXNMR, Bruker Analytische Messtechnik GmbH
##OWNER= root
$$ XWIN-NMR		Version 3.5
$$ Fri Nov  7 18:41:59 2025 Russian Standard Time (UT+4h)  servis@DPX200
##.OBSERVE FREQUENCY= 200.131235884673
##.OBSERVE NUCLEUS= ^1H
##.ACQUISITION MODE= SIMULTANEOUS
##.ACQUISITION SCHEME= undefined
##.AVERAGES= 32
##.DIGITISER RES= 18
##SPECTROMETER/DATA SYSTEM= spect
##.PULSE SEQUENCE= zg
##.SOLVENT NAME= CDCl3
##.SHIFT REFERENCE= (INTERNAL, CDCl3, 0, 16.4885)
##AUDIT TRAIL= $$ (NUMBER, WHEN, WHO, WHERE, WHAT)
$$ ##TITLE= Audit trail, XWIN-NMR		Version 3.5
$$ ##JCAMPDX= 5.01
$$ ##ORIGIN= Bruker BioSpin GmbH
$$ ##OWNER= servis
$$ F:\spectra/data/av/nmr/H1/1/pdata/1/auditp.txt
$$ ##AUDIT TRAIL=  $$ (NUMBER, WHEN, WHO, WHERE, WHAT)
(   1,<2025-11-07 18:41:23.85 +0400>,<servis>,<DPX200>,
      <created by zg, POWCHK disabled, PULCHK disabled
       configuration hash MD5:
       00 E9 B6 7A A2 85 ED C7 34 08 36 98 17 FE 4E 26
       data hash MD5: 32K
       BA EC BD 78 86 8E 41 F7 0B 84 54 69 9A 73 61 33>)
(   2,<2025-11-07 18:41:34.62 +0400>,<servis>,<DPX200>,
      <Start of raw data processing
       efp BC_mod = 2 LB = 0.05 FT_mod = 6 PKNL = 1 PHC0 = -262.762 PHC1 = 1.301565 SI = 16K 
       data hash MD5: 16K
       C5 2D 32 AC 5A BC 77 8A C4 71 8C D4 0E F4 E4 3B>)
$$ ##END=
$$ 
$$ hash MD5
$$ 85 5D 73 AB DF 74 96 50 3D 23 0C F2 BF 2C 71 DF
##$RELAX= 
##$RELAX= 
##$RELAX= 
##$RELAX= 
##$RELAX= 
##$RELAX= 
##$RELAX= 
##$RELAX= 
$$ Bruker specific parameters
$$ --------------------------
##$DU= <F:\spectra>
##$EXPNO= 1
##$NAME= <H1>
##$PROCNO= 1
##$TYPE= <nmr>
##$USER= <av>
##$AMP= (0..31)
100 100 100 100 100 100 100 100 100 100 100 100 100 100 100 100 100 100 
100 100 100 100 100 100 100 100 100 100 100 100 100 100 
##$AQSEQ= 0
##$AQ_mod= 1
##$AUNM= <au_zg>
##$AUTOPOS= <>
##$BF1= 200.13
##$BF2= 200.13
##$BF3= 200.13
##$BF4= 200.13
##$BF5= 500.13
##$BF6= 500.13
##$BF7= 500.13
##$BF8= 500.13
##$BYTORDA= 1
##$CFDGTYP= 0
##$CFRGTYP= 5
##$CHEMSTR= <none>
##$CNST= (0..31)
1 1 145 1 1 1 1 1 1 1 1 1 1 1 1 1 1 1 1 1 1 1 1 1 1 1 1 1 1 1 1 1 
##$CPDPRG= <>
##$CPDPRG1= <>
##$CPDPRG2= <>
##$CPDPRG3= <>
##$CPDPRG4= <mlev>
##$CPDPRG5= <mlev>
##$CPDPRG6= <mlev>
##$CPDPRG7= <mlev>
##$CPDPRG8= <mlev>
##$CPDPRGB= <>
##$CPDPRGT= <>
##$D= (0..31)
0 2 0 0 0 0 0 0 0 0.06 0 0 0 0 0 0 0.0002 0 0 0 0 0 0 0 0 0 0 0 0 0 0 
0 
##$DATE= 1762526483
##$DBL= (0..7)
120 120 120 120 120 120 120 120 
##$DBP= (0..7)
150 150 150 150 150 150 150 150 
##$DBP07= 0
##$DBPNAM0= <>
##$DBPNAM1= <>
##$DBPNAM2= <>
##$DBPNAM3= <>
##$DBPNAM4= <>
##$DBPNAM5= <>
##$DBPNAM6= <>
##$DBPNAM7= <>
##$DBPOAL= (0..7)
0.5 0.5 0.5 0.5 0.5 0.5 0.5 0.5 
##$DBPOFFS= (0..7)
0 0 0 0 0 0 0 0 
##$DE= 6
##$DECBNUC= <off>
##$DECIM= 32
##$DECNUC= <off>
##$DECSTAT= 4
##$DIGMOD= 1
##$DIGTYP= 9
##$DL= (0..7)
0 120 120 120 120 120 120 120 
##$DP= (0..7)
150 150 150 150 150 150 150 150 
##$DP07= 0
##$DPNAME0= <>
$$ [...]
##$SUBNAM4= <"">
##$SUBNAM5= <"">
##$SUBNAM6= <"">
##$SUBNAM7= <"">
##$SUBNAM8= <"">
##$SUBNAM9= <"">
##$SW= 20.6817932712277
##$SWIBOX= (0..15)
0 0 3 0 0 0 0 0 0 0 0 0 0 0 0 0 
##$SW_h= 4139.07284768212
##$TD= 32768
##$TD0= 1
##$TE= 0
##$TE2= 300
##$TE3= 300
##$TEG= 300
##$TL= (0..7)
0 120 120 120 120 120 120 120 
##$TP= (0..7)
150 150 150 150 150 150 150 150 
##$TP07= 0
##$TPNAME0= <>
##$TPNAME1= <>
##$TPNAME2= <>
##$TPNAME3= <>
##$TPNAME4= <>
##$TPNAME5= <>
##$TPNAME6= <>
##$TPNAME7= <>
##$TPOAL= (0..7)
0.5 0.5 0.5 0.5 0.5 0.5 0.5 0.5 
##$TPOFFS= (0..7)
0 0 0 0 0 0 0 0 
##$TUNHIN= 0
##$TUNHOUT= 0
##$TUNXOUT= 0
##$USERA1= <user>
##$USERA2= <user>
##$USERA3= <user>
##$USERA4= <user>
##$USERA5= <user>
##$V9= 5
##$VALIST= <valist>
##$VCLIST= <CCCCCCCCCCCCCCC>
##$VD= 0
##$VDLIST= <DDDDDDDDDDDDDDD>
##$VPLIST= <PPPPPPPPPPPPPPP>
##$VTLIST= <TTTTTTTTTTTTTTT>
##$WBST= 1024
##$WBSW= 30
##$XGAIN= (0..3)
0 0 0 0 
##$XL= 0
##$YL= 0
##$YMAX_a= 316494
##$YMIN_a= -176838
##$ZGOPTNS= <>
##$ZL1= 120
##$ZL2= 120
##$ZL3= 120
##$ZL4= 120
##$ABSF1= 0
##$ABSF2= 0
##$ABSG= 0
##$ABSL= 0
##$ALPHA= 0
##$AQORDER= 0
##$ASSFAC= 0
##$ASSFACI= 0
##$ASSFACX= 0
##$ASSWID= 0
##$AUNMP= <proc_1d>
##$AZFE= 0.1
##$AZFW= 0.1
##$BCFW= 0
##$BC_mod= 2
##$BYTORDP= 0
##$COROFFS= 0
##$CY= 18.4799938201904
##$DATMOD= 1
##$DC= 0
##$DFILT= <>
##$DTYPP= 0
##$F1P= 9.9274215381318
##$F2P= -0.165520771350173
##$FCOR= 1
##$FTSIZE= 16384
##$FT_mod= 6
##$GAMMA= 0
##$GB= 0
##$INTBC= 1
##$INTSCL= 4.127829e-11
##$ISEN= 128
##$LB= 0.05
##$LEV0= 0
##$LPBIN= 0
##$MAXI= 10000
##$MC2= 0
##$MEAN= 0
##$ME_mod= 0
##$MI= 50
##$NCOEF= 0
##$NC_proc= -8
##$NLEV= 6
##$NOISF1= 3.799351
##$NOISF2= 2.8
##$NSP= 0
##$NTH_PI= 0
##$NZP= 0
##$OFFSET= 16.48848
##$PC= 4
##$PHC0= -262.762
##$PHC1= 1.301565
##$PH_mod= 1
##$PKNL= yes
##$PPARMOD= 0
##$PSCAL= 4
##$PSIGN= 0
##$REVERSE= no
##$SF= 200.130005582386
##$SI= 16384
##$SIGF1= 3
##$SIGF2= 2
##$SINO= 400
##$SIOLD= 16384
##$SREGLST= <1H.CDCl3>
##$SSB= 0
##$STSI= 16384
##$STSR= 0
##$SW_p= 4139.07284768211
##$SYMM= 0
##$S_DEV= 0
##$TDeff= 32768
##$TDoff= 0
##$TI= <>
##$TILT= no
##$TM1= 0
##$TM2= 0
##$TOPLEV= 0
##$USERP1= <user>
##$USERP2= <user>
##$USERP3= <user>
##$USERP4= <user>
##$USERP5= <user>
##$WDW= 1
##$XDIM= 16384
##$YMAX_p= 410274314
##$YMIN_p= -2544423
$$ End of Bruker specific parameters
$$ ---------------------------------
##NTUPLES= NMR SPECTRUM
##VAR_NAME=  FREQUENCY,     SPECTRUM/REAL,   SPECTRUM/IMAG
##SYMBOL=    X,             R,               I
##VAR_TYPE=  INDEPENDENT,   DEPENDENT,       DEPENDENT
##VAR_FORM=  AFFN,          ASDF,            ASDF
##VAR_DIM=   16384,         16384,           16384
##UNITS=     HZ,            ARBITRARY UNITS, ARBITRARY UNITS
##FACTOR=    0.252644378177508, 1,           1
##FIRST=     3299.83951724647, 0,            0
##LAST=      -839.233330435636, 0,           0
##MIN=       -839.233330435636, -2544423,    0
##MAX=       3299.83951724647, 410274314,    0
$$ Real data points
##PAGE= N=1
##DATA TABLE= (X++(R..R)), XYDATA
$$ [...]
9742G08756K58691m09804q4660K90844j83339l46156r1800n6912J8707j59063
9732e4736O25093Q10249j257220Q9334n7568N17111j78466m30182L13439P54491
9722A131545K62227o20161K58918q67071k38790j79423J44630J207142j509584
9713d10567M88607J39099P89422k93859O67960j105187k24497j08381M403M08684
9703C55684P68188o28058k87950J55752P72311m05036j134467N97261L38105J38976
9693F70766m85606L50930n32555J19046O90381j212568K86025M53262M34617l41921
9683D32377J77068r93032J082643o46991L84732J61739l08203l08060N24115k77222
9673B29166n8420N48713m52335J51496L50779k28204J59531n54046M87664k60122
$$ y = [708756, 967447, 557643, 472983, 763827, 580488, 234332, 142532, 85620, 104327, -54736, 570357, 1380606, 123386, 212720, 155152, 672263, 493797, 63615, 377054, 1131545, 1393772, 773611, 1032529, 165458, -73332, -252755, -108125, 1099017, -410567, 78040, 217139, 1006561, 712702, 1380662, 275475, 50978, -57403, -53000, 355684, 1123872, 495814, 207864, 363616, 1135927, 730891, -403576, 193685, 531790, 670766, 185160, 536090, 3535, 122581, 812962, -399606, -113581, 339681, 774298, 432377, 609445, -383587, 699056, 52065, 436797, 598536, 290333, -17727, 506388, 229166, 170746, 719459, 267124, 418620, 769399, 541195, 700726, 146680, 634344, 374222]
9663C74222N18608o24063O86044n78829L09134j71443K47262j060170J023912
9654G24677k86005P9226k91387K05093N88028o67807L81224n86382K5083k98045
9644a26295n09812J543694p10018l74736L91263j0422j01320M4869P04727o69343
9634A82607O48152o97220M49473m73141P07252n29319j3326J74768M00940q71806
9624b1620L38603n233J49223n39583L05540j364515J706552o32076J05983J23468
9614A66342r8563p053o76600M94457j92812R99386r97313K32060J426460o71439
9604F74925l35839J26139N5251j97372j87312O11983j00105O9964K94091M24923
9594A436648j054169P02719l85926L51125m86067j51086n76739N84287n9544J02481
$$ y = [374222, 892830, 268767, 954811, 375982, 685116, 513673, 760935, -299235, 724677, 438672, 517898, 226511, 431604, 1019632, 351825, 733049, 146667, 171750, -126295, -636107, 907587, 197569, -177167, 214096, 203674, 102354, 147223, 851950, 182607, 830759, 133539, 583012, 109871, 817123, 287804, 274478, 449246, 850186, -21620, 316983, 311750, 460973, -78610, 226930, -1137585, 568967, -63109, 42874, 166342, 67779, 60726, -615874, -121417, -314229, 685157, -312156, -80096, 1346364, 674925, 339086, 465225, 520476, 323104, 135792, 747775, 647670, 717634, 1011725, 1436648, 382479, 1085198, 699272, 1050397, 564330, 413244, -163495, 420792, 361248, 463729]
9584D63729m5066k62876O85346j92084M22512O5454l37711J50494n48974P31363
9574A132187j262259J62853J087703m67411k49480M6636P19772J13326p44025
9565E39302m76123P98258n29160O44922q70845N49988k78651N23831k58880K70004
9555I12646m35825N28069l18268j11912K6002l5190J13756P35827p92256K22147
9545H44996m7089l13911n08840M53835M85845J78372m89035n35586j37456M54109
9535C85240l7208R18467j153968O2568M84762N94048j091149L4197P64238m25215
9525E35980J77156K89319m88475o84603L84414k69295O82903J55992M2618j081982
9515b55973K68882J147382m68107j1644K85769k12973k82339K98756l37245J86411
$$ y = [463729, 418663, 155787, 841133, 649049, 1071561, 1137015, 799304, 949798, 400824, 1132187, -130072, 32781, 1120484, 653073, 403593, 450229, 1170001, 1283327, 539302, 63179, 861437, 332277, 977199, 106354, 656342, 377691, 901522, 642642, 912646, 476821, 1004890, 686622, 574710, 600712, 565522, 679278, 1415105, 622849, 844996, 797907, 483996, -24844, 428991, 914836, 1093208, 604173, 68587, -68869, 385240, 348032, 1266499, 112531, 175099, 659861, 1253909, 162760, 196957, 961195, 535980, 713136, 1002455, 513980, -170623, 213791, -55504, 627399, 783391, 826009, -255973, 12909, 1160291, 692184, 680540, 966309, 753336, 470997, 769753, 432508, 618919]
9505F18919J36982q548q89186J050937r93175J116147j048846P89421n95018k03567
9495b5934R91461J32110l38506R5768K67336n42621o08623J261682q86447j24794
9485B21432K78428k71324J27351l57046L39598N73601k83817P48774k268965J299366
9475D07398o0804L32791j44863J50948l80192j45080O03234n74394M76973j6944
9465F49067K9716K43724n71603N89651j12029j162l37284m37867J896598j367067
9455E81744M85449l61044r24348J128385P3408M57297j220219Q1662J51896K07304
9445F61534n37163n45220R19332Q39731M01502j237679L80807q92582O76440m87322
9435A79380J052933m60608l8807m03117P12986m23628P43743k24033K24921q68598
$$ y = [618919, 755901, 747353, -141833, 909104, -84071, 1032076, -16770, 772651, 177633, -25934, 965527, 1097637, 759131, 854899, 1122235, 579614, -29009, 1232673, 346226, 221432, 499860, 228536, 355887, -1159, 338439, 912040, 628223, 1376997, -891968, 407398, 346594, 679385, 534522, 685470, 305278, 160198, 763432, 189038, 666011, 649067, 678783, 922507, 350904, 940555, 828526, 827364, 490080, 52213, 1948811, 581744, 1067193, 706149, -218199, 910186, 983594, 1440891, 220672, 302334, 454230, 661534, 124371, -420849, 498483, 1338214, 1739716, 502037, 882844, -9738, 666702, 179380, 1232313, 771705, 732898, 329781, 1042767, 619139, 1362882, 1138849, 1363770, 495172]
9425D95172l9081l2067K38637J01175k39821k4977N93784r48375J379110l86774
9415A136783j282709R27549n77748P95511m24202P12177n92422j64171j21058
9406D09710Q09314m21961o3673q97147J120319J49812j16554o48534K86490o98517
9396g0741Q68662M73735j016303J439869j373762L81065k22204m23990J586331
9387A642662j166579J48044K81694l93573K66847r7491P06164p97615J39902j45443
9377E84612k32001P1717N39711J37920R9517n89323N51869l5206q07919O07769
9367I28666N08417m00410l3342M16062m915j059867N74923L55005J06480L4200
9357A425219j72360O5092J91869K98076o52268M86507l60783K77733m41046L86041
$$ y = [495172, 456091, 424024, 662661, 763836, 524015, 499038, 1092822, 144447, 1523557, 1136783, -145926, 781623, 203875, 999386, 575184, 1287361, 694939, 530768, 409710, 1219024, 797063, 733390, -163757, 956562, 1106374, 989820, 341286, 627776, -70741, 797921, 1271656, 255353, 1695222, 321460, 702525, 480321, 56331, 1642662, 476083, 624127, 905821, 512248, 779095, 681604, 1387768, 590153, 730055, 584612, 352611, 424328, 964039, 1101959, 1201476, 612153, 1164022, 1128816, 320897, 928666, 1437083, 1036673, 1003331, 1419393, 1414478, 354611, 929534, 1284539, 1391019, 1425219, 1252859, 1317951, 1509820, 1807896, 1155628, 1642135, 1281352, 1559085, 1118039, 1504080]
9347A504080o31046l23092N44902j60093P38928p93754R1324N57635n90080J74808
9337A113612k06092P62720q09496k37491k41134J106947m18122N99724j262344
9328D08324M90720R703J17419K62J44941K25098j448569J001117M64033k86391
9318A126657l85569L33728J56932l46517l80542K04589n7330N78008o30556N99356
9308A198756l42408j1570k26204Q59342q07300L38919M70371k01561j71319J46650
9298A253676M03734l79330o0678l74111M95114j75592l03009P4117J29579j44206
9288I19294J96545M0948J2881n0286m06533m329M72604k89041J034544p09259
9278A217368j87315j05479P49880l5045o13284K57744o65566O77301k92706J19434
$$ y = [1504080, 873034, 549942, 1094844, 934751, 1673679, 879925, 971249, 1528884, 938804, 1113612, 907520, 1670240, 860744, 623253, 382119, 1489066, 1070944, 1670668, 408324, 899044, 908747, 1026166, 1026428, 1171369, 1396467, -52102, 949015, 1413048, 1126657, 741088, 1074816, 1231748, 885231, 504689, 709278, 651948, 1229956, 599400, 1198756, 856348, 844778, 618574, 1477916, 670616, 1009535, 1479906, 1278345, 1107026, 1253676, 1657410, 1278080, 1217402, 843291, 1338405, 1162813, 859804, 933921, 1063500, 919294, 1115839, 1156787, 1169668, 1119382, 712849, 708520, 1181124, 892083, 1926627, 1217368, 1030053, 924574, 1674454, 1639409, 1026125, 1283869, 618303, 1295604, 1002898, 1122332]
9268A122332P42057l86015l62218N2468m67306J361833m00702l89766Q66642n18601
9258A620724l39868m10685M88757m18135K0734N71658o4254j27615R89105p81606
9248A548815j99639Q20393P4716J17548n54397Q20445q77612j93285Q5697Q38747
9238B481428o7817L33887J56292n77006K85652j07246n10209M47607l76801j45380
9228A920407M40373j085831J083068k96464N1594J229807n09244K83134n0955
9219C065889o98255l18299J109774P9819K74527r39483r09101J518837j20382
9210C063326r2208N52889r44729O20334K21083k592K11907K95131m89946M18155
9200C853350o74961N84879k35046N88964L78392k64510m78277J292534N7064k15403
$$ y = [1122332, 1864389, 1478374, 1116156, 1168624, 701318, 2063151, 1662449, 1272683, 2139325, 1620724, 1280856, 870171, 1358928, 940793, 961527, 1533185, 1468931, 1341316, 2330421, 1548815, 1349176, 2169569, 2244285, 2361833, 1807436, 2627881, 1750269, 1556984, 1642681, 2481428, 2413611, 2747498, 2903790, 2326784, 2612436, 2505190, 1994981, 2442588, 2065787, 1920407, 2360780, 1274949, 2358017, 2061553, 2113147, 3342954, 2833710, 3116844, 3065889, 2367634, 2049335, 3159109, 3238928, 3513455, 2573972, 1664871, 3183708, 3063326, 2971118, 3524007, 2579278, 3199612, 3420695, 3418103, 3630010, 3925141, 3435195, 3853350, 3178389, 3763268, 3528222, 4117186, 4495578, 4231068, 3752791, 5045325, 5102389, 4886986]
9190D886986K51371J91309q44494J076222J95035p23864K51348J28049J327983
9181F739945l08187o7109K49746K95165J7228R77860m47552K33045J074953j20859
9171H644235L22734k66769K95776O05995P99818J760473R81584n11898R92513
9162A3624461j84238M31285q1798j003179J242104j248291N28459O30684l44950
9153A3594537P36022j79471O70796j038110R83585p8116Q64198m56973k29908
9144A4866560M75113M592n6157j68596q619n09748M53243q6428Q42995P82841
9134A6595796m76302R7969P51997O66579n8375O0291l70709J67310N6859q25285
9124A6666130l53424j066448m24579l40846j051457R0815L10144M37024J40849
$$ y = [4886986, 5138357, 5329666, 4485172, 5561394, 5756429, 5032565, 5283913, 5411962, 6739945, 6431758, 6364649, 6614395, 6909560, 6926788, 7904648, 7457096, 7690141, 8765094, 8644235, 8966969, 8700200, 8995976, 9601971, 10401789, 12162262, 13143846, 12631948, 13624461, 13440223, 13871508, 13789710, 12786531, 14028635, 12780344, 13308803, 13939487, 13594537, 14330559, 14151088, 14821884, 13783774, 14767359, 14689243, 15553441, 15096468, 14866560, 15341673, 15346265, 15290108, 15121512, 15112893, 14603145, 15056388, 14969960, 15812955, 16595796, 16119494, 16217463, 16969460, 17636039, 17577664, 17637955, 17267246, 17434556, 17491415, 16666130, 16312706, 15246258, 14821679, 14480833, 13429376, 13520191, 13830335, 14267359, 14408208]
9115A4408208q49839K9822J529484N62788k85558k2187r28196N92974q21638O42645
9105A4858503j189623O63318M90582K06956K98553o93062q92583J079564r1292
9096A4730916J09545j020547J96756k06522K12774R63812J73930J41093j42845
9087A5158912O30528J41923L68990j36752J358624J25185J480100J375414o13211
9078A9889713J568486J56850M99650r27465q15602r74444j147592j523386q54186
9069A5872024j533882j253769l99031r07771j116927j2186p17847k24848j071347
9060H634416l09947m67623l68801J91308r76658l61339j62738n4943O2646p72196
9050E414125N43746p28717k31324l04653m14961o1546k33489L12747K6706j89473
$$ y = [14408208, 13558369, 13588191, 15117675, 15680463, 15394905, 15372718, 14444522, 15037496, 14215858, 14858503, 13668880, 14332198, 14822780, 15029736, 15328289, 14635227, 13742644, 14822208, 14730916, 14840461, 13819914, 14016670, 13810148, 14022922, 14986734, 15160664, 15301757, 15158912, 15789440, 15931363, 16300353, 16163601, 17522225, 17647410, 19127510, 20502924, 19889713, 21458199, 21615049, 22114699, 21187234, 20371632, 19397188, 18249596, 16726210, 15872024, 14338142, 13084373, 12685342, 11777571, 10660644, 10648458, 9930611, 9705763, 8634416, 8324469, 7856846, 7488045, 7679353, 6702695, 6341356, 6178618, 6123675, 6186321, 5414125, 5957871, 5229154, 4997830, 4693177, 4278216, 4216670, 3983181, 4295928, 4322634, 4133161]
9040D133161m69819M02409J67379l72575o22690L94480k54542j72334Q5078l66685
9030B923862L46527O91725j342173M32935m84924P86018J50969m76482m23088
9021B605369p93435Q01429k62609j72022l43919o2030K58046l58400r4260N20298
9011B098467K73566k52015n3127l66625N90947K41859n61142N04o84154J55018
9001A443298N10145N8771j98779N84395q55152K46623P08844q4843j031139N41116
8991A923279o98712O02083o0878o85170L65167m13373M36428J50479L22727k14021
8981A728009r1660j21367J03753k10071k69028K42891j21221L91996r72214L63746
8971A044834l23104N38345j28792K59707j9463K39672n11935K2948l47344m7177
$$ y = [4133161, 3663342, 4065751, 4233130, 3860555, 3237865, 3632345, 3377803, 3205469, 3290547, 2923862, 3270389, 3962114, 2619941, 3052876, 2567952, 3353970, 3504939, 3028457, 2605369, 1811934, 2613363, 2350754, 2178732, 1834813, 1772783, 2030829, 1672429, 1578169, 2098467, 2372033, 2120018, 2066891, 1700266, 2291213, 2533072, 1971930, 1972434, 1288280, 1443298, 1953443, 2012214, 1813435, 2397830, 1542678, 1789301, 2498145, 2413302, 1382163, 1923279, 1224567, 1826650, 1765772, 1080602, 1445769, 1032396, 1468824, 1619303, 1942030, 1728009, 1636349, 1514982, 1618735, 1408664, 1139636, 1382527, 1261306, 1653302, 681088, 1044834, 721730, 1260075, 1131283, 1390990, 1371527, 1611199, 1099264, 1122212, 774868, 727691]
8961G27691L18703P75076m85868n75061K99969K25082j71223J3547O48869o20615
8951A156170j09860k96237N70357n180p09335J020059k09149o92506K28454n14978
8941D37795J019239p07433J046N52609o83063L62455L06448l13655P50325m44987
8931A280779n831O2718l44522J99202m64543j017695J473121o66534J331994m90544
8921A358145L00201l66610n04403M57399K15385o59224M43492j67952P30915r97769
8911H09579Q2171Q6920L25837k00366m8761J23966M36813j137303P861K2658L45718
8900H55093p43247P47150k02069j33372J055231J23304k46078P7358n78467l07020
8890F47883K75574r3443K46928L46026n19703L6022m95886Q4027O70528k95735
$$ y = [727691, 1046394, 1821470, 1335602, 760541, 1060510, 1285592, 1114369, 1127916, 1776785, 1156170, 1046310, 750073, 1320430, 1315250, 605915, 1625974, 1416825, 724319, 952773, 437795, 1457034, 749601, 750647, 1303256, 620193, 982648, 1289096, 975441, 1725766, 1280779, 1274948, 1337666, 993144, 1192346, 727803, -289892, 1183229, 516695, 1848689, 1358145, 1658346, 1291736, 787333, 1244732, 1460117, 800893, 1244385, 1076433, 1807348, 809579, 891750, 978670, 1304507, 1104141, 1055380, 1179346, 1616159, 478856, 486717, 509375, 855093, 111846, 858996, 656927, 523555, 1578786, 1702090, 1456012, 1533370, 954903, 647883, 923457, 830014, 1076942, 1422968, 903265, 939287, 443401, 527428, 1197956, 902221]
8880I02221n1380p62084N93285l83646P52527m34090Q66872p49791j67423L31321
8870H97812N03144p93353K96897k64548J14055K95880r24239J246059k79101Q6503
8860A179109p07861N53118L1568l58789m70904K039928j624125l341m27543R37166
8850A148326m50776P70879k17016o28177M70059j69897n24132M3990o4083R54659
8840A333832n40769J26223n4038k77145q31628P16330N40199r5839p64654J118383
8830A270894j42695p02166j47313m29066J102482K31980q80590K32724l11487
8821B24763P60146M14912k03976k87470m49672K0272P8960k54860N92512q74869
8811B0718J505405j126625M7664K91070J96701k94830L01837o74896k50828R51858
$$ y = [902221, 850841, 88757, 682042, 298396, 1050923, 616833, 1483705, 733914, 566491, 897812, 1400956, 607603, 904500, 639952, 754007, 1049887, 125648, 1371707, 1092606, 1179109, 471248, 1024366, 1055934, 697145, 226241, 2266169, 642044, 638703, 211160, 1148326, 697550, 1468429, 1251413, 623236, 1093295, 923398, 399266, 443256, 379173, 1333832, 793063, 919286, 865248, 588103, -243525, 472805, 1013004, 917165, 152511, 1270894, 1128199, 426033, 278720, -150346, 952136, 1184116, 303526, 536250, 224763, 984909, 1399821, 1195845, 908375, 458703, 478975, 557935, 303075, 895587, 20718, 1526123, 399498, 447162, 738232, 934933, 640103, 941940, 267044, 16216, 968074]
8801I68074J05494p64230L47508J67518l98994m0244P04016L0328k6507n80719
8791E12244M07264p91860K23533N98308n70039n24840Q05481O36822k61553K80197
8781A315557k26827l27763O239j5776O94304j256389N95692L30566j33298j62602
8771H19703K48303M1520m18494L38407m26496K52176j46552J061708j167492r14598
8761c11815J005411L04293N54813j170709N6053k3079K35721L36266N74563r51158
8751F10359P52288j007429Q05104o72311P17297m48802M09205p240K75943q79561
8741E54853L87296j85859J73396l064M74056J30597K03188j750218P12354M93726
8731A190325m53025M12778N47952q96356M14548l6454m81767O2334o81397J210082
$$ y = [968074, 1073568, 309338, 656846, 824364, 425370, 385126, 1089142, 1119470, 1092963, 512244, 919508, 127648, 351181, 949489, 379450, -145390, 660091, 1296913, 1035360, 1315557, 1088730, 760967, 767206, 751430, 1445734, 189345, 785037, 1115603, 982305, 819703, 1068006, 1109526, 691032, 1029439, 602943, 855119, 708567, 1770275, 602783, -311815, 693596, 997889, 1552702, 381993, 438046, 414967, 650688, 986954, 1561517, 610359, 1362647, 355218, 1160322, 488011, 1205308, 756506, 1165711, 1158471, 1434414, 554853, 942149, 756290, 929686, 926622, 1400678, 1531275, 1734463, -15755, 696599, 1190325, 737300, 1150078, 1698030, 801674, 1216222, 1179768, 698001, 760335, 78938, 1289020]
8721A289020o18026L31609L00515O7707o86411J19206L24454k45367q34062L17893
8711C66538N82355N09357q31361k88062O07111j43112k33695M53650m50292l68182
8701B04307J084699j78531n46865R14518n92962J22652J017691q03911m51079
8692G70519J07778P06737j094923L37787L63225L32897q08265L23088L3979m85438
8682E87384L27016M85261m31513o3544m5146M7061k34453K81562k01612L29695
8672A081711M84768m15090L75914l16181m33606M67838l86842K91460o53061Q6882
8662E83793j68243N82270l60673j29104K98521R7267L21885j091259J708973j548040
8652B95390J207829j238001M53610l2858m04724M90001L87898k98892p067O87110
$$ y = [1289020, 670994, 1002603, 1303118, 1370825, 684414, 803620, 1128074, 882707, 48645, 366538, 948893, 1458250, 626889, 338827, 945938, 802826, 569131, 1022781, 572489, 204307, 1289006, 1110475, 563610, 1478128, 885166, 1007818, 2025509, 1221598, 770519, 878297, 1585034, 490111, 827898, 1191123, 1524020, 715755, 1038843, 1072822, 587384, 914400, 1399661, 968148, 904604, 859458, 906519, 672066, 953628, 752016, 1081711, 1566479, 1151389, 1527303, 1211122, 777516, 1245354, 858512, 1149972, 496911, 583793, 415550, 997820, 637147, 508043, 806564, 903831, 1225716, 134457, 1843430, 295390, 1503219, 265218, 718828, 685970, 281246, 771247, 1159145, 860253, 853186, 1540296]
8642A540296j111634K40121P60585q52730N4468j89959K03662o41296N61763L20139
8632H85415j71563L9114N65536k05074l89613K399k37898M59601J42973p5320
8622A015570o88112M15603M13297j94060l77095J00213k0120L29102p5203m23095
8612D96100N88444l03977J32969n28532O55364K30180o71228R78468j078429M72248
8602I71607r90755M44281N26076n31554Q76278j081582M17541o1004J45997K57865
8592I74750L64068n01742l40988L46508r13564J197400o97036P01321Q09418j011548
8582I28587N0650k47847P04O00190p79844K67603k45603L54893l2028K00243P03789
8571A801337o12864L06491j03127l43534k87638O0014M05503l36287M48617p26158
$$ y = [1540296, 428662, 668783, 1429368, 576638, 631106, 441147, 644809, 3513, 565276, 885415, 713852, 752966, 1318502, 1113428, 723815, 726214, 488316, 947917, 1090890, 1015570, 327458, 743061, 1156358, 962298, 585203, 685416, 665296, 994398, 919195, 496100, 1084544, 780567, 913536, 385004, 1040368, 1270548, 599320, 1577788, 499359, 971607, -19148, 425133, 951209, 419655, 1295933, 214351, 631892, 570888, 716885, 974750, 1338818, 837076, 496088, 842596, -70968, 1126432, 429396, 1130717, 1940135, 928587, 979237, 731390, 732094, 1332284, 552440, 820043, 574440, 929333, 897305, 1097548, 1801337, 1188473, 1494964, 1391837, 1048303, 760665, 820679, 1226182, 889895, 1338512, 612354]
8561F12354L10261P3563K99627o04066J39454O27358j382457P07046n06384J094629
8551A371385m40814K33806p58227N04210K60599L69302j083258J071640j106123
8542D22520N44293k29731M02952n68356L02948O3035k52398K51661o60594n0889
8532B25441O53056L541161k189679j70548o70816j01558L78286l90813j13075
8523A161455j32062J6671j25820J92439j00508k42280L64903j20371N4933K31012
8513A300372j80822Q4190m96888k76841K70963O97130p12090J50361M91831p1277
8503A256929j75492l94452N40917j43153J93627p60401M24952L86860N85661r09385
8493A006063m96747K48758M26840o98337O33149k54492K52625M49665n29850l7522
$$ y = [612354, 922615, 996178, 1295805, 691739, 831193, 1458551, 76094, 783140, 276756, 1371385, 930571, 1164377, 406150, 910360, 1170959, 1540261, 457003, 1528643, 422520, 966813, 737082, 1140034, 571678, 874626, 937661, 685263, 936924, 276330, 225441, 878497, 4419658, 2229979, 2059431, 1388615, 1287057, 1665343, 1274530, 1161455, 1029393, 1046064, 920244, 1112683, 1012175, 769895, 1134798, 1014427, 1069360, 1300372, 1119550, 1203740, 706852, 430011, 700974, 1398104, 686014, 836375, 1328206, 1256929, 1081437, 686985, 1227902, 1084749, 1278376, 517975, 942927, 1329787, 1915448, 1006063, 509316, 758074, 1184914, 486577, 1119726, 865234, 1117859, 1567524, 1037674, 1000152]
8483A000152N61238j230262N36816J37421j05408n497k85522O51957j9928o84276
8473E56691K81248J074503m06920l1689n80842O54651r94730J035241j009263
8464E78890J16314P48346n81783J18361K31901o31039J615350j089583m91953
8455F14804L6121R50732p07691k98336j69743P05649m06707P91218j58476K824
8445A360395J41425o70531L97903J13872K04385j03116p7933p23844J027962j165864
8435E04654Q60560o19212K80238L04229m0487j371323J158136k28707M89052j29492
8425A207648k10881m21614O35250L55412k48024l13567J08155j86718m70861O35638
8415A090438J60397k09326N05693p22915L12139r3372L30386K96104o48756L24346
$$ y = [1000152, 1561390, 331128, 867944, 1005365, 899957, 894460, 608938, 1260895, 1240967, 556691, 837939, 1912442, 1505522, 1473833, 892991, 1547642, 552912, 1588153, 578890, 695204, 1443550, 861767, 980128, 1212029, 580990, 2196340, 1106757, 614804, 650925, 1601657, 893966, 595630, 425887, 1131536, 724829, 1516047, 1357571, 1360395, 1501820, 831289, 1229192, 1343064, 1547449, 1444333, 1366400, 642556, 1670518, 504654, 1365214, 746002, 1026240, 1330469, 1289982, -81341, 1076795, 848088, 1337140, 1207648, 996767, 575153, 1210403, 1565815, 1317791, 1004224, 1112379, 925661, 454800, 1090438, 1250835, 1041509, 1547202, 824287, 1136426, 1043054, 1373440, 1669544, 1020788, 1345134]
8405A345134N06230k35575k87501K84543q81270L28651L15791p04474L34108p5887
8395I29750n2982M91698j8974J89206M26794o33122j64686N22409j48030O32664
8385B174727j182604l93281P85929r36450p58914J010091R74443m71951J0707
8376A212697O59531n10496L9140l70592m49984K73861J11024R01711n37027O6903
8366A396768J13029l83321M25009j219590R20073J036611q79933R0427N80205
8357B079278k44624k32467k29415P0756n04530N04582p0950j54915R40494r38523
8347A219686Q0694q56500J317627o92250O73142j028210Q42998J87390k29545
8338A515032J66999o75610K43688J232301q80484m33892L48244M10766l32541
$$ y = [1345134, 1851364, 1615789, 1328288, 1612831, 731561, 1060212, 1376003, 671529, 1005637, 929750, 876768, 1368466, 1349492, 1538698, 1965492, 1332370, 1167684, 1690093, 1542063, 2174727, 992123, 598842, 1384771, 448321, -310593, 699498, 1673941, 1201990, 1212697, 1872228, 1361732, 1400872, 1030280, 580296, 854157, 965181, 1866892, 1329865, 1396768, 1509797, 1126476, 1551485, 331895, 1251968, 2288579, 1408646, 1499073, 2079278, 1834654, 1602187, 1372772, 1443528, 938998, 1443580, 1372630, 1217715, 2158209, 1219686, 1300380, 443880, 1761507, 1069257, 1742399, 714189, 1557187, 1744577, 1515032, 1682031, 1006421, 1250109, 2482410, 1601926, 1168034, 1516278, 1927044, 1594503]
8329A594503o69444R69944m44613p49926K48108M79146K73128j69236K35046k44361
8319A522295n22655l99428l69719J131604K09103m30411O86056o03099k8042P39169
8309A934873r24746P21243O27362j338667P15478m48818J39221L85917L22775
8300B134638p41749m86221M42161K73669k18048L90753n96678O98475n34582J02134
8290A464552q5916j8473j51274L46786O02243j124689J068204p33850R00683n20712
8280A747554m32191q82658J207729L96510o34176k11349M164l35167J39855J083287
8270B083558m86311L70666q2123j07683r4017M9439J41680L03629Q2917o14441
8260A647314J16132O9467M43148p1755j089183p9J148236n03943J9423J84941
$$ y = [1594503, 925059, 1895003, 1450390, 700464, 948572, 1427718, 1700846, 1531610, 1766656, 1522295, 999640, 600212, 230493, 1362097, 1571200, 1140789, 1826845, 1223746, 1195704, 1934873, 1010127, 1731370, 2358732, 1020065, 1735543, 1286725, 1425946, 1811863, 2134638, 1392889, 906668, 1348829, 1622498, 1404450, 1795203, 1198525, 1897000, 1362418, 1464552, 1378636, 1360163, 1208889, 1555675, 2157918, 1033229, 2101433, 1367583, 2268266, 1747554, 1315363, 432705, 1640434, 2036944, 1402768, 1191419, 1195583, 860416, 1000271, 2083558, 1597247, 1967913, 1885790, 1778107, 1684090, 1733529, 1875209, 2178838, 2261755, 1647314, 1763446, 1832913, 2276061, 2204306, 1115123, 1115044, 2263280, 1759337, 1778760, 1963701]
8250A963701l62897j69595K35285L80073J59686p95119L82475J1776k51934l3098
8240A520353K61566j91443M14923O3649p74114M46189K44393l47210N5646O02938
8230B296890l00580K50687r23366J21012P6723J07243j02980l21236P21539J29103
8220B055035Q240o6110j40337L20371j164694P53019o7296j36119R96657o56863
8210A901903L53280J61866j115740O46665q2949m35804L05733l79281J989237
8201C344910n29684r31899L91271M47906J25979o42258O15443p82844O02773L138737
8191E780334l527770L02023J03502q70503o54220J478882j477872J501044m96027
8182B139393K19550K42393m30626J73281L22027l82061R32509q96759l246k32436
$$ y = [1963701, 1600804, 1431209, 1666494, 2046567, 2206253, 1411134, 1793609, 1805385, 1553451, 1520353, 1781919, 1590476, 2005399, 2069048, 1294934, 1741123, 1985516, 1638306, 1693952, 2296890, 1996310, 2246997, 1323631, 1444643, 1521366, 1628609, 1525629, 1204393, 1925932, 2055035, 2063275, 1997165, 1856828, 2177199, 1012505, 1765524, 1698228, 1562109, 2558766, 1901903, 2255183, 2417049, 1301309, 1947974, 1865025, 1429221, 1734954, 1355673, 3344910, 2815226, 1883327, 2274598, 2722504, 2848483, 2206225, 2821668, 2038824, 2641597, 5780334, 2252564, 2554587, 2658089, 1787586, 1133366, 2612248, 1134376, 2635420, 2139393, 2358943, 2601336, 2170710, 2343991, 2666018, 2283957, 3216466, 2319707, 2316461, 2084025]
8172B084025Q97877k95028j98293m46072m37172J034652j26678k88800K62027
8163B486538M52751q49223O4252J16516Q1119J056039j067767r20708J075712
8154B495229L48760j002540L97125J094621q07012K33112K34738q91065M12130
8145B515098l46823N20062q37666J004844J14018J24976l79674J27665o38884
8136B203616L63849n39987O03801L07819K14032q2542r64480K64697j99257P74283
8126B945831k51051K95761J23877l65991J105085r96957j119629O16007k67K1355
8116B374021J30167N71755k45672P5145O62329j079108K08773m0092L77561O90477
8106C725356n15854k96610P01335n41390k59673K38768n79496M96777J001698
$$ y = [2084025, 2981902, 2686874, 2488581, 2042509, 1605337, 2639989, 2513311, 2224511, 2486538, 2939289, 2090066, 2154318, 2270834, 2351953, 3407992, 2340225, 1419517, 2495229, 2843989, 1841449, 2238574, 3333195, 2526183, 2759295, 2994033, 2102968, 2515098, 2168275, 2688337, 1850671, 2855515, 2969533, 3094509, 2714835, 2842500, 2203616, 2567465, 2027478, 2631279, 2939098, 3153130, 3070588, 2106108, 2370805, 2171548, 2945831, 2694780, 2990541, 3114418, 2748427, 3853512, 2856555, 1736926, 2352933, 2352666, 2374021, 2504188, 3075943, 2830271, 2905416, 3567745, 2488637, 2697410, 2657318, 3034879, 3725356, 3209502, 2912892, 3614227, 3072837, 2813164, 3051932, 2472436, 2969213, 3970911]
8097C970911m81123q36935J6078Q68298O12161q7606K64698j080525R4901P65621
8087D106479l95890N40095o56829O55081r8835P13217j130036j09101J008565
8078D632746r5525n61987N13845k88358m0590K76342l93854j55953J024720q5325
8068D826061l97959n62067R06265m1258K39808q91437j12169J456040j261533
8059D161751q4543J3708O32245p5341k31919R88377n89754M0987J28205o47189
8049D336527n30806P83814P58203L4804J87574j796089P8080J255821m27299j30936
8039D549693M17696m49067L83047K39858j086461N23211k40825O90147n53830
8030D473469j0024n37644J090375o84139N79308L73794m044k79212L16394m71680
$$ y = [3970911, 3489788, 2652853, 2668931, 3537229, 4149390, 4061784, 4326482, 3245957, 3340858, 4106479, 3710589, 4250684, 3593855, 4248936, 4150101, 4863318, 3733282, 3624181, 4632746, 4537221, 3975234, 4489079, 4200721, 4160131, 4436473, 4042619, 3886666, 4911386, 4826061, 4428102, 3866035, 4772300, 4731042, 4970850, 4079413, 3967244, 5423284, 4161751, 4077208, 4090916, 4723161, 4647820, 4415901, 5404278, 4814524, 4855511, 4983716, 4336527, 3805721, 4589535, 5347738, 5382542, 5570116, 3774027, 3852107, 5107928, 4680629, 4549693, 4967389, 4518322, 4901369, 5141227, 4054766, 4577977, 4337152, 5027299, 4473469, 4463445, 3925801, 5016176, 4332037, 4911345, 5285139, 5281095, 5001883, 5318277, 4846597]
8020D846597J41123l34471M79786K53981j284570J070918o23430L58985l74220
8011D534699J180136J257p62129O90773r34710J70995L77933L99188k57183O58126
8001F059085m77482K42970q26858P92454l09765J88673N00707m73949Q33824j098624
7991E431035K57822K57531k48471o74289L00116l20054P41433j94784p51831O02675
7981E401183q64246Q88833m44687k46892J09348P73480j01711j501606J178028
7972E191730k78329J42041q7738O6117J26243k66381O3020m60285M87149K32679
7962E216246k03057n9741J022188l95900r83391N51686J63278r72969J070730
7953E409070m34835N9451O75005j64269l10220l03252Q23668q9442l4547J64929
$$ y = [4846597, 4987720, 4653249, 5133035, 5387016, 4102446, 5173364, 4549934, 4908919, 4534699, 5714835, 5716092, 4953963, 5644736, 4710026, 4881021, 5258954, 5658142, 5400959, 6059085, 5581603, 5824573, 4997715, 5790169, 5480404, 5669077, 6169784, 5695835, 6529659, 5431035, 5688857, 5946388, 5697917, 5023628, 5323744, 5003690, 5745123, 5550339, 4798508, 5401183, 4536937, 5425770, 4981083, 4734191, 4843539, 5617019, 5515308, 4013702, 5191730, 4913401, 5055442, 4967704, 5033821, 5160064, 4893683, 4956703, 4496418, 4983567, 5216246, 5013189, 4953448, 5975636, 5579736, 4596345, 5148031, 5311309, 4338340, 5409070, 4974235, 5033686, 5708691, 5544422, 5234202, 4930950, 5754618, 5665176, 5630629, 5795558]
7943E795558n42201o61920N13989M16111Q20416j492593M72959J09211o7167O40865
7933F005228n05452L71995n92053O39482l00932Q5082n56348N65324l13125O83161
7923F082362q37382J69J03193J24523O31278m43392m1720N96508m23309l48556
7913E443674O88676M1425k92159k71514K4700J22357O31880R2264j14774k92175
7903F074354k38957O54931j213129J110242m33680R49490q15363K82819N16139
7894F886846r06365k06198J68867L47523j47636L50124m18078J43250j56829J96387
7884F257891p31423P44189J01137L52755o39919M68342l92857J49611o07789K43996
7874E945933P76389N97599p78218p444l52043m45547L80800l8755J57124L48179
$$ y = [5795558, 5253357, 4591437, 5105426, 5521537, 6341953, 4849360, 5322319, 5431530, 5364363, 6005228, 5499776, 5871771, 5279718, 5919200, 5618268, 5703350, 5147002, 5712326, 5399201, 6082362, 5244980, 5245149, 5348342, 5472865, 6104143, 5660751, 5619031, 6215539, 5792230, 5443674, 6132350, 6173775, 5881616, 5610102, 5634802, 5757159, 6389039, 6481303, 6366529, 6074354, 5835397, 6490328, 5277199, 6387441, 5953761, 6903251, 6087888, 6370707, 6886846, 5980481, 5774283, 5943150, 6290673, 6143037, 6493161, 6075083, 6218333, 6061504, 6257891, 5526468, 6270657, 6371794, 6724549, 6084630, 6552972, 6160115, 6309726, 5701937, 5945933, 6722322, 7319921, 6541703, 6534259, 6182216, 5736669, 6117469, 6078714, 6235838, 6584017]
7864F584017K83036l8677Q87248k062638Q65888M0517K01758l06199N06692K42521
7854G204163J082701K04910M323665p606830J061141m30861J167003j50063k78417
7845F577412J00239m35151L64708O45992j85532k458N0462p70760J106366k57869
7835G193409M87424K34051k62557j61529J72278n83892O8069P69917p715n5366
7825G854089L54525K13833k69969n952k45260k8259J017526L6894K9941Q40318
7815I797686m92339J89933M1139K91267l03959m16481m8572J191475p59011R25384
7805A0416522p10112P58796L15038j42374N05444K83268L41466K03845n68945
7796A1402948J53389O84901p58788P37513m99400M24954M73814m87281j63773
$$ y = [6584017, 6867053, 6828376, 7715624, 5652986, 6518874, 6559391, 6761149, 6454950, 6961642, 7204163, 8286864, 8491774, 12815439, 5208609, 6269750, 5838889, 7005892, 6855829, 6577412, 6677651, 6242500, 6607208, 7253200, 7067668, 7065210, 7115672, 6344912, 7451278, 7193409, 7680833, 7914884, 7652327, 7490798, 7663076, 7079184, 7147253, 7917170, 7909455, 7854089, 8208614, 8422447, 8152478, 8146526, 7901266, 7873007, 8890533, 8927427, 8957368, 9797686, 9305347, 9495280, 9536419, 9827686, 9523727, 9107246, 9058674, 10250149, 9491138, 10416522, 9706410, 10465206, 10780244, 10637870, 11143314, 11426582, 11768048, 11971893, 11402948, 11556337, 12241238, 11482450, 12219963, 11720563, 12145517, 12619331, 12132050, 11968277]
7787A1968277J82450N00397J060273j289561P06672l8592J65976m3503M40770
7778A3653159m32992j63684K34776J59394K05381L47447l98566R170P84057j91182
7768A4206960K79296k93166k16895J105815m50815M88271L12724j171617J90634
7759A4451207n17919J722936p41891Q7648o48227J332354n15040l82550O87524
7750A5476042p5972K66950p88960P41561K4427Q65242j907842J506425m38377
7741A5669496L87708p25281N05238P1671P65938N07526o46109R22460k66450k42813
7731A6949384M71324j79433k89150O83053O72229l53841j259122J195554J170050
7722A9060048r76978L97124O64065k5026j82805M26660J14304j76272L09657l51370
$$ y = [11968277, 12150727, 12651124, 13711397, 12421836, 13128508, 13089916, 13255892, 13212389, 13653159, 13220167, 13056483, 13291259, 13450653, 13656034, 14003481, 13604915, 13614085, 14398142, 14206960, 14486256, 14193090, 13976195, 15082010, 14631195, 15119466, 15432190, 14260573, 14451207, 13933288, 15656224, 14914333, 15001981, 14353754, 15686108, 15171068, 14788518, 15476042, 15400070, 15667020, 14878060, 15619621, 15644048, 16509290, 14601448, 16107873, 15669496, 16057204, 15331923, 15837161, 15908832, 16674770, 17182296, 16536187, 17458647, 17192197, 16949384, 17420708, 17241275, 16952125, 17635178, 18307407, 17953566, 16694444, 17889998, 19060048, 18083070, 18480194, 19144259, 19119233, 18936428, 19363088, 19477392, 19301120, 19610777, 19259407]
7712A9259407K17844L71618j006996j33113N21865m2135l55317j45207L41331
7703A9029297p00789K72913k56121J047272p91569j83397R2713p24500N71602
7694A8357421j076504N02676K16360p35170N60218N77534p89141k68152K74106
7685A7619348R8799K0611k74075J121333j323441O25103p65930N43312R34332
7676A8599392n10245o74693L77169m06764Q14738p66963k63547Q36283m30129
7667A7575241r52382J116204n45784P94184m83100o03763L77527L20516L09570
7658A7908213l96407M20335p48905K69753m29216O98907m1504l83625l72763R85893
7648A7910681n29125K86476K72735J59520j69111m74400n93879J78216N32352
$$ y = [19259407, 19477251, 19848869, 18841873, 18708760, 19230625, 19188490, 18833173, 18687966, 19029297, 18328508, 18601421, 18345300, 19392572, 18601003, 18417606, 18510319, 17785819, 18357421, 17280917, 17783593, 17999953, 17264783, 17825001, 18402535, 17613394, 17345242, 17619348, 17718147, 17738758, 17464683, 18586016, 17262575, 17887678, 17121748, 17665060, 18599392, 18089147, 17414454, 17791623, 17384859, 18199597, 17432634, 17169087, 18005370, 17575241, 16622859, 17739063, 17193279, 17987463, 17504363, 16900600, 17278127, 17598643, 17908213, 17511806, 17932141, 17183236, 17452989, 17023773, 17722680, 17681176, 17297551, 16924788, 17910681, 17381556, 17668032, 17940767, 18100287, 17931176, 17456776, 16862897, 17041113, 17573465]
7639A7573465p73062K31817J46491o5047L11660n75547O32722r15637k61708N09113
7629A6814267K87587N8942q21127N62435J1590p9117r3413L42057j94824n02030
7619A6386367j59848N63148J70863l51632J62243P79113o12441J011008q93839
7610A7054982j4318l0942N13991k23631N7852K84525L15065m73929k22988K58031
7600A7518638p2181l36360O14915o18510L08518j08044M66705m37961J296459
7591A8632179j281412n76106J364120j071868R23652J23625L9808m94799Q7349
7582A7746548j21015O70744l32110N32434J276913j089605N2853l91564k87344
7573A8057854L197J586669r53337k11886p9316L51511k11176M33705M56343L75283
$$ y = [17573465, 16800403, 17032220, 17178711, 17113664, 17425324, 16849777, 17482499, 16566862, 16305154, 16814267, 17101854, 17160796, 16339669, 16902104, 16913694, 16834577, 16741164, 17083221, 16888397, 16386367, 16226519, 16789667, 16960530, 16608898, 16771141, 17550254, 16937813, 17948821, 17054982, 17040664, 17009722, 17523713, 17300082, 17357934, 17642459, 17957524, 17483595, 17260607, 17518638, 17446457, 17110097, 17725012, 17106502, 17415020, 17306976, 17773681, 17335720, 18632179, 17350767, 16774661, 18138781, 17066913, 17990565, 18114190, 18153998, 17659199, 17746548, 17625533, 18296277, 17964167, 18496601, 19773514, 18683909, 18736762, 18345198, 18057854, 18061051, 19647720, 18694383, 18482497, 18403181, 18754692, 18543516, 18977221, 19433564, 19808847]
7563A9808847K89629q46621R75625L62290l87744j318990J232415R31063m72186
7554B0574328n46196K39752J067097K51417j467721J278864q26484N86125N16865
7545B1674047p85691p7457M72102k13104J330905K30258j317311j48070N52589
7536B1718268o7727K81445R09137j018056n62694Q06862K2812L12635j48637l81470
7526B1872575M07901o3465l41185J93151P78988n6235r95364O12201P1170l4520
7516B2445217N63411P1432j6805Q8404k50018j56377L77307p2417J324976n9542
7506B4315588j31662J89110L51206q6809k87026J342232l48253q4087M20702k97166
7496B5383835J299300k98868L08429K35072L43070Q43601L60197M05411J029888
$$ y = [19808847, 20098476, 19251855, 20227480, 20589770, 20202026, 18883036, 20115451, 21046514, 20574328, 20028132, 20267884, 21334981, 21586398, 20118677, 21397541, 20571057, 21157182, 21674047, 20888356, 20810899, 21283001, 21069897, 22400802, 22631060, 21313749, 21165679, 21718268, 21650541, 21931986, 22841123, 21823067, 21260373, 22067235, 22090047, 22402682, 22254045, 21872575, 22280476, 22217011, 21875826, 22068977, 22847965, 22791730, 21796366, 22408567, 22479737, 22445217, 23008628, 23080060, 23063255, 23151659, 22901641, 22745264, 23122571, 23050154, 24375130, 24315588, 24183926, 24373036, 24724242, 24637433, 24350407, 25692639, 25344386, 25260299, 25681001, 25383835, 26683135, 26384267, 26692696, 26927768, 27270838, 28114439, 28474636, 28880047, 29909935]
7487B9909935N44370n48359k6962J530046J044259M41441k76403J59715J554096
7478C4332138J449704L14896J588432J027505J258275N56869R05232J741389P47939
7469D3922379R47312J899126l58227M81329N13918j17324r4871P03044p0515L57242
7459D8183413n9163Q59159j31837Q65900P55554j19720j5911J237677m13837J25844
7449E1287079Q75449L19819j016573L99063K79284Q34258m2717K47630J303222
7440E4486514K16650m24158J372540L1887J734911j083846N53148K53790p84081
7431E6357355o83487p20113p28166k63068j461763l02592m16381j023675O40107
7422E1398217j10440p0280R94066R35370q67445L07766P01062m37900M49921p28278
$$ y = [29909935, 30454305, 29905946, 29878984, 31409030, 32453289, 32894730, 32618327, 32778042, 34332138, 35781842, 36096738, 37685170, 38712675, 39970950, 40527819, 41433051, 43174440, 43922379, 44869691, 46768817, 46410590, 46891919, 47405837, 47288513, 47193642, 47896686, 47826171, 48183413, 48124250, 48983409, 48851572, 49717472, 50473026, 50353306, 50337395, 51575072, 51161235, 51287079, 52162528, 52482347, 51465774, 51864837, 52144121, 52978379, 52935662, 53183292, 54486514, 54703164, 54279006, 55651546, 55683433, 57418344, 56334498, 56887646, 57141436, 56357355, 55673868, 54953755, 54225589, 53962521, 52500758, 52198166, 51781785, 50758110, 51398217, 51287777, 51217497, 52211563, 53146933, 52279488, 52587254, 53288316, 52850416, 53300337, 52572059]
7412E2572059k93657j08661M05059J45235r63366M60939N00125K02150n2936p52447
7402E2114500J0937N43815J81194P07711o2140L82500J317182r31249O20556J617769
7392E6502775L49573R35817P96297J346512K78259K093561N36631R84886J238068
7383F5062379J14068J003645k60672j044171j099227k301604k335558j188091
7375E7950769k637674j627436k687683j734049j579229k239405j548213p13580
7367D3183500j459122p40605p90839q29852j554364m02120m55575r76409M51033
7358C6425647j254895j46366p78310M91374l50492K4504n67013r63211J418262
7349C4299500j146393K90019m76721J27916J45576j309457M2185k07040J94914
$$ y = [52572059, 52278402, 52169741, 52574800, 52720035, 51756669, 52217608, 52717733, 52919883, 52866947, 52114500, 52125437, 52669252, 52850446, 53558157, 53496017, 53878517, 55195699, 54264450, 54885006, 56502775, 56852348, 57788165, 58584462, 59930974, 60209233, 62302794, 62839425, 63824311, 65062379, 65176447, 66180092, 65919420, 64875249, 63776022, 61474418, 59138860, 57950769, 55313095, 53685659, 50997976, 49263927, 47684698, 45445293, 43897080, 43183500, 41724378, 40983773, 40192934, 39363082, 37808718, 37406598, 36951023, 35974614, 36425647, 35170752, 35024386, 34246076, 34737450, 34386958, 34411462, 33844449, 32881238, 34299500, 33153107, 33443126, 32966405, 33094321, 33239897, 31930440, 31972625, 31765585, 31960499]
7340C1960499O37974j25221N60536N6027p03965j28245K02730L24731P86458k85438
7330C3286086r7020K76340P812O9383L52403L13630l25303j96223K22688O70p08967
7319C3201499J436045k52116k5148K90652J24761r37287J353003L13194J75520
7310C5680123k10337l61696L55151P22327j65890k45820o99884J049876m22073
7301C5701777M13683M59173j43469K95384p3085O27457J27061l60915O48164q79978
7291C6815252M83581P58903P4533j31716m71292K25601O48368l69522J621154
7282C9654862k147734J294794O61519K07187j002111R58980q9590J04005K56706
7273C9898618k2539j77008Q60127L11685K05691o73224O31022k77846M92210n18486
$$ y = [31960499, 32598473, 32473252, 33033788, 33089815, 32385850, 32257605, 32460335, 32785066, 33571524, 33286086, 33189066, 33465406, 33473218, 33542601, 33895004, 34208634, 33883331, 33687108, 33909796, 33910466, 33201499, 34637544, 34385428, 34360280, 34650932, 34775693, 33838406, 35191409, 35504603, 35680123, 35469786, 35108090, 35463241, 36185568, 36019678, 35773858, 35073974, 36123850, 35701777, 36115460, 36574633, 36431164, 36726548, 36653463, 37280920, 37407981, 37047066, 37695230, 36815252, 37298833, 38057736, 38132269, 38000553, 37529261, 37754862, 38403230, 38033708, 39654862, 37507128, 38801922, 39463441, 39670628, 38668517, 39627497, 39537907, 39641912, 39898618, 39876079, 39699071, 40559198, 40870883, 41076574, 40403350, 41034372, 40756526, 41248736, 40730250]
7263D0730250R26421p51038M03049K25289k84465K47306R93349J43232m29089
7254D2204304M66137J056224J64753k13051K974J43541J035363K12077m69731
7245D4602591R41691p5368l76115J325825K76921O79767J04990l60736L75583
7236D7495149K00339J43374k11292K14647l58497J197333O3870N4727k00187o98165
7226D7901298J54043N83431P20460p08322R79099J56300l42826P56564J02112
7217E0302159Q41277m61202R34059L70617l40951L48844r1095R32135N08062K79873
7207E3623778M94891L79691r6948K36315K204745j583178J295070J295128l07812
7198E7541680P64349M11752Q21258N74888m72971J212655Q29689q8770M66585
$$ y = [40730250, 41656671, 40905633, 41308682, 41533971, 41249506, 41496812, 42490161, 42633393, 42204304, 42670441, 43726665, 43891418, 43678367, 43681341, 43824882, 44860245, 45072322, 44602591, 45544282, 45468914, 45092799, 46418624, 46695545, 47375312, 47480302, 47119566, 47495149, 47695488, 47838862, 47627570, 47842217, 47483720, 48681053, 48744923, 48799650, 48599463, 47901298, 48055341, 48638772, 49359232, 48650910, 49630009, 49786309, 49443483, 50200047, 50302159, 51143436, 50682234, 51616293, 51986910, 51645959, 51994803, 51903708, 52835843, 53343905, 53623778, 54118669, 54498360, 54401412, 54637727, 56842472, 55259294, 56554364, 57849492, 57541680, 58306029, 58717781, 59539039, 60113927, 59640956, 60853611, 61683300, 61594530, 62061115]
7189F2061115Q60986M74230n484J835932J027056j5611J064160J86689J091219
7180F8580292L35098M31331Q5943M25284J047693L00462K38567R14718K4926L32117
7170G2716431O70132O00319Q34510J70349J46922J228065K75807L94180k64R97651
7160G8034102m3690J029932J187076l92516R29049K41742P07225R07124K77186
7151H2877230J690839j009957J399674O91989L99615J179636J039578Q99795J55792
7142H9324191M93595P06159P61954L30891J489846J168539J52830J117235R48643
7133I6493883M03751J330929N61905J336830J442596J99944K40668J385261J145521
7124A04541288J312235J271975N62152J166083O95786J111386J907093N34252
$$ y = [62061115, 62922101, 63396331, 63390847, 65226779, 66253835, 66238224, 67302384, 67489073, 68580292, 68915390, 69346721, 69432664, 69857948, 70905641, 71206103, 71444670, 72359388, 72384314, 72716431, 73386563, 73986882, 74821392, 74991741, 75138663, 76366728, 76642535, 77036715, 77036451, 78034102, 77990412, 79020344, 80207420, 79814904, 80743953, 80985695, 81692920, 82600044, 82877230, 84568069, 83558112, 84957786, 85649775, 86049390, 87229026, 88268604, 89168399, 89324191, 89817786, 90523945, 91285899, 91616790, 93106636, 94275175, 94428005, 95545240, 96493883, 96897634, 98228563, 98790468, 100127298, 101569894, 101769838, 102010506, 103395767, 104541288, 105853523, 107125498, 107687650, 108853733, 109549519, 110660905, 112567998, 113102250]
7116A13102250P87644R28442P60234J151279J430385J090382J646988J049462
7108A21947066O30072J655879J331660J695186J451448J964360J871392J546994
7100A34094057P35148J510340J190519J693710J073305J385819J143474J313893
7092A44140265J932477J488458L21066K264471J281834J027740K602591J539782
7084A56598684J719464K049244K326253J180039J501433J452335J097824K490867
7076A70416143J669467K344933J394676J587736J580655L117294K807716J342674
7068A86261294L561223L079614K526221K189249K827824K920167L245798J869256
7060B08480646L693853M324392K746184M390987M345256L873449M066502L834258
$$ y = [113102250, 113889894, 114818336, 115578570, 116729849, 118160234, 119250616, 120897604, 121947066, 122577138, 124233017, 125564677, 127259863, 128711311, 130675671, 132547063, 134094057, 134829205, 136339545, 137530064, 139223774, 140297079, 141682898, 142826372, 144140265, 146072742, 147561200, 147882266, 150146737, 151428571, 152456311, 155058902, 156598684, 158318148, 160367392, 162693645, 163873684, 165375117, 166827452, 167925276, 170416143, 172085610, 174430543, 175825219, 177412955, 178993610, 182110904, 184918620, 186261294, 189822517, 192902131, 195428352, 197617601, 200445425, 203365592, 206611390, 208480646, 212174499, 216498891, 219245075, 223636062, 227981318, 231854767, 235921269, 239755527]
7052B39755527L470260L608893M147983K883409M124582L197964M463510L185675
7044B68837803M527859L997014N237465M849226N906833N763361O026703M078648
7036C09224912M730188L868937M032639L216787L587214L163519K901317L067114
7028C37792627K416977L995149L104745L738117M187056M080609L878123M085839
7020C67279242M472243M069206M172885K770524K861450K314875J705223J004981
7012C90650629J738286J066646R47102M38802K310435J444111J282859K749799
7004D02628669K380876K529430J651706J083633q8447j120850j896657j668648
6996D05499712k025699j883537j871542k050858j659034r28626k00052j334844
$$ y = [239755527, 243225787, 246834680, 250982663, 253866072, 257990654, 261188618, 265652128, 268837803, 273365662, 277362676, 282600141, 287449367, 293356200, 299119561, 305146264, 309224912, 313955100, 317824037, 321856676, 325073463, 328660677, 331824196, 334725513, 337792627, 340209604, 344204753, 347309498, 351047615, 355234671, 359315280, 363193403, 367279242, 371751485, 375820691, 379993576, 382764100, 385625550, 387940425, 389645648, 390650629, 392388915, 393455561, 394402663, 394841465, 397151900, 398596011, 399878870, 402628669, 405009545, 407538975, 409190681, 410274314, 410185867, 409065017, 407168360, 405499712, 403474013, 401590476, 399718934, 397668076, 396009042, 395080416, 394880364, 393545520]
6988C93545520O72003J724630N12585J181058M8191J238984L80564P59324n17023
6979C99545836o49141J46901J0779l70344l72168r37172m56446l44810M87891
6970C97061326o57049J432850J333510J65198J131243r5127j762817m29421k767081
6961C95412632j834465k437694j867452l093196m31076l49711r49215K019775
6953C86469598q27451l8919K07675j372240k170414m604142m796246n739232q373828
6944C58754801p748771p960653p185025p177845o268889o985207o029497o071406
6936C03327508m683752l144863m040043k933296k777498k977075k702718k263311
6928B77804952l014808l912491m192003n998502o472538p094094o366096p027415
$$ y = [393545520, 394217523, 395942153, 396454738, 397635796, 397683987, 398922971, 399303535, 400062859, 399545836, 398896695, 399043596, 399054375, 398684031, 398311863, 397374691, 396918245, 396573435, 397061326, 396404277, 397837127, 399170637, 399335835, 400467078, 400371951, 398609134, 398179713, 395412632, 393578167, 391140473, 389273021, 386179825, 385748749, 385399038, 384449823, 386469598, 385642147, 385603228, 385810903, 384438663, 382268249, 377664107, 372867861, 367128629, 358754801, 351006030, 343045377, 335860352, 328682507, 322413618, 315428411, 309398914, 303327508, 298643756, 295498893, 291458850, 288525554, 285748056, 282770981, 280068263, 277804952, 274790144, 270877653, 266685650, 260687148, 254214610, 247120516, 240754420, 233727005]
6920B33727005n075089o599052n947629n746298n553542m908927l859273m862089
6912A91175106l734845l801352l501516l232702l018515k943601k459029k342748
6904A66140798l955858k066853k835027l157207k592842k402118k924472j991154
6896A44215267l504511j533875j301847k693858k105920j016609j927521j260679
6888A28870447n01414k024412n03822j557535l56218j812768k76787j582073r95359
6879A19260059j168469j740512j151619j944970k190829k055889j29176k063431
6871A06815164k482664J04594j997269j100150m75007j366627o6508j522553j034961
6862I6874019j19139j015042r17352N02956q17327j2805l56061l61939l14630
$$ y = [233727005, 228651916, 222052864, 216105235, 210358937, 204805395, 199896468, 196037195, 191175106, 187440261, 183638909, 180137393, 176904691, 173886176, 170942575, 168483546, 166140798, 162184940, 160118087, 157283060, 154125853, 151533011, 149130893, 146206421, 144215267, 140710756, 139176881, 137875034, 135181176, 133075256, 132058647, 130131126, 128870447, 128369033, 126344621, 125840799, 124283264, 123927046, 122114278, 121837491, 120255418, 119260059, 118091590, 116351078, 115199459, 113254489, 111063660, 109007771, 108878595, 106815164, 104332500, 104437094, 102439825, 101339675, 100864668, 99498041, 99431533, 97908980, 96874019, 96754880, 95739838, 94822486, 95325442, 94508115, 94495310, 94139249, 93777310, 93462680]
6853I3462680L65629j33568k14425j6059P5056O8778N50255o32700j25859Q8406
6843I3488193N72370l01954l94588P33660o24057j12971J176637j037183K13041
6834I3713148O07032L0009K46166K46150j2688L44489L21225j28755O55612R84739
6824I7007127o91659P78727m54141N80845j32515k72469N61333J319435o48729
6815I8047954p2969J040540L68798k87501Q46313m2422m04539J107562L23855
6806A00927591j185525J473846o74797O6577o55857O83760P13407p64281o7551
6797A00517170L45510Q24050l13933O72512p87986J23631P49705l28869p02712
6788A01099078N72995j48597L03906j132238N70118n62743k74599K55226o61022
$$ y = [93462680, 93828309, 93694741, 93480316, 93464257, 93539313, 93608091, 94158346, 93525646, 93399787, 93488193, 94060563, 93758609, 93364021, 94097681, 93473624, 93360653, 94537290, 93500107, 93713148, 94320180, 94350189, 94596355, 94842505, 94829817, 95174306, 95495531, 95366776, 96022388, 97007127, 96315468, 97094195, 96640054, 97220899, 97088384, 96815915, 97377248, 98696683, 98047954, 97974985, 99015525, 99384323, 99096822, 99943135, 99900713, 99496174, 100603736, 100927591, 99742066, 101215912, 100541115, 100607692, 99951835, 100635595, 101349002, 100584721, 100517170, 100862680, 101686730, 101372797, 102045309, 101257323, 101380954, 102130659, 101801790, 101099078, 101672073, 101523476, 101827382, 100695144, 101265262, 100702519, 100427920, 100683146, 100022124]
6779A00022124J35238j240170R53491m02407J0099K8018m3313n52893K87849o84176
6769I8513860K41139m32541N6133j0421k49706M5504m97022o7615j75133l59293
6759I7064905r98325o63935K11962j824274N3036o50509n01116r49776r25574
6750I0816394l30006j555435l44914j172353p77123j53560k03901p01231p40771
6741H4837100m54294j88572l01571l58462r40091j087699k36132j439282j704114
6732G8126883q42991j928482n39010j412880r89934j300874j132575j038531J50251
6723F9091857j404232L7286p50507j402121p10962n05855n07383k75340m60785
6714F3111958j048763j173662k59694j004906r58691p45034j379387m18055j169173
$$ y = [100022124, 100157362, 98917192, 99870683, 99468276, 99478375, 99506393, 99463080, 98910187, 99198036, 98513860, 98754999, 98322458, 98378591, 98368170, 98118464, 98163968, 97666946, 97599331, 97424198, 97064905, 96066580, 95402645, 95614607, 93790333, 93843369, 93192860, 92691744, 91741968, 90816394, 90486388, 88930953, 88586039, 87413686, 86636563, 86483003, 86279102, 85577871, 84837100, 84382806, 84194234, 83892663, 83534201, 82594110, 81506411, 81270279, 79830997, 78126883, 77283892, 75355410, 74816400, 73403520, 72413586, 71112712, 69980137, 68941606, 69091857, 67687625, 67724911, 66974404, 65572283, 64861321, 64355466, 63848083, 63572743, 63111958, 62063195, 60889533, 60629839, 59624933, 58666242, 57921208, 56541821, 56123766, 54954593]
6705E4954593r94167M29431q70785o20743k12301l64607L22980j734121P63603
6696E1673883j069235L97176l72290l46051k5170j011063J110974j96255k3845
6687E0138124j35254R89845K98370j311341M74313J82888J6772N37076p64610
6678E0426183M27623n02247L11135o76587L89790L87505N37321o70654K04011
6669E0834080p37730N12477M1936M16728J31356L12258K53844O59830L38351P69778
6659E3532908J83607J064751J05804K27669O12255l58184J445825m79804O52554
6650E6987385r0492O06631n6360p41271q59048M73376q3681M06847J17828q34027
6640E5927188k77872L76430R52329N87664n12253J24471L86995J328322M5210
$$ y = [54954593, 53960426, 54389857, 53519072, 52898329, 52686028, 52321421, 52644401, 50910280, 51673883, 50604648, 51001824, 50629534, 50283483, 50258313, 49247250, 50358224, 50161969, 50138124, 50002870, 50992715, 51291085, 49979744, 50454057, 50636945, 50653717, 51190793, 50426183, 50853806, 50351559, 50662694, 49986107, 50375897, 50763402, 51300723, 50630069, 50834080, 50096350, 50608827, 50650763, 51067491, 51198847, 51511105, 51764949, 52424779, 52763130, 53532908, 53716515, 54781266, 54887070, 55114739, 55726994, 55368810, 56814635, 56334831, 56987385, 56896893, 57503524, 57447164, 56705893, 55846845, 56320221, 56236540, 56643387, 56761215, 55927188, 55649316, 56025746, 56978075, 57565739, 57053486, 57177957, 57564952, 58893274, 58938484]
6631E8938484O5844L83902Q76504k2696J13379O22571p18788K72249O92151P08833
6621F1932433r73758l81219j19164j100525l75496J9391n77516K75451j192498
6612E7507099J175853o05122m10429R51197m86551J391862M423O82720q7307p169
6602F0116576J081661Q324J012241n5122J28614L03256P95594j239498j205223
6593F0946423l24135k038781L38714r87935j194178l96158m45207j130715p03140
6584E4064888l55291N0291o88505P6938m08765R54728J79649J13920n06348R52638
6574E4434143R2760O76162K89032K43720j489509J572979J2188r16792j379090
6565E3535593j307470k82466j314629j50498j036249j003046p42175o46018k23457
$$ y = [58938484, 59004328, 59388230, 60264734, 60242038, 60355417, 60977988, 60259200, 60531449, 61223600, 61932433, 60958675, 60577456, 60458292, 59357767, 58982271, 59001662, 58424146, 58699597, 57507099, 58682952, 58077830, 57667401, 58618598, 58132047, 59523909, 59528332, 60211052, 60123745, 60116576, 61198237, 61206561, 62218802, 62163680, 62292294, 62595550, 63391144, 62151646, 60946423, 60622288, 58583507, 58922221, 57934286, 56740108, 56343950, 55898743, 54768028, 54064888, 53709597, 53759888, 53071383, 53148321, 52739556, 53694284, 53873933, 53987853, 53481505, 54434143, 54526903, 55203065, 55492097, 55735817, 54246308, 55819287, 55831475, 54914683, 53535593, 52228123, 51945657, 50631028, 50480530, 49444281, 48441235, 47699060, 47053042, 46829585]
6556D6829585n01723p08704J45046j141263k48392n3406j69810n89599l39675
6547D3222059M78571q825q96484o96103J92116Q77923m09066r42387l41942J09844
6537D1585706j545766m83012R79889j539064n07926m81454m18622n50653r33615
6528C6105483O08916p47526J80939r68232L85264m77013r94018Q15879j074284
6519C3835408O36550o75551J01201j259991J42667N47692J78086j426515L11564
6510C2391111j68405R0327m35173j44829J75434m83543r3182J95813p96761J56327
6500C0887119N74285n97588k55452O1527r18935N98562l45835j244611J627856
6491C0386928p62640q46241J27901r46975l0376J90617k94968L82292o41373k62691
$$ y = [46829585, 46327862, 45619158, 45764204, 44622941, 44374549, 44321143, 44151333, 43561734, 43222059, 43700630, 43691805, 42795321, 42099218, 42291334, 43169257, 42760191, 41817804, 41475862, 41585706, 40039940, 39556928, 40536817, 38997753, 38489827, 38008373, 37589751, 37039098, 36105483, 36714399, 35966873, 36147812, 35179580, 35564844, 35087831, 34093813, 34909692, 33835408, 34471958, 33796407, 33897608, 32637617, 32780284, 33327976, 33506062, 32079547, 32391111, 32222706, 32313033, 31877860, 31733031, 31908465, 31424922, 31331740, 31527553, 30730792, 30887119, 31461404, 30863816, 30608364, 30669891, 29750956, 30349518, 30003683, 28759072, 30386928, 29624288, 28778047, 28905948, 27958973, 27928597, 28119214, 27824246, 28206538, 27565165, 27302474]
6481B7302474n45348Q4251R5236p11438L20007L2943L80063r1950l35848o63159
6471B5867231p31625R98404j383154L27955K56644k22535M1733j20365L12341
6462B5346629o19124J10969J11834J73384n18625q34k7553n29321L03727j77790
6452B4173296m92802J85613n36539J5053k67727K88744m12876o3118M74435o25373
6442B2738706L48401n82855N3783L41763j00557p4615l65144l67086O59722m15152
6432B2236966j77319n35648O31279o23613M21253K80202m77442r23150R00458
6423B1732986O20611j187404k0246M97171P10930j355399J016138p97252J51371
6414B1368906K35995N5428r84273J103889o89521j64474L41873N75497r64918
$$ y = [27302474, 26757126, 26841377, 26936613, 26225175, 26545182, 26578125, 26958188, 26866238, 26530390, 25867231, 25135606, 26134010, 24750856, 25078811, 25335455, 25112920, 25154653, 25034288, 25346629, 24727505, 24838474, 24950308, 25123692, 24605067, 24604233, 24576680, 24047359, 24351086, 24173296, 23680494, 23866107, 23329568, 23344621, 23076894, 23365638, 22952762, 22889644, 23364079, 22738706, 23087107, 22504252, 22558035, 22899798, 22799241, 22724626, 22359482, 21992396, 22652118, 22236966, 22059647, 21523999, 22155278, 21531665, 21952918, 22233120, 21755678, 20832528, 21732986, 22353597, 21166193, 21145947, 21643118, 22354048, 20998649, 22014787, 21217535, 21368906, 21604901, 21660329, 20676056, 21779945, 21090424, 20925950, 21267823, 21843320, 20878402]
6405B0878402N83786j88385Q9589p78370L88833J83397n09904M68740m79851O4191
6395B0700428k16940j68414J043023p04506N30564q92858p2776L09350O52427
6386B1180298J08958r45479L62942j69847L35093K61475p26046L10665Q28025
6377B1546084r30258N52649k8345J72699p17192N90887k4804r43775M45010J14342
6367B0777297J8190M49813q73085M87359K20801l20773J543189q90500j148748
6358B0263543j04343K4648O01045o87271N46552k42042Q03676o74203m39013N94315
6348B0686907K55734J21299l84704l13566m9798J474873j102867j009718N66987
6339B0245147L79420N40255o36954O11107o93805L38703l27363M86288L11160
$$ y = [20878402, 21462188, 21273803, 21363392, 20585022, 20973855, 21157252, 20647348, 21116088, 20636237, 20700428, 20483488, 20315074, 21358097, 20653591, 21184155, 20291297, 20218521, 20527871, 21180298, 21289256, 20343777, 20706719, 20536872, 20871965, 21133440, 20407394, 20718059, 21546084, 20615826, 21168475, 21140130, 21312829, 20595637, 21186524, 21161720, 20217945, 20662955, 20777297, 20795487, 21245300, 20372215, 20859574, 21080375, 20759602, 22302791, 21412291, 20263543, 20159200, 20183848, 20784893, 20097622, 20644174, 20402132, 21205808, 20531605, 20092592, 20686907, 20942641, 21063940, 20679236, 20365670, 20315872, 21790745, 20687878, 19678160, 20245147, 20624567, 21164822, 20527868, 21138975, 20445170, 20783873, 20456510, 20942798, 21253958]
6330B1253958j337939J24852M27862j24742k48358P1065j68086K04268K80890
6321B0483770n27289Q52863o93082m34813J002961r08857K90143p86350J078567
6312B0357913K41693q9380p59289M26985M9885m4857o13627O58157n09368M04145
6302B0122257N2562o59669j75157k13024M10035k59484K79854k32309l04926q29451
6292A8190688J369134j165929N72141K65178j98661j051715P55405q514n64537
6283A8163190O95197K06451j085242Q49848l03149O6444l7783l03909j02195M7446
6273A8196298k71106l52984R47388j24505l04277n74989J64027J255335j299121
6264A7636066K23736j78898Q02892n78647j59190j59019j45633o3931J35361L37346
$$ y = [21253958, 19916019, 20040871, 20468733, 20343991, 20095633, 20166698, 19998612, 20202880, 20483770, 19956481, 20809344, 20116262, 19681449, 20684410, 19775553, 20065696, 19279346, 20357913, 20599606, 20510226, 19750937, 20177922, 20227807, 20182950, 19569323, 20227480, 19718112, 20122257, 20174819, 19515150, 19339993, 19126969, 19537004, 19277520, 19557374, 19325065, 19020139, 18190688, 19559822, 18393893, 18966034, 19231212, 19032551, 17980836, 18736241, 18727727, 18163190, 18858387, 19064838, 17979596, 18829444, 18526295, 18592739, 18554956, 18251047, 18148852, 18196298, 17925192, 17572208, 18519596, 18395091, 18090814, 17515825, 17679852, 18935187, 17636066, 17859802, 17680904, 18483796, 17905149, 17745959, 17586940, 17441307, 17377376, 17512737, 17850083]
6254A7850083J81430j332175M92359o68566L30416L47789k80702r2661m37673
6245A6390300m97855L28501M38859k99521J50170l42960k35127J42040M66566
6236A6540973n48917r0974j130692J619397p60054m24992N29263n02262O13164
6227A5844906n8847k44479o97611K35725j44688J19446j24798k86959N40557n92795
6217A4590457j059528J869089p70793K23689r20039R49585m54803q2120j28444
6208A4217093o3533j38827K32033J21983j23896j49792m47805J84914m40815K69853
6198A3661208K61176n05594p96229M12354k79075J01467k83542J092913N5421
6189A3720099m171j160062o5757N71656j40818n62128J74783R30828q28076r3961
$$ y = [17850083, 18031513, 16699338, 17191697, 16523131, 16853547, 17201336, 16920634, 16827973, 16390300, 15892445, 16220946, 16659805, 16360284, 16510454, 16167494, 15932367, 16074407, 16540973, 15992056, 15901082, 14770390, 16389787, 15629733, 15204741, 15734004, 15231742, 15844906, 15786059, 15541580, 14843969, 15079694, 14935006, 15054452, 14929654, 14642695, 15183252, 14590457, 13530929, 15400018, 14629225, 14852914, 13932875, 14882460, 14427657, 14345537, 14217093, 14153560, 14014733, 14246766, 14368749, 14244853, 14095061, 13647256, 13832170, 13391355, 13661208, 13922384, 13416790, 12620561, 13032915, 12753840, 12855307, 12571765, 13664678, 13720099, 13715928, 12555866, 12490109, 13061765, 12920947, 12358819, 12533602, 13464430, 12636354, 12542393]
6179A2542393n62623K26675N0956k67299j61741j23886q2410O67974Q1547k14307
6169A2157279K68927O4488m44179q8045r9246O23232j176906O80150N20198m79839
6159A2026059o27584N60520r14051L7758k07703m98727O81216j48922L43181o728
6149A1245019k78099L51680n69104K8510L4075r78865M06964L83511n2603J82743
6139A0753831j69510m45230M52513m98578O05020p8496K35885n57357M5764k1756
6129A0322086J21950R2255J50710o44524J147837r16155M11983q54929K70651
6120A0101864O80677n98242L37850m58988L39030l14020J5204P43412n62180o91590
6110I593017K43917m83303P82951q6587m2984J56676j011522R31687j38683L58701
$$ y = [12542393, 11979770, 12206445, 12257401, 11990102, 11828361, 11704475, 11622065, 12290039, 12371586, 12157279, 12426206, 12490694, 12046515, 11958470, 11859224, 12482456, 11305550, 11985700, 12505898, 12026059, 11398475, 11958995, 11044944, 11082702, 10874999, 10376272, 11057488, 10908566, 11251747, 11245019, 10966920, 11318600, 10749496, 10778006, 10812081, 9833216, 10240180, 10623691, 10571088, 10753831, 10584321, 10139091, 10591604, 10093026, 10698046, 10619550, 10855435, 10298078, 10343842, 10322086, 10444036, 10536291, 10687001, 10042477, 11190314, 10274159, 10686142, 9831213, 10101864, 10782541, 10184299, 10522149, 10063161, 10402191, 10088171, 10103375, 10846787, 10284607, 9593017, 9836934, 9353631, 10136582, 10049995, 10007011, 10163687, 9152165, 10083852, 9945169, 10303870]
6100A0303870j135956P05545j38048L63042Q91593j165586J69722o53000K51153
6091I592335L76050n75388L57834l16921J298683j459783J187088n29528L08578
6082A0238948p53866N92854l08406p94552J057589o8749j9218O87428r18244K98299
6072A0012083j30375k8907k11782M99883j08474K30352k61937R04637q55868K23024
6062A0272636l70013Q59841m92389N80942q0414K6269L50368j45313q44686J43703
6052A0300944j19615P15781j059411K16383N95140N50663j086042K44448r4202
6043A0264089N01393k14500Q3259k40897L30147k8115J40373M8276o39323M69717
6033A0714419k34229M80820j07870j58489Q02211q6782j92497p42038J059484
$$ y = [10303870, 9167914, 9873459, 9735411, 10098453, 10990046, 9824460, 9994182, 9341182, 9592335, 9968385, 9392997, 9750831, 9433910, 10732593, 9272810, 10459898, 9930370, 10238948, 9485082, 10077936, 9769530, 8974978, 10032567, 9963818, 9944600, 10632028, 9713784, 10012083, 9881708, 9852801, 9641019, 10140902, 10032428, 10262780, 10000843, 10905480, 10049612, 10272636, 9902623, 10762464, 10270075, 10851017, 10770603, 10796872, 11147240, 11001927, 10157241, 10300944, 10181329, 10897110, 9837699, 10054082, 10649222, 11199885, 10113843, 10358291, 10264089, 10765482, 10550982, 10634241, 10393344, 10723491, 10695376, 10835749, 10884025, 10244702, 10714419, 10480190, 10961010, 10853140, 10694651, 11496862, 11410080, 11217583, 10475545, 11535029]
6024A1535029j221556O94283k49946R8498J02601J75411J98661m71011K05796
6015A1067766M84484p95709R98856n20458j04301N68188o7605q69739K35834j42011
6005A0855305M15815N25671o78304J075392j154895N48990M90016l02315j71516
5996A1604159P7244j54596K14088L68176p8348j141617J050268Q6519l8936J35646
5986A2122603n40543j19724P91491K03808p62768L53258N74040l23600m23112
5977A1875453q5585J033642r20635N66914K92525l64556N91618k40181p31127
5968A2018068P62605L89590n90363J34915k73738Q2753j81616P3718o3996J018629
5958A3370565j031353N35348R07368r95820K80826J93083r05279R32175m70119
$$ y = [11535029, 10313473, 11007756, 10757810, 10856308, 10958909, 11134320, 11332981, 10861970, 11067766, 11552250, 10756541, 11755397, 11234939, 11130638, 11698826, 11631221, 10761482, 10997316, 10855305, 11271120, 11796791, 11118487, 12193879, 11038984, 11587974, 12077990, 11775675, 11604159, 11681403, 11526807, 11740895, 12109071, 12030723, 10889106, 11939374, 12025893, 11986957, 12122603, 11582060, 11462336, 12253827, 12457635, 11694867, 12048125, 12622165, 12298565, 11875453, 11789868, 12823510, 11902875, 12469789, 12762314, 12397758, 12989376, 12749195, 12018068, 12780673, 13170263, 12579900, 12714815, 12441077, 12523830, 12342214, 12415932, 12351936, 13370565, 12339212, 12874560, 13781928, 12786108, 13066934, 13260017, 12354738, 13286913, 12816794]
5949A2816794j07621L76138M23295l32911M8418K38801L23896Q0725p9084l80682
5939A3407769J47610J88679J00907n5440j1178K01518O25390k96306j14527N99471
5929A4793893p53281J97379M65087q03703R05060n56192J094972j275688L90118
5920A4457645l86565N95497j58343P99923q43030J268641p32396k08901q6321
5911A4706150m0983N46557K89257k40476k51573K19188j38081O89122k08495m54716
5901A5115950O99267j36064k77934o06472J033663j91699J91934n17994M06901
5892A5717552L69719N0000M4891J24324N2397Q035J61195L64988n03929K25991
5882A6615163J79559k26925K83002J04872j89307R6067P27363k06368p35147l33863
$$ y = [12816794, 12709173, 13085311, 13508606, 13175695, 13224113, 13462914, 13786810, 13867535, 13788451, 13407769, 13555379, 13744058, 13844965, 13789525, 13778347, 13979865, 14605255, 14308949, 14194422, 14793893, 14040612, 14237991, 14703078, 13899375, 14804435, 14248243, 15343215, 14067527, 14457645, 14071080, 14666577, 14508234, 15308157, 14465127, 15733768, 15001372, 14792471, 14706150, 14665167, 15211724, 15500981, 15260505, 15008932, 15228120, 15090039, 15779161, 15570666, 15115950, 15815217, 15679153, 15401219, 14794747, 15828410, 15636711, 15828645, 15310651, 15717552, 16087271, 16137271, 16182162, 16306486, 16358883, 16366918, 16528113, 16893101, 16389172, 16615163, 16794722, 16567797, 16850799, 16955671, 16766364, 16862431, 17589794, 17383426, 16648279, 16314416]
5872A6314416Q35626J79128K92275L37821l56379q88120M27359k3226J22568k19635
5862A7021833Q44732R1132p20965J318696o85615L91242q19954J214244K18400
5853A8873745r37178M51896L59862k18780m85677O21509j84130K84602J82904
5844A8948753j44493L51086j94679J193361n53593K90980k52577K70355p3866
5835A9835327j15635K19124K10640j79315Q8854l40832N23097O69703p78132P3739
5825B0206570J303718n24382k24493j32463J76197O07493n45126P05127L99094
5816B1971735j49680j94292j92570K83820P7003l65373K28931O85384l1087J50377
5806B2464248K6244l89490L37233K22657k33165J366078q27935k68612J310982
$$ y = [16314416, 17150042, 17329170, 17621445, 17959266, 17602887, 16714767, 17142126, 17118900, 17241468, 17021833, 17866565, 17957697, 17236732, 18555428, 17869813, 18261055, 17441101, 18655345, 18873745, 17936567, 18388463, 18748325, 18529545, 18043868, 18665377, 18481247, 18765849, 18948753, 18804260, 19155346, 18960667, 20154028, 19600435, 19891415, 19638838, 19909193, 19835327, 19719692, 19938816, 20149456, 19970141, 20058995, 19718163, 20241260, 20910963, 20132831, 20206570, 21510288, 20985906, 20761413, 20628950, 20805147, 21412640, 20867514, 21572641, 21971735, 21822055, 21627763, 21435193, 21719013, 21796016, 21430643, 21659574, 22344958, 22313871, 22464248, 22490492, 22101002, 22438235, 22660892, 22427727, 23793805, 22965870, 22697258, 24008240]
5797B4008240k15900o90860K09261K91051l09195J172468o65163M88687K39371
5788B4527960m19458J91303K8734k58730R17351j0633L98037L14582j456000Q30539
5778B5063685M06330N60429p83639M85456K50594L19368q31191J549153R3266
5769B7113451j18480l11848K45565j28606m29184L61331j0957J061029m3752L41598
5759B8080147o49516k1401K19806N52085L2977o54945P74555j45124M64262k07127
5749B8445719O87197N5144o22025P11082K72936j48740k35697m98980J737651
5740C0404287o36585M41369O56764q29403L89664N20527L5971j48327l09271j69830
5730C0355166P53094J167033m24136j78320n18781J454917k88674l61284P83166
$$ y = [24008240, 23792340, 23101480, 23310741, 23601792, 23292597, 24465065, 23799902, 24288589, 24527960, 24108502, 24299805, 24328539, 24069809, 24987160, 24976527, 25374564, 25689146, 24233146, 25063685, 25470015, 26030444, 25246805, 25732261, 25982855, 26302223, 25471032, 27020185, 27113451, 26994971, 26683123, 26928688, 26800082, 26370898, 26732229, 26721272, 27782301, 27738549, 28080147, 27430631, 27409230, 27629036, 28181121, 28214098, 27559153, 28333708, 28188584, 28652846, 28445719, 29132916, 29188060, 28566035, 29277117, 29550053, 29401313, 29165616, 28666636, 30404287, 29767702, 30209071, 30865835, 30036432, 30426096, 30946623, 30982594, 30834267, 30524996, 30355166, 31108260, 32275293, 31851157, 31672837, 31154056, 32608973, 32320299, 31959015, 32742181]
5721C2742181l65708N9892P75432J24359m5684N5360q89044J049091l95999M92318
5711C3602198j9205J29207K43551L0953N68199N3096O7896k34998P94639m72607
5701C4762929Q26749k01309p9527J52491j28639J21870L35357J47775L4227M55967
5691C6427890K22203j47542K65335L96333K05298n11132j873N47010J64257k50126
5681C7317653N00535K86368K97569p29131J285588k17680m09614P24106n79424
5672C8475970N24469k08101L78924J10917j24934O30723K58468p51315N65961
5663C9861082l6657k5072J36150n36601J150761J76275j66236L08943m70559N08173
5653D0906259j95707j51311L43872R98747L0800p49328M98162o65066Q73758l07837
$$ y = [32742181, 32376473, 32436365, 33211797, 33336156, 33290472, 33345832, 32456788, 33505879, 33109880, 33602198, 33582993, 33712200, 33955751, 33986704, 34554903, 34607999, 34675895, 34440897, 35235536, 34762929, 35589678, 35388369, 35308842, 35461333, 35332694, 35454564, 35789921, 35937696, 35971923, 36427890, 36650093, 36502551, 36767886, 37164219, 37369517, 36858385, 36856512, 37403522, 37567779, 37317653, 37818188, 38104556, 38402125, 37672994, 38958582, 38740902, 38331288, 39055394, 38475970, 39000439, 38792338, 39171262, 39282179, 39157245, 39787968, 40046436, 39295121, 39861082, 39824425, 39799353, 39935503, 39398902, 40549663, 40725938, 40559702, 40868645, 40398086, 40906259, 40710552, 40559241, 40903113, 41901860, 41932660, 41183332, 41681494, 41016428, 41890186, 41582349]
5643D1582349k31887k50037P33163J54711m26365O17607M45172m47842m04730
5634D1772141Q81414l80003M57484p60450N63854l7459Q33357m7480l49611L89058
5624D3322305p22932O47307l54453j37455J77190n180N08895j00233p78615N68472
5614D3125301k64667Q1163O25339o03623Q7161P93217o76053K64957K066M45584
5604D3880445r26539j78596O85968J44055m26583l18764N57618J87360m25352
5595D3179612j17227O79752q0659m08256n52318K53596L90359j29523L82213m54297
5585D3143252J15331k38245k13145L05488r70632L17933l13277J48358P71526
5576D3066589j16997m57964r8353o51817Q80186q50615l52681O78806n71532o1661
$$ y = [41582349, 41350462, 41100425, 41833588, 41988299, 41561934, 42179541, 42624713, 42176871, 41772141, 42653555, 42273552, 42731036, 41970586, 42534440, 42496981, 43330338, 43282858, 42933247, 43322305, 42599373, 43246680, 42892227, 42754772, 42931962, 42926782, 43435677, 43335444, 42556829, 43125301, 42860634, 42941797, 43567136, 42963513, 43050674, 43843891, 43167838, 43432795, 43434861, 43880445, 42953906, 42775310, 43461278, 43605333, 43178750, 42859986, 43417604, 43604964, 43179612, 43062385, 43742137, 43661478, 43253222, 42700904, 42954500, 43344859, 43215336, 43597549, 43143252, 43258583, 43020338, 42807193, 43112681, 42142049, 42459982, 42146705, 42295063, 43066589, 42949592, 42491628, 42393275, 41741458, 42621644, 41771029, 41418348, 42097154, 41525622, 41463961]
5566D1463961M16428k30052o3846k7981k47832L41430k74536k3987o38852L89142
5556D1103875m83996l82539N90833p61622k83925O70053j027790N42133j106511
5547C8860511R34044q4594m31475J18176m2117o50470P25369q16230L99686l30357
5537C8682543j40479l43810N78013o23754k81800l11910n96407P18293j002691
5528C6677998Q4321J2630R23256j221527n12238M72315j26431o37538M63884j37633
5518C5999037q21778O75922l34051k05554P2455N55248p86898J02557N5444m28686
5508C4883696Q58299j626231P8828O07862m62770j82910K56963K7567o13043J6754
5498C3845015r21957L10261k08549O10260j23379j409068O5132j12021M4214n35310
$$ y = [41463961, 41880389, 41650337, 41586491, 41558510, 41310678, 41652108, 41377572, 41353585, 40714733, 41103875, 40619879, 40237340, 40828173, 40066551, 39782626, 40452679, 39424889, 39967022, 38860511, 39794555, 39709961, 39278486, 39396662, 39354545, 38704075, 39429444, 38613214, 39012900, 38682543, 38542064, 38198254, 38776267, 38152513, 37870713, 37558803, 36962396, 37680689, 36677998, 36762319, 36774949, 37698205, 36476678, 35964440, 36436755, 36310324, 35672786, 36136670, 35999037, 35177259, 35853181, 35519130, 35313576, 35386031, 35941279, 35154381, 35256938, 35312382, 34883696, 35741995, 34115764, 34194592, 34802454, 34339684, 34156774, 34413737, 34441304, 33828261, 33845015, 32923058, 33233319, 33024770, 33635030, 33511651, 32102583, 32167715, 32055694, 32099908, 31564598]
5488C1564598L29198n35586L4111q4120O56975j182860j23806O30443o75629q80259
5478B9733065L85755m31946J095952r18239k55922l74580p77959M85182j65981
5469B8775327n50777m00302N13490j72275q56253J30302m93914P98357j23332
5460B7620623p38623M6426q49806l47028n8987Q24314j020754L00579o58210o50824
5450B4467710l98879N61931L32916j27653n18061j94480P78616p16502p40548
5441B3445050J65294m58509N25295q99865j58015J011002q98514o4850O93702
5432B3360590r91059M77785k09006J40863q55451M82745q11279M50674K12560
5423B2258422o50172M25352p54510K99365q53919o7509j27084j143701l42434
$$ y = [31564598, 31893796, 31358210, 31392321, 31308201, 31965176, 30782316, 30658510, 31288953, 30613324, 29733065, 30118820, 29686874, 30782826, 29864587, 29608665, 29234085, 28456126, 28941308, 28775327, 28224550, 27824248, 28337738, 28165463, 27309210, 27439512, 26945598, 27743955, 27620623, 26882000, 26928426, 26078620, 25731592, 25672605, 26496919, 25476165, 25776744, 25118534, 24467710, 24068831, 24630762, 24963678, 24836025, 24317964, 24123484, 24902100, 24185598, 23445050, 23610344, 23151835, 23677130, 22777265, 22619250, 23630252, 22731738, 22666888, 23360590, 22369531, 22847316, 22638310, 22779173, 21923722, 22406467, 21595188, 22045862, 22258422, 21608250, 22033602, 21279092, 21578457, 20724538, 20657029, 20529945, 19386244, 19043810]
5414A9043810j64493j74524J12378N84360j649974l53679k26170O93618j779578
5405A6085748J335930J67612m36781o78434m50157j66789n6234m17638K69720
5396A5652977k58213O47603p46491n55749P23184p42375M67724p26349R1823n66747
5386A3987387N01465k49995K28181n16316n24877K36978K20347O16851p29143
5377A3770878p38932l86861J321300j640324K01718K6624L99843n63164Q31687
5368A3222769m55777l19792r08797J440414j451962N13146L48723j520139J105777
5359A1974362M0439L67382j765614M14135M99687l69059Q23317m75786j394097
5350A0114766J59036K99657j19805R0989N8361o5107L70086m34900M71545n52908
$$ y = [19043810, 18879317, 18704793, 18817171, 19401531, 17751557, 17397878, 17171708, 17865326, 16085748, 17421678, 17589290, 17152509, 16474075, 16023918, 15857129, 15800895, 15383257, 15652977, 15394764, 16042367, 15295876, 14740127, 15463311, 14720936, 15188660, 14462311, 14554134, 13987387, 14488852, 14238857, 14467038, 13950722, 13425845, 13662823, 13883170, 14500021, 13770878, 13031946, 12645085, 13966385, 12326061, 12527779, 12554403, 12954246, 12391082, 13222769, 12766992, 12447200, 11538403, 12978817, 11526855, 12040001, 12388724, 10868585, 11974362, 12014801, 12382183, 10616569, 11030704, 11530391, 11161332, 11984649, 11508863, 10114766, 10273802, 10573459, 10453654, 10544643, 10603004, 10537897, 10907983, 10473083, 10944628, 10391720]
5340A0391720p05731J197898j224821O01892k02209k17945P23564o64124o78649
5331I221595L09151K2410J3836k77521J32616K57870l45663k08857l89442n2544
5321H683451O34430p03202M74694k36448R65918n04879j584179Q06609J84409
5312H720803l88741M372L15287N63547j073266L39822l43468Q51644o22648Q2579
5302H449931L8367L93546r61897q1168O28553n89713P3334O4757K06547l5966
5292H186291q14194O74521M96094r95939L02883L66661J18398j156299O75285
5283G853701o43270N42815j60632l98268L87657j50576j28078L62948o30441O87417
5273G723273m69538J02625p75411P41184p83746R4081K76493m40444O89718P54591
$$ y = [10391720, 9685989, 10883887, 9659066, 10260958, 10058749, 9840804, 10564368, 9900244, 9221595, 9530746, 9553156, 9566992, 9289471, 9422087, 9679957, 9334294, 9125437, 8735995, 8683451, 9317881, 8614679, 9089373, 8852925, 9818843, 9313964, 7729785, 8536394, 8720803, 8332062, 8336434, 8651721, 9215268, 8142002, 8481824, 8138356, 8990000, 8367352, 8449931, 8488298, 8881844, 7919947, 7838779, 8467332, 7877619, 7950953, 8015710, 8222257, 8186291, 7372097, 8046618, 8542712, 7546773, 7849656, 8216317, 8334715, 7178416, 7853701, 7210431, 7753246, 7592614, 7194346, 7582003, 7431427, 7303349, 7666297, 7035856, 7723273, 7253735, 7356360, 6580949, 7322133, 6538387, 6632468, 6908961, 6468517, 7158235, 7912826]
5263G912826n81125k42945l75009q8442J225540r40090l99685k342m54455M74396
5253F528669Q40482k41516o44487m9458P77713j032652O69076J00178l24885J7076
5243F640196j31205n7460O59573r04097K86917m39140K89417m3497N58612k34477
5233F624839l05393J32384l94878k40304M94663M2097k81576n27675O20208k26803
5223E937562M44645L50402J58924o20478o64201L31062M46316m63965J105419
5214G025686l17965j86555K93681j72615K24593J97955l55523o02094L53118P32255
5204G192536o47111k35937M15522n35149P19513p90293J099582j397224K41766
5195F063205K73199K52425n28461J21639m50661P47995O9468K10596K74932n78044
$$ y = [7912826, 7331701, 7088756, 6713747, 6625305, 7850845, 6910755, 6511070, 6508728, 6054273, 6528669, 7369151, 7127635, 6483148, 6433690, 7211403, 6178751, 6847827, 6948005, 6623120, 6640196, 6508991, 6451531, 7111104, 6207007, 6493924, 6054784, 6344201, 6300704, 6859316, 6624839, 6319446, 6451830, 6056952, 5816648, 6311311, 6353408, 6071832, 5544157, 6164365, 5937562, 6382207, 6732609, 6891533, 6271055, 5606854, 5937916, 6384232, 5920267, 7025686, 6707721, 6521166, 6814847, 6642232, 6866825, 7064780, 6709257, 6107163, 6460281, 7192536, 6545425, 6309488, 6725010, 6189861, 6909374, 6119081, 7218663, 5821439, 6063205, 6336404, 6588829, 6060368, 6182007, 5731346, 6479341, 6548809, 6759405, 7034337, 6456293]
5185F456293R9872L92816r24272O86716k63866N59552K81224q46865l36657K54116
5175F358929K27966Q11543k67376q06843m8168N04031j78847M04638M64871k21109
5165G249635O34091J96226n43762N51410J6430l23696m94907M54304K70158j54503
5155G855386N90972l87471J076362l13506P19437k48472N22924j25358m1987L46053
5145I994340J01081J51396J32346N60843J76650l3124k19837K0071J59682l23991
5135A0719457J076447n76520K39006j86035M97526p2876j25310P84832k87248
5126A2069279N18796q48017Q45181L34011n68990N2777l63702J083876j2557L26472
5116A3437126L35606N87714q8969p45972L53766O61161J09707M50325l10471k81865
$$ y = [6456293, 6556165, 6948981, 6024709, 6711425, 6447559, 7007111, 7288335, 6441470, 6104813, 6358929, 6586895, 7398438, 7131062, 6324219, 6276051, 6780082, 6601235, 7005873, 7470744, 7249635, 7883726, 8079952, 7536190, 8087600, 8104030, 7780334, 7285427, 7739731, 8009889, 7855386, 8446358, 8058887, 9135249, 8821743, 9541180, 9292708, 9815632, 9690274, 9648287, 9994340, 10095421, 10246817, 10379163, 10940006, 11116656, 11083532, 10863695, 10883766, 11043448, 10719457, 11795904, 11219384, 11458390, 11272355, 11769881, 11697005, 11571695, 12356527, 12069279, 12588075, 11740058, 12585239, 12919250, 12350260, 12403037, 12039335, 13123211, 13110654, 13437126, 13772732, 14360446, 14271477, 13525505, 13879271, 14540432, 14650139, 15100464, 14789993, 14508128]
5106A4508128j96727P68723j06939L61376n56760k31925k09830O85021j29097
5097A4891970J023596N43020n6989k64878L18412p59027J139229M17750M99169
5088A7752252r8409n05688k09145J984492o72641p6432J152083j001139J354710
5079A9680083K12313J33105J14792J260935J57842L03873j82264M30892L93703
5070B2505274P31030J78549N08000l8019P68221Q97358J1509J757113R427n6262
5060B7272200N74924n4134R04254M88513O94829J55392p72443R47272K28615J201441
5050C1640863o73832J388194n55196l4942J756384P12755O63135L90455J778297
5041C7066113P81751J972705K901520J851967O67670J540776M88407J29612n4403
$$ y = [14508128, 14311401, 15080124, 14973185, 15334561, 14777801, 14545876, 14336046, 15021067, 14891970, 15915566, 16458586, 16401597, 16136719, 16455131, 15696104, 16835333, 17253083, 17752252, 17653843, 17148155, 16939010, 18923502, 18250861, 18174429, 19326512, 18325373, 19680083, 19892396, 20025501, 20140293, 21401228, 21559070, 21862943, 21680679, 22111571, 22505274, 23236304, 23414853, 23922853, 23884834, 24653055, 25550413, 25561922, 27319035, 27328462, 27272200, 27847124, 27792990, 28697244, 29185757, 29880586, 30035978, 29263535, 30210807, 30439422, 31640863, 30967031, 32355225, 31800029, 31765087, 33521471, 34234226, 34897361, 35287816, 37066113, 37847864, 39820569, 42722089, 44574056, 45241726, 46782502, 47270909, 47400521, 47346118]
5032D7346118l7809J99399K76747K41942k26720Q88043k87996P85594N07390J221785
5022E0914493K35000L08679r0657P48450P53774j113873M70443j34884O60379
5013E2751804l44791L46661l5520K93412L19763Q25952R99278J488636J01253
5004E6746448M8873K046710R42110J65945j20348m65325j076615j298764j595254
4995E5393780p03223k095693j551576j263516p06875J462699n6998J172852l93510
4986E1257940M05482M45845N38227k74390r51570j305548j765488k04229r93656
4977D7152613m82356O28311j581253J708023n69830j223039l77526o67413P11094
4968D5298624k21952k07080j07064K29408P18531N08506Q2547Q19456O89939K49695
$$ y = [47346118, 47308309, 47507708, 47784455, 48026397, 47799677, 48687720, 48399724, 49185318, 49692708, 50914493, 51149493, 51458172, 51367515, 52115965, 52869739, 51755866, 52226309, 52091425, 52751804, 52407013, 52753674, 52718154, 53011566, 53331329, 54157281, 55156559, 56645195, 56746448, 56795321, 58842031, 59784141, 59950086, 59829738, 59364413, 58287798, 56989034, 55393780, 54690557, 52594864, 51043288, 49779772, 49072897, 50535596, 50478598, 51651450, 51257940, 51663422, 52109267, 52647494, 52373104, 51421534, 50115986, 48350498, 48146269, 47152613, 46670257, 47298568, 45717315, 47425338, 46855508, 45632469, 45254943, 44587530, 45298624, 45076672, 44869592, 44762528, 44991936, 45710467, 46218973, 46301520, 47120976, 47810915, 48060610]
4958D8060610M05370P66600J221189K508895J453153K563474K186971J925830
4950F1092092R89817J999185J722191k012208k851277m446639l112539m335709
4942D9044913l750361k869640k453567k554876l298349k188422j870048j737389
4934B8322261j810051j541226q38552j606269m88385j961610q47003k69288j223606
4925A7736271o99001p2651q27193j108611q87222N09280r42435K12867r49174
4916A2972131k31694o20187J18205p64981J60343q22243J28141p78840n44442
4907I616433K98679k14112m86050l28700j43394m86530M51527n39527Q0903j9211
4897H230018j194052O25353o57548k3715l31561L61900J38309l27232k77153o61908
$$ y = [48060610, 48465980, 49232580, 50453769, 52962664, 54415817, 56979291, 59166262, 61092092, 62081909, 64081094, 65803285, 63791077, 60939800, 56493161, 53380622, 49044913, 45294552, 42424912, 39971345, 37416469, 34118120, 31929698, 30059650, 28322261, 26512210, 24970984, 24132432, 22526163, 22037778, 20076168, 19229165, 18959877, 17736271, 17037270, 16964619, 16137426, 15028815, 14141593, 14650873, 13708438, 13921305, 12972131, 12740437, 12120250, 12238455, 11473474, 11633817, 10811574, 10939715, 10160875, 9616433, 9915112, 9701000, 9214950, 8886250, 8742856, 8256326, 8707853, 8168326, 8249229, 8230018, 7035966, 7661319, 7003771, 6980056, 6648495, 7010395, 7148704, 6821472, 6544319, 5882411]
4887E882411l18342o20157Q14451k06297j20323J92889L95837j577481J015814
4878E458802l50548J62022m15489K65247n46963J48187O52048j253204K08914
4869D329016j79495l88752O72344j25152p1176l9953J52671j82833p89740M36929
4859C813859k62118N59846o9007o95142N35560r76363O29043l24233O11067J23046
4849C945558j110118M20974p7937J56942n13148O09799m10073K67092l7731M92242
4839C743600q83458M57345k98584o31266J024448o43864L0739N8190j05014M19915
4829C172051l05232j21999m04963L28323J14817M65981m50809M3254p21698J064826
4819C184551l95916m11521Q00319j068648J51484K91618m38076K07755L57426
$$ y = [5882411, 5564069, 4943912, 5758363, 5552066, 5431743, 5624632, 6020469, 4442988, 5458802, 5108254, 5270276, 4854787, 5120034, 4573071, 4721258, 5373306, 4120102, 4329016, 4149521, 3760769, 4433113, 4307961, 4236785, 4196832, 4349503, 4166670, 3376930, 3813859, 3551741, 4111587, 4042580, 3347438, 3882998, 2906635, 3535678, 3211445, 3822512, 3945558, 2835440, 3256414, 3178477, 3335419, 2822271, 3432070, 3021997, 3289089, 3251358, 3743600, 2860142, 3317487, 3018903, 2387637, 3412085, 2768221, 2798960, 2857150, 2752136, 3172051, 2866819, 2744820, 2339857, 2668180, 2782997, 3248978, 2798169, 2841423, 2119725, 3184551, 2788635, 2377114, 3177433, 2108785, 2260269, 2551887, 2113811, 2321566, 2678992]
4810B678992J4510l16597n04056J110515n04384K80887o63765J42369J92859m24020
4800B007310Q93423j234266N68540j66890N95459o08791P02646j131477O22503
4791B248457k95434R5833Q89279r32435M58264l08081j56379L705M52083J7004
4781B472296l41568p4460p50545N74708L89458Q65854l10850J70514r99104p5020
4771A921283P06835n74195R91441p19100j21373m97950L04743L27227J82572m63941
4761B057542J93048j39511O22560j307599K95516L88905Q96249o88136P69087
4752C087661m54714j29084l9502n82520N08420q4204n16073P24589l5139p12600
4742A766834J144148k09849o12409N08405o91509L79738N05856o69653m04286
$$ y = [2678992, 2693502, 2376905, 1872849, 2983364, 2478980, 2759867, 2096102, 2238471, 2431330, 2007310, 2900733, 1666467, 2235007, 2068117, 2663576, 2054785, 2757431, 1625954, 2248457, 1953023, 2048856, 2938135, 2005700, 2463964, 2155883, 1999504, 2003209, 2455292, 2472296, 2130728, 2056268, 1305723, 1880431, 2269889, 3135743, 2824893, 2995407, 1996303, 1921283, 2628118, 2053923, 3045364, 2326264, 2204891, 1706941, 2011684, 2338911, 2521483, 2057542, 2250590, 2111079, 2733639, 1426040, 1721556, 2110461, 3006710, 2318574, 3087661, 2632947, 2503863, 2464361, 1881841, 2390261, 2306057, 1789984, 2514573, 2479434, 1766834, 2910982, 2701133, 2088724, 2597129, 1905620, 2285358, 2791214, 2121561, 1717275]
4733A717275J438411n45582o73510J06651Q67186n73595R40875j309041J130173
4724C098843k78638M5167o39713K2576L35004O56466k21997j063799Q32554J84780
4714B971243j08394J04428l21825L34803l18860P28362p62269R86222o64645J76724
4704C125789L31936K282m71903l37257j26850M53686m16284M38301j89606J90467
4694C000561K89869j16071L29250j001149M05457J40510J149311o34671R9429
4685C662496k81362m49591M12609o92829N58144P46861j070628m63828K92522
4676B714394Q27762Q681o13646R45640k96962p25447N42519O2572p1483n63263
4666B830767Q70682o93290J67095n49N63931q84604Q31573J53343N1711n89903
$$ y = [1717275, 3155686, 2610104, 1936594, 2043245, 2910431, 2336836, 3277711, 1968670, 3098843, 2820205, 2865372, 2225659, 2248235, 2583239, 3239705, 3017708, 1953909, 2786463, 2971243, 2862849, 2967277, 2645452, 2980255, 2661395, 3389757, 2627488, 3613710, 2949065, 3125789, 3457725, 3460007, 2988104, 2650847, 2523997, 2977683, 2561399, 2999700, 2810094, 3000561, 3290430, 3174359, 3503609, 2502460, 2907917, 3048427, 4197738, 3563067, 3662496, 3381134, 2931543, 3344152, 2651323, 3209467, 3956328, 2885700, 2421872, 2714394, 3542156, 3550837, 2937191, 3882831, 3585869, 2860422, 3402941, 3465513, 3394030, 2830767, 3701449, 3008159, 3175254, 3174705, 3738636, 2854032, 3685605, 3838948, 3890659, 3300756]
4656C300756j93365J002319p52785M02464j2685l54079L26628l1710O36571M62720
4646D786834j129907N23533j094562O76525K92940k90643j29844N75973l42452
4637C868397n4587L95587m5856M05776o13491L9550M45676l14599L77414j129380
4627C374487J145154K88596j00751r86111N94270J22588K37204p31373J67721
4618D111785P73080r16903O2735N13316J66426K57392j49283o95552M87794k4884
4608D585906k94274P52414j51175j92623j0852K99667m37484M64390o10671M24851
4598D830149l04429M94700O69305r52767M26199m12800M2828m7556O15111r35057
4588D425683R60782m81376M21367J0964N5291o33224p6749P44636k01243Q51866
$$ y = [3300756, 3107391, 4109710, 3356925, 3759389, 3746704, 3392625, 3719253, 3687543, 4324114, 4786834, 3656927, 4180460, 3085898, 3762423, 4055363, 3764720, 3634876, 4210849, 3868397, 3813810, 4209397, 4163541, 4569317, 3955826, 3995376, 4441052, 4126453, 4503867, 3374487, 4519641, 4808237, 4707486, 3721375, 4315645, 4438233, 4675437, 3944064, 4111785, 4884865, 3967962, 4030697, 4544013, 4710439, 4967831, 4818548, 4122996, 4610790, 4585906, 4291632, 5044046, 4892871, 4700248, 4689396, 4989063, 4551579, 5015969, 4405298, 4830149, 4525720, 5020420, 5689725, 4736958, 5163157, 4750357, 4793185, 4745629, 5360740, 4425683, 5386465, 4905089, 5326456, 5337420, 5392711, 4759487, 4682738, 5427374, 5226131, 6077997]
4578F077997o04899j99174K09716l8567J03906K16951q65977J049949j68568n03021
4568E278313J87823Q9882R3330K06386j26479L78178j75734m86326p8619k56589
4558E110165O43554m00499O78543m5998k16845m84826R90361l66995P01494k41565
4548F367389p73582J153612k18178l99669M84124J32144m92949Q97070P48024
4539G897985j641414k00250O63530j84330n50214J304792K65082l86698N00021
4530G668504k08171N11348P4579J08581m25652K92272n02340P15846q3075m87838
4520G664054M70598O8847N89906R26182l82525l53759J17817n63542M69932N46019
4510I553529R6601k12958j61204Q18088N8193L30676p57950k58215R65752l44981
$$ y = [6077997, 5473098, 5273924, 5483640, 5445073, 5548979, 5765930, 4899953, 5949902, 5781334, 5278313, 5466136, 5556018, 5649348, 5855734, 5729255, 6107433, 5931699, 5445373, 5366754, 5110165, 5753719, 5353220, 6031763, 5985765, 5768920, 5284094, 6274455, 5907460, 6608954, 6367389, 5593807, 6747419, 6529241, 6129572, 6613696, 6745840, 6252891, 7149961, 7897985, 6256571, 6056321, 6719851, 6535521, 5985307, 7290099, 7555181, 7168483, 7668504, 7460333, 7971681, 8046260, 8154841, 7729189, 8021461, 7519121, 8234967, 8151892, 7664054, 8134652, 8203499, 8793405, 9719587, 9337062, 8983303, 9101120, 8537578, 9007510, 9553529, 9650130, 9437172, 9275968, 10094056, 10152249, 10482925, 9724975, 9466760, 10432512, 10087531]
4500A0087531N15154J016504o73860R2447P89783m04436O3272l9800J01854L42439
4490A1890888Q53563L23604K19142l08755L17782N76656m18728Q60808m28237
4481A3886723P35801j06O25182K75615J52860o10312P51094N66401r1144R52707
4471A7244821j93681L21135J117998n3241l34425J000295j47994J38818J272323
4462B0366049n63079N94896O4130Q64200J079780p88107J127440l8014N19460
4453B3226755M91379J424120K22174l00202J462488M35766O26492N54849O54272
4444B8798093Q65322Q53900K8770K007301R82001Q73976M53914J630635Q29648
4435C7323560J237856Q14082O08207L48261L19935J019786N98471J241025M6811
$$ y = [10087531, 10602685, 11619189, 10945329, 11037776, 11827559, 11423123, 11486395, 11446595, 11548449, 11890888, 12744451, 13068055, 13287197, 12978442, 13296224, 13872880, 13454152, 14314960, 13886723, 14622524, 14622418, 15247600, 15523215, 15676075, 15065763, 15816857, 16383258, 16292114, 17244821, 17051140, 17372275, 18490273, 18437032, 18102607, 19102902, 18954908, 19093726, 20366049, 19802970, 20397866, 20461996, 21326196, 22405976, 21617869, 22745309, 22707295, 23226755, 23718134, 25142254, 25364428, 25064226, 26526714, 26962480, 27588972, 28143821, 28798093, 29663415, 30517315, 30546085, 32553386, 33535387, 34409363, 34863277, 36493912, 37323560, 38561416, 39375498, 39983705, 40331966, 40651901, 41671687, 42270158, 43511183, 43557994]
4426D3557994Q60579J716064l97739J305881J816065L05624J846285M34307J276329
4417E2721389O14782R72539J157879J230956K035011P25443K909428J436119J992189
4408F5795735K034249K052291J022086J996568J040755Q78158J985007m690O56772
4399G7456931N39762L78868P18128J5726J486510M72005O52104Q71842O36387
4390H3228263R07300R49804O51488N40273J084129J326695L18171K046487N32855
4381I1585465L46991K254390P12266K51735J022220J348304J011356P49319J131782
4372A00413828Q19084N48246O93115j183185O90525p94383o40604q69667N83022
4363A00259981m66082n61273N74839O36621n78689K120730Q4434J596391N84158
$$ y = [43557994, 44418573, 46134637, 45736898, 47042779, 48858844, 49164468, 51010753, 51445060, 52721389, 53336171, 54308710, 55466589, 56697545, 58732556, 59457999, 62367427, 63803546, 65795735, 67829984, 69882275, 70904361, 72900929, 73941684, 74819842, 76804849, 76800159, 77456931, 77996693, 78375561, 79093689, 79109415, 80595925, 81067930, 81720034, 82591876, 83228263, 84135563, 85085367, 85736855, 86277128, 87361257, 88687952, 89006123, 91052610, 91585465, 91932456, 94186846, 94899112, 95150847, 96173067, 97521371, 98532727, 99282046, 100413828, 101232912, 101781158, 102474273, 101291088, 101981613, 101187230, 100546626, 99676959, 100259981, 99793899, 99232626, 99807465, 100444086, 99865397, 101986127, 102070561, 103666952, 104251110]
4354A04251110M84780R32763J00655J18544P33246m05786P11902L67091o41603
4345A06652702j276641j036022j279176j258837j191806j862743n94113j522099
4337I6631265J9689j139466j354840J58700l35224L83469l09195l27071P27973
4328I4455300R29371M6372O27009R88364l14931J183252Q05326J0265J864994
4319A00595322n71045j015362k619485j641623l113759j842877k957045k314602
4311H4519524j916326l404099j175790k462748j827527j859349q67370j958478
4303F9047837j308113j411597j215877j669070j127536r76976r43734p62146j228372
4294E8404416M15719k012974N67145j795585m69618k440058j285455j855156j117968
$$ y = [104251110, 104735890, 105668653, 105769308, 105887852, 106621098, 106215312, 106927214, 107294305, 106652702, 105376061, 104340039, 103060863, 101802026, 100610220, 98747477, 98153364, 96631265, 96650954, 95511488, 94156648, 94315348, 93980124, 94363593, 94054398, 93727327, 94455300, 95384671, 95431043, 96058052, 97046416, 96731485, 97914737, 98720063, 98730328, 100595322, 100024277, 99008915, 96389430, 94747807, 91634048, 89791171, 86834126, 84519524, 82603198, 79199099, 78023309, 75560561, 73733034, 71873685, 71006315, 69047837, 67739724, 66328127, 65112250, 63443180, 62315644, 61338668, 60394934, 59632788, 58404416, 58820135, 56807161, 57374306, 55578721, 55109103, 52669045, 51383590, 49528434, 48410466]
$$ [...]
##END NTUPLES=NMR SPECTRUM
##END=
