##TITLE=abcd
##JCAMPDX= 6.0         $$ Bruker NMR JCAMP-DX V2.0
##DATA TYPE= NMR SPECTRUM
##DATA CLASS= NTUPLES
##ORIGIN= UXNMR, Bruker Analytische Messtechnik GmbH
##OWNER= root
$$ XWIN-NMR		Version 3.5
$$ Fri Nov  7 19:03:56 2025 Russian Standard Time (UT+4h)  servis@DPX200
##.OBSERVE FREQUENCY= 200.131235884673
##.OBSERVE NUCLEUS= ^1H
##.ACQUISITION MODE= SIMULTANEOUS
##.ACQUISITION SCHEME= undefined
##.AVERAGES= 32
##.DIGITISER RES= 18
##SPECTROMETER/DATA SYSTEM= spect
##.PULSE SEQUENCE= zg
##.SOLVENT NAME= CDCl3
##.SHIFT REFERENCE= (INTERNAL, CDCl3, 0, 16.4885)
##AUDIT TRAIL= $$ (NUMBER, WHEN, WHO, WHERE, WHAT)
$$ ##TITLE= Audit trail, XWIN-NMR		Version 3.5
$$ ##JCAMPDX= 5.01
$$ ##ORIGIN= Bruker BioSpin GmbH
$$ ##OWNER= servis
$$ F:\spectra/data/av/nmr/H1/1/pdata/1/auditp.txt
$$ ##AUDIT TRAIL=  $$ (NUMBER, WHEN, WHO, WHERE, WHAT)
(   1,<2025-11-07 18:50:47.37 +0400>,<servis>,<DPX200>,
      <created by zg, POWCHK disabled, PULCHK disabled
       configuration hash MD5:
       00 E9 B6 7A A2 85 ED C7 34 08 36 98 17 FE 4E 26
       data hash MD5: 32K
       5E 86 C8 EB F3 75 7E B2 46 07 C3 4B 1B AA 49 B6>)
(   2,<2025-11-07 19:03:22.59 +0400>,<servis>,<DPX200>,
      <Start of raw data processing
       efp BC_mod = 2 LB = 0.05 FT_mod = 6 PKNL = 1 PHC0 = -262.762 PHC1 = 1.301565 SI = 16K 
       data hash MD5: 16K
       0A 42 5B 10 41 40 43 06 DB DD 28 70 84 E7 8F 41>)
$$ ##END=
$$ 
$$ hash MD5
$$ 4E 20 B0 F5 B9 FE 23 93 59 F4 47 89 47 6F 12 30
##$RELAX= 
##$RELAX= 
##$RELAX= 
##$RELAX= 
##$RELAX= 
##$RELAX= 
##$RELAX= 
##$RELAX= 
$$ Bruker specific parameters
$$ --------------------------
##$DU= <F:\spectra>
##$EXPNO= 1
##$NAME= <H1>
##$PROCNO= 1
##$TYPE= <nmr>
##$USER= <av>
##$AMP= (0..31)
100 100 100 100 100 100 100 100 100 100 100 100 100 100 100 100 100 100 
100 100 100 100 100 100 100 100 100 100 100 100 100 100 
##$AQSEQ= 0
##$AQ_mod= 1
##$AUNM= <au_zg>
##$AUTOPOS= <>
##$BF1= 200.13
##$BF2= 200.13
##$BF3= 200.13
##$BF4= 200.13
##$BF5= 500.13
##$BF6= 500.13
##$BF7= 500.13
##$BF8= 500.13
##$BYTORDA= 1
##$CFDGTYP= 0
##$CFRGTYP= 5
##$CHEMSTR= <none>
##$CNST= (0..31)
1 1 145 1 1 1 1 1 1 1 1 1 1 1 1 1 1 1 1 1 1 1 1 1 1 1 1 1 1 1 1 1 
##$CPDPRG= <>
##$CPDPRG1= <>
##$CPDPRG2= <>
##$CPDPRG3= <>
##$CPDPRG4= <mlev>
##$CPDPRG5= <mlev>
##$CPDPRG6= <mlev>
##$CPDPRG7= <mlev>
##$CPDPRG8= <mlev>
##$CPDPRGB= <>
##$CPDPRGT= <>
##$D= (0..31)
0 2 0 0 0 0 0 0 0 0.06 0 0 0 0 0 0 0.0002 0 0 0 0 0 0 0 0 0 0 0 0 0 0 
0 
##$DATE= 1762527046
##$DBL= (0..7)
120 120 120 120 120 120 120 120 
##$DBP= (0..7)
150 150 150 150 150 150 150 150 
##$DBP07= 0
##$DBPNAM0= <>
##$DBPNAM1= <>
##$DBPNAM2= <>
##$DBPNAM3= <>
##$DBPNAM4= <>
##$DBPNAM5= <>
##$DBPNAM6= <>
##$DBPNAM7= <>
##$DBPOAL= (0..7)
0.5 0.5 0.5 0.5 0.5 0.5 0.5 0.5 
##$DBPOFFS= (0..7)
0 0 0 0 0 0 0 0 
##$DE= 6
##$DECBNUC= <off>
##$DECIM= 32
##$DECNUC= <off>
##$DECSTAT= 4
##$DIGMOD= 1
##$DIGTYP= 9
##$DL= (0..7)
0 120 120 120 120 120 120 120 
##$DP= (0..7)
150 150 150 150 150 150 150 150 
##$DP07= 0
##$DPNAME0= <>
$$ [...]
##$SUBNAM4= <"">
##$SUBNAM5= <"">
##$SUBNAM6= <"">
##$SUBNAM7= <"">
##$SUBNAM8= <"">
##$SUBNAM9= <"">
##$SW= 20.6817932712277
##$SWIBOX= (0..15)
0 0 3 0 0 0 0 0 0 0 0 0 0 0 0 0 
##$SW_h= 4139.07284768212
##$TD= 32768
##$TD0= 1
##$TE= 0
##$TE2= 300
##$TE3= 300
##$TEG= 300
##$TL= (0..7)
0 120 120 120 120 120 120 120 
##$TP= (0..7)
150 150 150 150 150 150 150 150 
##$TP07= 0
##$TPNAME0= <>
##$TPNAME1= <>
##$TPNAME2= <>
##$TPNAME3= <>
##$TPNAME4= <>
##$TPNAME5= <>
##$TPNAME6= <>
##$TPNAME7= <>
##$TPOAL= (0..7)
0.5 0.5 0.5 0.5 0.5 0.5 0.5 0.5 
##$TPOFFS= (0..7)
0 0 0 0 0 0 0 0 
##$TUNHIN= 0
##$TUNHOUT= 0
##$TUNXOUT= 0
##$USERA1= <user>
##$USERA2= <user>
##$USERA3= <user>
##$USERA4= <user>
##$USERA5= <user>
##$V9= 5
##$VALIST= <valist>
##$VCLIST= <CCCCCCCCCCCCCCC>
##$VD= 0
##$VDLIST= <DDDDDDDDDDDDDDD>
##$VPLIST= <PPPPPPPPPPPPPPP>
##$VTLIST= <TTTTTTTTTTTTTTT>
##$WBST= 1024
##$WBSW= 30
##$XGAIN= (0..3)
0 0 0 0 
##$XL= 0
##$YL= 0
##$YMAX_a= 315996
##$YMIN_a= -179250
##$ZGOPTNS= <>
##$ZL1= 120
##$ZL2= 120
##$ZL3= 120
##$ZL4= 120
##$ABSF1= 0
##$ABSF2= 0
##$ABSG= 0
##$ABSL= 0
##$ALPHA= 0
##$AQORDER= 0
##$ASSFAC= 0
##$ASSFACI= 0
##$ASSFACX= 0
##$ASSWID= 0
##$AUNMP= <proc_1d>
##$AZFE= 0.1
##$AZFW= 0.1
##$BCFW= 0
##$BC_mod= 2
##$BYTORDP= 0
##$COROFFS= 0
##$CY= 18.4799938201904
##$DATMOD= 1
##$DC= 0
##$DFILT= <>
##$DTYPP= 0
##$F1P= 9.9274215381318
##$F2P= -0.165520771350173
##$FCOR= 1
##$FTSIZE= 16384
##$FT_mod= 6
##$GAMMA= 0
##$GB= 0
##$INTBC= 1
##$INTSCL= 4.127829e-11
##$ISEN= 128
##$LB= 0.05
##$LEV0= 0
##$LPBIN= 0
##$MAXI= 10000
##$MC2= 0
##$MEAN= 0
##$ME_mod= 0
##$MI= 50
##$NCOEF= 0
##$NC_proc= -7
##$NLEV= 6
##$NOISF1= 3.799351
##$NOISF2= 2.8
##$NSP= 0
##$NTH_PI= 0
##$NZP= 0
##$OFFSET= 16.48848
##$PC= 4
##$PHC0= -262.762
##$PHC1= 1.301565
##$PH_mod= 1
##$PKNL= yes
##$PPARMOD= 0
##$PSCAL= 4
##$PSIGN= 0
##$REVERSE= no
##$SF= 200.130005582386
##$SI= 16384
##$SIGF1= 3
##$SIGF2= 2
##$SINO= 400
##$SIOLD= 16384
##$SREGLST= <1H.CDCl3>
##$SSB= 0
##$STSI= 16384
##$STSR= 0
##$SW_p= 4139.07284768211
##$SYMM= 0
##$S_DEV= 0
##$TDeff= 32768
##$TDoff= 0
##$TI= <>
##$TILT= no
##$TM1= 0
##$TM2= 0
##$TOPLEV= 0
##$USERP1= <user>
##$USERP2= <user>
##$USERP3= <user>
##$USERP4= <user>
##$USERP5= <user>
##$WDW= 1
##$XDIM= 16384
##$YMAX_p= 508246333
##$YMIN_p= -1977079
$$ End of Bruker specific parameters
$$ ---------------------------------
##NTUPLES= NMR SPECTRUM
##VAR_NAME=  FREQUENCY,     SPECTRUM/REAL,   SPECTRUM/IMAG
##SYMBOL=    X,             R,               I
##VAR_TYPE=  INDEPENDENT,   DEPENDENT,       DEPENDENT
##VAR_FORM=  AFFN,          ASDF,            ASDF
##VAR_DIM=   16384,         16384,           16384
##UNITS=     HZ,            ARBITRARY UNITS, ARBITRARY UNITS
##FACTOR=    0.252644378177508, 1,           1
##FIRST=     3299.83951724647, 0,            0
##LAST=      -839.233330435636, 0,           0
##MIN=       -839.233330435636, -1977079,    0
##MAX=       3299.83951724647, 508246333,    0
$$ Real data points
##PAGE= N=1
##DATA TABLE= (X++(R..R)), XYDATA
$$ [...]
9864c23466L91633o5175M7114j0956O9526M1553j06136K82999n73699J87423j4017
9853g3201q6491M6602L64766k82341K61932m05530J33925L056j56495M9884J84970
9842D1077n01522N31528j31321J23818r6810m7556J9150o8244k1483L77786k96773
9831g0350k53905J83878K05779j84886J59273K14972k70235q6289N3200m36492
9821d85055K60772J07753J1457l97689O32669M5129q5654K17960j68581n0269
9811H8492P3261J89240o56696M37677r6550l07287M97178K37030J07249m91475
9801G8119m2537J73856J43172r8792m1483l62614J45602J44770k31981K51270
9791A59382p573j85166K81883j77291j10625K4481J37656k42080L32436K81593
$$ plain form
9864 -323466 68167 2992 50106 39150 108676 150229 44093 327092 -246607 -59184 -73201
9853 -73201 -159692 -113090 251676 -30665 231267 -174263 -40338 -37282 -193777 -143893 41077
9842 41077 -460445 71083 -60238 63580 -33230 -80786 -61636 -129880 -151363 226423 -70350
9831 -70350 -324255 -140377 65402 -119484 39789 254761 -15474 -101763 -48563 -485055
9821 -485055 -224283 -116530 -105073 -502762 129907 175036 89382 307342 138761 88492
9811 88492 161753 350993 -305703 131974 35424 -271863 225315 462345 569594 78119
9801 78119 35582 209438 352610 253818 212335 -150279 -4677 140093 -91888 159382
9791 159382 151809 -33357 248526 71235 -39390 -14909 122747 -119333 213103 494696
9781D94696r0974k08209m03066N59074j43797r3145J08296o04136K83433K49304
9771A51476j07618L61619m77106K05292n8111j98252K39962K37660j90501J96612
9761C61033k32125J07467j9308m0719K1578J8261k75219L1355K50045o9192m8855
9750A04321Q7855R4996l0362K90937l06869o3610j94732M01225n94339M48608
9740B38030K4721J34800l95992o1808N33057k02906l59640N75517l43063O4641
9730B07357k29276M20247j99270j75529L41787K20666m62437r8038P408K30464
9720B63379L46618q88629L17006j748L9082M08067n24757J48397k92187K72557
9710H7785Q5682j83724j92953O4374L35219k37812J68450R6760l72421J84904
$$ plain form
9781 494696 403722 195513 -207553 351521 207724 114579 222875 -381261 -97828 151476
9771 151476 43858 405477 -71629 133663 75552 -122700 117262 354922 164421 361033
9761 361033 128908 236375 217067 176348 197926 216187 -59032 -27677 222368 153176 104321
9750 104321 192176 287172 256810 547747 240878 177268 -17464 383761 -210578 238030
9740 238030 262751 397551 1559 -60249 472808 269902 -89738 485779 142716 207357
9730 207357 -21919 398328 199058 23529 365316 585982 123545 25507 32915 263379
9720 263379 609997 -278632 38374 36626 75708 483775 -40982 107415 -184772 87785
9710 87785 173467 -10257 -203210 -138836 196383 -41429 127021 223781 -148640 36264
9700C6264J68038l8119l96867L24512P5137j35329R1745k7814P1098k71470J52964
9689E0159q2674K9670K09963l38756L97239l73924J68955O6626m9112L2782m5990
9678F4938L27453j35017k63760N66848m22773r7862K9282K87510K41521j36460
9668D61680l36991L61845m6330j81435J07564j1082K33737n04420L97289J81808
9658F63665l39821j09110J87846k26236m17548N99116m78651Q9332j93433J36355
9648h8485J17882J49577k18661M56756l82055L48176l81064j00242m344K80540
9638A78080K0082R2383m04810L3665k8257L24570l71880K47985j51830J66157
9628A06145J9153J50749j51177N4924j39606N9468L0650K29189k87659r651J42488
$$ plain form
9700 36264 204302 166183 -230684 93828 168965 33636 125381 97567 168665 -102805 50159
9689 50159 -32515 -2845 207118 -131638 265601 -108323 60632 127258 78146 110928 64938
9678 64938 392391 257374 -6386 560462 137689 39827 69109 356619 598140 461680
9668 461680 124689 486534 440204 258769 366333 355251 588988 84568 481857 663665
9658 663665 323844 214734 402580 176344 -241204 357912 -120739 -31407 -224840 -88485
9648 -88485 29397 178974 -39687 417069 35014 383190 2126 -98116 -102460 178080
9638 178080 198162 290545 -114265 -80600 -108857 215713 -156167 91818 -60012 106145
9628 106145 125298 276047 124870 179794 40188 99656 130306 359495 71836 62185 204673
9617B04673k04291J87550J29511j92288k07293J47240n1677Q1408K9807p5949
9607D8691j22010N28949n21450J77838j89380Q695P2870J33091N8860P542o1996
9596A41700P2819N5007j61092K85397k67563l88626M06500K30239m23726n4100
9586a03445N14856m08847M6046M74719k10748m9908l52130L18615j89620M16353
9576D55891l34073L77996l21643j67694P5635j12144J14276R6049o5406J78454
9566B97341n48994Q62519n96704L82236J8829m00409J58369p5058J33387n1715
9556A79801j87945M57673j36575k27802K38466J99892k78001J48244j56977k55742
9546a8966J56714L4550M37180o23232J5944R099K48055O4559j10490J09490R4249
$$ plain form
9617 204673 382 187932 317443 125155 -82138 65102 13425 94833 124640 48691
9607 48691 -73319 455630 -65820 112018 -77362 -68667 4203 137294 196154 203696 141700
9596 141700 214519 269526 108434 393831 126268 -262358 144142 374381 -49345 -103445
9586 -103445 411411 2564 48610 523329 312581 262673 -89457 229158 39538 455891
9576 455891 121818 499814 178171 10477 86112 -26032 88244 184293 118887 297341
9566 297341 -251653 610866 14162 396398 415227 14818 173187 98129 231516 179801
9556 179801 -8144 449529 312954 85152 323618 523510 245509 393753 236776 -18966
9546 -18966 137748 172298 609478 -13754 2190 11289 259344 323903 213413 322903 417152
9535D17152j76045K15441j76424q6694k5171j13601N0920j56760N0738K15473
9525B15029j72922j27259L01550l26304K40912L05585k66819j21104r9300K98167
9515B47535r6485j45131R8564K38753k75287K50564n91953M01578k5898o0674
9505D1566R997R0479j44494L90069k17375K2011k39158N55227j64141p0777Q4580
9494C57984J09485l01029L86472n16691K48862q1995j01395j44177q5415N37110
9484D09211l12637p2352L23037k60702O1991K67553l79451J54853p8237k81817
9474a68551R0502J15032J23331J2242m11569N24806R1619j899l84982J09710J02447
9463B02688n03686O08907n5640j94210L38775n29476L56220K89285m21455K17214
$$ plain form
9535 417152 241107 456548 280124 193430 168259 54658 105578 -51182 -444 215029
9525 215029 42107 -85152 216398 -109906 131006 436591 169772 48668 -50632 247535
9515 247535 151050 5919 104483 343236 67949 318513 -273440 128138 102240 41566
9505 41566 51563 142042 -2452 387617 170242 192253 -46905 508322 344181 273404 357984
9494 357984 467469 166440 552912 36221 285083 203088 101693 -42484 -127899 409211
9484 409211 96574 24222 347259 86557 148548 416101 36650 191503 113266 -168551
9474 -168551 -78049 36983 160314 172556 -239013 285793 377412 375513 -9469 100241 202688
9463 202688 -300998 307909 252269 58059 396834 -132642 223578 512863 91408 308622
9453C08622l24264O2220J77392n0922o7566K05126k40320J03136j81095q495j15909
9442a32075M51489k40686J00068r3806j24777K85113J4705k47884J92822n1371
9432A53598l27855l0970J53678L83486l01909J49428j77437L42063j56556O2632
9422B50158K28034m13299k13227K09353K80160m0213j30149p7414k47065M98564
9412C44902P7285l26965J6226j38778R0525R8026j01613l17405L21738k94146
9402b30205j5893K68842k33401K89386K0988j4628K74406m09780j34667M29683
9392B44731j19378M75024n03586j04828p6560O74974m36169K9048K6511m90478
9382b80711P50649k04880O7916q1767l709j87474k06812L92082l05863L89438
$$ plain form
9453 308622 -15642 46578 223970 173048 105482 310608 70288 173424 -7671 -16166 -132075
9442 -132075 319414 78728 178796 84990 -39787 245326 260031 12147 204969 153598
9432 153598 -174257 -205227 -51549 331937 30028 179456 2019 344082 187526 250158
9422 250158 478192 64893 -148334 61019 341179 300966 170817 93403 -153662 344902
9412 344902 422187 95222 111448 -27330 63195 161221 59608 -257797 63941 -230205
9402 -230205 -246098 22744 -210657 78729 99717 85089 359495 -50285 -184952 244731
9392 244731 125353 600377 96791 -8037 -84597 590377 154208 183256 209767 -280711
9382 -280711 469938 265058 332974 251207 247498 60024 -146788 245294 -60569 328869
9372C28869k23779O33855n08655j32244J70977K35378n2607p19308k2499N04511
9362B14498Q6060J9472K7219l52126J55370k30586L26819k26727K31374k36700
9352A4673j01325L74065l41814K66463l57117J48929K41856k58325K14091m9766
9342A51730K695K39607k80196q2106k21995M33316j25135J28388o2563j44278
9332C9463p7350J88891j78264J72355j79608J77687K21518j19449j24855K66990
9322C87378M7410l35494l6744Q1553K28496n62224L89234r8136K19038j05347
9312B15164j62752N6881M23231j8904j94417J46965p7524q1713o454j05130K33708
9301D29055j27695J4672O1029j61452K71168k29286k0107k74937M79266Q9263
$$ plain form
9372 328869 105090 738945 230290 98046 269023 504401 451794 -267514 -290013 214498
9362 214498 300558 320030 347249 -4877 150493 -80093 246726 19999 251373 14673
9352 14673 -86652 287413 -54401 212062 -145055 3874 245730 -12595 201496 151730
9342 151730 154425 394032 113836 31730 -190265 243051 117916 246304 183741 39463
9332 39463 -37887 151004 -27260 145095 -34513 143174 364692 245243 120388 387378
9322 387378 434788 99294 62550 144103 372599 -189625 199609 101473 320511 215164
9312 215164 52412 109293 532524 513620 319203 466168 388644 306931 300477 195347 429055
9301 429055 301360 316032 377061 215609 486777 257491 237384 -37553 441713 530976
9291E30976m54202J05625J31350k43723J34315q1393K27146l7466N220k12422
9281A05426M82952M4329l84018l36083O55960J6954l48478j71288K38208k58560
9271D5402l02640N62898o0502q6346N4525l24302L7625M37652n6474j86813m9645
9260G1380J9373J18471l27767M18072l40445L18328j91109P5281p968K34976j13489
9249B75103k10808O18612j01113j26411l73583L27868j01973j83418J02720M8653
9239B75650j18510j48810M26353m55615K56283J1082k7547m4151M39940n16770
9229I7905J96179O946j01579k00645L74702R8256n9837k18688K49859l52941Q633
9218I8790J08727J4464J3664k02458J17269p8668L3841l4748J97962M12992n12873
$$ plain form
9291 530976 76774 182399 313749 70026 204341 122948 350094 312628 317848 105426
9281 105426 588378 632707 248689 -87394 568566 585520 237042 65754 303962 45402
9271 45402 -257238 305660 245158 158812 213337 -110965 -73340 364312 307838 121025 71380
9260 71380 90753 209224 -118543 299529 -40916 277412 86303 161584 153616 388592 275103
9249 275103 64295 682907 581794 455383 81800 409668 307695 124277 226997 275650
9239 275650 157140 8330 434683 -20932 235351 246433 218886 174735 614675 97905
9229 97905 294084 301030 199451 -1194 373508 471764 411927 193239 443098 90157 98790
9218 98790 207517 221981 235645 33187 150456 71788 105629 70881 268843 681835 168962
9207A68962m7048k22320L05899L4484J51273k83887L02902l23245q0141M25519
9197D32398L0673N8751k53298J54035J67826k43118k16133L71055m8036l85029
9187F9124K61673J2901k99419N59882J37392r37738M69405j5288L11840j62625
9177D07147K04993k60743J82589q0057j13794Q0774K07634N0308p7286J28779
9167G30344j51888O05653l16229j61522j68736M61127k43772m8976l71094K53516
9157E88423J01171O7036P38811j041131M02343l2615J15279k1628L26582m10395
9147H33876J08783M9296k16160N0711M06965j9496m47642M56186K31437p82970
9137F70986P24982l58357M33143l41909R7567p3799l09763Q61182n81915J41185
$$ plain form
9207 168962 121914 -100406 205493 239977 391250 107363 410265 87020 6879 432398
9197 432398 463071 521822 268524 422559 590385 347267 131134 502189 454153 69124
9187 69124 330797 343698 44279 604161 741553 -196185 273220 257932 569772 407147
9177 407147 612140 351397 533986 453929 340135 420909 628543 678851 601565 730344
9167 730344 578456 1184109 867880 706358 537622 998749 754977 706001 334907 588423
9157 588423 689594 756630 1495441 454310 856653 824038 939317 917689 1244271 833876
9147 833876 942659 991955 775795 826506 1233471 1213975 766333 1222519 1453956 670986
9137 670986 1395968 1037611 1470754 1128845 1226412 1152613 842850 1704032 1122117 1263302
9127A263302J66184J08133J26223n32797O71765J30159k71891K154J50224J79466
9117A992922M80370k45933M58302l37415M9118l0235J86816J56758N79306m87548
9107B802461K62582L97730J81252O10864M05666P08777O84874L63951J055698
9098G473855J055017P75324J154114K277565J488176L123292L664843M682124
9090B5694310M254291N014788N713190O167368N710109J538495K24619j188888
9082E3128282l458023m206465n293867m345376l622973l371666m069844l274685
9074B1485383m614451l648821k582709j928321j348655j197100j591727o02119
9066C971480l37354j017895P3302k15022L1799L10236q87557J12586j77530K72195
$$ plain form
9127 1263302 1429486 1537619 1663842 1131045 1802810 1932969 1661078 1663232 1813456 1992922
9117 1992922 2473292 2227359 2685661 2348246 2397364 2367129 2553945 2710703 3290009 2802461
9107 2802461 3065043 3462773 3644025 4254889 4660555 5369332 6054206 6418157 7473855
9098 7473855 8528872 9304196 10458310 12735875 14224051 17347343 21012186 25694310
9090 25694310 29948601 34963389 40676579 46843947 52554056 54092551 54317170 53128282
9082 53128282 49670259 45463794 40169927 35824551 32201578 28829912 24760068 21485383
9074 21485383 16870932 13222111 10639402 8711081 7362426 6165326 4573599 3971480
9066 3971480 3634126 2616231 2689533 2474511 2506310 2816546 1928989 2041575 1864045 2136240
9056B136240k71471l58775N2541k24538m513Q5457j91751q4826j15241k54433
9046G68690L77424l21385L19313m15328O3854J90472l57054k49304M05917N4713
9036H37312M4887l87357L68521o58173J23903K35466n4704k61371M4065J59908
9026D52457k24047k46545L77439l4697L4401m69572R2150J0836L24660k67971
9016D9111J30547l67449M38699j05473j99145K31078K32027j19526L17652k36537
9006C70984K7317j04709J3678J01230k98922J69540K3239j30127O5643j58891
8996G8982K52544j72021L3189O3591k07474J30751L12778O1945n62473L42927
8986C34739M5715l31495K43290l01104K20446j92533L80034n20085M18211o2069
$$ plain form
9056 2136240 1864769 1505994 1558535 1333997 1329484 1414941 1223190 1138364 1023123 768690
9046 768690 1146114 824729 1144042 728714 792568 983040 625986 376682 782599 837312
9036 837312 882199 494842 863363 205190 329093 564559 509855 248484 292549 452457
9026 452457 228410 -18135 359304 324607 359008 -110564 -18414 -7578 317082 49111
9016 49111 179658 -187791 250908 145435 -53710 177368 409395 289869 607521 370984
9006 370984 398301 293592 307270 408500 109578 279118 302357 172230 237873 78982
8996 78982 331526 159505 192694 256285 48811 179562 492340 554285 -8188 334739
8986 334739 380454 48959 292249 -8855 211591 19058 399092 -120993 297218 235149
8976B35149k10891K03369j91334L56268k51655J72463M684K78961o72814N01606
8966D25806j34146J93578m10007L35881n0735Q928n49825J30942k35775M72210
8956A86857J00313l62767J16231j47962O89304m37246K1481p2573l1687Q6376
8946A48327J36356k20343L06412q2196O4892n74751J28478L97905n47365R35552
8936F93267n59666O734j82627K14339J82052j39646J42481k65967L08288k97240
8926A02015j11442M03089L2272l0537k00180q4195q72l21413O75881m10416O201
8915F0403n9236p1713J0261N34654p1556o2117Q077k41447J15451n09821K83017
8904d027o6003k769L75686j62911M05689n50644L0903K47169k78098J98922J81608
$$ plain form
8976 235149 24258 227627 36293 392561 140906 313369 318053 597014 -75800 425806
8966 425806 291660 485238 75231 411112 360377 369305 -180520 -49578 -285353 186857
8956 186857 287170 -75597 40634 -107328 581976 144730 166211 93638 61951 148327
8946 148327 284683 64340 370752 288556 353448 -221303 -92825 305080 -242285 693267
8936 693267 133601 140335 -42292 172047 354099 214453 356934 90967 399255 102015
8926 102015 -9427 393662 425934 395397 195217 111022 110150 -211263 464618 54202 60403
8915 60403 1167 -70546 -60285 474369 402813 340696 348773 107326 222777 -287044 -4027
8904 -4027 -70030 -72799 302887 139976 545665 -4979 25924 273093 -5005 193917 375525
8893C75525j87455k90748N18445l95230Q7790N064j22021J81455K9016k94441
8883i2600K01814o4269P8425R0584R3814m94099M80833J50988m54301J22361p8309
8872C5241k71905R4526j91392J88378n8315Q6617j2670Q9980j92087M27570j2212
8861A83731K2741L7381M1860j72113J68665o64220L77472K19192j98687K1256
8851C7278r0302M48749k39798l9668n749R0322j15844K24512N5394m54609m6052
8840a35767J04569K40093o6353L39361J3822m23646R6967m9130J22008l15734
8830g3810J10697o8291l8808J1182o1121L24927l14693R3868K81505j64414j48129
8819d7087M37028J59992m91927K20078o571m59375L03647k1731L6797L12674k65327
$$ plain form
8893 375525 188070 -102678 415767 20537 108327 113391 -8630 172825 201841 -92600
8883 -92600 109214 44945 123370 213954 307768 -186331 294502 445490 -8811 113550 35241
8872 35241 -236664 -142138 -333530 -145152 -203467 -116850 -129520 -39540 -231627 195943 183731
8861 183731 206472 243853 285713 113600 282265 -381955 -4483 214709 16022 37278
8851 37278 -53024 395725 155927 116259 110510 200832 84988 309500 364894 -89715 -135767
8840 -135767 -31198 208895 142542 481903 495725 72079 169046 119916 241924 -73810
8830 -73810 36887 -31404 -70212 -59030 -120151 204776 -109917 -16049 265456 101042 -47087
8819 -47087 389941 549933 58006 278084 271513 -187862 115785 94054 130851 443525 178198
8808A78198k12004K13485j29063J24367J62887k75413J50477m43005M90438p6581
8798A83786J7567o3120l58171N98276k08502l11497M33043l85124J22213K26202
8788B54673l06671L24951r83352J112551k3856j55431r7279j05279J82597O6325
8778B69229J22858k17927M59071j68397o95924M70894P9378l76628J3796M22045
8768C78395l09731l23065K87140J6880O0438K13038j07926j47449L652j99133
8758a27761N34266o6536j7458k92371K96145n16893K98923j46973K20009O3440
8748B44791J35059j15716j39055k662r7342r2181K12103q7055K77481m12902P1979
8737e500j81048K31225K0964M0962J80866N8937m91149K81693L43401m91265J27681
$$ plain form
8808 178198 -33806 179679 50616 174983 337870 62457 212934 -230071 260367 183786
8798 183786 201353 138233 -219938 378338 169836 -141661 291382 -93742 28471 254673
8788 254673 -51998 272953 -710399 402152 378296 222865 125586 20307 202904 269229
8778 269229 392087 174160 633231 464834 -231090 239804 319182 -57446 -43650 378395
8768 378395 68664 -254401 32739 49619 110057 323095 215169 67720 71372 -127761
8758 -127761 406505 339969 322511 30140 326285 -190608 108315 -38658 181351 244791
8748 244791 379850 264134 125079 122417 25075 -67106 144997 57942 335423 -77479 -5500
8737 -5500 -186548 44677 65641 106603 287469 346406 -144743 136950 480351 -10914 116767
8726A16767R6298j46878L21061n6227j49157o61588N00054k89182J8542M01912
8716A51602L73133m74621O7677L09035p67295L82404K42479M11049m54213K13634
8706D54884m38865J47625k21832J53934J10806j82474j7590n4950L38184l5077
8696B54645J40130l80435N64675j75598m50792Q2451L47733l99021L41722j74665
8686A50845J86327l81430O01690q05830K17827J03450K2588K20894k54705J93530
8676B55186L38791q3963l9297n7553r7804K46270j6154r5587M25973k49816k154
8665F23892m36234K41558J11770j35074l46375J80710j14522l1866o8666K52757
8655B77950L9038j28020m5027k80706K48386j5601K67332n23812J34726L54136
$$ plain form
8726 116767 213065 66187 387248 331021 181864 -479724 20330 -268852 -250310 151602
8716 151602 524735 50114 117791 426826 -340469 41935 284414 695463 241250 454884
8706 454884 16019 163644 -58188 95746 206552 24078 6488 -48462 289722 254645
8696 254645 394775 14340 579015 403417 -47375 35076 382809 -16212 325510 150845
8686 150845 337172 -44258 557432 -248398 -30571 72879 95467 316361 61656 255186
8676 255186 593977 510014 470717 413164 315360 561630 545476 449889 875862 626046 623892
8665 623892 187658 429216 540986 405912 59537 240247 125725 93859 25193 277950
8655 277950 316988 188968 143941 -136765 111621 96020 363352 -160460 -25734 328402
8645C28402k36274K48412K32604j91049r1169J77184l99015J72001j65356L04032
8635C79772o2506j43966n1762J20335P7658j88370K85232k7679O9308j20430j36120
8624B01472J61422J7245l56730R8447j58875J71589r7747J5639L6548L8393R6095
8613B23498O3833R2369n2458j9697j82284J95126k9829R6665n06066j07546K3691
8602b02698K26415J085J96978J0976j19420K49515j24153L1475l05507M58149
8592D22815k66322q4596J45638l45146O95079m12655J82639j18962r3413j25855
8582g78r3824J06607K06821L1694q9132J48241L22231l57694L3348k57293j4418
8571C5803J92326J49844l09802J18644k80611K73938k10208J2161L06037J04014
$$ plain form
8645 328402 92128 340540 573144 382095 290926 468110 69095 241096 75740 379772
8635 379772 317266 173300 121538 241873 319531 131161 416393 388714 458022 337592 201472
8624 201472 362894 380139 23409 121856 -37019 134570 36823 52462 89010 127403 223498
8613 223498 287331 379700 327242 307545 125261 320387 290558 387223 -118843 -226389 -202698
8602 -202698 23717 24802 221780 232756 113336 362851 238698 270173 -35334 422815
8592 422815 156493 71897 217535 -127611 567468 154813 337452 218490 125077 -778
8582 -778 -94602 12005 218826 250520 161388 309629 631860 274166 307514 50221 35803
8571 35803 228129 377973 68171 186815 -93796 180142 -30066 -17905 288132 392146
8561C92146j65663L12740j85572l90285J15514J88667l06304M05631j89758o8236
8551A08880M58113m96988K12360j34557Q0744p7439K02793Q3107j82477N59530
8541H14066n07961J88835n86841j83176K17905K8185K53931K5270m40397L156478
8531B966295k472940o0284j59549J276N63002n03387p165n0254j07309r3617K70435
8520C46503j15162K93699k4458m01255r4463K31729L06464M0152m12502o4356
8510A06351j01250K3184K86182J08591m02289M49872k1080l80018M27784n72834
8500g5507L91288r8343R3642k71737k13486M89185j10820K06835N2984l8560k41142
8489A84339J53834n91557M33043k47249P15689m03031j67893k70101J67739N60105
$$ plain form
8561 392146 226483 539223 353651 -36634 78880 267547 -38757 366874 177116 108880
8551 108880 566993 70005 282365 147808 228552 151113 353906 437013 254536 814066
8541 814066 306105 494940 -91901 -275077 -57172 -28987 224944 250214 -190183 2966295
8531 2966295 493355 433071 273522 274798 837800 334413 327248 276994 169685 76068 346503
8520 346503 231341 525040 500582 99327 4864 236593 543057 583209 170707 106351
8510 106351 5101 28285 314467 423058 20769 470641 449561 69543 497327 -75507
8500 -75507 315781 217438 311080 39343 -174143 315042 204222 411057 464041 425481 184339
8489 184339 338173 -253384 179659 -67590 648099 245068 77175 -192926 -25187 534918
8479E34918j84352k11312N83962k63279k73443l12505O32487n50366K40924J33131
8469C30165j27939L09950l05225l36719M80753o5339j1308K86159l85712r6585
8459G8200K25412n5572n8965J87655m3193L17862l46387O9237K95559m66302K68281
8448D71787k73118p1021O7773J69546K45447k33984J68997J2661l26102K09750
8438D41736k31116J80595m57457O72988n24148L28557K35060p8937j652n24309
8428D1317N7160K70150l1894J01154Q7904k78173P6675j48922L20565j88235J29503
8417D37204l34987J60972j9964K82924k03467m2036j60089j18854N23373k03794
8407C21282k29373j5046K61994l3854L56972n13528M55572k09594o8315j2675
$$ plain form
8479 534918 350566 139254 723216 459937 186494 -126011 506476 -43890 197034 330165
8469 330165 202226 512176 206951 -129768 350985 285646 274338 560497 174785 78200
8459 78200 303612 248040 189075 376730 333537 651399 305012 374249 669808 203506 471787
8448 471787 198669 127648 195421 364967 610414 376430 545427 558088 231986 441736
8438 441736 210620 391215 -66242 606746 82598 411155 646215 567278 565626 41317
8428 41317 98477 368627 336733 437887 525791 247618 324293 175371 495936 307701 437204
8417 437204 102217 263189 243225 526149 322682 280646 120557 1703 525076 321282
8407 321282 91909 76863 338857 305003 661975 148447 604019 394425 326110 313435
8397C13435q4766J88077j2924k61725j12087K54246J20201p88991P38183O5434
8387D19083q3856n03014J37389N41666r3695m42696K1288Q1829J63707j48582
8377I3119J44875P2860O1646n9189K90484q8658P0873j18730J00003l59960J24142
8366C31465J23528P9586l97296K30586m59965N08036o15306L17969M1655K53379
8356D13637k14573k30338M99134j3623l81797J02679K59747J79574r8638l80585
8346A35217J20938J67821P0421K015o35768L49695J13059j2556J71835j20736
8336C61941j2335J00219l69026M95509J04886k71842k25328M50006o83911N65349
8326E15468j74230M15699n59335j1511J60927N774K8379L37823k77880j14059
$$ plain form
8397 313435 228669 416746 403822 142097 30010 284256 404457 -384534 353649 419083
8387 419083 335227 -167787 -30398 511268 417573 -25123 -3835 77994 241701 93119
8377 93119 237994 310854 372500 313311 603795 515137 586010 467280 567283 207323 331465
8366 331465 454993 534579 137283 367869 -92096 415940 -199366 118603 160258 413637
8356 413637 199064 -31274 467860 454237 72440 175119 434866 614440 515802 135217
8346 135217 256155 423976 494397 496412 -139356 210339 323398 310842 482677 361941
8336 361941 349606 449825 80799 576308 681194 409352 184024 634030 -49881 515468
8326 515468 341238 756937 197602 186091 347018 352792 381171 718994 441114 327055
8316C27055K91362m56352L66219l7731o33227k43884N09879J72173M80574l68372
8306D07696l66587J44893L4472K50824l32455J80647J33884K16182m58329p6021
8296A35206N81947k02974N6002l72145j9971O11872m82543L83237Q8194p77472
8286A353M34620j02609L13275k50431J48017p4831K02847n74890N40996k32921
8276D05426J72188P7985j53570K15956n00973J63868j46434M70856l33273j0691
8266C61338K02054k08321J61752l29110l1656M69325m67377L88976j39063J71324
8256E79242n4096k81562k1661O04176k38351o9178k49107K59491k83030L35187
8246E81111m78381M10320k35031M39929j1739k28877j01995J62166p0453o29288
$$ plain form
8316 327055 618417 162065 528284 490553 -142674 -386558 123321 295494 776068 407696
8306 407696 41109 186002 220474 471298 138843 319490 453374 669556 211227 135206
8296 135206 717153 514179 570181 198036 178065 789937 307394 690631 778825 1353
8286 1353 435973 333364 646639 396208 544225 469394 672241 97351 638347 405426
8276 405426 577614 655599 502029 717985 217012 380880 234446 705302 372029 361338
8266 361338 563392 355071 516823 187713 156057 625382 158005 546981 407918 579242
8256 579242 525146 243584 221923 826099 587748 518570 269463 528954 245924 581111
8246 581111 102730 513050 278019 717948 706209 477332 375337 537503 467050 -162238
8236a62238O81609k72116K05345N0910L8336J47923k32365l6889J40859L35540
8226H96914n87733j72105J28591K85043n96048P26061l56223l4784Q1719J3096
8216C84531L76116m39556L14701m57717K68545K52116q4273K55112o6475n28378
8206B74722K30942J58753m33388K59408O2670N5189k5299m85822O2235J35572
8196B94982k6289l09320J65289l31350j770391K615948L43513k50279k90193K69630
8186G11540m2311o9847m6543j34072R0287K30815j88697K99351j08386n33897
8176B08240J33968L67935m0289M9431o665K01627j93112j29197N0021k2304J91022
8165H10677J55518l00274j8762r128L60777n78898J80803L7944R8187j84211O1045
$$ plain form
8236 -162238 519371 247255 452600 503510 541846 689769 457404 420515 561374 896914
8226 896914 309181 137076 265667 550710 -45338 680723 324500 289716 371435 384531
8216 384531 760647 321091 635792 178075 446620 698736 614463 869575 803100 274722
8206 274722 505664 664417 231029 490437 553107 608296 582997 97175 159410 294982
8196 294982 268693 -40627 124662 -206688 -1977079 638869 982382 732103 441910 711540
8186 711540 669229 599382 552839 418767 509054 739869 551172 850523 742137 208240
8176 208240 342208 710143 669854 719285 712620 914247 721135 591938 641959 619655 810677
8165 810677 966195 665921 647159 638031 998808 419910 600713 638657 736844 552633 613678
8154F13678J37703n78816Q12060m68959J56204o5103j36434L07645Q2944j87182
8144F73740Q6814J1994p4124l86612K74559j91750L48687k61314J08656K30474
8134H21124p2629j98194j59618J20168J23943j57075l1775K92100j60576j83307
8124C94161J92011q5684L68468j56687r4588j79574O6961j58845J77174o1894
8114D61503J98572O9301k33641j95965K13523J79010k05729N73164j94719k82535
8104E82484L82563k67306n9522J83006n8077k03560k10195J60130L03966j58847
8094F54642m1040o2020o9086O4894k56729M34725r8350M00925J68676l80996j77207
8083F38434J88890K87568J72081k42203k84203m6228K47427L96972k29939q5442
$$ plain form
8154 613678 751381 172565 984625 515666 671870 606767 470333 777978 860922 673740
8144 673740 760554 772548 698424 311812 586371 394621 743308 481994 590650 821124
8134 821124 748495 550301 390683 510851 634794 477719 445944 738044 577468 394161
8124 394161 586172 500488 868956 712269 617681 438107 505068 346223 523397 461503
8114 461503 660075 729376 495735 299770 513293 692303 486574 1059738 865019 582484
8104 582484 965047 697741 638219 821225 763148 559588 349393 509523 813489 654642
8094 654642 613602 551582 482496 547390 290661 725386 627036 1027961 1196637 815641 638434
8083 638434 827324 1114892 1286973 1044770 760567 714339 961766 1358738 1128799 1043357
8073A043357j20585L8436q3137K37981K14351j38180j84990m1843l36641N08377
8063A137126J1317m1074K07978k87088j70557R7063m68639K52882L60281r6728
8053A002561j82189n6567L74376m11637J22437o1805N43226j2631j08618p3204
8043A135949K69487R1501j11620P6377j17415k41188M95787l33539q1521J73268
8033A357086m0215J46514K27804l3591k020m4253o3479N5670k7246J38046K25191
8022A939507j67007K86768j43622K14876j11160L48220L52834q1597K27865J73785
8012C040469K23645j11973R18223K23654K11623J91516K82776K41282l51380J19522
8002D989357j45589j10471N8899l28701l82003j99073l99071N5662J3027o21163
$$ plain form
8073 1043357 922772 961208 878071 1116052 1330403 1192223 1007233 965390 628749 1137126
8063 1137126 1148443 1107369 1315347 1028259 857702 954765 486126 739008 1099289 1002561
8053 1002561 820372 763805 1138181 726544 848981 787176 1330402 1317771 1209153 1135949
8043 1135949 1405436 1496937 1385317 1461694 1344279 1103091 1598878 1265339 1183818 1357086
8033 1357086 1316871 1463385 1691189 1657598 1655578 1611325 1547846 1603516 1576270 1714316 1939507
8022 1939507 1772500 2059268 1915646 2130522 2019362 2367582 2720416 2638819 2866684 3040469
8012 3040469 3264114 3152141 4070364 4294018 4505641 4697157 4979933 5221215 4869835 4989357
8002 4989357 4843768 4733297 4792196 4463495 4081492 3882419 3483348 3539010 3552037 2930874
7992B930874l09110k49965J05012J49041n03682p8176J43226o3736m41116O5291
7982A747659J11721Q5442L1949L56360m95537n31j91803k15881M5550K13295k93273
7971A394951K95248O2293n5127P0910l12935J81957K26789m87479K57365l8435
7961A595537m99896K28552m6135p0453o7516L71160p6977J67476j76460n4416
7951A370872l35001K44609r9622L60240j55591k77653O39613l94362m29952P50856
7941A674009k13910r2163J43107j09801K3771K04619M6340J54902P90J26571n65749
7930A392486L45974K53775K94230K09196m40198J71110j74937n1496N297K82815
7920B288252j00812L88118j49586k81332M56617k86162N50157k41246K5053J51967
$$ plain form
7992 2930874 2621764 2371799 2476811 2625852 2122170 2043994 2187220 2123484 1682368 1747659
7982 1747659 1859380 1944822 1976771 2333131 1837594 1837063 1645260 1429379 1474929 1688224 1394951
7971 1394951 1690199 1752492 1697365 1768275 1455340 1637297 1864086 1376607 1633972 1595537
7961 1595537 1095641 1324193 1278058 1207605 1140089 1511249 1434272 1601748 1425288 1370872
7951 1370872 1035871 1280480 1180858 1541098 1385507 1107854 1747467 1353105 923153 1674009
7941 1674009 1460099 1367936 1511043 1401242 1425013 1629632 1675972 1830874 1831664 1958235 1392486
7930 1392486 1738460 1992235 2286465 2495661 2055463 2226573 2051636 2000140 2005437 2288252
7920 2288252 2187440 2575558 2425972 2144640 2601257 2315095 2865252 2624006 2649059 2801026
7910B801026q2288l0384m15574L04083j07428J2973l04051L59981k1964j35067
7900B381307l35073Q11610l34574m13689J23582l25291J6232K67235k93580J26827
7890B024586k56441M15256l77488R7640l24623M53845r4282k37193K92277p6024
7880A917553o15399O35511O7553j66125J66844k85942K65733m88522J14862K12196
7870A824264j33817K6157m25330L12122Q8117j48508k05856J8808M37932k45329
7860A548560J46912k88500N9401J24786J95879l60702L62213o7264j769369o39727
7850f87811K089798n5803K69835n3380J16326l88725M47974k10715N487J91799
7840A724785l10007N08009l25435j0099k0375N36117o51208L96602j10638P4287
$$ plain form
7910 2801026 2718738 2688354 2272780 2576863 2469435 2482408 2178357 2538338 2516374 2381307
7900 2381307 2046234 2857844 2523270 2109581 2233163 1907872 1924104 2191339 1897759 2024586
7890 2024586 1768145 2183401 1805913 1903553 1578930 2032775 1938493 1701300 1993577 1917553
7880 1917553 1302154 1937665 2005218 1839093 2005937 1719995 1985728 1497206 1612068 1824264
7870 1824264 1690447 1716604 1291274 1603396 1691513 1543005 1337149 1355957 1793889 1548560
7860 1548560 1695472 1406972 1466373 1591159 1787038 1426336 1788549 1721285 -48084 -687811
7850 -687811 1401987 1346184 1616019 1562639 1678965 1290240 1738214 1527499 1532986 1724785
7840 1724785 1414778 1922787 1597352 1587253 1566878 2102995 1451787 1848389 1737751 1812038
7830A812038O3988J4663j84152J66638K49187j93049k30606M38872j17711k4313
7820A995555j87692j69245L15671l16670M06346j53544N33892n74919K09220j98792
7810A859822J98256Q4623j26977K67142J75868n92101N47122l94891O83695j44485
7800B558074R8054p9643j71324J64525K95389k77146l02471J83815K5421o3854
7790B430840j16521J69905K89203k62147K31725l8049l78561K63129k03929J44601
7780B530196l56906L11587N5766Q5010L94423l90041L33168k85694K49895K29914
7770C157318j60743K87185j83634K06244k87836J68261n2967J30261j00773M1981
7760C205297k65380Q05761L3260l97591M26229n45874O54954l91163P48953M3059
$$ plain form
7830 1812038 1876026 1890689 1706537 1873175 2122362 1929313 1698707 2137579 2019868 1995555
7820 1995555 1807863 1638618 1954289 1637619 2043965 1890421 2424313 1849394 2058614 1859822
7810 1859822 2058078 2142701 2015724 2282866 2458734 1866633 2413755 2018864 2702559 2558074
7800 2558074 2656128 2576485 2405161 2569686 2865075 2587929 2285458 2469273 2494694 2430840
7790 2430840 2314319 2484224 2773427 2511280 2743005 2704956 2326395 2589524 2385595 2530196
7780 2530196 2173290 2484877 2540643 2625653 3020076 2630035 2963203 2677509 2927404 3157318
7770 3157318 2996575 3283760 3100126 3306370 3018534 3186795 3133828 3264089 3163316 3205297
7760 3205297 2939917 3745678 3778938 3381347 3807576 3261702 3916656 3525493 4274446 4317505
7750D317505m01678M46532j05798K41245J20336K95011p3333Q67201l44453O14943
7740E977511k26040M53915M43626M47016Q50765K48231O4286R14463P84569L36037
7730A0294379O64442N35572Q94193P52694j27259J094349O34969N64907L11949
7721A5620195J87373M68066m83600l10185q17929m54284o76614n05603r59763
7712A2067656n11698m39056p67573q23173j13354l62821j81640p19499J8220j7638
7702H149424p59922J94917J1326k52237j6525p23683j60901l27041N17318N7372
7692F690048K8176l96290J52175M1288K12034j73733K00355K13515l17023M46560
7682G097105r8594O0051K38893j12887N97520n27580j32606m6293k1996J63139
$$ plain form
7750 4317505 3915827 4362359 4256561 4497806 4618142 4913153 4839820 5707021 5362568 5977511
7740 5977511 5751471 6205386 6649012 7096028 7946793 8195024 8259310 9173773 9958342 10294379
7730 10294379 10958821 11494393 12388586 13141280 13014021 14108370 14743339 15308246 15620195
7721 15620195 15807568 16275634 15792034 15481849 14663920 14209636 13533022 13027419 12067656
7712 12067656 11555958 11116902 10349329 9526156 9412802 9049981 8868341 8148842 8167062 8149424
7702 8149424 7389502 7584419 7595745 7343508 7326983 6603300 6442399 6115358 6632676 6690048
7692 6690048 6718224 6321934 6474109 6515397 6727431 6553698 6754053 6967568 6650545 7097105
7682 7097105 6998511 7058562 7297455 7184568 7782088 7254508 7121902 7075609 7053613 7216752
7672G216752m6519j18174j93542k08733j28933K87586K74195J240K71752M15129
7662G770753L99681K16490L12343M28117O17063N47862J74032J52889Q13143l89930
7652A1042443J04905J77458n94565K09825k3581p35251m72925j02996m25844l34810
7642H844659j85317l08014l73290m3280K1410k83910l56824K98057j41717J15250
7632G587024k31822K39799j98788j53995L18028m93548J58262M02030J06185l21525
7622G411650q7797p7378R1723k534j12313p3553K68197L0599m35300o636l813
7611G002845o4383q0866k16048J4795j6117J93780l85098k8381J80118k1827k2332
7600F556486J99499j86685L10679o65496o2660O6340J13520q9267J27821n09776
$$ plain form
7672 7216752 7170233 7052059 6858517 6649784 6520851 6808437 7082632 7083872 7355624 7770753
7662 7770753 8170434 8386924 8699267 9127384 9744447 10292309 10466341 10619230 11432373 11042443
7652 11042443 11147348 11324806 10730241 10940066 10916485 10181234 9708309 9605313 9179469 8844659
7642 8844659 8659342 8351328 7978038 7934758 7956168 7672258 7315434 7613491 7471774 7587024
7632 7587024 7355202 7595001 7396213 7242218 7560246 7066698 7224960 7626990 7733175 7411650
7622 7411650 7323853 7246475 7338198 7335664 7223351 7149798 7417995 7448594 7013294 7006658 7002845
7611 7002845 6938462 6857596 6641548 6656343 6640226 6834006 6448908 6420527 6600645 6578818 6556486
7600 6556486 6755985 6569300 6879979 6214483 6151823 6218163 6331683 6242416 6370237 5860461
7590E860461J89309j73514K16380K14840l00815J2771J10654k36468J19491M69494
7580F482603l94178J35945n4155L44228N1337k15653K59680J79829K70594J04092
7570G164322J86904r0770Q8773O08194k66597L43550l36085J80756O41778J66682
7560H687507J86509O5825l9265Q9988l38747Q281K54332L66215n08576J68565
7550H940634K81545m15216L03798j95947N4757J31667P4859m53104K29308k23796
7540H728505M78801k08701j41552J6347L75817l22016m9974K20894J6584l88044
7530H726661Q8214K88421k01992M21908n74833K32985p5214J51376O1864N2590
7520I171980l65425j26313O73725l51843l6464L46154l92513K95560J5487M8683
$$ plain form
7590 5860461 6049770 5876256 6092636 6307476 6006661 6019432 6130086 5893618 6013109 6482603
7580 6482603 6088425 6224370 6170215 6514443 6565780 6350127 6609807 6789636 7060230 7164322
7570 7164322 7351226 7260456 7349229 7957423 7690826 8034376 7698291 7879047 8520825 8687507
7560 8687507 8874016 8939841 8900576 8990564 8651817 8660098 8914430 9280645 8772069 8940634
7550 8940634 9222179 8806963 9110761 8914814 8969571 9101238 9176097 8722993 8952301 8728505
7540 8728505 9207306 8998605 8857053 8873400 9249217 8927201 8877227 9098121 9114705 8726661
7530 8726661 8814875 9103296 8901304 9323212 8748379 8981364 8906150 9057526 9119390 9171980
7520 9171980 8806555 8680242 9353967 9002124 8965660 9311814 8919301 9214861 9230348 9279031
7510I279031m7863p6044P03314k17096Q6739L31044l27714Q5351n07744Q12426
7500A0121444k69443p93851Q16416R7040n6307o9402N0782p74266L01944r3954
7490I330403m6908j34677N04800j97759l14460M77137J22528L56100k92172J46025
7480I951017J15241p44004P2546n22442J19917m56687k71718k21286m76186L54913
7470G921311n43620l87466j79689O27278l53294J67552k38920o616m19831L94033
7460F980738m46437M5473j12393p5550N00638k68154Q0412j49095K64837k0554
7450F799915j59876k54359j06839O40935l96811N5517L88661O5698m59239K25370
7440F798972K54826J4973J34376j43571J08527L484q5416J25196N81268p8390
$$ plain form
7510 9279031 9231168 9155124 9858438 9641342 9728081 10059125 9731411 9816762 9309018 10121444
7500 10121444 9852001 9058150 9874566 9971606 9915299 9845897 9896679 9122413 9424357 9330403
7490 9330403 9283495 9148818 9653618 9455859 9141399 9618536 9741064 10097164 9804992 9951017
7480 9951017 10066258 9322254 9394800 8872358 8992275 8535588 8263870 8042584 7566398 7921311
7470 7921311 7377691 6990225 6810536 7437814 7084520 7252072 7013152 7006536 6586705 6980738
7460 6980738 6534301 6579774 6467381 6391831 6892469 6624315 6704727 6555632 6820469 6799915
7450 6799915 6640039 6385680 6278841 6919776 6522965 6578482 6967143 7032841 6573602 6798972
7440 6798972 7053798 7068771 7203147 7059576 7168103 7171587 7086171 7211367 7792635 7714245
7430G714245L92440L66864j8898Q2001M65590J01706M44183O5142M41125M27335
7420A0481733N75533K07886N81120N73595O40202M88411Q21647R07872P04271
7411A5982270J115235J352103J571978J296030J723570K422375K656445K467810
7403C0587816L527788L959251M324959N064641N242132P293218Q194182Q920096
7395G7114083R018579R348523R252707P723392O810301L647407N24682j787495
7387A21652179m617905o759693q295472q423326q294738q362559p811440p940569
7379F1146477q119928p573617n935799n707199l994924m179004k987100k202071
7371B0446835k457304j642435j084777j071012q27318j046629m77970l21219n82415
$$ plain form
7430 7714245 8106685 8473549 8454651 8536652 9002242 9103948 9548131 9613273 10054398 10481733
7420 10481733 11057266 11265152 11846272 12419867 13060069 13548480 14370127 15277999 15982270
7411 15982270 17097505 18449608 20021586 21317616 23041186 25463561 28120006 30587816
7403 30587816 34115604 38074855 42399814 47464455 52706587 59999805 68193987 77114083
7395 77114083 86132662 95481185 104733892 112457284 119267585 122914992 123439674 121652179
7387 121652179 117034274 110274581 101979109 93555783 85261045 76898486 69087046 61146477
7379 61146477 53026549 45452932 39517133 33809934 29815010 25636006 22648906 20446835
7371 20446835 17989531 16347096 15262319 14191307 13363989 12317360 11839390 11518171 10935756
7362A0935756l16594o08257m0542k84500r32273K49948k62653l09069n95028k83916
7352G552872J06585n05974J11467l17840L08154o33548J09242j96216L535N2514
7342F590791P7658m50856L07215J02630k18963j2726j46172m0015J57027j46734
7332F219855j34782l77377K23868n23298M24946k34598j52757K97982j18469n45734
7322E079636L03316k40663L9872J96792J47209k36240k49406j2744O2196L48956
7312E438924Q8583k71325m1937k71616N75318j76898J17820J38058J99148m38089
7302E357986J58087J26345N11193K06022j66201M15056J3604L78940M11824Q28181
7292H241037M7129K51664L76526K72512O90502J04925N1313N03956l70483j56905
$$ plain form
7362 10935756 10619162 10010905 9970363 9685863 8753590 9003538 8740885 8431816 7836788 7552872
7352 7552872 7659457 7153483 7264950 6947110 7255264 6621716 6730958 6534742 6538277 6590791
7342 6590791 6668449 6217593 6524808 6627438 6408475 6395749 6249577 6209562 6366589 6219855
7332 6219855 6085073 5707696 5931564 5408266 5833212 5598614 5445857 5743839 5625370 5079636
7322 5079636 5382952 5142289 5182161 5378953 5526162 5289922 5040516 5027772 5089968 5438924
7312 5438924 5527507 5256182 5214245 4942629 5517947 5341049 5458869 5596927 5796075 5357986
7302 5357986 5516073 5642418 6153611 6359633 6193432 6608488 6622092 7001032 7412856 8241037
7292 8241037 8288166 8539830 8916356 9188868 9879370 9984295 10035608 10539564 10169081 10012176
7282A0012176j74596q2710J44096m61294j94074l18451k06343r3816M348q6457
7272H542879K2084j57929P6183K004j49571O04391q2376O6135r3354N85674N40420
7261I956540Q7528M54688O28961R11713P94129P21101J230826R87959J365038
7252A7138483R89434P29659J093626J075581P72297l63853j66350J90764q10709
7243B0648932l60129o81067o32501l92356j155298Q019j157072n70487j260181
7234A4447860k64734p82575m32675o14338p66376o81929k08494n45310j29581
7225A0021848k93113o4829l93754J02735Q6213J1314j9332o26801M27773n1532
7215I200522j62357J5471M73201J45564q9789n4158P23878l11705L58226J26552
$$ plain form
7282 10012176 9837580 9754870 9898966 9437672 9243598 8925147 8718804 8624988 8629336 8542879
7272 8542879 8564963 8407034 8483217 8485221 8335650 8940041 8857665 8923800 8830446 9416120 9956540
7261 9956540 10044068 10498756 11127717 12039430 12833559 13554660 14785486 15773445 17138483
7252 17138483 18127917 18857576 19951202 21026783 21799080 21435227 21268877 21459641 20648932
7243 20648932 20288803 19607736 18975235 18582879 17427581 17435600 16278528 15708041 14447860
7234 14447860 14183126 13400551 12967876 12353538 11587162 10905233 10696739 10151429 10021848
7225 10021848 9728735 9663906 9270152 9372887 9459100 9470414 9451082 8824281 9252054 9200522
7215 9200522 9038165 9053636 9526837 9672401 9582612 9528454 10252332 9940627 10298853 10425405
7205A0425405M26017k04977N61468q29811Q05073L53392j17722K82122M91903
7196A2192870O02742P04556O50949Q71195J013594P70114P14410M52111L72965
7187A8345506K16110m67448O4637n03068j68526n65464m89608k19661n96640n24344
7177A5091494R5880k74780k84735l02055J94883L052L47310J51992J55981m33126
7167A4745896j0544K3811l09672m1415J95450k46052L80623l51369J57282O96434
7157A5240444P2793j86091L26482N32238K12331L78417L87296K72879R41244R6159
7147A8274192J412840k9218R22424P87209R27364L47543J159855M22942M46721
7138B4671872K92206O92423j73900J33614L42297N44402j07530R3765K33812R28812
$$ plain form
7205 10425405 10851422 10646445 11207913 10378102 11183175 11536567 11418845 11700967 12192870
7196 12192870 12795612 13500168 14151117 15022312 16035906 16806020 17520430 17972541 18345506
7187 18345506 18561616 18094168 18158805 17655737 17487211 16921747 16432139 16212478 15615838 15091494
7177 15091494 15187374 14912594 14627859 14325804 14520687 14523739 14871049 15023041 15179022 14745896
7167 14745896 14735352 14759163 14449491 14408076 14603526 14357474 14738097 14386728 14544010 15240444
7157 15240444 15313237 15127146 15453628 15985866 16198197 16576614 16963910 17236789 18178033 18274192
7147 18274192 19687032 19657814 20580238 21367447 22294811 22642354 23802209 24225151 24671872
7138 24671872 24964078 25656501 25482601 25616215 25958512 26502914 26395384 26489149 26722961 27651773
7128B7651773p0378P85214M72774L47716O26660M33064N25762P37928j9419M78504
7118C1969598O08361J68566K09202J15045P02255K61041N56636k2485O04739M83777
7108C5656735Q26112O62284O27313J243570O35654O3962J012801J37994K35632
7099D1102057M34034J7849m51665q8488l36366q54854K55854P2506j16788l30000
7089C9704139n3570j09206m20492J68975r9091M12204j07700N85297N50446j45580
7079D0485422O98253K66283Q33107N61660P97888O48864O78881N55172Q46066
7070D6371596O91505O75521L88272P75512O59254J432188Q71631K24996J538761
7061E3629236O99381Q57973R17948P01188O86934r2487N25487M24297J77438Q1011
$$ plain form
7128 27651773 27581395 28366609 28839383 29187099 29813759 30246823 30772585 31510513 31491094 31969598
7118 31969598 32577959 32746525 32955727 33070772 33773027 34034068 34590704 34568219 35172958 35656735
7108 35656735 36482847 37145131 37772444 39016014 39651668 39715630 40728431 40866425 41102057
7099 41102057 41536091 41553940 41102275 41013787 40677421 39822567 40078421 40150927 40034139 39704139
7089 39704139 39650569 39541363 39120871 39289846 39190755 39602959 39495259 40080556 40631002 40485422
7079 40485422 41183675 41449958 42283065 42844725 43642613 44291477 44970358 45525530 46371596
7070 46371596 47063101 47738622 48126894 48902406 49561660 50993848 51865479 52090475 53629236
7061 53629236 54328617 55186590 56104538 56805726 57492660 57400173 57925660 58349957 58527395 58608406
7051E8608406N89887Q8178O19649Q18420M81521J178654R39847J504689J281978
7042F6111229J874637K006289J539130J568475J620874J447170J174646J553887
7034G8896337M31212J765080J120774K129602K064397L069733K637792M254481
7026I6369408K895321M416442M477145L785042L956861K094225J441040L58170
7018A19793654k64448o94924j559664j945954j101350o70679q03487j5070j79526
7009A12558552J106227J935833K035852K468734L064168K802991K409717P41520
7001A29123594N61380j14887m12792n62108p71240q74310K36123j10715Q57376
6992A27932421J841869K309752L535266M009822N663903O919011P172030R633178
$$ plain form
7051 58608406 59198293 59286471 59906120 60724540 61206061 62384715 63324562 64829251 66111229
7042 66111229 67985866 69992155 71531285 73099760 74720634 76167804 77342450 78896337
7034 78896337 79327549 81092629 82213403 84343005 86407402 89477135 92114927 96369408
7026 96369408 99264729 103681171 108158316 111943358 115900219 117994444 119435484 119793654
7018 119793654 119529206 118834282 117274618 115328664 114227314 113556635 112753148 112738078 112558552
7009 112558552 113664779 115600612 117636464 120105198 123169366 125972357 128382074 129123594
7001 129123594 129684974 129570087 129157295 128595187 127823947 126949637 127185760 127075045 127932421
6992 127932421 129774290 132084042 135619308 139629130 145293033 152212044 159384074 169017252
6984A69017252J0709335J2273664J4504761J5750435J7090131J7406595J8450751
6977B75202924J6407520J4601799J1484194Q370375M646811J755475L1169J22553
6969C32622820j67049K051356N061533P963232J1799185J5851088J9270386K1929994
6961D16382545K4084996K3215309K1105188J5523184P935111l45823p819251j4717411
6953D85363848j9072174k2905830k3945537k3260731k3343326k1161219j9843744
6946C31831287j7584770j3266261q744127l463405J550177M904220P643396R865358
6938C12735875J0330623R413580O311085J619735l336744q439890j3094930j5704918
6930B99834416j8086041j8500235j8613717j7725391j6664007j6286990j4902533
$$ plain form
6984 169017252 179726587 192000251 206505012 222255447 239345578 256752173 275202924
6977 275202924 291610444 306212243 317696437 326066812 330713623 332469098 332500267 332622820
6969 332622820 332455771 334507127 339568660 347531892 359331077 375182165 394452551 416382545
6961 416382545 440467541 463682850 484788038 500311222 508246333 507900510 500081259 485363848
6953 485363848 466291674 443385844 419440307 396179576 372836250 351675031 331831287
6946 331831287 314246517 300980256 292236129 288772724 290322901 295227121 302870517 312735875
6938 312735875 323066498 332480078 338791163 340410898 337074154 328634264 315539334 299834416
6930 299834416 281748375 263248140 244634423 226909032 210245025 193958035 179055502
6923A79055502j2464861j1189286q149577o215029m573425l494150k431942j675318
6915A28861914j135321j136570j329508k222237k166246l279880m087447l216119
6907A10288586l963434m058138m054320l619654l164558k966890j825983j622590
6899H5013019o94082j7343Q45552K017497K342042K611945L778105L049941K343289
6890A01289965J899261J16440l06694k081002l191858l065998m371841l651245
6882H6637028m866438l846717l940887l930337l730533l644374k725639k855954
6874E7096149k358694j757326j339455j372238k13561j274620p4952j230431J2571
6865D7487443l74345j55370l17544o69426j99417o19765j129590l93821j040103
$$ plain form
6923 179055502 166590641 155401355 147251778 141036749 136463324 132969174 130537232 128861914
6915 128861914 127726593 126590023 125260515 123038278 120872032 117592152 113504705 110288586
6907 110288586 106325152 102267014 98212694 94593040 91428482 88461592 86635609 85013019
6899 85013019 84318937 84301594 85147146 87164643 89506685 92118630 95896735 98946676 101289965
6890 101289965 103189226 103305666 102998972 100917970 97726112 94660114 90288273 86637028
6882 86637028 81770590 77923873 73982986 70052649 66322116 62677742 59952103 57096149
6874 57096149 54737455 52980129 51640674 50268436 50054875 48780255 48705303 47474872 47487443
6865 47487443 47113098 46957728 46640184 45970758 45771341 45151576 44021986 43628165 42588062
6856D2588062o34528m98154j174014m48179o70802k39344r32040p2653r38228
6847C6980120q44283k87930j059442q89327r06858j207998o81825r82762q79371
6838B9240324q81670o80472q69363m75728n57129n94367m29238l93571k17236
6829B4141550k93054p14683l68399j86397l57610j01887j4643k54133k43239L90977
6819B1998482k62114N21063Q3916N41880R4788M61111L06101L7014M95170O03517
6809B4880928k61952L99018K51853K80911P03944L55349M32453N18415O24607
6800B8185526N61555Q15787J222919P98472J097306J584862J817777J265858J501799
6791C8851861J822952J783947R91246J211226J477047J200496N47239O59004Q67693
$$ plain form
6856 42588062 41953534 41455380 40281366 39833187 39162385 38923041 37991001 37918348 36980120
6847 36980120 36135837 35847907 34788465 33899138 32992280 31784282 31102457 30119695 29240324
6838 29240324 28358654 27678182 26808819 26333091 25775962 25181595 24752357 24358786 24141550
6829 24141550 23848496 23133813 22765414 22579017 22221407 22119520 22104877 21850744 21607505 21998482
6819 21998482 21736368 22257431 22341347 22883227 22978015 23439126 23745227 23782241 24277411 24880928
6809 24880928 24618976 25017994 25269847 25550758 26254702 26610051 27042504 27560919 28185526
6800 28185526 28747081 29562868 30785787 31584259 32681565 34266427 36084204 37350062 38851861
6791 38851861 40674813 42458760 43450006 44661232 46138279 47338775 47886014 48545018 49412711
6782D9412711K34075J751402Q58086J231905J473023J760027K605706J929199
6774F1256134K515707L382160L238432L027227K490703K708342K151072J647948
6766H2417725J076737L89304J73910r42694o69945j545264j388659j180055o78950
6757G7652109o50921j64019J33104J252716P90171K170359J771701J813462K030954
6748H6799636J469258J144954Q54984j83196q31959j084072k231195l093781k816229
6739H0028400k641375k637607k918365k570554j748143k103096j741341j119073
6731F2548846p84159j96395k80849l47945r5082q43526o71397p07233j496340
6722E7125920j456064k391133k102402k353497k626921k108600k247339k068998
$$ plain form
6782 49412711 49646786 51398188 52256274 53488179 54961202 56721229 59326935 61256134
6774 61256134 63771841 67154001 70392433 73419660 75910363 78618705 80769777 82417725
6766 82417725 83494462 83883766 84057676 83114982 82445037 80899773 79511114 78331059 77652109
6757 77652109 77001188 76837169 76970273 78222989 79013160 81183519 82955220 84768682 86799636
6748 86799636 88268894 89413848 90268832 90085636 89253677 88169605 85938410 82844629 80028400
6739 80028400 77387025 74749418 71831053 69260499 67512356 65409260 63667919 62548846
6731 62548846 61764687 61568292 61287443 60939498 60844416 60000890 59329493 58622260 57125920
6722 57125920 55669856 53278723 51176321 48822824 46195903 44087303 41839964 39770966
6714C9770966k032315j894489j738991j069775j223551r41884r31264n51138n54012
6705B8833547m67864o46196o12913p45154o29054r12525r67399n78214j084390
6696B2189838p84101p70970n44270n70762j074318k81459m66579n04955m20522
6687A6771902m57474k58492k1634m00561K7685j58724p8095L38740n30342M38992
6677A5671997j82846N1349j76845j10352K04416j68023J18370k11855k37003J95652
6667A5154860J01386k02096K19406j26188K03256j15564K54661p17861M62977
6658A5234837L24381L56536j30518k4330J74056m48140J83706J97915m2720j05119
6648A5720604m0402J4946M32906l5136J81124P79984N61783J238328Q38675J392864
$$ plain form
6714 39770966 37738651 35844162 34105171 33035396 31811845 30869961 29938697 29387559 28833547
6705 28833547 28365683 27719487 27106574 26361420 25732366 24819841 23852442 23274228 22189838
6696 22189838 21405737 20634767 20090497 19519735 18445417 18163958 17697379 17192424 16771902
6687 16771902 16314428 16055936 16034302 15633741 15661426 15502702 15424607 15763347 15233005 15671997
6677 15671997 15489151 15540500 15363655 15253303 15457719 15289696 15408066 15196211 14959208 15154860
6667 15154860 15256246 15054150 15273556 15147368 15350624 15235060 15489721 14771860 15234837
6658 15234837 15559218 15915754 15785236 15760906 15934962 15486822 15670528 15868443 15825723 15720604
6648 15720604 15680202 15695148 16128054 16092918 16274042 17054026 17615809 18854137 19692812 21085676
6638B1085676J311411J379829J537906J127459M75405j63488Q1248o68331o20711
6629B5546404p21131n21846p85700j060754j70508p98101k89732n0758j30288
6620B1017586R07637K0717P78787R01659J082654J415162K604031K702169L083733
6611C4514135L168660L912642L936069M062554L467607J615303k44729o43623
6603E3788618j820617k654807l338262k867850k358170k060685k264490k387929
6595C4035808j919941j496539j603803r4462p34921M60011K33031O50299J192303
6586C0721786J600021K356772L289383L125690L653580M234721L950069L101171
6578E6033193J974936Q60449q35843k013949k682797k718903l294550k846022
$$ plain form
6638 21085676 22397087 23776916 25314822 26442281 26917686 26754198 26835446 26167115 25546404
6629 25546404 24825273 24303427 23517727 22456973 22286465 21488364 21198632 21147874 21017586
6620 21017586 21925223 21945940 22724727 23626386 24709040 26124202 28728233 31430402 34514135
6611 34514135 37682795 41595437 45531506 49594060 53061667 54676970 54432241 53788618
6603 53788618 51968001 49313194 45974932 43107082 40748912 38688227 36423737 34035808
6595 34035808 32115867 30619328 29015525 28921063 28186142 28646153 28879184 29529483 30721786
6586 30721786 32321807 34678579 37967962 41093652 44747232 48981953 52932022 56033193
6578 56033193 58008129 58868578 58032735 56018786 53335989 50617086 47322536 44476514
6570D4476514k362159k602717k524248k187383k337901j927282r72553n78789
6562B8983482k21855n13190j82661K15714L64557R53978M64665J324348M51715
6553C1840753R43762J024224J080248L71904k40532j96822p08437j326259j336102
6544C1452739j963841p95383q81715r08328j352794j049279j114125r68237o08067
6535B1810970n81948p77649m16340l66021n7987m10678k00177J16270j0888J46698
6525A9252250l93667p0683L75889l44343L09156K4106J97661L06025O2580j77301
6515A9541673K46298q8516K14047K47679L36075j4443J63427k84931J67228k89018
6505B0239519p22016K09892n41396j60189n72395k22371K37460m33894m04100
$$ plain form
6570 44476514 42114355 39511638 36987390 34800007 32462106 30534824 29562271 28983482
6562 28983482 28761627 28248437 28065776 28281490 28646047 29600025 30064690 31389038 31840753
6553 31840753 32784515 33808739 34888987 35260891 35020359 34823537 34115100 32788841 31452739
6544 31452739 29488898 28693515 27811800 26903472 25550678 24501399 23387274 22419037 21810970
6535 21810970 21229022 20451373 20035033 19669012 19611025 19200347 19000170 19116440 19105552 19252250
6525 19252250 18858583 18787900 19163789 18819446 19128602 19152708 19350369 19656394 19718974 19541673
6515 19541673 19787971 19699455 19913502 20161181 20497256 20482813 20646240 20361309 20528537 20239519
6505 20239519 19517503 19727395 19185999 19025810 18453415 18231044 18468504 18034610 17630510
6496A7630510r6249p5315m60619R66963m84542m21165k59595M42991p3991n47466
6486A6621522l6835J72295K05715k10061j44058n7236k9094k21225j71023j72025
6476A5957975l65319j25557k36004j72455R475k9020M90778k93086j13366M13719
6466A5537140L23810L20971j98002K1617l69741M9641m62998m53257k48477k42826
6456A4277878m43342r707j42116m97191j52800J55760l62938J36312j78724K49398
6446A3032530j21490l9234J84068r4199Q8049l79985K34795p3936r5533j01327
6436A2633738l79331k86527m59972L56796n26944j16463k77222n1273k53398k2152
6426A0617252K37417j75290J42264K98449l25032O24313Q5108K54302P431J93861
$$ plain form
6496 17630510 17534261 17458946 16998327 17965290 17480748 17059583 16799988 17242979 17168988 16621522
6486 16621522 16584687 16756982 16962697 16752636 16608578 16551342 16522248 16301023 16130000 15957975
6476 15957975 15592656 15467099 15231095 15058640 15068115 15039095 15529873 15236787 15123421 15537140
6466 15537140 15860950 16181921 15983919 16005536 15635795 15685436 15222438 14769181 14520704 14277878
6456 14277878 13834536 13824829 13682713 13185522 13032722 13188482 12825544 12961856 12783132 13032530
6446 13032530 12911040 12871806 13055874 12961675 13049724 12669739 12904534 12830598 12735065 12633738
6436 12633738 12254407 11967880 11507908 11864704 11337760 11221297 10944075 10892802 10639404 10617252
6426 10617252 10854669 10679379 10821643 11120092 10795060 11419373 11504481 11758783 11766214 11960075
6416A1960075L47031m48300k05109q5705j80518n35877L12914m24921l27200l78202
6406A0034188M41834j55044n21846J27405J16148n0086n32594M56239k1567J44480
6396A0039157j19303K48646j35998j21370K69757P6145k63079L78708j90536J27771
6386A0309898l75073J33537Q7779M22661J6944J25737J50550n50885N64195J62526
6376A1047869k42912R4041K49116J45983l07258M97349k76911k62530N18245n20595
6366A0942397L95600k52568l91854j3594N1875p2152p5392L06978N7773o3571
6356A0885492j16194L76327P085l50002K97153j44712L143K60872R714m273n2336
6345A1172269K22882k64505M85709k69774L50819j47550k40342J32816K54692
$$ plain form
6416 11960075 12307106 11858806 11653697 11567992 11387474 10851597 11164511 10739590 10412390 10034188
6406 10034188 10476022 10320978 9799132 9926537 10042685 9992599 9460005 9916244 9894677 10039157
6396 10039157 9919854 10168500 10032502 9911132 10180889 10257034 9993955 10372663 10182127 10309898
6386 10309898 9934825 10068362 10156141 10578802 10595746 10721483 10872033 10321148 10885343 11047869
6376 11047869 10804957 10898998 11148114 11294097 10986839 11484188 11207277 10944747 11462992 10942397
6366 10942397 11337997 11085429 10693575 10679981 10731856 10659704 10584312 10891290 10949063 10885492
6356 10885492 10769298 11145625 11152710 10802708 11099861 10955149 10958292 11219164 11228878 11224605 11172269
6345 11172269 11395151 11130646 11616355 11346581 11697400 11549850 11309508 11442324 11697016
6336A1697016j27493m64903O32433m19993J76998o01537J15408L78499l744k86265
6326A1096419j68746N3225L05699k61978K03749K66107K59456O96028j53095K46193
6316A2543057o255L31852j09588L58595o61173N03861k44111k52000p6869l5228
6306A2352141j21022n43963J82182l6834l32051j28269j41740L22253k31423L8271
6296A1359545j34878Q5097J6189N06668P3667k50478K33461O7474j09088l12061
6286A1535596J49504K61595k04690J32411k54825m47020N71942j23806K67403
6277A1888110m45960L48487L52543O0907L56626n45193j08866K75297m55509j0750
6267A1715692J15198n2688n02786M7132L90196o57119J09422j79670l94608J49863
$$ plain form
6336 11697016 11569523 11104620 11737053 11317060 11494058 10892521 11007929 11386428 11382684 11096419
6326 11096419 10927673 10980898 11286597 11024619 11228368 11494475 11753931 12449959 12296864 12543057
6316 12543057 12536802 12868654 12759066 13117661 12456488 12960349 12716238 12464238 12387369 12352141
6306 12352141 12231119 11687156 11869338 11832504 11500453 11372184 11230444 11552697 11321274 11359545
6296 11359545 11224667 11309764 11325953 11832621 11906288 11655810 11889271 11956745 11847657 11535596
6286 11535596 11685100 11946695 11742005 11874416 11619591 11172571 11744513 11620707 11888110
6277 11888110 11442150 11790637 12143180 12204087 12560713 12015520 11906654 12181951 11726442 11715692
6267 11715692 11830890 11778202 11275416 11322548 11712744 11055625 11165047 10985377 10590769 10740632
6257A0740632n15646M16641Q889n62622R7075J00720O5127J97014R3508m79782
6247A0161556M24328j37854K4259k4362J89753J71755k57120L60943k38344K17592
6237A0892506l61749J85567q7641K46525m44663l26171L06826N0435m38503M62534
6227A0485666o10571K87079m29271J51118r8303q1252K84982k22089M35726l59049
6217I844036l47035j08531o8635K41801k8763K0336k1628r1439j70801N77191
6207I846532K31043l10846m34358n4522j00218o2800j97504l35924r695m39863
6197H131845R9687l288j59222J53034l18464k23007j59466L37452j07965n5047
6187G695559N5295k79086M95217n52116M93460k92099L26852J08145K51308J57723
$$ plain form
6257 10740632 10224986 10641627 10650516 10087894 10184969 10285689 10350816 10547830 10641338 10161556
6247 10161556 10585884 10448030 10472289 10447927 10637680 10809435 10552315 10913258 10674914 10892506
6237 10892506 10530757 10716324 10628683 10875208 10430545 10104374 10411200 10461635 10023132 10485666
6227 10485666 9875095 10162174 9732903 9884021 9785718 9704466 9989448 9767359 10203085 9844036
6217 9844036 9497001 9388470 9319835 9561636 9532873 9553209 9531581 9440142 9269341 9846532
6207 9846532 10077575 9766729 9332371 9277849 9177631 9114831 8917327 8581403 8571708 8131845
6197 8131845 8231532 8228244 8069022 8222056 7903592 7680585 7521119 7858571 7750606 7695559
6187 7695559 7750854 7471768 7966985 7414869 7908329 7616230 7943082 8051227 8302535 8460258
6177H460258l0560L04450j52281O74626o19099O61396o23842K00228j54285k39376
6167H481515j99840m29562O63430n15207j28858n09792K56609l7773n87151m2464
6157F950907k86897n00864k0769K69263k64977p60846J13258J4271j56634M32655
6147E789367k08886O9297k53374N30620k27964k31006L80561p7099K87850p9969
6137E979397K01025M47134k87275P4743J80931K89501o39222J71161K19584K19898
6127F856877l05233J91014j30788L24950l37936l84880j11445J26782l05633k86411
6117E637297K84678k04311p7549j11773l47245J63121j32349L73356j65450J95936
6107E615711j98149m31449j01888K30929K33875j04500j34995L3294m18242M59976
$$ plain form
6177 8460258 8429698 8734148 8581867 9256493 8637394 9298790 8674948 8875176 8720891 8481515
6167 8481515 8281675 7852113 8515543 8000336 7871478 7361686 7618295 7580522 6993371 6950907
6157 6950907 6664010 6163146 6142377 6411640 6146663 5385817 5499075 5513346 5356712 5789367
6147 5789367 5580481 5649778 5396404 5927024 5699060 5468054 5848615 5771516 6059366 5979397
6137 5979397 6180422 6627556 6340281 6415024 6595955 6885456 6246234 6417395 6636979 6856877
6127 6856877 6551644 6742658 6611870 6936820 6598884 6214004 6102559 6229341 5923708 5637297
6117 5637297 5921975 5717664 5640115 5528342 5181097 5344218 5211869 5585225 5419775 5615711
6107 5615711 5417562 4986113 4884225 5115154 5349029 5244529 5109534 5142828 4724586 5184562
6097E184562K18945p924k04671k28439O0008l6496L00442k88993Q9169N11675
6087E598278k28803j69805J52286k67896j0358J19642k85673M54417J004J11105
6077E474197j6111r6811j22906M29163m51654k32858M41028J55915k59111k14405
6067E106447j04465J81003m929N55547j48544o4584l35788K09220j27239k18765
6057E047903K43876K37531j80479j73808L71925j03158J22357m77302K08276K20064
6047E517185K16398J7465n82351R99439r00173M51992l4194k45261L8468O40642
6037F119610l68310J70735r7825J05136l31998K30035j36142K99528J42328m02035
6027E731062O6090J45686p4359P7466j21714J79227K9182j30506J70450j72198
$$ plain form
6097 5184562 5403507 5395583 5190912 4962473 5022481 4985985 5286427 4997434 5086603 5598278
6087 5598278 5369475 5199670 5351956 5084060 5073702 5193344 4907671 5362088 5363092 5474197
6077 5474197 5458086 5361275 5238369 5667532 5215878 4983020 5424048 5579963 5320852 5106447
6067 5106447 5001982 5182985 5178056 5733603 5585059 5520475 5184687 5393907 5266668 5047903
6057 5047903 5291779 5529310 5348831 5175023 5546948 5443790 5566147 5088845 5297121 5517185
6047 5517185 5733583 5751048 5168697 6168136 5267963 5719955 5685761 5440500 5478968 6119610
6037 6119610 5751300 5922035 5824210 5929346 5597348 5827383 5691241 5990769 6133097 5731062
6027 5731062 5797152 5942838 5868479 5945945 5824231 6003458 6032640 5902134 6072584 5900386
6017E900386j82059K36297J04099p6067R0431J56376l72807L04024k23364j55869
6007E781447L17872n05051K56664O5063J82289J89649j82594k13304J05585K5118
5997F022738j47452M28428k28925M57068j33246K1028j23033j56107K00802k98969
5987F042332M86653k76683J45474k99093J11810M47246k40552m30793M44921j85760
5977F245555j2233K36724j96596N3086K68874L21919n37696K99764l69069M91265
5967F801593M37384o09973N7106R3769k76059L4061j33112R3903m1495J66873
5957F624050L34153O1008p3249n20329K48315M30357o16582L56335k28067L35342
5947F951333J1508N0885l33200L20809j01560l9966M23004k76948n6695j01569
$$ plain form
6017 5900386 5718327 5954624 6058723 5982656 6073087 6229463 5856656 6160680 5937316 5781447
6007 5781447 6099319 5594268 5850932 5915995 6098284 6287933 6105339 5892035 5997620 6022738
5997 6022738 5875286 6303714 6074789 6531857 6398611 6419639 6296606 6140499 6341301 6042332
5987 6042332 6528985 6252302 6397776 6098683 6210493 6657739 6417187 5986394 6431315 6245555
5977 6245555 6233322 6470046 6273450 6326536 6595410 6917329 6379633 6679397 6310328 6801593
5967 6801593 7238977 6629004 6686110 6779879 6503820 6537881 6404769 6498672 6457177 6624050
5957 6624050 6958203 7019211 6945962 6425633 6673948 7104305 6487723 6844058 6615991 6951333
5947 6951333 6962841 7013726 6680526 7001335 6899775 6859809 7282813 7005865 6949170 6847601
5937F847601P9976K82956K96296o01254Q439M73418k74959L06503m04824K10196
5927G224348J69460K7993j59162O7164L68803l81470J67666J8562l77521N19586
5917G645429l88649L3164J17375L04845Q4321r4816q0781j32592L83636O382R3255
5906G971569k70353K88812q0794m9299p561J680l7920L08822M31552l82197j86952
5895G987359J40495j17985K56201k74435L97473m489j77390K20114j4734j41076
5885H271533m6038K73351q1849l175L17438m87525M60606l35250P7874M40950
5875H887915j11095l9734J38786q2784J61456J0789J90044k44250K70934N0769
5865I232830j21465J4498j86628K24069K7830p4042J77559J23419j55348J51777
$$ plain form
5937 6847601 6927577 7210533 7506829 6905575 6914014 7387432 7112473 7418976 7014152 7224348
5927 7224348 7393808 7421801 7262639 7329803 7698606 7317136 7484802 7503364 7125843 7645429
5917 7645429 7256780 7289944 7407319 7712164 7796485 7701669 7620888 7488296 7871932 7878314 7971569
5906 7971569 7701216 7990028 7909234 7859935 7852374 7854054 7816134 8124956 8556508 8174311 7987359
5895 7987359 8127854 8009869 8266070 7991635 8389108 8384619 8207229 8427343 8412609 8271533
5885 8271533 8225495 8498846 8416997 8413822 8731260 8243735 8704341 8369091 8446965 8887915
5875 8887915 8776820 8737086 8875872 8793088 8954544 8965333 9155377 8911127 9182061 9232830
5865 9232830 9111365 9125863 8939235 9163304 9191134 9117092 9294651 9418070 9262722 9414499
5855I414499N2171r3373M2754K3983K06383M0678l11771J79673K79034K70779
5845A0104810p4050n2868m44182M50923l99646N34993O3050l34971J11990M55874
5835A0415923m87923J29261p9454J85561R8559r5772J42585K66280O0467J09462
5825A0744949m7731k51976o0018M42782R0550m94889N79856k33247J30718R7139
5815A0998133m16350M30701J22627M23536j52933j70957Q9174k12171L53848l28687
5805A1136921J22986K41179l03975J58705J45040M59892j61985M8119L1661l4022
5795A1844521j91526J08197J54376K06914L01650m04624L78386J58323l6717j51819
5785A2367681l15659M73539J6948p0971k82391N13428k40427K85530k83517M54114
$$ plain form
5855 9414499 9466670 9373297 9416051 9440034 9646417 9687095 9375324 9554997 9834031 10104810
5845 10104810 10030760 9977892 9533710 9984633 9584987 10119980 10183030 9848059 9960049 10415923
5835 10415923 9928000 10057261 9977807 10163368 10261927 10166155 10308740 10575020 10635487 10744949
5825 10744949 10697218 10445242 10385224 10828006 10918556 10423667 11003523 10770276 10900994 10998133
5815 10998133 10581783 11012484 11135111 11558647 11405714 11234757 11323931 11111760 11465608 11136921
5805 11136921 11259907 11501086 11197111 11355816 11500856 11960748 11798763 11846882 11878543 11844521
5795 11844521 11652995 11761192 11915568 12122482 12424132 12019508 12397894 12556217 12519500 12367681
5785 12367681 12052022 12525561 12542509 12471538 12189147 12702575 12462148 12747678 12464161 12918275
5775A2918275K83302L0109N7203N5458r4866R1741l65666M33276j92537L64447
5765A3580742J49961J32816l64987M09447k92963M71878K46889l10741j12706
5756A3910336M1289M90746K71781l85500Q8072Q1896j07201K68838L39807j09549
5746A4890515P8246k19101R6653J54697L47583J23434l49912M075M30367K46610
5736A5803167k43335j97451M47700l06320N07294P2528k1591o144J74248j13109
5726A6116987l5395P7540O08381R6001K95820m33103J34505K71728j45348k17959
5716A6769157J06911M90057k95996K84286J29313K87501j90340K55319J643L76431
5706A8214282J73183k35761j6193k04100L9234N78215N3894j01024K06760n7107
$$ plain form
5775 12918275 13201577 13231686 13288889 13344347 13249481 13341222 12975556 13408832 13216295 13580742
5765 13580742 13730703 13863519 13498532 13907979 13615016 14086894 14333783 14023042 13910336
5756 13910336 13951625 14442371 14714152 14328652 14416724 14498620 14391419 14660257 15000064 14890515
5746 14890515 14968761 14749660 14846313 15001010 15348593 15472027 15122115 15126190 15556557 15803167
5736 15803167 15559832 15362381 15810081 15503761 16011055 16083583 16061992 16055848 16230096 16116987
5726 16116987 16081592 16159132 16767513 16863514 17159334 16726231 16860736 17132464 16987116 16769157
5716 16769157 16876068 17366125 17070129 17354415 17483728 17771229 17580889 17836208 17837851 18214282
5706 18214282 18387465 18151704 18135511 17931411 17970645 18548860 18602754 18501730 18708490 18651383
5696A8651383p0270K67382K22058J99938p4407L33898L1677Q6796n5874P4O0342
5685A9652997L60864k89727N09737m40397N70403l16173Q3439K61896j62169L61803
5675B0592673J71887j63611K09728K06645p3892K17801k67653K61288J16630J77628
5665B1449124n3345o4515O1496K17669j32320J26005K92750M97503n04993K3294
5655B1912668J5250k1543J84007O38981l52297J26088K77472p3916o6797M02610
5645B3042523L5580k56937K16559J88434l5360j76421K22861j91423J42365N76380
5635B3764561k93250L03146L80025n46750L20495p180N8653k21838O18394m04726
5625B3971530K0211M57825M6399n34051L91046J86398p2170r9213K22967n490
$$ plain form
5696 18651383 18581113 18848495 19070553 19270491 19196084 19529982 19561659 19648455 19592581 19592655 19652997
5685 19652997 20013861 19724134 20233871 19793474 20363877 20047704 20131143 20393039 20230870 20592673
5675 20592673 20764560 20600949 20810677 21017322 20943430 21161231 20893578 21154866 21271496 21449124
5665 21449124 21395779 21331264 21392760 21610429 21478109 21604114 21896864 22394367 21889374 21912668
5655 21912668 21927918 21906375 22090382 22729363 22377066 22503154 22780626 22706710 22639913 23042523
5645 23042523 23078103 22821166 23037725 23226159 23190799 23014378 23237239 23045816 23188181 23764561
5635 23764561 23471311 23774457 24154482 23607732 23928227 23921047 23979700 23757862 24376256 23971530
5625 23971530 23991741 24449566 24495965 23961914 24352960 24539358 24467188 24367975 24590942 24585452
5615B4585452K09256o34096M43337K97976j07339r761J66262j83973K54137O2506
5605B5083757m7739k4315J42520J40220m16912K75548m46743O41005j53537l00872
5595B4892932j3150J51692r8051J5811R6234l20123L58204l21241L63368k86430
5585B4839246j44594l442K20871l47377J58018L97618l30903P357r1097J0378
5575B4716075o5078K08305p02684O06392Q3132n16486J97365k97586J23179j10594
5565B4242020J71151l35236k34466J73859l49207J93804K32388o37936j04169
5556B3352208P8336K63638k43265k3054k84613J83087j24995Q3056l38949J13587
5546B3059036l93967N86369r36653K89771l05200J96432k28824k77452q5320L48056
$$ plain form
5615 24585452 24794708 24160612 24603949 24901925 24794586 24784825 24951087 24767114 25021251 25083757
5605 25083757 25036018 25011703 25154223 25294443 24877531 25153079 24706336 25347341 25193804 24892932
5595 24892932 24879782 25031474 24933423 24949234 25045468 24725345 25083549 24762308 25125676 24839246
5585 24839246 24694652 24691210 24912081 24564704 24722722 25120340 24789437 24796794 24705697 24716075
5575 24716075 24650997 24859302 24156618 24763010 24846142 24329656 24527021 24229435 24352614 24242020
5565 24242020 24413171 24077935 23843469 24017328 23668121 23861925 24094313 23456377 23352208
5556 23352208 23430544 23694182 23450917 23427863 23143250 23326337 23201342 23284398 22945449 23059036
5546 23059036 22665069 23251438 22314785 22604556 22299356 22495788 22266964 21989512 21904192 22252248
5536B2252248m55810P82J74979m01548K09493K86417p49877R8659n20148n1923
5526B0843272j60374J61023l7836N08894p97666j37129q020l93122n2557K51928
5516B0178413k46347j21089j87359K12002n37069J13859k92366p144l76247L30642
5506A9067295k68933j30618k54815L36043m37816r884k46553q5421J87878o13453
5496A7543723K12138k50284J35205l74883J1096j15867k70815M05371m19730k00412
5486A6675542k17276J12857l11726K38407k26027N03716q14709k12206L47351
5477A6095929k63443k39379l38944K76568j15162n39326M54733L1039l37009R6786
5467A5121792j51853L63120q59600j52974K23098m20399K97552N134j08545q112
$$ plain form
5536 22252248 21796438 21797220 21972199 21570651 21780144 22066561 21316684 21415343 20895195 20843272
5526 20843272 20682898 20843921 20806085 21314979 20517313 20380184 20372164 19979042 19926485 20178413
5516 20178413 19932066 19810977 19623618 19835620 19298551 19412410 19120044 19112900 18736653 19067295
5506 19067295 18798362 18667744 18412929 18748972 18311156 18301272 18054719 17969298 18157176 17543723
5496 17543723 17755861 17505577 17640782 17265899 17276995 17161128 16890313 17295684 16875954 16675542
5486 16675542 16458266 16571123 16259397 16497804 16271777 16775493 15960784 15748578 16095929
5477 16095929 15832486 15593107 15254163 15530731 15415569 14876243 15330976 15362015 15025006 15121792
5467 15121792 14969939 15333059 14473459 14320485 14543583 14123184 14420736 14425870 14317325 14309213
5457A4309213o77431N24166n63519K24163K39473l14022k01341L04402o2185j37937
5447A3644982M78213J24187Q1923J89254J02019K99165L39324O20261O6905J446144
5437A7392377M34626O81444P06995P41770M80136K2576L98726p10755k18248o83455
5427A9246192j094116n63420j148939q58517k90870j195092q60596n88958l49572
5418A2296112k17573l52470l80806o25877k31276k41891o889J18195j86726m19290
5408I751509j60309l92110M59250k322l27265n40547K31819J0263M6591k28823
5398H848056j58143J14348l28863M64983o58850k1491l52543K40513j94290J47136
5388H100856l36964M19735r8901j38845j30556p1196m42464M3071j50982K14575
$$ plain form
5457 14309213 13631782 14155948 13592429 13816592 14056065 13742043 13540702 13845104 13782919 13644982
5447 13644982 14123195 14247382 14329305 14518559 14620578 14919743 15259067 15879328 15946233 17392377
5437 17392377 17827003 18508447 19215442 19957212 20437348 20459924 20858650 20147895 19929647 19246192
5427 19246192 18152076 17588656 16439717 15581200 15290330 14095238 13234642 12645684 12296112
5418 12296112 12078539 11726069 11345263 10719386 10488110 10246219 10239330 10357525 10170799 9751509
5408 9751509 9591200 9199090 9658340 9656018 9328753 8788206 9020025 9030288 9076879 8848056
5398 8848056 8689913 8804261 8475398 8940381 8281531 8260040 7907497 8148010 7953720 8100856
5388 8100856 7763892 8183627 8084726 7945881 7815325 7744129 7301665 7344736 7193754 7408329
5378G408329J43740m09602N8880K3667q7167l83333R8793M03354m48883j24590
5368F683188J08159p9266R1760K14761l44525J14088j89200j8763m4248O5856
5358F601810j01843o6976n55818K32941J97540l47578M58690m16182n72793L62101
5348E791892J22389j47998j16043j8716m22042J66153L64677n8728Q0739n70481
5338E191842M20506J94118p48471N91052j51248l8125o2117j52629L3825l21486
5328D957267J73510j14760j9447O5665o934K410J46049l33442P2856j45397J2706
5317D810483q833p740p9431m43688O98103k11636o4621k47250K40544k28415N34448
5306D991964l99934k50940J83316j71955K2788K13247k19190J62684j78782j90117
$$ plain form
5378 7408329 7552069 7142467 7201347 7225014 7137847 6754514 6853307 7256661 6807778 6683188
5368 6683188 6791347 6712081 6803841 7018602 6674077 6788165 6598965 6580202 6535954 6601810
5358 6601810 6499967 6432991 5877173 6110114 6307654 5960076 6418766 6002584 5429791 5791892
5348 5791892 5914281 5766283 5650240 5631524 5209482 5375635 5740312 5681584 5762323 5191842
5338 5191842 5612348 5806466 5057995 5649047 5497799 5459674 5397557 5244928 5278753 4957267
5328 4957267 5130777 5016017 4996570 5062235 5055301 5057711 5203760 4870318 4943174 4797777 4810483
5317 4810483 4801650 4793910 4714479 4270791 4968894 4757258 4692637 4445387 4685931 4457516 4991964
5306 4991964 4592030 4341090 4524406 4352451 4375239 4588486 4369296 4531980 4353198 4163081
5296D163081l8825J32438j89554o7531M86337m69526L7918J05603K50800m89731
5286C921010K84868j48560l28273J66249O1925l54426K50425j45630K68057m39070
5276C536575j7683j02178n8972O3541l9946K55182o7650J77119Q2329j84412l30180
5265C313725J41512M54089n51832j8241l2941j68973L01996J46103o08215N37634
5255C514857r1112r5864J5256j24j99137j45046O6805M43828k50699n2599P8862
5244C285027P6193N7298q6699m1722j63991o6553K78491l31015j19351J09525
5234B997203J34604n5928M61546m86161J5346K05166m65480J02200q3243J93151
5224C018404L07911k60636L4787j75493m6675J28013J18681k00543L91640J17443
$$ plain form
5296 4163081 4124256 4256694 4067140 3999609 4485946 4016420 4054338 4159941 4410741 3921010
5286 3921010 4205878 4057318 3729045 3895294 3957219 3602793 3853218 3707588 3975645 3536575
5276 3536575 3518892 3416714 3357742 3421283 3381337 3636519 3568869 3745988 3828317 3643905 3313725
5265 3313725 3455237 3909326 3357494 3339253 3306312 3137339 3439335 3585438 2977223 3514857
5255 3514857 3423745 3327881 3343137 3343013 3143876 2998830 3065635 3509463 3258764 3206165 3285027
5244 3285027 3361220 3418518 3331819 3290097 3126106 3059553 3338044 3007029 2887678 2997203
5234 2997203 3131807 3075879 3537425 3051264 3066610 3271776 2806296 2908496 2825253 3018404
5224 3018404 3326315 3065679 3100466 2924973 2878298 3006311 3124992 2924449 3316089 3433532
5214C433532M75799L4018j89238j28236O46461n75868l0628l43992j17456L82068
5204C586460l15451j68039k39663O8630l30659L26868K59099l70941l54660N01254
5194B962898p812m66607L47226P1853L0249k49664k80105N81637J25469n28333
5184B586811Q4248O4380O972M08659r03211M95297l17553L16463j55337P4496
5174B661225o7092R1868N4817m51403J85228k26205P79939l51496k74535M03563
5164B805909k59599J96328K91494p30526M97874j85585l4606j00220K37445j29734
5154B588780o4195J84746o6091l42732q606L18227k52307l24960P10751n24796
5144B218817J43481J705J99869L19570k86915l50478j89551K33368j16465J13424
$$ plain form
5214 3433532 3909331 3943349 3754111 3625875 4272336 3696468 3665840 3321848 3204392 3586460
5204 3586460 3271009 3102970 2863307 2931937 2601278 2928146 3187245 2816304 2461644 2962898
5194 2962898 2955086 2488479 2835705 2907558 2937807 2688143 2408038 2989675 3115144 2586811
5184 2586811 2671059 2735439 2742411 3151070 2247859 2743156 2425603 2742066 2586729 2661225
5174 2661225 2594133 2686001 2740818 2289415 2474643 2248438 3028377 2676881 2402346 2805909
5164 2805909 2546310 2742638 3034132 2303606 2801480 2615895 2581289 2481069 2718514 2588780
5154 2588780 2524585 2709331 2643240 2300508 2291902 2610129 2357822 2032862 2743613 2218817
5144 2218817 2362298 2364003 2563872 2883442 2596527 2246049 2056498 2289866 2173401 2286825
5134B286825K67053l10010Q5248L76318m46419K78184k53208K52253r6591O2238
5124B501891J35042l46853L0600K27704l01430j29274K9185M77360l63579j0665
5114B249981Q0690k4640J38148r2257M13179l90810K01898j92822K28898J79158
5104B791423q3829J18836k17156j27108K40543K12726J2736l53961L96985j96486
5094B794709N89726n57086K80742k26318R0730J17688L18083K7587K96327l42127
5084C390061R55854l4232O05433L65583L92722K26593M18920R33448O53650J324044
5074I232076O01953J140523J725288J500217J682137J256880J555186N67756L14894
5065A9576910J17737k53226j460326n05278j684726q94854j017503j069167j152645
$$ plain form
5134 2286825 2553878 2243868 2329116 2705434 2259015 2537199 2283991 2536244 2439653 2501891
5124 2501891 2636933 2290080 2320680 2548384 2246954 2117680 2146865 2624225 2260646 2249981
5114 2249981 2330671 2306031 2444179 2351922 2765101 2374291 2576189 2383367 2612265 2791423
5104 2791423 2707594 2826430 2609274 2482166 2722709 2935435 2948171 2594210 2991195 2794709
5094 2794709 3384435 2827349 3108091 2881773 2972503 3090191 3408274 3435861 3732188 3390061
5084 3390061 4345915 4311683 4917116 5282699 5675421 5902014 6320934 7254382 7908032 9232076
5074 9232076 9834029 10974552 12699840 14200057 15882194 17139074 18694260 19262016 19576910
5065 19576910 19694647 19441421 17981095 17475817 15791091 14896237 13878734 12809567 11656922
5056A1656922p48759j369553q24506p94547o25663l48699k72161j015234o7861
5047E589939j87663j64931m54118k80648L1718J3650l13148O67951n39360k74180
5037D089210K7386K96617J41786k36452N06522N7598n6046K88768l91481N68944
5027E292852l14194M33535K40530P68882N55906r6187q9592P11292N91427M47700
5017H542151Q1198L48034N23779k4715Q851j9023J66605K23897R1185M33058J73511
5006A0548531Q22821P98372J158332K204130J022232K222488J989052K321612
4998B3087570J357413Q21356N76075n66291j226884j544380j356095j514524j349424
4989A8284816q11612j571599j013885j026428j392897r62897R85j51747Q5679
$$ plain form
5056 11656922 10908163 9538610 8714104 7919557 7293894 6945195 6673034 5657800 5589939
5047 5589939 5402276 5237345 4783227 4502579 4534297 4547947 4234799 4902750 4363390 4089210
5037 4089210 4116596 4413213 4554999 4318547 4825069 4882667 4826621 5115389 4723908 5292852
5027 5292852 4978658 5412193 5652723 6421605 6977511 6881324 6791732 7503024 8094451 8542151
5017 8542151 8623349 8971383 9495162 9470447 9479298 9460275 9626880 9850777 9941962 10375020 10548531
5006 10548531 11371352 12169724 13328056 15532186 16554418 18776906 20765958 23087570
4998 23087570 24444983 25266339 25842414 25276123 24049239 22504859 21148764 19634240 18284816
4989 18284816 17473204 15901605 14887720 13861292 12468395 11505498 11506483 11354736 11440415
4980A1440415m83551O55989M59295N75038J177840K218408J768719J742749K037261
4971B1592163K961702K255485L545547L641405M174704N752529P897428J0948189
4963F2769152J2741696J3774482J5058380J7088626J7605077J6304943Q352726
4956A63695082J203833k283707q220960j2071998j5294743j3889378j2076062
4949A01062067j1872905j0467017j1320958j1884575j1641340q781696o052109
4942B9041467m848000m199072l759043k494074j911615j131407j153847o54884
4934H889525j158222r9659p42764m08504j75381o40513m09918J34878q80177L21913
4924D831178m82836m33631K27313n49938j15993k6029k66992J45101k00363O5714
$$ plain form
4980 11440415 10956864 11612853 12072148 12647186 13825026 16043434 17812153 19554902 21592163
4971 21592163 24553865 26809350 30354897 33996302 38171006 43923535 51820963 62769152
4963 62769152 75510848 89285330 104343710 121432336 139037413 155342356 163695082
4956 163695082 164898915 162615208 154394248 142322250 127027507 113138129 101062067
4949 101062067 89189162 78722145 67401187 55516612 43875272 35093576 29041467
4942 29041467 24193467 19994395 16235352 13741278 11829663 10698256 9544409 8889525
4934 8889525 7731303 7631644 6888880 6480376 6304995 5664482 5254564 5389442 4509265 4831178
4924 4831178 4348342 3914711 4142024 3592086 3476093 3450064 3183072 3328173 3127810 3193524
4914C193524k94371m90533M43352o8609j94135K9610j13813m21627L16198K77767
4904B677363k09553k62266k86699L50870m68383l59427O89065j73402m98009K55939
4894A715498k12625o03r2203j42247k8899j96590J14666N3188q069J12571J0255
4883A324942j23717P4169o9728k19366K52519N9417J67360m71758K45200l1273
4873A207765j7624j02350p4035k77088K51243M23379m73608N6164K79029n90076
4863F82799J45505j40837N4299M1288K72264m9579q2957K6710O8341k6913k97889
4852F93031K79301k12486M31207k87246k45990N42811m93001M06506j20360K37791
4842A231564J99670n1078O08211p64621K05049K92885K91928m9202r0877L6321
$$ plain form
4914 3193524 2899153 2408620 2851972 2783363 2589228 2618838 2505025 2083398 2399596 2677363
4904 2677363 2467810 2205544 1918845 2269715 1801332 1441905 2130970 1957568 1459559 1715498
4894 1715498 1502873 1502270 1410067 1267820 1238921 1042331 1156997 1210185 1202116 1314687 1324942
4883 1324942 1201225 1275394 1205666 986300 1238819 1298236 1465596 993838 1239038 1207765
4873 1207765 1190141 1087791 1013756 736668 987911 1411290 937682 993846 1272875 682799
4863 682799 828304 687467 741766 783054 1055318 1005739 922782 949492 1017833 990920 693031
4852 693031 972332 759846 1191053 903807 657817 1200628 707627 1114133 993773 1231564
4842 1231564 1431234 1380156 1988367 1223746 1428795 1721680 2013608 1964406 1873529 1909850
4832A909850j12465k89872K75114l40808M73183m36547K1910l96207j53455K05243
4822A155946P7758k11371K21691Q6860j5746n14033J23170M2709K93526j46679
4812A113831J41740K10794O7860k04839J19508L25315m52710R0401j11534m0715
4802A259651k74881k03232K92500M6488m06954j79078L61383R9540l1639L91436
4792A355214n59693P4623n7835J82754l79523J57966J25473n11088K07011k40130
4782C54772J12279K13244J88764j38240l24170O77732k39151J27070l3285k14190
4772G24825l20862M78521j31382m8281R7026r8771K48705l56638P6723M73750
4762A143616k50851j0864j90192k72K23173j74919O4441l63795O22406k89092
$$ plain form
4832 1909850 1797385 1507513 1782627 1441819 1915002 1478455 1500365 1104158 950703 1155946
4822 1155946 1233704 1022333 1244024 1330884 1315138 801105 924275 966984 1260510 1113831
4812 1113831 1255571 1466365 1534225 1329386 1448894 1774209 1321499 1411900 1300366 1259651
4802 1259651 984770 781538 1074038 1120526 713572 534494 895877 995417 963778 1355214
4792 1355214 795521 870144 812309 995063 615540 773506 898979 387891 594902 354772
4782 354772 467051 680295 869059 730819 406649 1084381 845230 972300 939015 724825
4772 724825 403963 882484 751102 702821 799847 701076 949781 593143 669866 1143616
4762 1143616 892765 881901 691709 691437 914610 739691 804132 440337 1062743 773651
4752G73651j32224K56128l12980M35749m41366M35460j97768K62382k54655n5082
4742G69295J39173Q9516O1784k5883k03191O3491L25402k51337k58657L22796
4732A032389o9975J82362j56864Q2037R137k00888K2847J74346k8681r2068L24009
4721A278651k46161J36256J72049J40215n19514N45786l13177L13823l43123K19498
4711A384303J56728J50557k51945o05029Q33837J88400k0168m7005l32129L05631
4701A763180m6793K13748K486K13514q0089J43796m56676k6649K03431m33680
4691A496268l18185o3387K28278l27172M44038R903m31878p8331J99735j83598
4681I75671Q756J98155o8431j66179k23080K65256j95494J69478K52051n1913
$$ plain form
4752 773651 641427 897555 584575 1020324 578958 1014418 816650 1079032 824377 769295
4742 769295 908468 997984 1059768 1033885 830694 894185 1219587 968250 709593 1032389
4732 1032389 962414 1144776 987912 1069949 1079086 878198 901045 1075391 1046710 954642 1278651
4721 1278651 1032490 1168746 1340795 1481010 961496 1507282 1194105 1507928 1164805 1384303
4711 1384303 1541031 1691588 1439643 834614 1668451 1856851 1836683 1789678 1457549 1763180
4701 1763180 1716387 1930135 1932621 2146135 2066046 2209842 1753166 1726517 1929948 1496268
4691 1496268 1178083 1114696 1342974 1015802 1459840 1469743 1037865 959534 1159269 975671
4681 975671 984427 1182582 1114151 947972 724892 990148 794654 964132 1216183 1164270
4671A164270O9644o8999j844L84705n56263j27700O81999k94086p5405K61784
4661A438105j00007l36919L94994r9643Q8457K73846n06003K40260O5328r3689
4651A364729J91964K07382k48676j04492l64079K86328J75732l9768k29181j99148
4641A040791N45228m36923J35922K27648m50515K81243K45915l28208M7882j39106
4631A169877j12268j39289M3648J77672N30209l44609Q4891m2263j42378P59K36949
4620A463198j15677J45095K16498l7414L44440m0694n17853M6802k91369N93447
4610A806473L1212K36789l42293J10760L41931n91956N29117l51967M06940l0463
4600B146543N4706j77131L078J18805J32081k67849k09441J5115K89682k92347
$$ plain form
4671 1164270 1233914 1164915 1163071 1547776 991513 863813 1545812 1251726 1176321 1438105
4661 1438105 1338098 1001179 1396173 1296530 1384987 1658833 1152830 1393090 1458418 1364729
4651 1364729 1556693 1764075 1515399 1410907 1046828 1333156 1508888 1469120 1239939 1040791
4641 1040791 1586019 1149096 1285018 1512666 1062151 1343394 1589309 1261101 1308983 1169877
4631 1169877 1057609 918320 961968 1139640 1669849 1325240 1410131 1367868 1225490 1226249 1463198
4620 1463198 1347521 1492616 1709114 1671700 2016140 1975446 1457593 1504395 1213026 1806473
4610 1806473 1837685 2074474 1732181 1842941 2184872 1592916 2122033 1770066 2177006 2146543
4600 2146543 2201249 2024118 2027196 2146001 2278082 2010233 1800792 1815907 2105589 1813242
4590A813242N1719K75542o15059O19322j98320J50282K44668m02661k7796L00874
4580B211813J40484J94239j25722k04932K08069M3881k98645M42340j92482p0133
4570B348912n9794K59744J4334k61915j60672N3375k64500O3356k6508j71570
4560A794762K62439j18676J94923r2546M1824L0129K55517L1940j90919q6215
4550B123178J84507L7988j52713J33060m07328M48111L31383k05689L87220K9567
4540B909284l53764J01213K29563r3972J11644J60845k61568J0632o0367N56333
4530C309843p00961n002J17443m70386J94660m27172j20824L88244R8392n99115
4520A785122K02100J01470Q0804j14548R4365Q7694k50783K12616k85045Q5817
$$ plain form
4590 1813242 1864961 2140503 1525444 2144766 1946446 2096728 2341396 1938735 1910939 2211813
4580 2211813 2352297 2546536 2420814 2215882 2423951 2467832 2169187 2611527 2419045 2348912
4570 2348912 2289118 2548862 2563196 2301281 2140609 2193984 1929484 1992840 1966332 1794762
4560 1794762 2057201 1938525 2133448 2040902 2082726 2112855 2368372 2400312 2209393 2123178
4550 2123178 2307685 2345673 2192960 2326020 1918692 2366803 2698186 2492497 2879717 2909284
4540 2909284 2555520 2656733 2886296 2792324 2903968 3064813 2803245 2813877 2753510 3309843
4530 3309843 2608882 2603880 2721323 2250937 2445597 2018425 1897601 2285845 2384237 1785122
4520 1785122 1987222 2088692 2169496 2054948 2149313 2237007 1986224 2198840 1913795 1999612
4510A999612J02775o746K66638o13537L45019j44916J06404R2003p1842n41415
4500A533995N27833M245K75652k31961N4714r368J49165l29563J88206k00694
4490A962224M27620m92695M68299p16481M97053P2908p1670j13591L76609k93465
4480B116811L54803m57264N32347j2039L47015l18606L295q7417J82103K16081
4470B877129P4894k12950o5504J88679j83265L0000K3342J41561O2643j38095
4460B798434J13792q2480K52504J98893k82502J83649O646o6928L27602L10907
4450C760517J2942L29713J79369K12903J02710K28972n82825J64222J39868j65215
4440D383176K57668j91316j8894L40867K67175l38390J28887j89196K05634K9347
$$ plain form
4510 1999612 2102387 2095641 2362279 1748742 2093761 1948845 2055249 2147252 2075410 1533995
4500 1533995 2061828 2066073 2341725 2109764 2164478 2155110 2304275 1974712 2162918 1962224
4490 1962224 2389844 1897149 2365448 1648967 2146020 2218928 2147258 2033667 2410276 2116811
4480 2116811 2471614 2014350 2546697 2534658 2881673 2563067 2566362 2478945 2661048 2877129
4470 2877129 2952023 2739073 2673569 2862248 2678983 2708983 2732325 2873886 2936529 2798434
4460 2798434 2912226 2829746 3082250 3281143 2998641 3182290 3188936 3122008 3449610 3760517
4450 3760517 3773459 4103172 4282541 4495444 4598154 4827126 4244301 4408523 4548391 4383176
4440 4383176 4640844 4449528 4430634 4771501 5038676 4700286 4829173 4639977 4845611 4874958
4430D874958j20903N873K21097M62935J71618n61017N34621o0109N28997k4384
4420F033686M5241M46910k05353m0668N33305J18776l34428R99244k04488j74454
4410G217771j29119K4752P529M90104R2098k67265j42769M48407l70906P94603
4400H165205J42051k95322J92779Q05866j2356K74202M07374N9949L37757K72521
4390A0350026O74546J76935P26565j5542L57107J003078M56617N29881N73658
4381A4832871P56689L28811J048914N30721Q85878J224696O87670J150174J143021
4372B2589445R67976J172069J049882J330746J953287J734731K067689K411603
4364C5277428M266399M335213M103415M819142N436039N371926N015737K827134
$$ plain form
4430 4874958 4754055 4759928 4981025 5443960 5615578 5054561 5589182 5529073 6058070 6033686
4420 6033686 6078927 6525837 6320484 6279816 6813121 6931897 6597469 7596713 7392225 7217771
4410 7217771 7088652 7113404 7120933 7611037 7703135 7435870 7293101 7741508 7370602 8165205
4400 8165205 8307256 8011934 8204713 9010579 8998223 9272425 9679799 9739748 10077505 10350026
4390 10350026 11024572 11201507 11928072 11912530 12269637 13272715 13729332 14259213 14832871
4381 14832871 15589560 15918371 16967285 17498006 18383884 19608580 20296250 21446424 22589445
4372 22589445 23557421 24729490 25779372 27110118 29063405 30798136 32865825 35277428
4364 35277428 39543827 43879040 47982455 52801597 58237636 63609562 68625299 71452433
4356G1452433J172697j85351j854602k797445l885785l015328k214617k167634
4348E6504368j990000j804074j989985j553493o81214L33637Q87055J222674K198506
4339E3127474K382379L298507M144486O578136P865577Q682422R687788J0819540
4331A06586309J1907130J2226363R624415M523667L496480J05807l909558o682744
4323A37877869p093634o471566o617113o545208o887398p254195o791276o224753
4315H3992726m887840m088741l360628l188954k053412j674956j533440K78072
4307F3482827L20552O31801J534604K150493J713187L256724J617570k02441j460857
4298G3044460j734687l379531l631529l589285l059638k465105j899720j776238
$$ plain form
4356 71452433 72625130 72439779 70585177 67787732 63901947 60886619 58672002 56504368
4348 56504368 54514368 52710294 50720309 49166816 48485602 48819239 49706294 50928968 53127474
4339 53127474 55509853 58808360 62952846 69530982 77396559 86078981 95766769 106586309
4331 106586309 118493439 130719802 140344217 144867884 148364364 148470171 144560613 137877869
4323 137877869 130784235 124312669 117695556 111150348 104262950 97008755 90217479 83992726
4315 83992726 79104886 75016145 71655517 68466563 66413151 64738195 63204755 63482827
4307 63482827 63803379 64435180 65969784 68120277 69833464 73090188 74707758 74505317 73044460
4298 73044460 71309773 67930242 64298713 60709428 57649790 55184685 53284965 51508727
4290E1508727j928848k289768j781822j111250j312262j206902j404148j873698
4282C8600029k288269j551149k149437j861880j818003j741995j425059j583148
4274B4181089j737848j584909m75731j432495m59487p39811l01232p50726L32404
4265A7031254k96233k37893j17618k13077j81372m12075l54071l08215o69599
4256A4241101m88250p54613q79966o82667o56187q37578o29924l64770j121602
4247G825544m99848m82272p36944K63479o53263m26152n23088m13697m36122M14931
4237D332568l64107k61038k45126n02031J6768K20499m38361o0394R6527j23517
4227B671788n61498J4239K06351k37532k45464K42539l19957k46674L16245j30515
$$ plain form
4290 51508727 49579879 47290111 45508289 44397039 43084777 41877875 40473727 38600029
4282 38600029 36311760 34760611 32611174 30749294 28931291 27189296 25764237 24181089
4274 24181089 22443241 20858332 20382601 18950106 18490619 17750808 17449576 16698850 17031254
4265 17031254 16735021 16497128 16379510 16166433 15985061 15572986 15218915 14910700 14241101
4256 14241101 13752851 12998238 12118272 11435605 10779418 9941840 9311916 8947146 7825544
4247 7825544 7325696 6843424 6106480 6369959 5716696 5290544 4767456 4353759 3917637 4332568
4237 4332568 3968461 3707423 3462297 2960266 2977034 3197533 2759172 2698778 2795305 2671788
4227 2671788 2110290 2124529 2330880 2093348 1847884 2090423 1770466 1523792 1840037 1709522
4217A709522L39529n04331j64773R8558k08848J53762j18353j88197p6722J43011
4207A183158J74993n792r1241q1345j32944L94755j23174k80952P021q5994J52297
4196A110782l69858M13331k27434j24701n3050j11369k19878K85467k02172K42258
4186G43376k05910m2313M06714l01329j51822j56609L13257l00806L61325m27820
4176B38063J45281J28984J87820l32022J11690J04443K60797m6859n03489J80990
4166D75698K2767J77338l49614K87303j83064L11888m39094N57921q1250j81848
4156E98045n8853k00744m711K89019j08262J84957l04133J31559k61455L45068
4146F10490o6600j82271J31142R6044l24079M38135n0573j82055j79232K66741
$$ plain form
4217 1709522 2049051 1544720 1379947 1478505 1269657 1423419 1305066 1116869 1040147 1183158
4207 1183158 1358151 1352359 1261118 1179773 1046829 1441584 1318410 1037458 1044479 958485 1110782
4196 1110782 740924 1154255 926821 802120 749070 637701 417823 703290 501118 743376
4186 743376 537466 495153 901867 600538 448716 292107 605364 304558 665883 238063
4176 238063 383344 512328 700148 368126 479816 584259 845056 798197 294708 475698
4166 475698 498465 675803 326189 613492 430428 742316 303222 861143 779893 598045
4156 598045 539192 338448 333737 622756 514494 699451 395318 526877 265422 610490
4146 610490 543890 361619 492761 588805 264726 702861 652288 470233 291001 557742
4136E57742l33837J19103k174K6988j0387K48651k7328J62557o07864J97110J72584
$$ plain form
4136 557742 223905 343008 340834 367822 357435 606086 578758 741315 133451 330561 503145
$$ [...]
##END NTUPLES=NMR SPECTRUM
##END=
