##TITLE=abcd
##JCAMPDX= 6.0         $$ Bruker NMR JCAMP-DX V2.0
##DATA TYPE= NMR SPECTRUM
##DATA CLASS= NTUPLES
##ORIGIN= UXNMR, Bruker Analytische Messtechnik GmbH
##OWNER= root
$$ XWIN-NMR		Version 3.5
$$ Mon Nov 10 19:09:09 2025 Russian Standard Time (UT+4h)  servis@DPX200
##.OBSERVE FREQUENCY= 200.131235884673
##.OBSERVE NUCLEUS= ^1H
##.ACQUISITION MODE= SIMULTANEOUS
##.ACQUISITION SCHEME= undefined
##.AVERAGES= 32
##.DIGITISER RES= 18
##SPECTROMETER/DATA SYSTEM= spect
##.PULSE SEQUENCE= zg
##.SOLVENT NAME= CDCl3
##.SHIFT REFERENCE= (INTERNAL, CDCl3, 0, 16.4885)
##AUDIT TRAIL= $$ (NUMBER, WHEN, WHO, WHERE, WHAT)
$$ ##TITLE= Audit trail, XWIN-NMR		Version 3.5
$$ ##JCAMPDX= 5.01
$$ ##ORIGIN= Bruker BioSpin GmbH
$$ ##OWNER= servis
$$ F:\spectra/data/av/nmr/H1/1/pdata/1/auditp.txt
$$ ##AUDIT TRAIL=  $$ (NUMBER, WHEN, WHO, WHERE, WHAT)
(   1,<2025-11-10 19:07:13.23 +0400>,<servis>,<DPX200>,
      <created by zg, POWCHK disabled, PULCHK disabled
       configuration hash MD5:
       00 E9 B6 7A A2 85 ED C7 34 08 36 98 17 FE 4E 26
       data hash MD5: 32K
       2B C6 F9 46 57 2F 75 1A 16 2D 87 54 A1 A0 50 F1>)
(   2,<2025-11-10 19:08:17.57 +0400>,<servis>,<DPX200>,
      <Start of raw data processing
       efp BC_mod = 2 LB = 0.05 FT_mod = 6 PKNL = 1 PHC0 = -262.762 PHC1 = 1.301565 SI = 16K 
       data hash MD5: 16K
       9E 17 40 CA D9 4C 1C 64 F7 40 D6 E1 2B 84 D1 47>)
(   3,<2025-11-10 19:08:47.67 +0400>,<servis>,<DPX200>,
      <pk PHC0 = 1.6 PHC1 = 0 
       data hash MD5: 16K
       72 EB 1C 06 39 46 E3 84 C6 EE DD 01 D2 63 32 49>)
$$ ##END=
$$ 
$$ hash MD5
$$ DD 88 5C 5F ED 57 3C 0D ED D0 FA F9 C2 64 AB 8D
##$RELAX= 
##$RELAX= 
##$RELAX= 
##$RELAX= 
##$RELAX= 
##$RELAX= 
##$RELAX= 
##$RELAX= 
$$ Bruker specific parameters
$$ --------------------------
##$DU= <F:\spectra>
##$EXPNO= 1
##$NAME= <H1>
##$PROCNO= 1
##$TYPE= <nmr>
##$USER= <av>
##$AMP= (0..31)
100 100 100 100 100 100 100 100 100 100 100 100 100 100 100 100 100 100 
100 100 100 100 100 100 100 100 100 100 100 100 100 100 
##$AQSEQ= 0
##$AQ_mod= 1
##$AUNM= <au_zg>
##$AUTOPOS= <>
##$BF1= 200.13
##$BF2= 200.13
##$BF3= 200.13
##$BF4= 200.13
##$BF5= 500.13
##$BF6= 500.13
##$BF7= 500.13
##$BF8= 500.13
##$BYTORDA= 1
##$CFDGTYP= 0
##$CFRGTYP= 5
##$CHEMSTR= <none>
##$CNST= (0..31)
1 1 145 1 1 1 1 1 1 1 1 1 1 1 1 1 1 1 1 1 1 1 1 1 1 1 1 1 1 1 1 1 
##$CPDPRG= <>
##$CPDPRG1= <>
##$CPDPRG2= <>
##$CPDPRG3= <>
##$CPDPRG4= <mlev>
##$CPDPRG5= <mlev>
##$CPDPRG6= <mlev>
##$CPDPRG7= <mlev>
##$CPDPRG8= <mlev>
##$CPDPRGB= <>
##$CPDPRGT= <>
##$D= (0..31)
0 2 0 0 0 0 0 0 0 0.06 0 0 0 0 0 0 0.0002 0 0 0 0 0 0 0 0 0 0 0 0 0 0 
0 
##$DATE= 1762787232
##$DBL= (0..7)
120 120 120 120 120 120 120 120 
##$DBP= (0..7)
150 150 150 150 150 150 150 150 
##$DBP07= 0
##$DBPNAM0= <>
##$DBPNAM1= <>
##$DBPNAM2= <>
##$DBPNAM3= <>
##$DBPNAM4= <>
##$DBPNAM5= <>
##$DBPNAM6= <>
##$DBPNAM7= <>
##$DBPOAL= (0..7)
0.5 0.5 0.5 0.5 0.5 0.5 0.5 0.5 
##$DBPOFFS= (0..7)
0 0 0 0 0 0 0 0 
##$DE= 6
##$DECBNUC= <off>
##$DECIM= 32
$$ [...]
##$SUBNAM4= <"">
##$SUBNAM5= <"">
##$SUBNAM6= <"">
##$SUBNAM7= <"">
##$SUBNAM8= <"">
##$SUBNAM9= <"">
##$SW= 20.6817932712277
##$SWIBOX= (0..15)
0 0 3 0 0 0 0 0 0 0 0 0 0 0 0 0 
##$SW_h= 4139.07284768212
##$TD= 32768
##$TD0= 1
##$TE= 0
##$TE2= 300
##$TE3= 300
##$TEG= 300
##$TL= (0..7)
0 120 120 120 120 120 120 120 
##$TP= (0..7)
150 150 150 150 150 150 150 150 
##$TP07= 0
##$TPNAME0= <>
##$TPNAME1= <>
##$TPNAME2= <>
##$TPNAME3= <>
##$TPNAME4= <>
##$TPNAME5= <>
##$TPNAME6= <>
##$TPNAME7= <>
##$TPOAL= (0..7)
0.5 0.5 0.5 0.5 0.5 0.5 0.5 0.5 
##$TPOFFS= (0..7)
0 0 0 0 0 0 0 0 
##$TUNHIN= 0
##$TUNHOUT= 0
##$TUNXOUT= 0
##$USERA1= <user>
##$USERA2= <user>
##$USERA3= <user>
##$USERA4= <user>
##$USERA5= <user>
##$V9= 5
##$VALIST= <valist>
##$VCLIST= <CCCCCCCCCCCCCCC>
##$VD= 0
##$VDLIST= <DDDDDDDDDDDDDDD>
##$VPLIST= <PPPPPPPPPPPPPPP>
##$VTLIST= <TTTTTTTTTTTTTTT>
##$WBST= 1024
##$WBSW= 30
##$XGAIN= (0..3)
0 0 0 0 
##$XL= 0
##$YL= 0
##$YMAX_a= 157539
##$YMIN_a= -108874
##$ZGOPTNS= <>
##$ZL1= 120
##$ZL2= 120
##$ZL3= 120
##$ZL4= 120
##$ABSF1= 0
##$ABSF2= 0
##$ABSG= 0
##$ABSL= 0
##$ALPHA= 0
##$AQORDER= 0
##$ASSFAC= 0
##$ASSFACI= 0
##$ASSFACX= 0
##$ASSWID= 0
##$AUNMP= <proc_1d>
##$AZFE= 0.1
##$AZFW= 0.1
##$BCFW= 0
##$BC_mod= 2
##$BYTORDP= 0
##$COROFFS= 0
##$CY= 18.4799938201904
##$DATMOD= 1
##$DC= 0
##$DFILT= <>
##$DTYPP= 0
##$F1P= 9.9274215381318
##$F2P= -0.165520771350173
##$FCOR= 1
##$FTSIZE= 16384
##$FT_mod= 6
##$GAMMA= 0
##$GB= 0
##$INTBC= 1
##$INTSCL= 4.127829e-11
##$ISEN= 128
##$LB= 0.05
##$LEV0= 0
##$LPBIN= 0
##$MAXI= 10000
##$MC2= 0
##$MEAN= 0
##$ME_mod= 0
##$MI= 50
##$NCOEF= 0
##$NC_proc= -5
##$NLEV= 6
##$NOISF1= 3.799351
##$NOISF2= 2.8
##$NSP= 0
##$NTH_PI= 0
##$NZP= 0
##$OFFSET= 16.48848
##$PC= 4
##$PHC0= -261.162
##$PHC1= 1.301565
##$PH_mod= 1
##$PKNL= yes
##$PPARMOD= 0
##$PSCAL= 4
##$PSIGN= 0
##$REVERSE= no
##$SF= 200.130005582386
##$SI= 16384
##$SIGF1= 3
##$SIGF2= 2
##$SINO= 400
##$SIOLD= 16384
##$SREGLST= <1H.CDCl3>
##$SSB= 0
##$STSI= 16384
##$STSR= 0
##$SW_p= 4139.07284768211
##$SYMM= 0
##$S_DEV= 0
##$TDeff= 32768
##$TDoff= 0
##$TI= <>
##$TILT= no
##$TM1= 0
##$TM2= 0
##$TOPLEV= 0
##$USERP1= <user>
##$USERP2= <user>
##$USERP3= <user>
##$USERP4= <user>
##$USERP5= <user>
##$WDW= 1
##$XDIM= 16384
##$YMAX_p= 283886815
##$YMIN_p= -305714
$$ End of Bruker specific parameters
$$ ---------------------------------
##NTUPLES= NMR SPECTRUM
##VAR_NAME=  FREQUENCY,     SPECTRUM/REAL,   SPECTRUM/IMAG
##SYMBOL=    X,             R,               I
##VAR_TYPE=  INDEPENDENT,   DEPENDENT,       DEPENDENT
##VAR_FORM=  AFFN,          ASDF,            ASDF
##VAR_DIM=   16384,         16384,           16384
##UNITS=     HZ,            ARBITRARY UNITS, ARBITRARY UNITS
##FACTOR=    0.252644378177508, 1,           1
##FIRST=     3299.83951724647, 0,            0
##LAST=      -839.233330435636, 0,           0
##MIN=       -839.233330435636, -305714,     0
##MAX=       3299.83951724647, 283886815,    0
$$ Real data points
##PAGE= N=1
##DATA TABLE= (X++(R..R)), XYDATA
$$ [...]
10800F5685l6886j5789P2231J0506j07653Q053Q104N2988l4899n9008J04331J494
10788F9157o2206L3583j13220K6856l85P8203P910o7763l0314j5349J0668M2675
10776b0185Q579r755Q3076j44951K0049O5771L5648o7079Q8918n7365j0398P6513
10764F8821Q958j00597O2640R0779q5039L589J0455j2019Q355j9823K5746N3194
10752A15059k2455o5034l2228K4888L4345P7101j28523q618Q6452k3458m2063
10741A5466j7325P61m5299O2220p2281O0279J8281P102R614p2249n158K9757M3847
10728C5015o4548J8004L8197m8713J07307r2761J3528M5443m0472r6415O0000
10717b5415J7771K4982M6688j05937L3443k2703N2288L8409q7842O4957l5072
$$ plain form
10800 65685 28799 13010 85241 95747 -11906 -3853 4251 57239 22340 -36668 67663 69157
10788 69157 6951 40534 -72686 -45830 -46215 31988 39898 -27865 -58179 -73528 -62860 -20185
10776 -20185 -11606 -21361 61715 -83236 -63187 2584 38232 -28847 60071 2706 -7692 68821
10764 68821 77779 -22818 39822 130601 45562 49151 59606 47587 55942 36119 61865 115059
10752 115059 92604 27570 -4658 20230 54575 131676 3153 -5465 80987 57529 15466
10741 15466 -1859 -1098 -46397 15823 -56458 3821 22102 29204 38818 -33431 -38589 -8832 35015
10728 35015 -29533 -11529 26668 -22045 85262 -7499 6029 51472 11000 -85415 -25415
10717 -25415 -7644 17338 64026 -41911 -8468 -31171 21117 59526 -28316 36641 1569
10706A569J5769P51R082j8736K4092l9286m3938J27948m7786n3631M7658O7016
10694I0508j25640J44768j35316j9552L7989P011Q118R971r6985J28481j606o3126
10682a5379R5J0032L4274j21441J49252l339l7957O433p8418N7369L251o0451
10670e6279j0418O1309K8877r1056M0788P00q722K2637m0951M7599j5204q4314
10658a05034O5782j6513p3920L6611J09478j01866J37233N5357j52120P1406k6387
10647B7Q6452m3550M3105n639O1490j40751O427l4728j2456n2662Q4825l2224
10635c9684q020l4865l6151M1339q2566J10837j69178J55606j04472R4359O902
10624f5893J9089J6077J03505l8065M3392J9827O7290o8862M5220O3570n4843
$$ plain form
10706 1569 17338 18089 27171 8435 32527 -6759 -50697 77251 29465 -24166 23492 90508
10694 90508 -35132 109636 -25680 -45232 -7243 -232 7886 17857 -79128 49353 47747 -15379
10682 -15379 -15284 -5252 29022 -92419 56833 53494 15537 21970 -56448 921 4172 -56279
10670 -56279 -66697 -5388 23489 -67567 -26779 -26079 -34801 -12164 -53115 -5516 -20720 -105034
10658 -105034 -39252 -55765 -129685 -93074 16404 -85462 51771 107128 -44992 26414 27
10647 27 86479 42929 86034 80395 141885 1134 7561 -27167 -39623 -92285 -7460 -39684
10635 -39684 -47704 -82569 -118720 -77381 -159947 -49110 -218288 -62682 -167154 -72795 -65893
10624 -65893 -46804 -30727 72778 34713 78105 97932 165222 96360 141580 205150 150307
10613A50307r141j19642M2895K2057k7829p705l0320l9899m0746P2327r2964q2093
10601a62753J42667J164r896J8362p55P6055J14282K0464j31719L9282J02911
10590B10064M7654j05485O095K7271k354j241p8155J09232q9959k8040m096j21144
10578c0158N9503J0513J5262m7694P1330p7029j1601m2384p352j2073l2196Q8663
10566a5216N4902M8503J5223r7272M7515J9630l4558O3152j5911n0739P3595M25
10554A09249p4554N7625o523L155n8183J2895o3723m8359J02755m6765m263P3142
10542E6451M1580j16182N7156o1239l4973J41281n8595o5247R5820n100M5079
10531I6031K9872o5554j34439J17131K2378k8540J4122j2015j8452P3532j52109
$$ plain form
10613 150307 141166 21524 64419 86476 58647 50942 20622 -19277 -60023 12304 -80660 -162753
10601 -162753 -20086 -18922 -28818 -10456 -11211 64844 179126 199590 67871 107153 210064
10590 210064 257718 152233 158328 185599 183245 182004 103849 213081 123122 95082 90986 -30158
10578 -30158 29345 39858 55120 7426 78756 1727 -9874 -52258 -59610 -71683 -103879 -15216
10566 -15216 39686 88189 103412 6140 53655 73285 38727 101879 85968 35229 108824 109249
10554 109249 34695 92320 85797 88952 30769 43664 -20059 -68418 34337 -12428 -16691 56451
10542 56451 98031 -18151 39005 -22234 -57207 84074 25479 -39768 56052 50952 96031
10531 96031 125903 60349 -74090 43041 65419 36879 51001 38986 20534 94066 -58043
10520e8043Q0912p687o4745J23002j55836O4107Q3182m4765J6699J10339q9286
10509E7879j5189p188N1559m6384N3928m0462l1692p6221J11155m6383L0057l0128
10497A0931N7348l2403m8842N8998L1264m7819K4205M219j28776P5160k5753M6721
10485B5253K0090l8893N0368l8020K4634K15J3428l8880l0810Q9101k6528K0761
10473G0719j24026Q8646N403M4246o3399k8457J910J1130Q3936n1518p507n1433
10461b0350N7661l1093K6396j06516L9170J7283P0292q4111J28326q8784k9063
10450b0789k8450O3342n9954O3702k3472L7679P5836q3689J7618q425n4124j180
10438b1906j5393M4388m5099m561O0065M4295k1470J8637n5293K4846m7684R5965
$$ plain form
10520 -58043 22869 15182 -49563 73439 -82397 -18290 64892 20127 36826 147165 57879
10509 57879 42690 35502 87061 40677 94605 54143 22451 -53770 57385 11002 41059 10931
10497 10931 68279 35876 -12966 46032 77296 29477 53682 57901 -70875 4285 -21468 25253
10485 25253 45343 6450 56818 18798 43432 43647 57075 18195 -12615 76486 49958 70719
10473 70719 -53307 35339 40742 84988 21589 -6868 -4958 6172 90108 38590 31083 -20350
10461 -20350 37311 6218 32614 -73902 -34732 -17449 52843 -31268 97058 8274 -20789
10450 -20789 -49239 14103 -45851 17851 -5621 32058 107894 24205 41823 33398 -20726 -21906
10438 -21906 -37299 7089 -38010 -42571 17494 61789 40319 58956 3663 28509 -19175 76790
10426G6790j11095R4622M211q0868N6450L3054k1278q7119L0608p2833P1459P4742
10414F8743m9827J9848k6149J8635j51734O5517J4043j074k912J31345r610m6260
10402C0565l2523O8812j08522M7670J5018k2328l015K8603J225N020N368l0551
10390E342p480M8693p2291J81999j04756m7223J0132Q4517p0332P5988p7013K5626
10378E3202j109o704Q298j1217O0491j08490r4272R4398R0013o7918n878m0813
10366b9999L518K364n355K8917R0989j13883Q2738o9708n8924N2895N4419k4451
10354A3520m0247J31411k5968j14659M1749P5101J4437m1270r9968L272O287j3083
10342d9418K8103J11540M1031r3127O3524j37565K8713o8578J12862j5864K3624
$$ plain form
10426 76790 -34305 60317 64528 -16340 40110 73164 51886 -35233 -4625 -77458 -5999 68743
10414 68743 18916 38764 12615 31250 -120484 -54967 -40924 -41998 -44910 86435 76825 30565
10402 30565 -1958 66854 -41668 6002 21020 -1308 -4323 24280 25505 30525 35893 5342
10390 5342 -2138 46555 -25736 156263 51507 4284 14416 98933 28601 104589 27576 53202
10378 53202 52093 45389 53687 42470 102961 -5529 -99801 -5403 84610 16692 10814 -29999
10366 -29999 -26481 -24117 -29472 -555 90434 -23449 59289 -10419 -69343 -16448 37971 13520
10354 13520 -26727 104684 78716 -35943 5806 80907 95344 54074 -45894 -42622 -36335 -49418
10342 -49418 -21315 90225 131256 38129 101653 -35912 -7199 -75777 37085 21221 44845
10331D4845o4679j1962M1406j041K7864N448n8512R239J2550L9770j9834J9902
10319D4996j00115J08415M7670n5140J2125p1505J2157r754L6176p2540R8044
10308E0529m5553Q4058j10154M3562l6963l699J26534j37063L6266P7412o0891
10297B4038l5720L9460K4087n4061M4512N4804n3782j1647J7596M2738j20531
10286b8506M1527l042P0065p5271O680r161m8563O9080J6782r8036N5111O9505
10274F6171r3733o102J24394o6568j03471K1881R6544k1268o7628J61121l7856
10263G3485r2174R4785j08166j9400O4999j9666l9282J09262J7126M7254j15587
10252A2636k7241p575M9885P2691j39058k9580R3448j70167Q4682O1464R113P2042
$$ plain form
10331 44845 -19834 -31796 9610 8569 36433 41881 -16631 -7392 5158 44928 25094 44996
10319 44996 -55119 53296 100966 45826 57951 -13554 -1397 -11151 25025 -47515 50529
10308 50529 4976 89034 -21120 22442 -14521 -18220 108314 -28749 7517 84929 24038
10297 24038 -11682 27778 51865 -2196 42316 97120 43338 31691 49287 92025 -28506
10286 -28506 13021 9979 80044 4773 11453 2292 -46271 22809 39591 -58445 -3334 66171
10274 66171 -27562 -33664 90730 24162 -79309 -57428 39116 17848 -49780 111341 73485
10263 73485 -18689 76096 -32070 -51470 13529 -6137 -45419 63843 80969 128223 12636
10252 12636 -14605 -22180 27705 100396 -38662 -68242 25206 -144961 -60279 1185 10298 82340
10240H2340q134q7209M0342p6982R9525j38567J26123n3562J1372Q1470j16204
10229c9486Q4892m5461j3606J16433j09665M6893m6720l0068j1690K4242O6871
10218D2635q2633P5894q691l7586l5807P0792p173N9391J0213P035k4278k2302
10206D7490l691M3566j45068P3059M1173l8635m5902J9895m5449L1679L3083m2959
10194c1759L0125P0478o3207o0695J08603r5477L7066K9557m1348K5978J5015
10183B4336l9539N9684O5435j00515r5911Q9164L3867L906m6113M32M3980o831
10171C1895k0475p1186j1205R3176J9939o7246P3332p816Q730p2193O1556j52937
10159a14430O3722N3643N318l4215m996N4157p7783n7145K04166J9240J6905j51120
$$ plain form
10240 82340 74206 -13003 27339 -49643 49882 -88685 37438 -16124 -4752 76718 -39486
10229 -39486 45406 -55 -13661 102772 -6893 40000 -6720 -36788 -48478 -24236 42635
10218 42635 -39998 35896 27205 -10381 -46188 24604 17431 76822 87035 94070 69792 47490
10206 47490 43799 87365 -57703 15356 56529 17894 -28008 -8113 -53562 -21883 11200 -31759
10194 -31759 -1634 68844 5637 -55058 53545 -41932 -4866 24691 -16657 9321 24336
10183 24336 -15203 44481 109916 9401 -86510 2654 36521 40427 -5686 -5254 38726 31895
10171 31895 11420 -59766 -70971 22205 42144 -25102 48230 40414 49144 -23049 38507 -114430
10159 -114430 -50708 2935 8253 -25962 -30958 23199 -54584 -111729 92437 111677 128582 -22538
10147b2538N3390M2693K089j61347N8570J6610R1588j10435O8379j8775m784J7380
10135C2820l5460L0340m1989Q508L4950M0182O635n5298k3564L6997Q3681m8287
10123F9515j47965J47197m0337K1258n5005l4926N2064P2929l0889l1972L0120
10112E1989l3915k4678J43544j72937L572J3842K5992N1276q8107K7624M0099
10101C8301p261j3803n2407K8958Q745j01567J27204j18589J11084r3780R4229
10090B1114l6494l1007O8431K4734k5808N1137j48692R3617m9789J1782k0088
10079d1063k4538P0577j8449M2469J06321r5893n5481j246L9135k232q7136m6892
10067a14428K01190j19244R6223j01771M7024p035k3042k4662Q3199o7534l8819
$$ plain form
10147 -22538 30852 73545 75634 -85713 -27143 -10533 81055 -29380 38999 20224 15440 32820
10135 32820 -2640 27700 -14289 -5781 29169 69351 75986 20688 -2876 34121 117802 69515
10123 69515 -78450 68747 28410 49668 -5337 -40263 11801 84730 53841 21869 51989
10112 51989 18074 -6604 136940 -35997 -32425 -18583 7409 58685 -29422 -1798 38301
10101 38301 31040 17237 -35170 -6212 2533 -99034 28170 -90419 20665 -73115 21114
10090 21114 -15380 -46387 22044 46778 20970 72107 -76585 17032 -32757 -20975 -41063
10079 -41063 -65601 4976 -13473 28996 135317 39424 -16057 -17303 21832 19600 -67536 -114428
10067 -114428 86762 -32482 63741 -38030 8994 1959 -21083 -45745 37454 -30080 -68899
10056f8899Q0838l956m793o4838R9515j5325J4136k837o0429o848P3275k389k6278
10043A1172O1759n8609m661r974k5601K3883l4715J08561j0990J0700q7939P6484
10031F0070r414q4109J03076j23280P1328j05140Q8035j7222J5983O6842m5196
10020B0973o3356o972O1457J4687J3958r1388o645Q6707O731L5389o4733m9121
10008d2313M1182l9916L321K106M26M5133k7847O7927p6207P9422r5550Q038M9663
9995A5385K7990J9993o8523o2246R3691K7210n2896j8338J0956L7848R352n621
9983C4801M1551j41946K9975l4012M4623J612j7261R144J35300m2439j95417J07377
9971b6692P2310l7756L103n46n3091l7044N7556k3591P7345J413M3139j7345j00297
$$ plain form
10056 -68899 11939 7983 3190 -61648 37867 22542 36678 33841 -26588 -33436 39839 37450 11172
10043 11172 72931 14322 9661 -313 -25914 -2031 -36746 71815 60825 71525 -16414 60070
10031 60070 50656 -33453 69623 -53657 17671 -87469 566 -16656 -673 66169 20973
10020 20973 -42383 -49355 12102 26789 40747 -50641 -57286 29421 36152 71541 6808 -42313
10008 -42313 -1131 -41047 -37726 -35620 -35194 9939 -17908 50019 -26188 53234 -42316 -34278 15385
9995 15385 43375 63368 -5155 -67401 26290 53500 604 -17734 -6778 31070 40422 34801
9983 34801 76352 -65594 -35619 -69631 -25008 -23396 -40657 -31513 103787 61348 -134069 -26692
9971 -26692 45618 7862 10965 10419 -42672 -79716 -22160 -45751 31594 33007 76146 58801 -41496
9958d1496J54457j30449M3133k2281L355K6169q1998O8417L5993j7225k5201q3816
9946g0942P9702j6767K846R0429o5430M36J8821l2049J091P9128j00497J06658
9934I3426p4566n9124N7613L9445l5844j895l1371J2534k6171J2899j409k608
9922a7071J0762j3693P8840l3142k0696p103K1447k3719p984O5745l4356j5062
9910C968O2966r575j03500N2398L6037n7539R1134l4288m6591k1459r583M5761
9898I729J9004l0700j3928L4072m2831K233P0276r455J9313n2510J00496j14415
9886h716M1542q2170P8356n0853P9629j89140J55954j4077p45p86j04041P6007
9874a9040j7741J41432j04930p3657J16424n8974M9126K6318k9558j50534O0486
$$ plain form
9958 -41496 112961 -17488 25645 3364 6719 32888 -49110 19307 55300 38075 12874 -70942
9946 -70942 8760 -8007 -5161 85268 19838 20274 39095 7046 8137 87265 -13232 93426
9934 93426 18860 -40264 17349 56794 20950 19055 -12316 218 -25953 -13054 -14463 -17071
9922 -17071 -6309 -20002 58838 25696 5000 -2103 19344 -4375 -12359 53386 19030 3968
9910 3968 66934 57359 -46141 6257 42294 -15245 75889 41601 -4990 -26449 -36032 9729
9898 9729 28733 -1967 -15895 18177 -24654 -22421 47855 38400 57713 5203 105699 -8716
9886 -8716 32826 -49344 29012 -21841 57788 -131352 24602 10525 9780 8994 -95047 -19040
9874 -19040 -36781 104651 -279 -73936 42488 -16486 32640 58958 29400 -121134 -60648
9863f0648N6324o874k1782K7770K7141O769m2268Q112Q1359k2955o0376N4162
9851D6734K300j08384M6239n095k0252L4830K3352p1828J00513p0068L744L9345
9839B1430o582L6970j07665J5314Q6462O6795j12319j9262k7462P0849N957o7957
9827c7470j659L2535J8815k7869R3960j57674R6104k710R1236n4545p3928j4459
9815c7664M9814J02526j09110j1792J719m9885N6730j14298N3454N0066R0367
9804H1927o2951O70j3154O1124J729l5198q9674J00759j18600J24493J9468j03632
9792c3039J7800Q9070k8124m7277O1417m2762k562M853J21422j40620n6975N2397
9780d400J6M794k8085Q6485m7457r8069J00108r5087J39646o8653q628m1685P0452
$$ plain form
9863 -60648 -4324 -11198 -32980 -5210 21931 28700 -13568 -5456 75903 52948 -7428 46734
9851 46734 49034 -59350 -13111 -18206 -38458 -3628 19724 -52104 48409 -21659 -17915 21430
9839 21430 14848 51818 -55847 -40533 45929 112724 405 -18857 -46319 24530 30487 -37470
9827 -37470 -39129 -6594 12221 -15648 78312 -79362 16742 14032 105268 50723 -23205 -37664
9815 -37664 12150 114676 5566 -6226 -4507 -54392 2338 -111960 -58506 -8440 81927
9804 81927 18976 19646 6492 67616 69345 34147 -55527 45232 -73368 51125 70593 -33039
9792 -33039 -15239 73831 45707 -1570 59847 17085 14523 19376 140798 178 -56797 -4400
9780 -4400 -4384 410 -27675 58810 11353 -86716 13392 -81695 57951 -10702 -19330 -61015 9437
9767I437l7483R864K7861K7469p0188L1039L4206j10584J10783l6005o1153N9731
9755e023p3175K5860J53176p2806l6585K0114J8155n2158M0610J0289m2823L7082
9743B2716m4590j030j0076J57319k01j45809K5351O5930m1295L0339j15358R5936
9731C9232k0424p720j5249m4081N4268J01246L2223q2045j23057M89J26683k2820
9719C8745j7164l1326J09667j1475j21808Q9735j0437j22321J43095q2312M2616
9708B7015J153l3951k9858O1296o4165J30102j4650n8343p3572K5060J27632j46806
9696d9087J36737n1893l3002P5268j18164J29948k4465q3871j4473M2511m6390
9685c6881N482K1381m0447O8198L0857K6239j29705O2160n0366m1969J70133p3231
$$ plain form
9767 9437 -28046 -18182 9679 37148 -33040 -2001 32205 -78379 32404 -3601 -64754 -5023
9755 -5023 -78198 -52338 100838 28032 -8553 11561 29716 -22442 18168 28457 -14366 22716
9743 22716 -21874 -22904 -32980 124339 124138 -21671 3680 69610 28315 58654 -56704 39232
9731 39232 18808 11088 -4161 -48242 6026 107272 139495 57450 -65607 -65118 61565 38745
9719 38745 21581 -9745 99922 88447 -33361 56374 45937 -76384 66711 -15601 27015
9708 27015 28168 -5783 -35641 25655 -38510 91592 76942 18599 -54973 -29913 97719 -49087
9696 -49087 87650 35757 2755 78023 -40141 89807 65342 -18529 -33002 9509 -36881
9685 -36881 -31399 -10018 -50465 17733 48590 74829 -54876 7284 -43082 -85051 85082 11851
9673A1851p5543M6429Q6642q3969P8654r9503M245J05475k2321l1461N0269L896
9661G4664L5315j28136N7072j9350M9470o5395K269n5994Q4858m1637M4701n7362
9649a9525k3249L1763J56517p6166N8304m3114n3420k7680p13O1745m059j2265
9637D8138p1442j0013N9249M6564o3598N1598J9327j3331j01129k4873P2981O3508
9625G6979j08762K8067k5149J6453J7067l9041N7668n7r777o4507J22335j06318
9613c5042Q0781l9113q66J01487j13112l3629J08911l7238q1295k4800J68408
9602I4492p8534n9172M3348L9975l2057N8858L6726j70586Q400N735J16325o7471
9590c961J66484r0889r337p1448L1343L4108N3970j33434M571K9875R7183j28682
$$ plain form
9673 11851 -63692 -17263 69379 -14590 64064 -35439 -31194 74281 51960 20499 70768 74664
9661 74664 109979 -18157 38915 19565 69035 3640 5909 -50085 34773 -6864 37837 -19525
9649 -19525 -42774 -11011 145506 69340 127644 84530 31110 3430 2717 64462 60403 48138
9637 48138 -23304 -33317 25932 72496 8898 60496 79823 66492 -34637 -59510 13471 76979
9625 76979 -31783 -3716 -28865 -12412 4655 -34386 23282 23225 13448 -51059 71276 -35042
9613 -35042 45739 6626 5760 107247 -5865 -39494 69417 32179 -49116 -73916 94492
9602 94492 15958 -43214 134 40109 8052 66910 103636 -66950 -58550 -52815 63510 -3961
9590 -3961 162523 71634 62297 -9151 22192 56300 110270 -23164 -18593 11282 108465 -20217
9578b0217N9758L1302j8238n2108Q8625j21812Q2426l6601n0239O1901J2035q4030
9566d7198k1750J05086l8156J49630j79177M6602R868o1795L1546J2661K611J33046
9554A42974j41390J02019j02897J2822m7396P1496m9852N2210r1929J36141j4776
9543F9422o814j5276Q151p8302Q9985o9783J0928l2330J13080q0795K3035l549
9531B7752k4083l8313M8252R013j05291R0894j6347l4441r990q130O2857L4038
9519C6211j7144K3040R955M1519l7095n727j5202j00405K3860k9827J1926J93864
9507A34975q2452k6486K3005J8253m2490J56451j05740r688O977J15492j85525
9496B772J49625k5575M8954r0908j09064M3917L811Q0566P510j03446J973M2256
$$ plain form
9578 -20217 39541 70843 52605 497 89122 -32690 49736 13135 -37104 24797 36832 -47198
9566 -47198 -68948 36138 -2018 147612 -31565 15037 24905 -36890 -5344 7317 9928 142974
9554 142974 1584 103603 706 13528 -33868 37628 -12224 39986 -51943 84198 69422
9543 69422 62608 47332 55483 -22819 67166 -2617 8311 -24019 89061 8266 31301 27752
9531 27752 3669 -34644 13608 22621 -82670 8224 -8123 -42564 -52554 -60684 2173 36211
9519 36211 19067 42107 52062 93581 56486 50759 35557 -64848 -40988 -70815 -58889 134975
9507 134975 52523 26037 49042 67295 24805 181256 75516 65828 72805 188297 2772
9496 2772 152397 126822 175776 84868 -24196 19721 23532 104098 111608 8162 10135 52391
9484E2391M3147n0978P426L4517P2172j24395p707P8582K0571j22936M1172k2803
9472B1159o116K3206L6790j11067O9319n8233N9333k9210k2982j22017J95714
9461E5896j5574N3533l5528o303k6117P436k8126Q531R7327n0013o1737Q2669
9449H1994K0354j79802J06814K3211J3735k7587L4401q2817P8268r1899J00155
9438G6827k1364m8362j172k4309J09296p7026N5586J8898p3031j6674j04292K85052
9426A79429j42360J7371k1095J8906l3018l817n6304J1270L2381K1758K5210p8332
9414b8601Q1485l2267j04643P8927R0427L807l0132j584l0878M2024m4861j838
9402B1866o1061O6455M1678j09118N5780N2766j35608P023J92202n2946j01289
$$ plain form
9484 52391 95538 44560 51986 86503 158675 34280 26573 105155 125726 2790 43962 21159
9472 21159 15043 38249 75039 -36028 33291 -24942 34391 5181 -17801 -139818 55896
9461 55896 40322 93855 58327 52024 25907 33343 5217 13748 111075 61062 -675 81994
9449 81994 102348 -77454 29360 52571 66306 38719 73120 -9697 68571 -23328 76827
9438 76827 55463 7101 5929 -18380 90916 13890 69476 88374 15343 -1331 -105623 179429
9426 179429 37069 54440 33345 52251 19233 15416 -40888 -29618 2763 24521 49731 -28601
9414 -28601 52884 20617 -84026 -5099 85328 89135 59003 57419 26541 68565 23704 21866
9402 21866 -39195 27260 68938 -40180 15600 68366 -67242 -60219 131983 79037 -22252
9391b2252P6593M5349j15952J77369q9903j5072r8619K6138J01298l2496q6126
9380c3673K30279j48467L0409n7768Q1084J6166j58936J15306j6434K0799l5867
9369D2898O258j4148m0985K7660Q808M0363m2620k0495M2943o4821P0941P830
9357F4632j16N50j1354o0108N4794k1950m7447M5304J2595L2809n2155l8883M034
9344a7295Q0943K2370l0784j9467O457j5521J33979j24722j1986N3179p2016m350
9332G87J40666j20524P9780j6595j0410l8957q155o2542J01280P336l4430l0859
9320G377K5255K7545o2517P8570n5049M1247L0389l2855p9976K2520O3183j1005
9308E4684P5307j03892m6248O4374k5928Q7531r0436J6143J13902m3133K5548
$$ plain form
9391 -22252 54341 99690 -16262 161107 71204 56132 -42487 -16349 84949 52453 -33673
9380 -33673 196606 48139 78548 20780 101864 118030 -40906 74400 57966 78765 42898
9369 42898 49156 35008 -5977 21683 30491 70854 28234 7739 50682 -14139 56802 64632
9357 64632 64516 65066 53712 -6396 48398 26448 -20999 24305 36900 69709 17554 -21329 -17295
9344 -17295 63648 86018 55234 35767 42224 26703 160682 35960 23974 77153 5137 787
9332 787 141453 20929 100709 84114 73704 34747 26592 -35950 65330 72666 38236 7377
9320 7377 32632 60177 -2340 76230 21181 62428 92817 59962 -20014 2506 65689 54684
9308 54684 129991 26099 -20149 44225 18297 105828 15392 31535 145437 102304 127852
9297A27852k4159l2646J575k2315Q186J04018j54882J40239p4496l1720P2r424
9285C2300m794J20623p1520M6173n7353m4068J4103P4051j53711J35849j6450
9274G5203n4016N8866q0664J85282j31946m3721N5005N016k2700l157l5174N8969
9262F6963m0014l0248M6490k3576M7615L1482j7382o9531M8234K8656o3429q3700
9250e8440L5451J55410r740o984l6365M1651p1500l8457N0403q34L7092m5416
9238E2271O1877k6761L315j38793J61936o359n8752j0116J06430q5394p4785M8972
9226C3841P862k0282J02211j08443l4474K8025N2251K3742j2375O1335r3017K6734
9214F7410M4617j20772J73183N1613j08802q5727L1612R2545K7254o4488Q0903
$$ plain form
9297 127852 103693 71047 72622 50307 58493 162511 7629 147868 73372 41652 41724 32300
9285 32300 27506 148129 76609 122782 65429 21361 35464 109515 -44196 91653 75203
9274 75203 21187 80053 -611 184671 52725 9004 64009 69025 46325 43168 7994 66963
9262 66963 26949 -3299 43191 19615 67230 98712 81330 11799 60033 88689 25260 -58440
9250 -58440 -22989 132421 122681 115697 79332 120983 49483 11026 61429 60595 97687 52271
9238 52271 114148 87387 90702 -48091 113845 107486 48734 38618 145048 59654 -15131 33841
9226 33841 41703 21421 123632 15189 -19285 8740 60991 84733 72358 133693 40676 67410
9214 67410 112027 -8745 164438 216051 107249 21522 53134 145679 172933 108445 189348
9203A89348L714k15096J64830m5962m3833K1470K8747l255J16092o6118k3013
9192A26924m5372P2870K990m0787K8753M0249m1607l7612K5933J9168m4355M7952
9180A55106J5277o8874P2630n2529J06514l0538n4743Q6668j43600Q4354M2213
9169B12478j4792l7895M8380p9412P9076j55629Q8286P2743j29502J71833j23749
9158A31817P2802o75o4065R5102R267l8014p8197L6134O4010P5982j42652Q5663
9146B47174p5661R6539j16739K02116j06933N4745p1451O4928n0035M3288M405
9135B92376J37080j07931L3784m0505N7264L8629k4731M6L3834J18347j89601
9124C48592O2015k5974N0335k8585n9111Q2013O2827r740J21034l3769m1966P2558
$$ plain form
9203 189348 193062 -22034 142796 96834 53001 74471 103218 99963 216055 149937 126924
9192 126924 81552 154422 157412 116625 145378 185627 144020 106408 132341 151509 107154 155106
9180 155106 170383 101509 174139 121610 228124 197586 142843 229511 85911 170265 212478
9169 212478 197686 159791 208171 128759 207835 52206 140492 213235 83733 255566 131817
9158 131817 204619 203944 139879 234981 244248 206234 128037 164171 228181 304163 161511 247174
9146 247174 171513 268052 151313 353429 246496 301241 229790 294718 244683 287971 292376
9135 292376 429456 321525 355309 314804 372068 410697 385966 386012 419846 538193 348592
9124 348592 410607 384633 434968 406383 347272 429285 492112 482372 603406 569637 527671 600229
9112F00229P7098j8181L8229J04324m5444M0555P0160M7637Q6555P7783N8938
9101A137883P7938K73078J65125J28023L54084L31919N39459Q31613Q78464O59017
9091E376603R39251R38204J098447J752130K488644J128951M6267j11085n02960
9082A3154452o40336p36813j240542j414407j060600r62470j276944q27740p41864
9073D252736p25689q39155n62230l33704l01920j34675k04124j25998j69101k09775
9063F46365j05555l2965q2949J7706J5125p4775p1653P3361q3893M9653l7732
9052C12688R6137j40861k8432R4054q4966L0663n1608N3530l5681L5783j30150
9041A51157o85N6359J8583q483L8092n6646j257O9677n4582m7879j3198L4110
$$ plain form
9112 600229 677327 659146 697375 801699 756255 796810 866970 914607 1001162 1078945 1137883
9101 1137883 1215821 1488899 1654024 1782047 2136131 2468050 3007509 3839122 4717586 5376603
9091 5376603 6315854 7254058 8352505 10104635 12593279 13722230 13768497 13657412 13154452
9082 13154452 12514116 11777303 10536761 9122354 8061754 7099284 5822340 4994600 4252736
9073 4252736 3527047 2687892 2125662 1791958 1490038 1355363 1151239 1025241 856140 646365
9063 646365 540810 507845 424896 442602 457727 382952 311299 384660 300767 350420 312688
9052 312688 408825 267964 239532 333586 248620 279283 227675 281205 245524 281307 151157
9041 151157 150472 206831 225414 216931 255023 198377 197120 266797 212215 164336 151138 185248
9029A85248q5246L4888l7142K3385j6079L824Q3950j9830K1710q2548P3441r3101
9017I2500m705N1105q4606Q6567r8989N4050m3477K3717N6763m4427k097k0805
9005F5596j580Q0580k4126o8759r788j14825J48665O9299m348n3146k1281j460
8993F4827O187J645m1255R204O5018r179l4873K0497k554l3395o6658J48563m2809
8980H5218l9613Q5423j10061Q2334q8384M4124J6489o1377j5995L0553J3126M6474
8968H8311q224K9516q0484m5345J02663j2733q5466N1784P481q0152O1406J9074
8956D7831L1666K8524j04611J20140j45325J06488n7420J7431k6844N6984o140
8945F8724k7421o9612J32573n5271K2651j05092R8640N3445k0326j50969N5193
$$ plain form
9029 185248 100002 134890 97748 121133 105054 108878 192828 172998 194708 112160 185601 92500
9017 92500 87795 138900 54294 140861 41872 95922 52445 76162 132925 88498 86401 65596
9005 65596 64016 144596 120470 51711 41923 -72902 75763 145062 140714 87568 66287 64827
8993 64827 71014 72659 31404 40608 105626 96447 61574 82071 79517 46122 -20536 128027 85218
8980 85218 45605 131028 20967 103301 14917 59041 75530 14153 -1842 28711 41837 88311
8968 88311 80087 109603 29119 -16226 86437 73704 -11762 40022 47503 -32649 28757 47831
8956 47831 79497 108021 3410 123550 -21775 84713 27293 44724 17880 74864 68724
8945 68724 41303 -28309 104264 48993 71644 -33448 65192 118637 98311 -52658 2535
8934B535J04976p1879P762q7940J29862o6849O7303j07384P5599o5945P9352m6458
8922B0934p4125J32114l1581p0065j238N5434q590P459J03097j09129O5748j00944
8910a0886J87319j67031n3694J29235p3112n0680M222L1874o360k6658J01856
8899F6085Q1378o0647o7754J21560m6106n9890q5679P2105q5506P3678j3533p4488
8887g8797J43891k751K5935J3274j12848L5986K1830l8387k9167R044L7782J7653
8875D3445k8675K333M9423J0902k5754j7734r509L2828l5547O0412l6401R758
8863E5481n083J6294j4208J8161j00718R0309n8863M7120n8333J1046K2542l103
8851B0645k2723P7064l7726j7381m2863Q4245n6236L1457J2887l0063K1824p02
$$ plain form
8934 2535 107511 35632 43394 -44546 85316 18467 85770 -21614 53985 -11960 67392 20934
8922 20934 -53191 78923 47342 -22723 -23961 31473 22883 30342 133439 24310 90058 -10886
8910 -10886 176433 9402 -44292 84943 11831 -38849 -34627 -2753 -9113 -35771 66085
8899 66085 147463 86816 19062 140622 94516 34626 -51053 21052 -64454 9224 -4309 -78797
8887 -78797 65094 62343 88278 101552 -11296 24690 46520 8133 -21034 -11990 25792 43445
8875 43445 14770 17103 66526 77428 51674 33940 24431 57259 21712 82124 45723 55481
8863 55481 50398 66692 52484 70645 -30073 60236 1373 48493 -9840 1206 23748 20645
8851 20645 -2078 74986 37260 19879 -22984 61261 5025 36482 49369 19306 41130 40428
8839D0428M2738l1445L7251j04674N4238M6672o7873l3515Q1492K0132q371n4883
8827B2190L18k4573P7725K3418j20867P9716k4859N3663P519m0999Q906J5489
8815G7646L0930q8430M3593j06308q212R1209m793M2871p5642K6760L3130p924
8803E4830k8786J9294k2384q561J694q1557L1310k8686Q3984j5997Q2119L2434
8791A19694n8528o3534m484Q5178J7076j15057L0647n2872R774J29705r7907M195
8779C887K755n8940K4378N9944o8539L6784M2421l5217O7598k1183O7481M0423
8767A61792j43774l4388n468j3007J43814m7041n9454O1949m547j8741J018l9807
8755B346R0460k2617j5273m3063N2265o0671Q3919m6850m2464J2971n4597J7728
$$ plain form
8839 40428 83166 51721 88972 -15702 38536 85208 17335 -16180 65312 85444 77073 22190
8827 22190 22508 -2065 75660 99078 -21789 57927 33068 86731 94250 53251 62157 77646
8815 77646 108576 20146 63739 -42569 -50781 40428 35635 78506 2864 29624 62754 54830
8803 54830 26044 45338 22954 14393 16087 -65470 -34160 -62846 21138 5141 87260 119694
8791 119694 61166 -2368 -6852 78326 95402 -19655 10992 -41880 -32106 97599 -308 3887
8779 3887 6642 -52298 -27920 32024 -36515 269 42690 7473 75071 53888 121369 161792
8767 161792 18018 -16370 -21838 -34845 108969 61928 2474 64423 59876 41135 42153 2346
8755 2346 92806 70189 54916 11853 64118 3447 87366 40516 -1948 11023 -43574 -25846
8743b5846R7355l1097M4640q7088j5015m4438L7772p1434J59011K434j22318L8363
8731a7661R7259n1150j243o0097Q6399K8851r6899M152J35948r5008p867L5344
8719E8028k1430J2687p840m4064k1400O9048j21792Q5644L1256n0739J34672j82046
8707e7976R0198L760J26891j48280o3127Q4796l7391M659k0930N5119J0849J7028
8695F5596j1964N9282r4477j4878J883M5478M8070k5899q9847j9923N9798K0800
8683D3919q7573Q4157j2784o016M5169k5284P9244j28515M764R8589n7832J6892
8671E4730O9812o7985J42848m3986k7000o9559l9259L0221Q9656Q313j37052O1915
8659G2654k3071L3343K0966j6588l3980j4573m940P8998p8252m5744l1719M3950
$$ plain form
8743 -25846 71509 40412 85052 -2036 -17051 -61489 -23717 -95151 63860 66294 -56024 -17661
8731 -17661 79598 28448 27205 -32892 53507 82358 -14541 -10389 125559 30551 22684 58028
8719 58028 36598 49285 41445 -2619 -24019 45029 -76763 8881 40137 -10602 124070 -57976
8707 -57976 32222 35982 162873 14593 -48534 36262 -1129 3530 -17400 37719 48568 65596
8695 65596 53632 112914 18437 3559 5442 50920 98990 73091 -16756 -36679 23119 43919
8683 43919 -43654 40503 27719 21703 66872 41588 120832 -7683 -2919 95670 37838 54730
8671 54730 124542 56557 199405 155419 128419 58860 19601 49822 139478 147791 10739 72654
8659 72654 49583 82926 103892 87304 53324 38751 33811 112809 34557 -11187 -42906 1044
8647A044K9656P8670J6192q4413q2883J17359j41706J23208J0295j00321N3842
8636B0943J0563M4528j35981r147K57421j23272l2927l3517q113R5617q9028O4996
8624F2083k8659M8768r6406R8413l3007k0911J3110n2205R1172J037K8093j71657
8612f0169J72617m6521n7445L2j0765J3891r14k4191O346J11672j27850N010J02337
8599H4050k313r3400m2917N9215O6898j1924N955l9635l4471N1600M0702j3135
8587G0625L3256m3610r0119n9506J33618j1421m7513N7225M4911p1119O6630n2381
8575C0596n1957j8210L8311r655q238J58842j38990l6972k056L9190J6600l4887
8563a7426K2346n8966J20350n322j06984Q0214k2937o601J12573q5018k9202N4778
$$ plain form
8647 1044 30700 109370 125562 41149 -41734 75625 -66081 57127 67422 -32899 20943
8636 20943 31506 76034 -59947 -69094 188327 65055 32128 -1389 -9502 86115 -2913 62083
8624 62083 33424 82192 -14214 84199 51192 30281 43391 -8814 82358 83395 111488 -60169
8612 -60169 112448 65927 8482 8514 -2251 11640 10726 -13465 -7119 104553 -23297 -18287 84050
8599 84050 81737 -11663 -54580 4635 71533 59609 65564 25929 -8542 43058 83760 70625
8587 70625 103881 60271 -29848 -89354 44264 32843 -14670 42555 87466 16347 82977 30596
8575 30596 -21361 -39571 -1260 -10915 -19153 139689 699 -36273 -38329 861 17461 -17426
8563 -17426 4920 -54046 66304 60982 -46002 34212 11275 4674 117247 32229 3027 57805
8551E7805k980n42j5609K6711k1831N5029k6341p4150J29441n2085p9887J5736
8539A1297M754M8754r9127P6968r1537J15957j427j03554J31286l99085L01997
8528c717j4023N0431L7703l8375l9272n9896N8487K5433l956L0724L1249j05627
8516c0839J08038o787m485q6899j3895L0719o3N6761L2101K0016o5422k9660l4581
8503b4996Q9915K6493n9137J42515q6336o1095M4938M4002q9909M4951l5304j931
8491C4106K8684L172m3016J0081N8897q8555P7319r2635N8800j7407J9815Q9025
8479A38286r2921n8886L5586L8936j5176k1107O2189j04162J00451j9724l0313
8468C3159j4114L113q4919P6345Q6830K0965j33455N3587m929P4960k607q2298
$$ plain form
8551 57805 54825 54283 38674 65385 43554 98583 72242 -1908 127533 75448 -4439 11297
8539 11297 16051 64805 -34322 42646 -48891 67066 65639 -37915 93371 -305714 -3717
8528 -3717 -17740 32691 70394 32019 -7253 -67149 -8662 16771 12815 43539 74788 -30839
8516 -30839 77199 70412 65927 -20972 -34867 -4148 -4211 52550 84651 104667 39245 9585 -24996
8503 -24996 64919 91412 32275 174790 88454 27359 72297 116299 26390 71341 36037 34106
8491 34106 62790 65962 22946 33027 91924 3369 80688 -11947 46853 29446 49261 138286
8479 138286 45365 -13521 22065 61001 45825 24718 86907 -17255 83196 63472 33159
8468 33159 19045 22158 -62761 13584 100414 121379 -12076 41511 36582 111542 108935 26637
8456B6637J0562J5836k8154R873Q2626o2222L8717m3068J39482j84989Q9399l0076
8444F4623P901l1444P365l0119L2250j527L5372m5503L7227m4067J0213m3305
8432a014Q7488p8127R654m4137K8312k253J03628k617J5699O877j32282j772L9505
8419B8961l4284R6281q7024J15947o3623j3702n2603J2862L4801k6059P3897j16778
8407c1324J12333k7158J0949O0143k5312q8279M3389P39k4206O555N3860k5320
8395F6369K8307p2737J7549J1758j5920j0546k7973J5054k8629L1825L0872m905
8383D1024K5917M9197j0207l5321K1976n3344L4492n0433Q3576j63962N9899O2290
8371F5104j6466m4636R7945o2974k1904Q3735m4568k3469K0591M7596l5521m2145
$$ plain form
8456 26637 37199 53035 24881 34754 117380 55158 93875 50807 190289 5300 94699 64623
8444 64623 72524 41080 48445 18326 50576 49049 84421 38918 76145 32078 42291 -1014
8432 -1014 86474 8347 18001 -26136 2176 -77 103551 100934 116633 123510 -8772 -10544 28961
8419 28961 -5323 90958 3934 119881 56258 42556 -10047 2815 37616 11557 85454 -31324
8407 -31324 81009 53851 64800 124943 99631 11352 54741 55480 31274 37829 91689 66369
8395 66369 94676 21939 39488 51246 35326 24780 -3193 11861 -16768 15057 45929 41024
8383 41024 66941 116138 105931 70610 92586 39242 73734 23301 106877 -57085 2814 65104
8371 65104 48638 4002 101947 38973 17069 100804 56236 32767 53358 100954 65433 23288
8359B3288l4591L883J10420k7497l4049K2341J48507j43028M0289p5720o2293
8348b8450p613J45061p6926M5646j333k3247M9101m9691l5684Q6182r0661j4963
8336b578N2258O5346j49953L1749J24245r6189Q5767j44326N4077m6097l280L2746
8324C765J0802J0505j8163q6385Q3957J31201p8400K1593q8286P7312p3208J01989
8312I6682o9219L1130L9641J2670l9300n057k3630J4015M3571o8049O4769m9302
8300D7921j0373M4151j19918Q4782K6306M4461r5240J34921r7515K0017q5116
8289e603J41759l9833P0142j60884N0869r5861K8430N5997o224j8201J01071n3126
8277F8536L1972q3476J5359M2771J8727M004l2376K5352j01615K9488j3559l6822
$$ plain form
8359 23288 -11303 -7420 103000 75503 41454 63795 212302 69274 109563 33843 -28450
8348 -28450 -36063 108998 32072 77718 76385 53138 102239 52548 16864 103046 12385 -2578
8336 -2578 49680 115026 -34927 -3178 121067 24878 110645 -33681 20396 -25701 -28981 3765
8324 3765 14567 25072 6909 -79476 4481 135682 57282 78875 -9411 67901 -5307 96682
8312 96682 27463 58593 98234 110904 71604 66547 42917 56932 100503 32454 97223 47921
8300 47921 37548 81699 -38219 46563 72869 117330 22090 157011 59496 79513 -5603
8289 -5603 136156 96323 166465 5581 56450 -39411 -10981 45016 38792 20591 121662 68536
8277 68536 100508 17032 32391 75162 93889 97893 65517 90869 -10746 18742 5183 -31639
8265c1639L270K2636J12834p7378p543l3323P8252k7314p2590j0058J08307L3998
8253I9452n0948M2331j6167L1357q5781J45294j28205L732n6514P3592J5152k4032
8241D9263K8747k6040j9006L7644k9143L2426n7655O4458m3192M4207j9618o3687
8229a596l0292K8241j4584O4549M3237n784j01082L8854j8129J25153M2448o8425
8217A02590J8974p0422J1521O7223j11578L6338l5572R3804P763M5785j47234
8206A9192N4745j04135Q9605j2568n6380N3896Q911L9063J06159k27062P7707
8195D9133m8153N4393P1594k33793K77742j34074M3172n0162N4531O7984p2167
8184H0200m655o9207M5513j247P6215k3015r2831j4017P1952M5364L7917j07187
$$ plain form
8265 -31639 -28369 -5733 107101 29723 22180 -11143 67109 39795 -32795 -42853 65454 99452
8253 99452 48504 90835 74668 106025 20244 165538 37333 41065 -15449 58143 73295 49263
8241 49263 78010 51970 32964 70608 41465 73891 16236 80694 37502 81709 62091 -1596
8229 -1596 -31888 -3647 -18231 46318 89555 83771 -17311 21543 3414 128567 171015 102590
8217 102590 121564 51142 62663 129886 18308 54646 19074 112878 120641 166426 19192
8206 19192 73937 -30198 59407 46839 -9541 44355 53266 92329 198488 -28574 49133
8195 49133 980 55373 126967 -106826 170916 36842 80014 29852 84383 152367 80200
8184 80200 75545 6338 51851 50604 126819 103804 10973 -3044 68908 114272 152189 45002
8172D5002l5853n5034J87021q3680o0911J06689K1661j08783j1729J18049j46597
8161b4165P0076K9264L7112j29467J30745N9067j39081k8778N1365p3765K0158
8150B531j9224P8708L4315J898J7076M275k9950r8389P1633Q8931K0566P291K1551
8137B01212j18138l6796N1954j29527J81317j54613M3633l6837P6658J6347m5430
8126D9780l2481J09204p0414P948J9165K2272l5882J02178r4905j6976O0922p7152
8114D3659j2505O3649m2256K1220l7371J17523j07655Q5503n1964N1602j28667
8103B738j6281J65404p2053j4469K0141o183J01082r0064o9123Q0064p3611P6427
8091A04072L4632r3038j8803o5084K7188M4787j1179L6555O2070j07478r872J13672
$$ plain form
8172 45002 9149 -45885 141136 57456 -3455 103234 124895 16112 4383 122432 -24165
8161 -24165 45911 75175 112287 -17180 113565 172632 33551 4773 56138 -17627 2531
8150 2531 -16693 62015 96330 98228 115304 119579 89629 -8760 62873 151804 172370 179661 201212
8137 201212 83074 46278 98232 -31295 150022 -4591 39042 2205 78863 95210 49780
8126 49780 17299 126503 56089 64037 83202 105474 69592 171770 76865 59889 120811 43659
8114 43659 31154 94803 52547 73767 36396 153919 46264 131767 79803 131405 2738
8103 2738 -13543 151861 79808 65339 85480 79297 180379 90315 21192 101256 27645 104072
8091 104072 138704 45666 26863 -38221 -11033 33754 22575 59130 121200 13722 3850 117522
8079A17522o1259n0744l298N8035M785N8263n8641N1514o2963O1874N3649l9295
8067A29442r7068J1540J17612l4027o730r9729O7343l5133K8710M8062J8835p9571
8055F9286o076J1865k1909O5617m4598p4705Q7126o2652L5085N2193n1753R3086
8043A52565j47997K147P0322q9997Q8688n2992P1581o0013l2257Q1704N0748j8487
8031A16012o7289P34J36085o8794Q3354j61403j4280K2198p6728J06198J601O1603
8019A39291p3457Q2406p2114J1557K8370R0717k01301J69428j59774J27164j36567
8008E720J47528j3835l7293j2222o5192Q7892k2344K2340l0677n6430J34836j77013
7996a6690J43629J5179k16584Q8053R8265p1589R7750j05107J6199K3369o372
$$ plain form
8079 117522 56263 5519 2221 60256 65041 123304 64663 116177 53214 115088 168737 129442
8067 129442 32374 43914 161526 127499 120769 21040 88383 53250 81960 130022 148857 69286
8055 69286 63210 75075 53166 118783 74185 -520 86606 23954 59039 111232 59479 152565
8043 152565 4568 6715 77037 -12960 75728 22736 94317 34304 2047 83751 134499 116012
8031 116012 48723 49457 185542 116748 200102 38699 24419 46617 -30111 76087 77688 139291
8019 139291 65834 148240 76126 87683 116053 206770 5469 174897 15123 142287 5720
8008 5720 153248 139413 102120 89898 24706 112598 90254 112594 81917 25487 160323 -16690
7996 -16690 126939 142118 -74466 13587 111852 40263 138013 32906 49105 72474 66102
7985F6102J0288L6489o0967J79361j58091L8440j8516n2730n514K6861j0629m9750
7973A344J35808j61173Q8013P8457j22643J15127m9654j7641L6999j1462L073
7962I6248M9339j03243K7560J13629q8584j2433K4874o6155R2158j32212J65848
7951A67029r0127k9987J50698j86809R4772J17927j30558P2316r3710R9983N5909
7940B27443p9107o4362J26386r4945N907M1138j8990j55460J72780o7285J10143
7929B03648k0406n6966L0025o9354M9050j7896o4282L3079k444O3626r5758Q5043
7917A37365K0017m1250k6390M6975m3068M4639J1205k9019P525K132j9702L3586
7905A44015o3165M9995R515l8794q6962J38065J7464n349m1311R346n4439K1554
$$ plain form
7985 66102 76390 112879 51912 231273 73182 111622 93106 40376 34862 61723 51094 1344
7973 1344 137152 -24021 63992 142449 19806 134933 85279 67638 104637 93175 96248
7962 96248 145587 42344 69904 183533 94949 82516 107390 41235 133393 1181 167029
7951 167029 76902 46915 197613 10804 105576 223503 92945 165261 71551 171534 227443
7940 227443 148336 83974 210360 115415 121322 162460 143470 -11990 160790 93505 203648
7929 203648 183242 126276 156301 86947 135997 118101 53819 86898 84454 148080 52322 137365
7917 137365 157382 116132 89742 136717 93649 138288 149493 120474 127999 130131 110429 144015
7905 144015 80850 130845 140360 101566 14604 152669 170133 164784 123473 132819 78380 99934
7893I9934m5074R8001n150j25587K06142n2600J6996j15666K4880k4872N1055
7882A28059o3665R9489q2390O4383j9899j34354J16138l2253j5307P3628p7186
7871E6643P4119m7073J23358q3096m5412Q7568K9006n7643K0327m8331n760j6391
7859H7315M8739j13743P3257j4632k41449M57237j51828L8868o0107Q9828j04488
7848A08997M0264Q8478l4530r3849J21396q6100K0368p3586O4863L1093n3191
7837A34203k1444P6845j47522N8159r2485J10130N3270k2225Q2760j02061O4611
7826A94241p0884J18031m7949p1793K0627J23111j62491l9981N1121N3082J9046
7815A86161n1533P2085l240L0734p5275j5778k0468j4722R0770J0041J5733p6851
$$ plain form
7893 99934 54860 152861 147711 22124 228266 175666 192662 76996 101876 77004 128059
7882 128059 64394 163883 81493 145876 125977 -8377 107761 75508 60201 133829 56643
7871 56643 130762 83689 207047 123951 78539 166107 195113 137470 157797 109466 103706 87315
7859 87315 136054 22311 95568 80936 -160513 296724 144896 183764 123657 213485 108997
7848 108997 149261 237739 203209 109360 230756 144656 165024 91438 156301 187394 134203
7837 134203 112759 189604 42082 100241 7756 117886 171156 148931 231691 129630 194241
7826 194241 123357 241388 193439 121646 142273 265384 102893 62912 114033 167115 186161
7815 186161 134628 206713 203473 234207 158932 143154 122686 107964 198734 208775 224508 147657
7803A47657J03101o1226p520J56823j97006J58299j27364o8608K3328M5673R8776
7792B71933r8500J59912j73522j2614m2279M7122K6069M9983r9342R1521p8680
7781A41603Q2379k5230L7899J01918j44998J9399L0946l8365K3072J17411j19552
7770B26482L767P465R2917k1623n6652m9699M6492j6837M3655Q1906p2451q8596
7758A96826j560M7795R979P87N7846k7719m6683P6732l0904k0526j8701k5283
7746B18589J3397J08691o6921N2036N4127j65865M4935P3611p455P3460j6055
7735C82550j7322P8987j6165k9658m578K0638Q0566j01784J28122j01495M3529
7724D63390N7900l4013j5363J1210K7079q7267N1919J43458p8774q1538l681K5704
$$ plain form
7803 147657 250758 189532 182012 338835 141829 300128 172764 104156 127484 173157 271933
7792 271933 173433 333345 159823 147209 104930 152052 178121 228104 128762 220283 141603
7781 141603 223982 198752 236651 338569 193571 212970 243916 205551 228623 346034 226482
7770 226482 230249 237714 330631 309008 252356 202657 249149 232312 275967 357873 285422 196826
7758 196826 195266 243061 253040 253827 311673 283954 237271 314003 283099 262573 243872 218589
7746 218589 231986 340677 273756 325792 379919 214054 258989 332600 325145 398605 382550
7735 382550 365228 444215 428050 398392 393814 414452 495018 393234 521356 419861 463390
7724 463390 521290 487277 471914 483124 510203 422936 474855 618313 539539 458001 454320 480024
7712D80024k7999Q4131m5346R7408l9826r1483J07214o7363P6432Q8125r7564
7701E63753l1939P7014j1269J05344m3772J7917p89P4802J78233J8174J13116
7690A060584P9054N6720K24183P1997J21180R7110M4723J96727N4171q7515N3381
7679A972315j9364j00732j41260r4381j03996j23620j34619j49985M5876j06688
7669A043546k54257p15k0725j76363Q1552N783k0415o4321l4587N0327N263J08478
7657G23566j00897k5010J0110O0010N1861p4201o1982R1938O8813q4086L2070
7646F92192j2060l5646m4043O9088K2922n2522K7823j5100j48208J66843j61349
7635E09940J00018j5585n3414J42037j46699Q2381N468K0803l6360k1965k9536
$$ plain form
7712 480024 452025 536156 490810 588218 548392 456909 564123 496760 573192 661317 563753
7701 563753 531814 608828 597559 702903 659131 677048 676259 751061 929294 947468 1060584
7690 1060584 1139638 1196358 1420541 1492538 1613718 1710828 1755551 1952278 2006449 1918934 1972315
7679 1972315 1952951 1852219 1710959 1616578 1512582 1388962 1254343 1104358 1150234 1043546
7669 1043546 789289 788574 767849 591486 673038 678821 658406 594085 559498 609825 615088 723566
7657 723566 622669 597659 607769 667779 719640 645439 583457 675395 744208 660122 692192
7646 692192 680132 644486 600443 669531 692453 639931 667754 652654 504446 671289 509940
7635 509940 609958 594373 540959 682996 536297 618678 624146 644949 608589 586624 557088
7624E57088P6442l3145M6570n389k9980o4702J41919j2644J4102J11233n4347
7613G47147m9483P9090J4008j17970J29179O968l6188P7009k6231o6554j6481
7602G40494J24158j83613M9767J1515k0690N3689J11701j62968J03674O4142j4177
7591H77692M2183p6535L6905M1182J3383r952M761L9525M6249l501o9022Q3006
7579A025876j56111J21379l0894N9406p465o0226J6213K7141j25206J70501m9769
7568I90845o643Q9228N449k8920L8853k7374r1839Q0832Q3931J6219q1731K2553
7556A091403J6532j8036k5382R8818r6493K7236o773j0627P127o8854P8768k4437
7544A069282L7883J7665L204q0009j2208M8977l5745O0876L8474o3514k1435O3245
$$ plain form
7624 557088 633530 600385 646955 641566 611586 546884 688803 676159 690261 801494 747147
7613 747147 697664 776754 790762 672792 801971 808939 772751 849760 823529 756975 740494
7602 740494 864652 681039 730806 742321 721631 775320 887021 724053 827727 891869 877692
7591 877692 919875 843340 880245 921427 934810 924858 929619 969144 1015393 1011892 942870 1025876
7579 1025876 869765 991144 960250 1019656 1012191 951965 968178 995319 870113 1040614 990845
7568 990845 984202 1073430 1078879 1049959 1088812 1061438 969599 1050431 1134362 1150581 1068850 1091403
7556 1091403 1107935 1089899 1064517 1163335 1066842 1094078 1087305 1076678 1083805 1014951 1093719 1069282
7544 1069282 1107165 1124830 1128034 1048025 1035817 1084794 1049049 1109925 1148399 1084885 1063450 1126695
7532A126695K5642l935Q2084P385q0773K35226j1835n1996J31867K1248J135Q2096
7520A564839N4626N6117q911P1501J20243o617q0009R5893J3686N8419O305K6968
7508A973060Q7107j4835O2661o1842M6298L8020j6892K2749R7168r907K9216J21236
7496B374039M5434j5336k460N8890P0122M3624R2555k5869J48356n9839M5838
7485B775354J11268p2637J21640J5676J28794k4674N7322M415J00093m9683Q9987
7474C257555K2337J44234O8398M4012K2512J11536Q3687P3224J12322m5817L3832
7463C927832K29542P0779J21335P0293N9438J29755J02721J24468J08490L24696
7453E269349R035J78045O7991L12230P5348K17650J61111R3135K14927K49486
$$ plain form
7532 1126695 1152337 1148402 1230486 1237871 1157098 1392324 1380489 1328493 1460360 1481608 1482743 1564839
7520 1564839 1619465 1675582 1666671 1738172 1858415 1851798 1771789 1867682 1881368 1939787 1946092 1973060
7508 1973060 2060167 2045332 2107993 2046151 2092449 2130469 2113577 2136326 2233494 2223587 2252803 2374039
7496 2374039 2419473 2404137 2401677 2460567 2530689 2574313 2666868 2640999 2789355 2729516 2775354
7485 2775354 2886622 2813985 2935625 2951301 3080095 3055421 3112743 3117158 3217251 3167568 3257555
7474 3257555 3279892 3424126 3492524 3536536 3559048 3670584 3754271 3827495 3939817 3894000 3927832
7463 3927832 4157374 4228153 4349488 4419781 4479219 4608974 4711695 4836163 4944653 5269349
7453 5269349 5278384 5456429 5524420 5836650 5911998 6129648 6290759 6383894 6598821 6848307
7443F848307J82411K42072K09830K29169K32119K33655K11377L51089K64310K68363
7433I272702L17784L07653J69967L49459L90034L11496M15213L29552N49600M32400
7423A2845860M90328O33461O69276O41454Q51971R04101Q81365J060680J177107
7414B0155603J312826J559549J523757J794250J933898K282418K648637L010252
7406C6221190L631861M226066N122178N965615P240402Q391109J0278046J2246499
7398I3322966J4331503J6432260J7971563J8992433J9863709K0991682K2296758
7391B24202874K2786687J9757043J2673183M467028k474021p918322j2751279
7384B60743193j6562361j9550812k1002856k1033078k0509287j9637435j8134076
$$ plain form
7443 6848307 7030718 7272790 7482620 7711789 7943908 8177563 8388940 8740029 9004339 9272702
7433 9272702 9590486 9898139 10068106 10417565 10807599 11119095 11534308 11863860 12413460 12845860
7423 12845860 13336188 13969649 14638925 15280379 16132350 17036451 17917816 18978496 20155603
7414 20155603 21468429 23027978 24551735 26345985 28279883 30562301 33210938 36221190
7406 36221190 39853051 44079117 49201295 55166910 62407312 70798421 81076467 93322966
7398 93322966 107654469 124086729 142058292 161050725 180914434 201906116 224202874
7391 224202874 246989561 266746604 279419787 283886815 281412794 273494472 260743193
7384 260743193 244180832 224630020 203627164 182594086 162084799 142447364 124313288
7377A24313288j6623701j5141503j3559351j1452790r484760p907073o513967
7370D3630143n421572m754012m208331l415239k823252k435424j920230j584041
7362A7068042j403683j050629j017285q84091p04307p36898o70345m90755n14443
7353I595606m44819n06672l97294m09041k67591l59726k88731l83627k14093l39020
7343E984992j99983k59010k00936k22380j74568j30492k00083j68087p8372j35408
7333D215673k64680r9383j64612m9058j31201o3929j60545j39476J0030j23918
7323C028901j76091J40829j28694j23026k3443j02452o1866p2353m544r7670q9297
7312B290294j054o7782j31459n6232r7351j30839N0335m4971n9986o8261j7127
$$ plain form
7377 124313288 107689587 92548084 78988733 67535943 58051183 50144110 43630143
7370 43630143 38208571 33454559 29246228 25830989 23007737 20572313 18652083 17068042
7362 17068042 15664359 14613730 13596445 12712354 12008047 11271149 10600804 10110049 9595606
7353 9595606 9150787 8644115 8246821 7837780 7570189 7210463 6921732 6538105 6324012 5984992
7343 5984992 5785009 5525999 5325063 5102683 4928115 4797623 4597540 4429453 4351081 4215673
7333 4215673 3950993 3851610 3686998 3637940 3506739 3442810 3282265 3142789 3152819 3028901
7323 3028901 2852810 2993639 2864945 2741919 2718476 2616024 2554158 2481805 2477261 2379591 2290294
7312 2290294 2289240 2221458 2089999 2033767 1936416 1805577 1855912 1810941 1750955 1682694 1665567
7301A665567k27336N3641k6644k7268j80658P8717P5550j03966j36304P5853k5987
7290A221165q2359k0205o2518o2356O6899p3136k2488o3261L0584j5728j23189
7279G93408J50072j28221l5406Q288M7307q3286J9168j10864m0502l248P8480
7268F95196n5754j68214J03404j3695l4652m4937J6669p2937q225J12237j8474
7257E10618P1495K551k6029P3823j0591l0226o767q216j0027N982L0303K4557
7245F27473P0477k4375L7028r4923J6495o6414O3391j01779K74N8279j5846p3113
7233D96967J10682j93571J00069l6157l2243r1264M2318k5422j11293J38578r7734
7222C00930M501M3190j02586J9540n6181P1081j10831J7149J8905r5763J35368
$$ plain form
7301 1665567 1438231 1491872 1465228 1437960 1257302 1336019 1411569 1307603 1171299 1247152 1221165
7290 1221165 1138806 1118601 1056083 993727 1060626 987490 965002 901741 932325 916597 793408
7279 793408 943480 815259 779853 788141 835448 752162 771330 660466 619964 616716 695196
7268 695196 639442 471228 574632 560937 526285 481348 498017 425080 416855 529092 510618
7257 510618 582113 584664 558635 632458 621867 591641 584874 576658 566631 572613 602916 627473
7245 627473 697950 673575 710603 615680 632175 565761 629152 527373 527647 585926 570080 496967
7233 496967 607649 414078 514147 477990 445747 354483 396801 371379 260086 398664 300930
7222 300930 305431 348621 246035 265575 209394 280475 169644 186793 205698 109935 245303
7211B45303k2712L4753j9533q2741J6603r478k9999O0086j1928J57276l01079
7200C6551Q1263N7769K8126n914l7644Q2126l8214N3751N8286j54526N4505M7978
7188B64057p8065M7091Q5093k0659n6743j23061O799P274n34N0756k5673r7967
7176E8368K8202k887J07381j540j09765K9791R02L9895R1062p1835J30177k39119
7164F0632J42054P371P5889l5964l5254O6559j510K0691K4044m5380J39102l8804
7152C79430M3487q769J50112k5145l2720Q7696N8783q6340O2506M2994K8583j1716
7140F88901r864k1172n7043M8076P323o1153k2599j7282j0909P731N957k3770
7128E34196J00046K4846q0209j0702Q2236j01334Q010K3727J466O0236r186k6490
$$ plain form
7211 245303 222591 257344 237811 155070 171673 162195 132196 192282 180354 337630 36551
7200 36551 117814 175583 203709 197795 160151 242277 204063 257814 316100 161574 216079 264057
7188 264057 185992 233083 318176 297517 240774 117713 124512 131786 131252 182008 156335 58368
7176 58368 86570 83683 191064 189524 79759 109550 110452 150347 241409 169574 299751 60632
7164 60632 202686 210057 285946 249982 214728 281287 279777 300468 324512 279132 418234 379430
7152 379430 422917 414148 564260 539115 506395 594091 652874 566534 629040 672034 700617 688901
7140 688901 679037 657865 600822 648898 656221 595068 572469 555187 544278 552009 557966 534196
7128 534196 634242 659088 578879 568177 650413 549079 557089 580816 582282 642518 633332 606842
7116F06842R5919o9827O1860K2064o7307J56795n5424L2057Q5476O6852o990R1921
7104A020238J94856J09443R3537J22169J58860J11062J33299J45439J63072L7963
7094B289938J25889O8529N3504p6818k485o3719j07799P729j20844j54940L6714
7083B055698j75118p1320J8421k39291n672p6760j7587q2728q4576k5809L100
7072A298358j15j04006j1256m8437P2820O6018L6469k7979N987J00387Q8342P1841
7060A548429K03000J57665O576K01763J69275K60750L28252J36274K2095j5425
7050C018654Q9170j23251j10693j08537j19448j89827j15348j10229j34431k8438
7040B067622j02781l8358k06013q659O4134J6701l5882R8157o5201L4154J31669
$$ plain form
7116 606842 702761 632934 694794 716858 649551 806346 750922 782979 868455 935307 928317 1020238
7104 1020238 1215094 1324537 1418074 1540243 1699103 1810165 1943464 2088903 2251975 2289938
7094 2289938 2415827 2484356 2537860 2461042 2458557 2394838 2287039 2294768 2173924 2018984 2055698
7083 2055698 1880580 1809260 1827681 1588390 1582718 1505958 1488371 1405643 1321067 1295258 1298358
7072 1298358 1298243 1194237 1182981 1134544 1207364 1273382 1309851 1281872 1287859 1388246 1476588 1548429
7060 1548429 1751429 1909094 1915670 2117433 2286708 2547458 2875710 3011984 3034079 3018654
7050 3018654 3107824 2984573 2873880 2765343 2645895 2456068 2340720 2230491 2096060 2067622
7040 2067622 1964841 1926483 1720470 1711811 1775945 1792646 1756764 1854921 1789720 1823874 1955543
7029A955543o5734J20942m0831m5041q8900O958j16381r0844m2095K1759j48411
7018A466965P855j28108J49974j03776k6218m0035J68487O7953R9235L0301q9899
7007A602734j787j3618l0282k249j19570M2116o596j16827O3213K0124O1511l3030
6995A465739P1720N4747J02695o1772r6857K2016Q0203j48216P0872J3167j0417
6984A563897j10320J62828j18425Q2967K8651J35609m4861J94479J04845k909
6974A996761N4124J16447j07361k9682R7602k5987J48830N2240R415R2148J8739
6963B423276j7605R2105n4341n0218j15628j29543n5342k43346q0199p4036k05109
6952A490014r8109n8516j15326o9950K3056j33107L8207o239J2745j9321p261
$$ plain form
7029 1955543 1889809 2010751 1969920 1924879 1835979 1842937 1726556 1635712 1593617 1615376 1466965
7018 1466965 1474820 1346712 1496686 1392910 1366692 1326657 1495144 1563097 1662332 1692633 1602734
7007 1602734 1600947 1587329 1557047 1554798 1435228 1477344 1470748 1353921 1417134 1437258 1498769 1465739
6995 1465739 1537459 1592206 1694901 1633129 1536272 1558288 1638491 1490275 1561147 1574314 1563897
6984 1563897 1453577 1616405 1497980 1580947 1609598 1745207 1700346 1894825 1999670 1996761
6974 1996761 2050885 2167332 2059971 2030289 2127891 2101904 2250734 2302974 2312389 2404537 2423276
6963 2423276 2405671 2497776 2443435 2393217 2277589 2148046 2092704 1849358 1769159 1695123 1490014
6952 1490014 1391905 1333389 1218063 1148113 1171169 1038062 1076269 1070030 1082775 1063454 1056193
6941A056193K1035n0164J04442j05421O2633J5850n1880J16949j4545m5481J29599
6930A239210J7213J46449J02366J27941J10808J29744R7964J94609j63190J60449
6920B163563j5743m9476k05546J3170k07094n6064k22837m6751r9616l5415j20091
6909A118100j53558K6928K1158p3696L077m9911J0555k1059q0060m9593Q5115
6898H37056K4068J3402j3648k7045K3352r3140J36373K0847K6172P046P5698J41449
6886A171630n6737m8101J38085L0568K8351k9326l2739K23672J11816J07111P1373
6875A715703p098J85574M9863L29370J03830Q2860J64942J51242J20345N9017
6865B955648J60106J67492K49470K87238K33102L28060M36304M95857O81712O90929
$$ plain form
6941 1056193 1077228 1027064 1131506 1026085 1088718 1104568 1052688 1169637 1155092 1109611 1239210
6930 1239210 1256423 1402872 1505238 1633179 1743987 1873731 1971695 2166304 2003114 2163563
6920 2163563 2147820 2098344 1892798 1905968 1698874 1642810 1419973 1373222 1273606 1238191 1118100
6909 1118100 964542 991470 1012628 938932 942009 892098 902653 881594 801534 751941 837056
6898 837056 861124 874526 860878 833833 857185 764045 900418 921265 947437 954483 1030181 1171630
6886 1171630 1114893 1066792 1204877 1235445 1263796 1234470 1201731 1425403 1537219 1644330 1715703
6875 1715703 1708605 1894179 1944042 2273412 2377242 2460102 2625044 2776286 2896631 2955648
6865 2955648 3115754 3283246 3532716 3819954 4053056 4381116 4817420 5313277 5994989 6685918
6855F685918Q47693Q45332R72766J185159J189790J235650J300617J174989J147381
6846A6585295J158228P72012O28341N99041K70715L22521Q3073M4567J22271m6948
6836B0539116J45076k5653Q456M1217j11123n1636k11472n48142o37409q21318
6826A8327112r01897j109892j111492j413949j197976j314657j141515j154644
6818H981090j010988j088931q12010p53537p19070m75010n73260m06182l77467
6809B764635l01524k79235j99980k66166j39223j65016l4372j04787k16462J5507
6799A073377p4425j08322L9914j23866J0719l724j22838Q3060o5770q0529l81
6788F27215K4885l0443p3112m9035P4883l1874j6779o0106k4270p3989J23342
$$ plain form
6855 6685918 7533611 8378943 9351709 10536868 11726658 12962308 14262925 15437914 16585295
6846 16585295 17743523 18515535 19143876 19742917 20013632 20336153 20419226 20463793 20586064 20539116
6836 20539116 20684192 20658539 20666995 20708212 20597089 20545453 20333981 19785839 19148430 18327112
6826 18327112 17425215 16315323 15203831 13789882 12591906 11277249 10135734 8981090
6818 8981090 7970102 6881171 6069161 5315624 4596554 4121544 3548284 3142102 2764635
6809 2764635 2463111 2183876 1983896 1717730 1578507 1413491 1379119 1274332 1057870 1073377
6799 1073377 998952 890630 930544 806678 817397 813673 690835 773895 708125 627596 627215
6788 627215 652100 621657 548545 499510 574393 542519 525740 465634 441364 367375 490717
6777D90717K668j1893j4785o8634j2073R8028m3434l9105M6980j42639o3748J13836
6765C55918o6416P5921k5853j17710L5967P5916k2060N1484j02762l624O7745
6754C24526p1329l6610Q2812j11962j647J12254K3885J1609o5708n4476l1093
6743A82261J11101p0591m2565K5660K3214j35778J18049j6056k4591L6143K8985
6732B35832o6029K4286l5158l12O907p7878L8041Q4773o2510r7506K2885M2093
6720A15424M522k8654K0613J03254j53743J37324j7121m6667l7779N7909M8051
6709B03133p5161L7643L7899k1137J6943j5664k0424J8797m0100R0743R798M065
6697B46535Q3107p9714l4500J4545M0440j39801J14890p0445j25893K36216q6162
$$ plain form
6777 490717 493385 481492 466707 398073 386000 484028 440594 401489 448469 305830 242082 355918
6765 355918 289502 365423 339570 221860 257827 333743 311683 363167 260405 256781 324526
6754 324526 253197 216587 299399 187437 185790 298044 321929 333538 267830 213354 182261
6743 182261 293362 222771 180206 205866 229080 93302 211351 195295 170704 206847 235832
6732 235832 169803 194089 158931 158619 165526 87648 125689 210462 147952 50446 73331 115424
6720 115424 119946 91292 111905 215159 61416 198740 181619 134952 97173 155082 203133
6709 203133 127972 165615 203514 182377 199320 183656 163232 182029 141929 232672 242470 246535
6697 246535 329642 249928 215428 229973 270413 130612 245502 175057 49164 285380 199218
6686A99218m2914m507R5412q6492l6631O6672o4171R1115q9931K1038L5559j081
6674A83287Q274j23826J16313J3384q7695Q1864p0150O3510l108l3961K9820Q3738
6662B61450n4768l3173Q2740n647o6474P8924r5966P6705O9293j17986p2254Q499
6650A31343P3239J03210j49013N3689N2097m3585J41804j41466J63318o4331K081
6639C22386M3134o0942K309n4540O5827K8784J5708O1654J2508o9727L1124P1026
6627D69251O630n6613o3859O2238N1742o0576O8300j3928J6961k3748J04712N3327
6615F14437N4135J09665P3721P9341J21891Q7201O3137K59569J60898J15981K82784
6604B022760L4301L9727J06159k8072O8047p4487J18058p177n1430l8863n9337
$$ plain form
6686 199218 156304 151797 247209 160717 124086 190758 126587 217702 127771 148809 184368 183287
6674 183287 191561 67735 184048 197432 109737 191601 121451 184961 181853 147892 177712 261450
6662 261450 206682 173509 256249 250602 184128 263052 167086 243791 313084 195098 122844 131343
6650 131343 204582 307792 158779 212468 264565 220980 362784 221318 384636 320305 322386
6639 322386 365520 304578 306887 252347 318174 346958 362666 424320 436828 367101 398225 469251
6627 469251 475881 419268 355409 417647 469389 408813 477113 463185 480146 456398 561110 614437
6615 614437 668572 778237 851958 931299 1053190 1140391 1203528 1463097 1623995 1739976 2022760
6604 2022760 2057061 2096788 2202947 2174875 2242922 2168435 2286493 2279316 2227886 2189023 2129686
6593B129686m3166o5908n9637j19621j55781K5755j26861j23967j41191P9888
6583A399197m3249q7720O1267j4480o0117J07901q3881J5543m351q7299P0992
6572A273803p2502j02355R9569j6626j14620J32111N886N9674l1239j1211R1536
6561A314026l0604o0488k1220j01266j46187q1872K355l8632k195j66153P8379
6550G46143p1879j39211R5126l6594j40808N8764j1897m0030O8857r6810P0976
6539E02637m0095q4338K7253K2253L533o6625q1548k8142N704J45540j1298j31552
6527B63322N6057m7792p3630J8889l0646K4345J1903j1799j9822N9583j04706
6516A45704M589m7392k5006Q6060M154o2623O2602M68j05280P1417J05298q9865
$$ plain form
6593 2129686 2086520 2020612 1960975 1841354 1685573 1711328 1584467 1460500 1319309 1399197
6583 1399197 1355948 1268228 1329495 1315015 1254898 1362799 1278918 1294461 1290110 1202811 1273803
6572 1273803 1201301 1098946 1198515 1181889 1067269 1199380 1205266 1264940 1233701 1222490 1314026
6561 1314026 1283422 1222934 1201714 1100448 954261 872389 874744 836112 833917 667764 746143
6550 746143 674264 535053 630179 593585 452777 511541 499644 459614 528471 431661 502637
6539 502637 462542 378204 405457 427710 431243 364618 283070 254928 260632 406172 394874 263322
6527 263322 319379 271587 197957 216846 186200 210545 222448 210649 190827 250410 145704
6516 145704 150293 102901 77895 163955 168109 105486 168088 168556 63276 134693 239991 150126
6504A50126o284l8080O0161K7865j24603L2376N3070l5761L1796q488q832m811
6492A28535l0881M9660l3606j607L9626j8242L7623j53536R3141J7606k2180j16921
6480a0782J52582l2410o7333J47132j23626O6617p9318J08861k201r8357K771
6469F3936o6301Q3354J2629J5663p2051Q2780l5700k9082P6573j13486J12143
6458A30458j22385R6313m5687M6969k5381P6568o6923L5560k1920m1911J25203
6447A86864j09990R728M3451l4642K4410n990j07643J21714j0125j9572J01827
6436B00032m881p6579o7020K4610P2454J1922q1254R0182j36770N9225N6799m4456
6424A04264L8147J820p8932O3328k7391N2291j6594j7941M5518o3901l4156N8138
$$ plain form
6504 150126 143842 105762 165923 193788 69185 101561 154631 118870 150666 142178 133346 128535
6492 128535 97654 147314 113708 112101 151727 133485 171108 17572 110713 128319 106139 -10782
6480 -10782 141800 109390 42057 189189 65563 132180 52862 161723 159522 61165 63936
6469 63936 -2365 80989 93618 109281 37230 120010 84310 55228 131801 18315 130458
6458 130458 8073 104386 58699 105668 80287 156855 89932 125492 103572 61661 186864
6447 186864 76874 86602 130053 95411 119821 113831 6188 127902 117777 98205 200032
6436 200032 195151 118572 51552 76162 148616 160538 79284 169466 32696 91921 148720 104264
6424 104264 142411 144231 65299 128627 101236 153527 136933 118992 164510 100609 66453 124591
6412A24591p7331n6826J02516l3378J34229m9124l286l8852M6503m8424k2010
6401G8608j90L2215L7107L803q219N5331n1668J21093m8318p3984J0552J15628
6389B71958q210N467l7556k5329J08649K8472m4113M0636k004N878j227J9480
6377C62101q2139R7767p6539N64P4487j33255J29464j21957R2400m7002J04910
6366D00801j33291N4165M6344q6181O6781L2480L7691m0828k9435P1912m7158
6355C73281Q4939k2592k8672R3414M4951j95474J44698l8843r64Q1224j09322
6344D26640J12051k9074K4651n5282Q9627m1725L8742R9901j58804P8404j01130
6333D84001L5554R9723l7651p6588O6073m8586n0360L733k4141j26o3749q4401
$$ plain form
6412 124591 47260 -9566 92950 59572 193801 144677 141391 102539 149042 100618 78608
6401 78608 78418 110633 147740 151543 143324 198655 146987 268080 219762 145778 156330 271958
6389 271958 263748 269215 231659 206330 314979 343451 299338 339974 337970 343848 342621 362101
6377 362101 279962 377729 301190 301754 376241 242986 372450 250493 342893 295891 400801
6366 400801 267510 321675 368019 281838 348619 381099 418790 377962 348527 420439 373281
6355 373281 458220 435628 406956 500370 545321 349847 494545 455702 454738 535962 426640
6344 426640 538691 509617 534268 478986 568613 526888 565630 665531 506727 585131 484001
6333 484001 519555 619278 581627 505039 571112 522526 472166 475899 451758 451632 387883 303482
6321C03482n792J58409R113K8641j81144L2923L48P652m1787j1127J32015m8565
6309C84168K5653n8797P5073q4824J06982J4476N1601K3542J897j4997K649N9326
6297E86749p5771p5307J49686j0240q276J239L1559l7969P3689q1861j11641Q1486
6285E23343p6984N3266k5360L0977p4138J6751j1843o9979J17158o32m2445m5581
6273C94533J06743p4041N3787k4530K4102J00084j38773R1106p8248n2638j1964
6262C90161j7250K7139Q3413J199r8141J3717Q5780j41996J55395j3788l4660
6251D50969j1449O7201k5976j14741R7095P0960n1978M0037o8702R1882R6886
6240F42184n3707q8140O902J007P8690j54903M4371o8687J3760P8648k0187K0134
$$ plain form
6321 303482 297690 456099 465212 493853 312709 345632 345980 353632 311845 300718 432733 384168
6309 384168 409821 351024 426097 341273 448255 462731 514332 537874 539771 524774 527423 586749
6297 586749 510978 435671 585357 575117 566841 568080 599639 561670 635359 553498 441857 523343
6285 523343 446359 499625 474265 505242 431104 447855 436012 366033 483191 482559 440114 394533
6273 394533 501276 427235 481022 456492 480594 580678 441905 533011 454763 402125 390161
6262 390161 372911 400050 483463 484662 386521 400238 486018 344022 499417 485629 450969
6251 450969 439520 506721 480745 366004 463099 534059 482081 522118 453416 545298 642184
6240 642184 588477 500337 507239 508246 586936 432033 476404 407717 421477 500125 479938 500072
6228E00072m4174J6948q3525Q5032m0147l6412R7828n8049M3464K8447N6510j10916
6216D55078k102R6092L1877j3802k7010n2733R9314r4919J2966M4275J9098r2456
6204D75678J8628j7765J0057P3417j06681j4128j563K0263M6497o0723M2624l1525
6192D54779J0157K6545K5322n535M1029n0328M9989p9356P5965N4457q4705M5439
6180E63758P5963L319J9522j09930J17197o117J48215r6799J73192m580m021J452
6168H81171j6523M2856M1163j46540n4093o1083k3315n1343n7691j31519J21585
6157E44668q2955N9936j10126j64597Q0487J03304r6636Q05N2169r4959J37207
6146D29303m8491J08489j60697N6415r35K2561j8579o6210M6662J1663m1493o1771
$$ plain form
6228 500072 455898 472846 389321 474353 434206 397794 495622 437573 481037 509484 565994 455078
6216 455078 452976 549068 580945 567143 540133 487400 586714 491795 504761 549036 568134 475678
6204 475678 494306 476541 486598 560015 453334 439206 437643 457906 504403 443680 486304 454779
6192 454779 464936 491481 516803 511268 552297 501969 551958 472602 548567 603024 518319 563758
6180 563758 639721 643040 662562 552632 669829 663712 811927 715128 888320 883740 879719 881171
6168 881171 864648 907504 948667 802127 748034 686951 663636 612293 554602 423083 544668
6157 544668 461713 521649 411523 246926 327413 430717 334081 334886 387055 292096 429303
6146 429303 380812 489301 328604 385019 384084 406645 388066 321856 368518 380181 338688 276917
6134B76917P5030j48214O6601k5918m5023k0634N056M4321L9962m2821l1961n6947
6122A36369J14846l6522q9432O6063k2183N2072l919p7522N484O3086j25155M0156
6110A23343O0997m638o2920M5379l1616M3636Q0611p4462j1542k6066k2923N8653
6098A78452q0010L3032M8138O819k201p8126J4992R606O5659j39511J26M424O839
6085F8239O9713k7043N2112n1938O7797M3915m7292l4051p4084P8907p9351Q8477
6073A55401l6843Q5931n8519M4343l990q8474J6670L8038J8319m3694O0473p8540
6061A09115N385r3780O6642J6823k0228J8693j02441L6854L978M766L6239l9687
6049D2359P2148j06475J62482j853M7767j41932N7541p2938N9160m8552J09637
$$ plain form
6134 276917 351947 203733 270334 244416 199393 178759 183815 228136 268098 225277 193316 136369
6122 136369 251215 214693 125261 191324 169141 221213 217294 139772 145256 208342 83187 123343
6110 123343 184340 179702 116782 162161 130545 174181 254792 180330 168788 142722 119799 178452
6098 178452 98442 131474 179612 186431 184230 106104 121096 130702 196361 56850 56976 61400 68239
6085 68239 137952 110909 163021 111083 178880 222795 175503 141452 67368 146275 66924 155401
6073 155401 118558 204489 145970 190313 186323 97849 114519 152557 170876 127182 187655 109115
6061 109115 114500 20720 87362 104185 83957 102650 209 37063 41041 45807 82046 42359
6049 42359 114507 8032 170514 168661 216428 74496 132037 59099 118259 69707 179344
6038A79344m4656m7751K0506p975k7905j7960P4307M125r840m6233P4236l0291
6026A19907J03707p5171m3084m4054p830J9418J4110N3056m7654l8910P9697k3784
6014A09408P469j1239l4621J4947K1605N3873m0994k1005m1444M6752q1991M8995
6002G1755r5509J53767p9996l371O3608j8295J2133r8435N4602l1505M9492k3938
5990E4308l9676M6676N9405L096o3586R617M8998L434L6717r3934K6309n1077
5978D0287O5700J262l5375K8704k5695L0246j1144J4805n3018l2893P5969N5153
5966A54001Q2051j38161O4802K782J0640r3519Q2101J5033q2302J8525k8528O8211
5954A55636r8731J51315l2664L327o5395L1457N5077K9832M650k8990Q6581J8286
$$ plain form
6038 179344 134688 86937 107443 99468 71563 53603 127910 132035 122195 75962 150198 119907
6026 119907 223614 148443 105359 61305 53475 72893 87003 140059 92405 53495 133192 109408
6014 109408 116877 105638 71017 85964 107569 161442 120448 99443 57999 104751 22760 71755
6002 71755 -23754 130013 50017 46646 110254 91959 104092 5657 60259 28754 78246 54308
5990 54308 14632 61308 120713 123809 60223 69840 118838 122272 158989 65055 91364 40287
5978 40287 105987 107249 71874 100578 74883 105129 93985 108790 55772 22879 98848 154001
5966 154001 236052 97891 162693 165475 176115 82596 164697 179730 97428 115953 87425 155636
5954 155636 56905 208220 175556 178883 113488 144945 200022 229854 234504 205514 292095 310381
5942C10381n4684J06999l4731P5546K5017o9460J35246j4292j23175J41552j53719
5931C44680M1409K1689q2053O5311N2930j10598P0182j11455j5467L0772o4435
5920B42965p1103J7882P5150o2726o4176N311J9401j2554k8421p619j5922J00615
5908A98803j48375K0604j029R8262p1586P8798P7312r3399o5828Q3351j2052J01878
5896B66739L5277q5623m2579K0954j12252Q3310K461J6106j09712J06245r1542
5885H9384K4032m2150j7058N3945p4496M1356k3304R9224q9251J6070j4272K9183
5873I2663k2849p6835N8486j7466O2751K0409j37996Q8427k0951J6127l1238J5500
5861D7028K6214K3413P3426l5466o6209N2922K1424r2749L6314k7201q4372J27389
$$ plain form
5942 310381 255697 362696 327965 403511 428528 359068 494314 480022 356847 498399 344680
5931 344680 386089 407778 325725 391036 443966 333368 403550 292095 276628 307400 242965
5920 242965 171862 189744 264894 202168 137992 143303 162704 150150 121729 114110 98188 198803
5908 198803 50428 71032 70003 168265 96679 175477 252789 159390 93562 176913 164861 266739
5896 266739 302016 216393 173814 194768 82516 165826 168287 184393 74681 180926 89384
5885 89384 113416 71266 54208 108153 33657 75013 51709 150933 61682 77752 63480 92663
5873 92663 69814 -7021 51465 33999 96750 117159 -20837 67590 46639 62766 31528 47028
5861 47028 73242 96655 170081 134615 68406 121328 142752 50003 86317 59116 -25256 102133
5849A02133k3940l4130N1473m5251L2446q1202J17709o1558K4027L6172n1823
5838F6056M4279l1306l9705L6223k0177j0125o5654M9730N7229o5706K0708M5085
5826H6637j85998J35143P5851m0823r2467K5809J9039m8756J22158m1993O8975
5815A23575j4188o2653l4768J7537m390N0055J08922q3680N267j3428j9747p109
5803F5393P8085o7164p805j0318j06944J16341n2274J18399L1747r5275r0537
5792b0352N0462N6084o7281k623N4841L490j11608R4869L4418n7017m6311M2874
5780C1846L4939l7955j01597P3372O3514k4123Q7673p0864n0549P6628m9399J5128
5768D8613J0258r539k6651o1832j0669J26419n3762Q417m9292J49525l5456l9138
$$ plain form
5849 102133 78193 44063 95536 50285 82731 1529 119238 57680 81707 117879 66056
5838 66056 110335 79029 39324 75547 55370 45245 -20409 29321 86550 20844 41552 86637
5826 86637 -99361 35782 111633 70810 -21657 4152 23191 -25565 96593 54600 123575
5815 123575 109387 46734 11966 29503 25113 75168 184090 100410 105677 92249 72502 65393
5803 65393 143478 76314 68509 58191 -48753 67588 15314 133713 165460 70185 -20352
5792 -20352 30110 86194 18913 16290 71131 74621 -36987 57882 92300 35283 -11028 31846
5780 31846 66785 28830 -72767 605 64119 39996 127669 56805 6256 82884 33485 48613
5768 48613 58871 49332 22681 -39151 -49820 76599 22837 31254 -18038 131487 96031 56893
5756E6893m026J17770r1630O3454o7811j486o1881j5179K8702L9778o1840P297
5744A0041K6592L6472j627l4450R6949j06414N9592M701j4980j8913K0761k6891
5732E1833M449m9111N7833R6628m6601o5006L3238p4266k08Q6370k0241K7771
5720A02689r4370O9424j05413J05435M100M8221p3961J2433j0198M7682k2275
5709H3767n1272l5454N3044J03221o809n782n1056K2266m8026L4556N8373j3377
5697A43451o6974R553K3594O5959L6510j67682R9713O2118j11246J34737j32759
5686I6974J43764L665p6448n4166M2325k1301L4814l1175n3134o0243N0721N4686
5674A30482o4991J7756j4009P3999k7420n6710K3722N3008j22980O5725l3384
$$ plain form
5756 56893 52867 170637 79007 142461 74650 73164 11283 -3896 24806 64584 2744 10041
5744 10041 36633 73105 71478 37028 133977 27563 87155 91856 76876 57963 78724 51833
5732 51833 56282 7171 65004 161632 115031 50025 83263 8997 8789 95159 74918 102689
5720 102689 8319 77743 -27670 77765 81865 130086 56125 68558 58360 106042 83767
5709 83767 32495 -2959 50085 153306 146497 140715 89659 111925 63899 98455 156828 143451
5697 143451 76477 86030 109624 175583 212093 44411 144124 206242 94996 229733 96974
5686 96974 240738 244403 167955 113789 156114 134813 169627 138452 85318 25075 75796 130482
5674 130482 65491 83247 69238 143237 115817 59107 82829 135837 12857 78582 45198
5663D5198k476O9416L8702K9363p3687j8846J37495k9664o4740M6876p8163p42
5651I8732J07464j6638o8831O1539q90m6119O0952l0266r249L7224n9115l0272
5639A04531Q2100r1269O5916J3457K3127J2315L8110M4865j26176J26933n5435
5628B38474J437l883q7721J33555j34186J87818k2686o2614n7782n8479Q5627
5617B19560o2302N3278P3467l404m7773P5153J3877r9450N1344R8923M04p1816
5605C01261k3653K5644o8648P3539K8372o0354Q4715j03505J3924m3829J38970
5594C66436P453q3182O1908l022p6809K3554m6171J69483p3397K9728Q699J2106
5582C96786N6473L5106P3770j00012M4359n4924K107J58416q4378o311m5760J09751
$$ plain form
5663 45198 42722 112138 150840 180203 106516 87670 225165 195501 130761 177637 99474 98732
5651 98732 206196 189558 120727 182266 181376 135257 196209 165943 156694 193918 134803 104531
5639 104531 186631 95362 161278 174735 197862 210177 248287 293152 166976 293909 238474
5628 238474 239911 236028 148307 281862 147676 335494 312808 250194 192412 133933 219560
5617 219560 157258 210536 284003 280599 232826 307979 321856 222406 273750 372673 373077 301261
5605 301261 277608 303252 234604 308143 336515 276161 360876 257371 271295 227466 366436
5594 366436 373889 290707 352615 349593 272784 296338 250167 419650 346253 375981 384680 396786
5582 396786 453259 488365 562135 462123 506482 451558 453665 612081 527703 521392 475632 585383
5570E85383r4476J58158M619J5015J6915N4054J2028M6786n0936M3237O9396K0204
5558H80383m2608J88535K8645q5741R9430J24756l7631N5910K46J13293O0840
5547A386058R2316J13340Q8527J80538L6633J10369J69158J24979J86204J45755
5537B633877J14534K43328J11416K07529K95560K30417J76329Q3233K62159J57639
5527D516021J06697J67878P8269K43738K4903J68952o8314J41895J97459L4906
5517E612404J66673J62461J48232K67365J42281Q2272J64250J2144K00385P4073
5507G032540Q3378l0456p3314j30387j44072j23526j38542j54066k65751j58090
5497E897714k62954j23546j29826j40205j89315J6422j55742k07738j5284j74956
$$ plain form
5570 585383 490907 649065 653684 668699 685614 739668 751696 798482 747546 790783 860179 880383
5558 880383 837775 1026310 1054955 969214 1068644 1193400 1155769 1211679 1211925 1325218 1386058
5547 1386058 1478374 1591714 1680241 1860779 1897412 2007781 2176939 2301918 2488122 2633877
5537 2633877 2748411 2991739 3103155 3310684 3606244 3836661 4012990 4096223 4358382 4516021
5527 4516021 4622718 4790596 4868865 5112603 5137506 5306458 5238144 5380039 5577498 5612404
5517 5612404 5779077 5941538 6089770 6357135 6499416 6581688 6745938 6758082 6958467 7032540
5507 7032540 7115918 7085462 7012148 6881761 6737689 6614163 6475621 6321555 6055804 5897714
5497 5897714 5634760 5511214 5381388 5241183 5051868 5068290 4912548 4704810 4689526 4514570
5487D514570k43594p030q9329j53868j32954k95271k57314o5475k59383j48972
5477B861380j51492k03178j12928k04263j43544j59346q5060j04175j89318o3820
5467A444256p3718j1610j29171j47130l3600k0086p8181l9547M2238j47903P6852
5456H82400n2380p6489p0575L6511q4594p7452P0879r2869L9511k0153n7960L2233
5444E29062L675o3900q3969J4891P9272j51540K144J30417l4138l7306j1236k0168
5432C57204N73M7623j1109j10652O1768n3010N2246q7787M013p3745j8078P5375
5420B44421K7005J699j5522M484L1424p8342J4676M1690j41118J08640m6898j4255
5408A77904J9447K1994l678O5787k4182q8903O5423j00526p070N7802j8300q022
$$ plain form
5487 4514570 4270976 4263946 4174617 4020749 3887795 3592524 3335210 3269735 3010352 2861380
5477 2861380 2709888 2506710 2393782 2189519 2045975 1886629 1801569 1697394 1508076 1444256
5467 1444256 1370538 1358928 1229757 1082627 1049027 1028941 950760 911213 953451 805548 882400
5456 882400 830020 753531 682956 719467 634873 557421 628300 535431 574942 554789 496829 529062
5444 529062 532737 468837 384868 399759 479031 327491 329635 460052 425914 388608 377372 357204
5432 357204 357777 405400 394291 283639 345407 292397 344643 256856 260869 187124 169046 244421
5420 244421 271426 273125 257603 262087 293511 215169 229845 271535 130417 239057 192159 177904
5408 177904 197351 219345 215667 281454 257272 168369 233792 133266 126196 183998 165698 157676
5396A57676m3815M1148K0731L6044M1695p9578k9425j5961N910j06455N1923P4932
5384A54825j502o012n407o8863J20388p6725n7554M3214K4259k7632L4044k6791
5372A06244l0719k2924Q6485J289m9863Q5578j1210K5671q1893K2810m3347P879
5360I6000k2621P3708j03880J5771L9067r768Q3220o8337l0921N525J9490N479
5348A02733J3809l0595P1348o495l4613n714K1830p2025P4447q2547J01524n2204
5336A01498k6210L9317O3361j10577M9861K0856j12303J41732K4967j8796o8702
5325A05004Q1409m5288r0229P0058n7698L088K6726M6654k2197m4784j36J23608
5313A96215q9118J5157J08164j78985O789L7850O1944j5003q6997Q2932o672r2450
$$ plain form
5396 157676 113861 155009 175740 211784 253479 173901 144476 128515 134425 27970 79893 154825
5384 154825 153323 147311 141904 73041 193429 116704 59150 102364 126623 98991 133035 106244
5372 106244 75525 52601 139086 140375 90512 176090 164880 190551 108658 131468 88121 96000
5360 96000 73379 147087 43207 58978 98045 88277 171497 103160 72239 77764 97254 102733
5348 102733 116542 85947 157295 150800 116187 110473 132303 60278 134725 52178 153702 101498
5336 101498 75288 114605 177966 67389 117250 138106 25803 167535 192502 173706 105004
5325 105004 186413 141125 50896 120954 63256 66344 93070 139724 117527 72743 72607 196215
5313 196215 107097 122254 230418 51433 58222 96072 158016 143013 56016 138948 132276 39826
5301C9826k8863J31029j3898j1014o0924J67321j87904J41705K609O365m2342
5290A43910q0119J05204l115j145m8222J01156q3142J8813l2869p856J1103p110
5278A16608k3116L6853K7184k2970Q5134p7976l5073j9528k1579L2758j8062K5367
5266A05600J00357j35017j3985J04667N46r8269K2697L0669K5195N901q6778R4302
5254A55885p1948L6372k411m1924p1547J18644p0459K0762N2788q3143k0589J38415
5242A60845r9329k625J05376q5696M5175K4656l9826k0179l7561k599P7942q5860
5230D0319N2123M4850j43318P2544j7051O2664q8157J45890j49098L4231J06318
5219A61315o3858m1j46871J24693N015l6958N0066J7018o2445j1715L1938P3356
$$ plain form
5301 39826 10963 141992 128094 117080 56156 223477 35573 177278 179887 186252 143910
5290 143910 63791 168995 165880 164735 116513 217669 134527 153340 120471 112615 123718 116608
5278 116608 93492 130345 157529 134559 219693 141717 106644 87116 65537 98295 80233 105600
5266 105600 205957 70940 56955 161622 162168 63899 86596 117265 142460 148361 61583 155885
5254 155885 83937 120309 117898 75974 4427 123071 52612 73374 126162 43019 22430 160845
5242 160845 61516 58891 164267 78571 123746 148402 108576 88397 50836 48237 126179 40319
5230 40319 92442 137292 -6026 66518 49467 112131 23974 169864 20766 54997 161315
5219 161315 97457 97416 -49455 75238 80253 43295 93361 110379 47934 36219 68157 141513
5207A41513R668K3915o1744O95p1975O3092k5907M3919J4434P9161j44267Q4504
5195A57008p1263l0058J10925p1980k9512L1090k4248L1862j61P231o8727N1152
5183I3319R843p4417P2192J7937n9826N1078N3620p3787m1298L9556L1039m3189
5171G6067K3811m6222J10522k2758r0275J40586n654j44412P6911p4647R4137
5160A38066M0008j40081K8893N9376j9376p0732J91448p1946j20556M1324j283
5149G5141q5109J13217o9471N3163K7416j1719Q247o3732M6008L942m7608O4391
5137A13886m3731M8933m9551n067L5839l6089O4161k2418l965N2062j02128P2296
5125A24228L5351m3709n7731n8351J81761n2517K4927m9610n9253M1054j067L6563
$$ plain form
5207 141513 151181 175096 113352 114047 42072 105164 79257 123176 137610 216771 72504 157008
5195 157008 85745 55687 166612 94632 65120 96210 71962 103824 103663 110894 42167 93319
5183 93319 103162 28745 100937 118874 59048 110126 163746 89959 48661 88217 119256 76067
5171 76067 99878 53656 164178 141420 51145 191731 186077 41665 118576 43929 138066
5160 138066 178074 37993 66886 126262 106886 36154 227602 155656 35100 76424 75141
5149 75141 -9968 103249 33778 86941 114357 102638 110885 47153 93161 97103 49495 113886
5137 113886 70155 119088 69537 64470 100309 64220 128381 105963 101998 154060 51932 124228
5125 124228 159579 115870 58139 -212 181549 129032 153959 104349 45096 86150 85083 121646
5113A21646j18928P5941n3600j7831J19942o249L0189M494j72870J72250m1152
5102A13832k3659j10481N1617L5895J08381n4946n1719R632k5029n1782J41584
5091A43325p7926m7053J2011P9505R645j07825Q2552k5040Q2334m5941M6088l0104
5079A21571j1674K9918j39720R3634J30013j86016J58317l015n6092o5642Q2866
5068A54160P686K3754p0488O185p209J81207j01551p7741J52912j11518J13077
5057B70474l8288r5293K09581p6052N2067K5805j05713J8768O8982q9125l2242
5046B08964m0250p106m4850K6928R231J2885k3231j5687m5332N9110l2713p2201
5034C5748P2411m1944j6261M6515M4488K8376r6358L8810N8672r4036p24J3860
$$ plain form
5113 121646 2718 78659 25059 7228 127170 120921 151110 155604 -17266 154984 113832
5102 113832 90173 -20308 31309 67204 175585 120639 68920 78552 53523 1741 143325
5091 143325 65399 18346 30357 109862 119507 11682 94234 69194 151528 105587 151675 121571
5079 121571 109897 139815 95 93729 223742 37726 196043 193028 136936 71294 154160
5068 154160 161846 185600 115112 121297 114088 295295 193744 116003 268915 157397 270474
5057 270474 232186 136893 346474 270422 322489 348294 242581 261349 330331 241206 208964
5046 208964 168714 161608 116758 143686 152917 165802 142571 126884 81552 140662 107949 35748
5034 35748 108159 66215 49954 96469 140957 169333 72975 111785 170457 76421 75697 89557
5022H9557O3402j2531n2915L0359q005r673N303k4927j5864K5000L8875j7484
5010A11097l064J2433L6105N4232o4006k2311j03035J73704m4709J6495o6749
4999A00192l4954L5373M9635j9527N7421N49n1000r2577J15021j0792p1599Q0926
4987A58668P8760r7525K004l4253J103K4009N1514M5057K870r9236J01665n3453
4975A81183L6328p3842Q5110l2471J1177M9666n3719n2147J12467M3703J9029
4964C26484j01668J23950N9046M6920K4439J71527J21814J05050L1048J99942
4954A108552J48352K79189Q5950J0261L1902L0984j89632o0499k39950L3573j86083
4943A052599m9332k07546j74756o2229r4482j8600j29009j06424p923L2074m074
$$ plain form
5022 89557 152959 140428 87513 117872 109867 100194 105497 80570 64706 89706 128581 111097
5010 111097 108033 120466 156571 210803 146797 124486 21451 195155 150446 166941 100192
4999 100192 65238 100611 150246 130719 188140 188689 137689 45112 160133 149341 77742 158668
4987 158668 237428 139903 141907 107654 108757 132766 184280 229337 232207 132971 234636 181183
4975 181183 217511 143669 228779 196308 207485 257151 203432 151285 263752 307455 326484
4964 326484 224816 348766 407812 454732 479171 650698 772512 877562 908610 1108552
4954 1108552 1256904 1536093 1622043 1632304 1664206 1695190 1505558 1445059 1205109 1238682 1052599
4943 1052599 1003267 795721 620965 558736 464254 445654 316645 210221 202298 234372 230298
4932B30298R442k3596n2566L9006n2951R017l3431N4723r3214J2417J06828k3404
4920A82569N2017l1531o7297N6300k0494n6092P7604j6954o2619m2516N6399M3783
4908A71169O5173j37826M3271K5611k3145M8198o5886L0449j7189O9776n3256
4897A56345N1935k6528l7017N9766r8186K6323j9921J890K2251k2535L1652O5489
4885B11464j05462O6124L6600O067r5908J0786Q1953n8006J19231j36512P7558
4874B13895j3276K6145k1662J0182q3593J3415J16912n9394L1764L6024j47938
4863A22474M5394l2592P1149l6687L5945j7838J1126L8982o9663P308J1256j3350
4851A73504P9545m0028o7690P7934k9678K5026Q6479j35953J53493m1242j9292
$$ plain form
4932 230298 239740 216144 163578 202584 149633 158650 125219 179942 86728 99145 205973 182569
4920 182569 234586 203055 135758 192058 171564 115472 193076 176122 113503 70987 127386 171169
4908 171169 236342 98516 141787 167398 144253 192451 126565 157014 139825 209601 156345
4897 156345 208280 181752 144735 204501 106315 132638 112717 114607 136858 114323 145975 211464
4885 211464 106002 172126 208726 214793 118885 129671 211624 153618 272849 136337 213895
4874 213895 200619 226764 205102 215284 131691 145106 262018 202624 234388 270412 122474
4863 122474 167868 135276 206425 169738 205683 187845 198971 237953 168290 175598 186854 173504
4851 173504 253049 213021 145331 223265 193587 218613 305092 169139 322632 281390 262098
4840B62098k9943N7117p9672K5165k5692M8028q0k1492j2789P6457q9800K3088
4828B32485R6877j04721K1444N4367j7388q1093J61871j24620J78516j68931J210
4817B50017j4963M9456J4707o2118l807L490j3890J1733j7153N5944p0576J22195
4805C25035o5311L280K0321m5750j1452M1873L5743m3041O3864m1690K1748j8988
4793B85632p226q771Q068K1480p5771R2609k0167L659p6523J17188l3634j9342
4781B87202J6710n7178L7927P6779m9948l9991o9347J43623j59410R7261L24j121
4769B82831m2863K8265p6533O4693R7820o44j475M3333p9769L410R563n0799J00410
4756C78242K6335P0434o7014L566p0302P0174l6813K0253o2376r3207J41904P363
$$ plain form
4840 262098 232155 289272 209600 234765 209073 257101 257021 235529 222740 299197 209397 232485
4828 232485 329362 224641 246085 300452 283064 201971 363842 239222 417738 248807 250017
4817 250017 235054 284510 299217 237099 233292 236782 222892 234625 217472 273416 202840 325035
4805 325035 259724 263004 283325 237575 226123 267996 303739 260698 324562 282872 304620 285632
4793 285632 278406 269635 277703 299183 223412 316021 295854 299513 222990 340178 306544 287202
4781 287202 303912 246734 284661 361440 311492 271501 202154 345777 186367 283628 283952 282831
4769 282831 239968 268233 191700 256393 354213 353569 352094 395427 315658 319068 328631 277832 378242
4756 378242 404577 475011 407997 411563 341261 411435 374622 394875 332499 239292 381196 388559
4744C88559K5035k6133K0978m283J9150R384k6668L6563k369K2927m4728j3576
4732D04839Q3741n4575P0832L604J7589k4248j57879J97498l9337p0630J16388
4721E47822M1506j38975J86838j8091j40075J57551p8598L3305m2370m9506J02091
4710F01498o012L8006l4878J62013K301j30474J07460o9689O5563J0956l9767
4699G06977N0128L09O7593j1282M0545N568l9072M3856O1876m636M6557j9642
4687I48777K8691k7671m0594R7649L5735r439K158K0703K7490Q7914K3036L4349
4675A228798j9186N9253M3028M7055M6504m849J06298L2976R6619j03312J17227
4664A650411P0809P4208O0428M4076P4272J15506k3085J27470K9172L2518J57749
$$ plain form
4744 388559 413594 387461 408439 404156 423306 432690 406022 442585 440216 463143 418415 404839
4732 404839 488580 434005 504837 508441 526030 501782 343903 541401 502064 431434 547822
4721 547822 589328 450353 637191 619100 479025 636576 557978 591283 548913 499407 601498
4710 601498 595486 633492 598614 760627 762928 632454 739914 670225 735788 746744 706977
4699 706977 757105 757414 825007 813725 854270 859838 820766 864622 926498 921862 968419 948777
4687 948777 977468 949797 909203 1006852 1042587 1033148 1035306 1056009 1083499 1171413 1194449 1228798
4675 1228798 1209612 1268865 1311893 1358948 1405452 1400603 1506901 1539877 1636496 1533184 1650411
4664 1650411 1721220 1795428 1855856 1899932 1974204 2089710 2066625 2194095 2223267 2255785 2413534
4653B413534O4779J70475J18788J43269L6481J74782J20783J37054J96865K50246
4643C827056J19953K28274K30861K03034K03675L86706J48410L26269M32083L90816
4633F497137K95891L95874M13912M08593M27005M47365L65748L50430M20324M08364
4623A0430643K27986K71847J95291R4493M7366k1788m1127j60058j46046k00910
4613A0697697l74528l64322l55776m84901m61467m31540m14243m34767m67693
4604F908460l79929l70048l58753m07404l17394l47142k64219k88620k52663k77625
4594C644663j91091j47494k39218j92021j36710q9411k02169j11993j17677k2755
4584B194124j46010j28004J2545k08301n8574o4191k7534j7210j14002n6875k4668
$$ plain form
4653 2413534 2478313 2648788 2767576 2910845 2947326 3122108 3242891 3379945 3576810 3827056
4643 3827056 3947009 4175283 4406144 4609178 4812853 5199559 5347969 5674238 6106321 6497137
4633 6497137 6793028 7188902 7602814 8011407 8438412 8885777 9251525 9601955 10022279 10430643
4623 10430643 10658629 10930476 11125767 11220260 11267626 11245838 11204711 11044653 10898607 10697697
4613 10697697 10323169 9958847 9603071 9118170 8656703 8225163 7810920 7376153 6908460
4604 6908460 6528531 6158483 5799730 5392326 5074932 4727790 4463571 4174951 3922288 3644663
4594 3644663 3453572 3306078 3066860 2874839 2738129 2648718 2446549 2334556 2216879 2194124
4584 2194124 2048114 1920110 1932655 1724354 1665780 1601589 1574055 1556845 1442843 1385968 1361300
4573A361300o7750q796p686j44040K106j17549N1245q4734J8842m3348P164m5966
4561I20788j33918O8913p2831L591j10910J06723l4543n5223m0301l1545j5185
4550F05559l4778m3834P8467K8606r3337N9820j55194k503J30880j061r0319K7138
4538E09444k2471L6545j24693M3767P5142j36321J3615n1684P1111J6357P086
4527D37898j58056R0113k7355P0157p7406P5830l6889l1370J5743m8885l8895
4516B70885N1897j52424J34662k3657p7542K9128P0594p0460J02163l2824l8108
4505B64314m8562J8422M7607R3684k14924M6927j8810J03089m5834n5328K9684
4494B20269l1133n4535J6634l4270P6962N8003k1410J8506M0865J852k1559j36299
$$ plain form
4573 1361300 1293550 1284754 1277068 1133028 1135134 1017585 1068830 984096 1002938 959590 966754 920788
4561 920788 786870 855783 782952 786543 675633 782356 747813 692590 652289 620744 605559
4550 605559 570781 526947 605414 634020 540683 600503 445309 442806 573686 572625 482306 509444
4538 509444 486973 523518 398825 442592 517734 381413 395028 343344 414455 430812 437898
4527 437898 279842 369955 342600 412757 335351 411181 374292 342922 358665 309780 270885
4516 270885 322782 170358 305020 281363 203821 232949 303543 233083 335246 302422 264314
4505 264314 215752 234174 281781 375465 160541 207468 188658 291747 245913 190585 220269
4494 220269 189136 134601 151235 116965 193927 251930 230520 249026 289891 291743 270184 133885
4482A33885M6259J0755o2347M4361P1894j06875P5578o8654j1458J46318l9883
4471B39833n1941q625p4147O9581j6925P0438J2963n217o3188K3691M009p901
4459A92571j15615R1568J4541o7303J04710p5528j5021m2740J34819K3044q5449
4448A59597N2187q70p9846j1787k411J03690o9685K9546P8542o9245M0572j05600
4436A24690R5506m5374Q0356r6350N7102J0665j01550l6112K3061O1729m3011
4425A30712R7747J0173m033l2228Q7700r0039q1445O1091n3019M2647q8233J17609
4413A98682m9762j3852L9752j7189O7154l225j08375N8500j5859j5825P1332j20924
4401I0409Q5747n7789R1723k0884o4278J37292P072l4616m4416K5854M8767n7870
$$ plain form
4482 133885 180144 190899 128552 172913 244807 137932 213510 144856 133398 279716 239833
4471 239833 187892 179267 105120 174701 157776 228214 241177 235960 172772 196463 200472 192571
4459 192571 76956 168524 183065 115762 220472 144944 129923 87183 222002 245046 159597
4448 159597 211784 210914 131068 119281 116870 220560 150875 180421 258963 189718 230290 124690
4436 124690 220196 174822 255178 158828 215930 226595 125045 88933 111994 173723 130712
4425 130712 228459 238632 234599 202371 290071 200032 118587 179678 126659 169306 81073 198682
4413 198682 148920 135068 174820 157631 224785 221560 113185 171685 155826 140001 211333 90409
4401 90409 176156 118367 210090 189206 124928 262220 269292 234676 190260 216114 264881 207011
4389B07011K4045Q2173n5562L5488K916o0781K3450J68887j38341R3636p6600
4378C06322L4081N592j4465J00709p7058J03986K4726m2840l1474R5076p5504
4367D29151L7627Q750P001O6706P3037j31136J41022N9571n8905Q7541M1189J11945
4355H73499l1088j6253J9008M1408J3961m3599j2993j01789J21851o1116o3280
4344G39609J33629j57462J56761o8389K3242J12087l1685L4235J3318M2025R0762
4333A088132J12297q921J42234K4317K44740J82468Q6170Q0968L224O7568r615
4322B013582m3350P9572o091j14893j24534r5699m6186j80314o49j34082k45140
4311A102216r3072l3382l4455j40022j7540N4328j63172m121K5276O130p1608
$$ plain form
4389 207011 231056 313229 257667 293155 296071 235290 258740 427627 289286 382922 306322
4378 306322 340403 345995 331530 432239 355181 459167 483893 441053 409579 504655 429151
4367 429151 466778 475528 482529 549235 622272 491136 632158 691729 632824 720365 761554 873499
4355 873499 842411 826158 845166 886574 900535 856936 843943 742154 864005 802889 739609
4344 739609 873238 715776 872537 804148 827390 939477 907792 942027 955345 997370 1088132
4333 1088132 1200429 1191508 1333742 1358059 1602799 1785267 1871437 1952405 1955629 2023197 2013582
4322 2013582 1970232 2049804 2043713 1928820 1804286 1708587 1662401 1482087 1481438 1347356 1102216
4311 1102216 1009144 975762 941307 801285 783745 838073 674901 670780 696056 702186 630578
4300F30578J51917m779k9146r8839o3543n461l0366j4287q2986m4062n1724n7491
4288B99811m8316J06466j87263J65864j26869r0343L4161L8017m6281o8436M6491
4277A23302q7544Q7042O1428M091j53627J18840j01117J00732K2956m4613j14230
4266A7260Q3815j6556N2147J4402l1157n9898Q2492j36655Q2928j8110J030l7558
4254C4140n8681N6125O8204n4573P132L851J99n0395J09623r9404R5361r8093
4242A3489P2592L20r7801O0215K706l7766n1473J43276j64259J03249j2159r2420
4230f0031O6073n7125K2065J4255P1613n7807J2066o0293J33556k466r7805K1952
4218F053P2663o1140k1544R0144q2930j8036J82658j24023L1932j0390K187l5032
$$ plain form
4300 630578 782495 777716 748570 649731 586188 580727 550361 536074 453088 409026 357302 299811
4288 299811 251495 357961 170698 336562 209693 119350 153511 191528 145247 76811 123302
4277 123302 35758 122800 184228 188319 34692 153532 52415 153147 176103 131490 17260
4266 17260 101075 84519 136666 151068 119911 60013 142505 5850 88778 70668 71698 34140
4254 34140 -24541 31584 99788 45215 52347 56198 56397 6002 115625 16221 111582 13489
4242 13489 86081 86401 -11400 48815 51521 13755 -37718 105558 -58701 44548 32389 -60031
4230 -60031 6042 -51083 -29018 -14763 56850 -957 11109 -49184 84372 81906 -15899 6053
4218 6053 78716 17576 -3968 86176 3246 -14790 167868 43845 75777 65387 67574 32542
4206C2542J9863j27781J47361j13922M5840L3826k3534k7703J4952m3923o4254
4195a06733K7001L2006M7624l5894k5182k8568L566P0509k6291k53m5887P0815
4183a7287p2490J18470o4908L5556O3547m6959K8184M6588m135K2876P4878q6110
4171I8210k8614R101K7553j14184k419M0834n8407J22105j56577J3090q2349L8530
4159i3127M0849n6901M9365l8868J7586P7463j2436L8415j07139m387N1745L9281
4147A846L9336L9202k3927o738j1217l0714J327O5376P096q1740K5845K2600K3088
4134G1380R947k6517O3839L969m2027M255o7116L3540o6352k7059M5038l5286
4122c2389P5654r0427n652J31814p3905r2075P1239N0004k6462k2415N1732k0889
$$ plain form
4206 32542 52405 -75376 71985 -41937 3903 37729 14195 -13508 1444 -42479 -106733
4195 -106733 -79732 -47726 -102 -35996 -61178 -89746 -86180 -15671 -41962 -42215 -88102 -17287
4183 -17287 -89777 28693 -36215 -659 62888 15929 44113 90701 86566 109442 184320 98210
4171 98210 69596 78697 106250 -7934 -10353 30481 -27926 94179 -62398 -49308 -131657 -93127
4159 -93127 -52278 -109179 -59814 -98682 -81096 -3633 -16069 22346 -84793 -89180 -37435 1846
4147 1846 41182 80384 56457 49719 38502 7788 9115 74491 81587 -153 25692 48292 71380
4134 71380 81327 54810 118649 122618 80591 84846 17730 51270 -15082 -42141 2897 -32389
4122 -32389 43265 -47162 -52814 79000 5095 -86980 -15741 34263 7801 -14614 37118 16229
4110A6229K9975r423N5331n0839L1598L7886r0188M377M4583L2826j00085N0342
4098E2612j5585K9387j13029O8132l0857q2506R3745M5433j31613J21006o4215
4087b7490N6692R6328j02944l1094M8230J4371O1409j42536J6680O7170j4962
4076D1854j6193N666L7847l045P286r063m9608J3573L6485O1249j11945N8987
4064G3093O367N875n0918L2772L9761o2821N6030P7074l9833k8930r5328J33100
4052A46242j24821J900J38903n3435R9497n8297o4475P4515L0867r9398O5048
4041A56546j21921Q2874j8502L7242J396R7523p2702o9002K3045q395N190l7587
4029G5707P9830l5668M1890L3346L2432N556l6100Q0170p017j22412N678Q010
$$ plain form
4110 16229 46204 36781 92112 41273 72871 110757 20569 24946 69529 102355 2270 52612
4098 52612 37027 66414 -46615 21517 -9340 -91846 1899 47332 -84281 36725 -27490
4087 -27490 29202 125530 22586 -8508 39722 54093 115502 -27034 -10354 56816 41854
4076 41854 25661 31327 69174 66129 73415 64352 14744 28317 64802 126051 14106 73093
4064 73093 79460 85335 34417 67189 106950 44129 100159 177233 137400 108470 13142 146242
4052 146242 21421 23321 162224 108789 208286 149989 85514 160029 190896 91498 156546
4041 156546 34625 117499 98997 136239 137635 235158 162456 93454 116499 108104 113294 75707
4029 75707 155537 119869 161759 195105 227537 233093 196993 277163 270146 147734 153412 161422
$$ [...]
##END NTUPLES=NMR SPECTRUM
##END=
