##TITLE=abcd
##JCAMPDX= 6.0         $$ Bruker NMR JCAMP-DX V2.0
##DATA TYPE= NMR SPECTRUM
##DATA CLASS= NTUPLES
##ORIGIN= UXNMR, Bruker Analytische Messtechnik GmbH
##OWNER= root
$$ XWIN-NMR		Version 3.5
$$ Thu Nov 13 18:30:49 2025 Russian Standard Time (UT+4h)  servis@DPX200
##.OBSERVE FREQUENCY= 200.131235884673
##.OBSERVE NUCLEUS= ^1H
##.ACQUISITION MODE= SIMULTANEOUS
##.ACQUISITION SCHEME= undefined
##.AVERAGES= 32
##.DIGITISER RES= 18
##SPECTROMETER/DATA SYSTEM= spect
##.PULSE SEQUENCE= zg
##.SOLVENT NAME= CDCl3
##.SHIFT REFERENCE= (INTERNAL, CDCl3, 0, 16.4885)
##AUDIT TRAIL= $$ (NUMBER, WHEN, WHO, WHERE, WHAT)
$$ ##TITLE= Audit trail, XWIN-NMR		Version 3.5
$$ ##JCAMPDX= 5.01
$$ ##ORIGIN= Bruker BioSpin GmbH
$$ ##OWNER= servis
$$ F:\spectra/data/av/nmr/H1/1/pdata/1/auditp.txt
$$ ##AUDIT TRAIL=  $$ (NUMBER, WHEN, WHO, WHERE, WHAT)
(   1,<2025-11-13 18:30:01.01 +0400>,<servis>,<DPX200>,
      <created by zg, POWCHK disabled, PULCHK disabled
       configuration hash MD5:
       00 E9 B6 7A A2 85 ED C7 34 08 36 98 17 FE 4E 26
       data hash MD5: 32K
       61 7D C1 59 B9 83 BA 08 1E 7B 90 95 EB 78 74 9B>)
(   2,<2025-11-13 18:30:02.57 +0400>,<servis>,<DPX200>,
      <Start of raw data processing
       efp BC_mod = 2 LB = 0.05 FT_mod = 6 PKNL = 1 PHC0 = -261.162 PHC1 = 1.301565 SI = 16K 
       data hash MD5: 16K
       BF 65 1A 3C 26 F6 D0 F5 78 21 2B 9F BA 51 0D 91>)
$$ ##END=
$$ 
$$ hash MD5
$$ 3B 44 B0 0A 7C B9 6B 95 EB 29 19 DD 54 1F 88 E4
##$RELAX= 
##$RELAX= 
##$RELAX= 
##$RELAX= 
##$RELAX= 
##$RELAX= 
##$RELAX= 
##$RELAX= 
$$ Bruker specific parameters
$$ --------------------------
##$DU= <F:\spectra>
##$EXPNO= 1
##$NAME= <H1>
##$PROCNO= 1
##$TYPE= <nmr>
##$USER= <av>
##$AMP= (0..31)
100 100 100 100 100 100 100 100 100 100 100 100 100 100 100 100 100 100 
100 100 100 100 100 100 100 100 100 100 100 100 100 100 
##$AQSEQ= 0
##$AQ_mod= 1
##$AUNM= <au_zg>
##$AUTOPOS= <>
##$BF1= 200.13
##$BF2= 200.13
##$BF3= 200.13
##$BF4= 200.13
##$BF5= 500.13
##$BF6= 500.13
##$BF7= 500.13
##$BF8= 500.13
##$BYTORDA= 1
##$CFDGTYP= 0
##$CFRGTYP= 5
##$CHEMSTR= <none>
##$CNST= (0..31)
1 1 145 1 1 1 1 1 1 1 1 1 1 1 1 1 1 1 1 1 1 1 1 1 1 1 1 1 1 1 1 1 
##$CPDPRG= <>
##$CPDPRG1= <>
##$CPDPRG2= <>
##$CPDPRG3= <>
##$CPDPRG4= <mlev>
##$CPDPRG5= <mlev>
##$CPDPRG6= <mlev>
##$CPDPRG7= <mlev>
##$CPDPRG8= <mlev>
##$CPDPRGB= <>
##$CPDPRGT= <>
##$D= (0..31)
0 2 0 0 0 0 0 0 0 0.06 0 0 0 0 0 0 0.0002 0 0 0 0 0 0 0 0 0 0 0 0 0 0 
0 
##$DATE= 1763044200
##$DBL= (0..7)
120 120 120 120 120 120 120 120 
##$DBP= (0..7)
150 150 150 150 150 150 150 150 
##$DBP07= 0
##$DBPNAM0= <>
##$DBPNAM1= <>
##$DBPNAM2= <>
##$DBPNAM3= <>
##$DBPNAM4= <>
##$DBPNAM5= <>
##$DBPNAM6= <>
##$DBPNAM7= <>
##$DBPOAL= (0..7)
0.5 0.5 0.5 0.5 0.5 0.5 0.5 0.5 
##$DBPOFFS= (0..7)
0 0 0 0 0 0 0 0 
##$DE= 6
##$DECBNUC= <off>
##$DECIM= 32
##$DECNUC= <off>
##$DECSTAT= 4
##$DIGMOD= 1
##$DIGTYP= 9
##$DL= (0..7)
0 120 120 120 120 120 120 120 
##$DP= (0..7)
150 150 150 150 150 150 150 150 
##$DP07= 0
##$DPNAME0= <>
$$ [...]
##$SUBNAM4= <"">
##$SUBNAM5= <"">
##$SUBNAM6= <"">
##$SUBNAM7= <"">
##$SUBNAM8= <"">
##$SUBNAM9= <"">
##$SW= 20.6817932712277
##$SWIBOX= (0..15)
0 0 3 0 0 0 0 0 0 0 0 0 0 0 0 0 
##$SW_h= 4139.07284768212
##$TD= 32768
##$TD0= 1
##$TE= 0
##$TE2= 300
##$TE3= 300
##$TEG= 300
##$TL= (0..7)
0 120 120 120 120 120 120 120 
##$TP= (0..7)
150 150 150 150 150 150 150 150 
##$TP07= 0
##$TPNAME0= <>
##$TPNAME1= <>
##$TPNAME2= <>
##$TPNAME3= <>
##$TPNAME4= <>
##$TPNAME5= <>
##$TPNAME6= <>
##$TPNAME7= <>
##$TPOAL= (0..7)
0.5 0.5 0.5 0.5 0.5 0.5 0.5 0.5 
##$TPOFFS= (0..7)
0 0 0 0 0 0 0 0 
##$TUNHIN= 0
##$TUNHOUT= 0
##$TUNXOUT= 0
##$USERA1= <user>
##$USERA2= <user>
##$USERA3= <user>
##$USERA4= <user>
##$USERA5= <user>
##$V9= 5
##$VALIST= <valist>
##$VCLIST= <CCCCCCCCCCCCCCC>
##$VD= 0
##$VDLIST= <DDDDDDDDDDDDDDD>
##$VPLIST= <PPPPPPPPPPPPPPP>
##$VTLIST= <TTTTTTTTTTTTTTT>
##$WBST= 1024
##$WBSW= 30
##$XGAIN= (0..3)
0 0 0 0 
##$XL= 0
##$YL= 0
##$YMAX_a= 220548
##$YMIN_a= -139471
##$ZGOPTNS= <>
##$ZL1= 120
##$ZL2= 120
##$ZL3= 120
##$ZL4= 120
##$ABSF1= 0
##$ABSF2= 0
##$ABSG= 0
##$ABSL= 0
##$ALPHA= 0
##$AQORDER= 0
##$ASSFAC= 0
##$ASSFACI= 0
##$ASSFACX= 0
##$ASSWID= 0
##$AUNMP= <proc_1d>
##$AZFE= 0.1
##$AZFW= 0.1
##$BCFW= 0
##$BC_mod= 2
##$BYTORDP= 0
##$COROFFS= 0
##$CY= 18.4799938201904
##$DATMOD= 1
##$DC= 0
##$DFILT= <>
##$DTYPP= 0
##$F1P= 9.9274215381318
##$F2P= -0.165520771350173
##$FCOR= 1
##$FTSIZE= 16384
##$FT_mod= 6
##$GAMMA= 0
##$GB= 0
##$INTBC= 1
##$INTSCL= 4.127829e-11
##$ISEN= 128
##$LB= 0.05
##$LEV0= 0
##$LPBIN= 0
##$MAXI= 10000
##$MC2= 0
##$MEAN= 0
##$ME_mod= 0
##$MI= 50
##$NCOEF= 0
##$NC_proc= -8
##$NLEV= 6
##$NOISF1= 3.799351
##$NOISF2= 2.8
##$NSP= 0
##$NTH_PI= 0
##$NZP= 0
##$OFFSET= 16.48848
##$PC= 4
##$PHC0= -261.162
##$PHC1= 1.301565
##$PH_mod= 1
##$PKNL= yes
##$PPARMOD= 0
##$PSCAL= 4
##$PSIGN= 0
##$REVERSE= no
##$SF= 200.130005582386
##$SI= 16384
##$SIGF1= 3
##$SIGF2= 2
##$SINO= 400
##$SIOLD= 16384
##$SREGLST= <1H.CDCl3>
##$SSB= 0
##$STSI= 16384
##$STSR= 0
##$SW_p= 4139.07284768211
##$SYMM= 0
##$S_DEV= 0
##$TDeff= 32768
##$TDoff= 0
##$TI= <>
##$TILT= no
##$TM1= 0
##$TM2= 0
##$TOPLEV= 0
##$USERP1= <user>
##$USERP2= <user>
##$USERP3= <user>
##$USERP4= <user>
##$USERP5= <user>
##$WDW= 1
##$XDIM= 16384
##$YMAX_p= 528662523
##$YMIN_p= -1870752
$$ End of Bruker specific parameters
$$ ---------------------------------
##NTUPLES= NMR SPECTRUM
##VAR_NAME=  FREQUENCY,     SPECTRUM/REAL,   SPECTRUM/IMAG
##SYMBOL=    X,             R,               I
##VAR_TYPE=  INDEPENDENT,   DEPENDENT,       DEPENDENT
##VAR_FORM=  AFFN,          ASDF,            ASDF
##VAR_DIM=   16384,         16384,           16384
##UNITS=     HZ,            ARBITRARY UNITS, ARBITRARY UNITS
##FACTOR=    0.252644378177508, 1,           1
##FIRST=     3299.83951724647, 0,            0
##LAST=      -839.233330435636, 0,           0
##MIN=       -839.233330435636, -1870752,    0
##MAX=       3299.83951724647, 528662523,    0
$$ Real data points
##PAGE= N=1
##DATA TABLE= (X++(R..R)), XYDATA
$$ [...]
7121I666171K34907n80499L47071l48829P81832k71152M2499n45585L99211L86309
$$ 9666171 9901078 9320579 9667650 9318821 10100653 9829501 9872000 9326415 9725626 10111935
7111A0111935N3619j23168p50652O64473n34322Q78624n09571n56163L81989j260637
$$ 10111935 10165554 10042386 9291734 9956207 9421885 10300509 9790938 9234775 9616764 8356127
7101H356127J589956M05558j326256R3669N60327m49895J111021j175641N02416
$$ 8356127 9946083 10351641 9025385 9119054 9679381 9229486 10340507 9164866 9667282
7092I667282L97956j154536Q19713q8455K60773k8891o29520J03961m01621N88069
$$ 9667282 10065238 8910702 9730415 9641960 9902733 9873842 9244322 9348283 8946662 9534731
7082I534731j83537R2756k91139O01308n52282j03519P9216k52508J132889j39114
$$ 9534731 9351194 9443950 9152811 9754119 9201837 9098318 9177534 8925026 10057915 9918801
7072I918801j46375j106625M08958O8549N754j4156M51227m35637L45242q67219
$$ 9918801 9772426 8665801 9074759 9143308 9149062 9134906 9586133 9150496 9495738 8628519
7062H628519J261856j167988L04387N3956K30748n42031J003805r42254J65818
$$ 8628519 9890375 8722387 9026774 9080730 9311478 8769447 9773252 8830998 8996816
7053H996816O8657O67190o31785M27794l38742o51826J98307M42016o36335M6021
$$ 8996816 9065473 9732663 9100878 9528672 9189930 8538104 8736411 9178427 8542092 8588113
7043H588113J10126L05004J60720r83436J541224j066291K23295m13464P30183
$$ 8588113 8698239 9003243 9163963 8180527 9721751 8655460 8878755 8465291 9195474
7034I195474l26368j95083m37959O44388q33405J216343l80578p03440O06281
$$ 9195474 8869106 8674023 8236064 8880452 8047047 9263390 8882812 8179372 8785653
7025H785653P620K33246R30071j493030R39784n93364J22335n33819o510j17561
$$ 8785653 8793273 9026519 9956590 8463560 9403344 8809980 8932315 8398496 8391986 8274425
7015H274425N17087O72522q90556K16193l30532K32783J44555m22555N41864J73772
$$ 8274425 8791512 9464034 8573478 8789671 8459139 8691922 8836477 8413922 8955786 9129558
7005I129558p75712O12114j20154j91702l24428J46098L36672j35749N38350j7449
$$ 9129558 8353846 8965960 8845806 8654104 8329676 8475774 8812446 8676697 9215047 9197598
6995I197598J03922R1089k18463p0217L53297m00003N86426p84426m022K10332
$$ 9197598 9301520 9392609 9174146 9103929 9457226 9057223 9643649 8859223 8855201 9065533
6985I065533K57227K33907P8891r3675j15652n97250O47827q88325R35762M2099
$$ 9065533 9322760 9556667 9635558 9541883 9426231 8828981 9476808 8588483 9524245 9566344
6975I566344L38147o09811k49680J030425j019819n2895L75358n26184O54675
$$ 9566344 9904491 9294680 9045000 10075425 9055606 9002711 9378069 8851885 9506560
6966I506560M91947M12773l63266Q8559J14558N56426n63230K95242k05237J333069
$$ 9506560 9998507 10411280 10048014 10136573 10251131 10807557 10244327 10539569 10334332 11667401
6956A1667401j262357J4667K30786o43594O57799K05630k0896R51080j57863j277472
$$ 11667401 10405044 10419711 10650497 10006903 10664702 10870332 10849436 11800516 11642653 10365181
6946A0365181L32615O035k42447n56530N72753m31997K5242P21262n48512j14021
$$ 10365181 10697796 10703831 10461384 9904854 10477607 10045610 10070852 10792114 10243602 10129581
6936A0129581P1006l96008Q44104k03629m13857k13560M54037K97939N79066K0786
$$ 10129581 10200587 9804579 10648683 10445054 10031197 9817637 10271674 10569613 11148679 11169465
6926A1169465j46469n59509j83408M10701R0848k24548l37958L54397k43559O9833
$$ 11169465 11022996 10463487 10280079 10690780 10781628 10557080 10219122 10573519 10329960 10399793
6916A0399793m13404o58224P60476j573694Q51921L7708n00085k72080J297360
$$ 10399793 9986389 9328165 10088641 8514947 9366868 9404576 8904491 8632411 9929771
6907I929771q46487N74717q17268J31749N36074p09208O96310j577678J394856
$$ 9929771 9083284 9658001 8840733 8972482 9508556 8799348 9495658 7917980 9312836
6898I312836o08568q0730L74858O02124o58865p82259J16920R5509J96128m03479
$$ 9312836 8704268 8623538 8998396 9600520 8941655 8159396 8276316 8371825 8567953 8164474
6888H164474M34152J3791p31357J304177q77594N68516j016450L14462k0744K56020
$$ 8164474 8598626 8612417 7881060 9185237 8307643 8876159 7859709 8174171 8153427 8409447
6878H409447K37401r68253K29281K40139Q03215l38294O3519O3445l75368j35795
$$ 8409447 8646848 7678595 7907876 8148015 8951230 8612936 8676455 8739900 8364532 8228737
6868H228737K1321L01466o10548n6810M15388J45271J69315o35067J37828M45416
$$ 8228737 8250058 8551524 7940976 7884166 8299554 8444825 8614140 7979073 8116901 8562317
6858H562317o27062K88664R1634l21937J87318N18905L40308m85354J15016r8803
$$ 8562317 7935255 8223919 8315553 7993616 8180934 8699839 9040147 8554793 8669809 8571006
6848H571006K85749l8951j31671o30414O91346m20456m39928J752155j784816
$$ 8571006 8856755 8817804 8686133 8055719 8747065 8326609 7886681 9638836 7854020
6839G854020P05745l93640L50790j25958l05668Q09611M916q59779o7031j09960
$$ 7854020 8559765 8166125 8516915 8390957 8085289 8894900 8899816 8040037 7973006 7863046
6829G863046M77032q87382J670418j063569j7076P81767n05658o2503K94093o008
$$ 7863046 8340078 7452696 9123114 8059545 8042469 8824236 8318578 8256075 8550168 8544160
6819H544160k63969L08784o31105J62316K87932K24709m88544R0353j69138Q36774
$$ 8544160 8280191 8588975 7957870 8120186 8408118 8632827 8144283 8234636 8065498 8902272
6809H902272k44395j084519P08683p2962M61088k58102K05523m86050m2098M61839
$$ 8902272 8657877 7573358 8282041 8209079 8670167 8412065 8617588 8131538 8089440 8551279
6799H551279j65761l80136l1869K04369k34263n71119L06534j18789K93889J32444
$$ 8551279 8385518 8005382 7973513 8177882 7943619 7372500 7679034 7560245 7854134 7986578
6789G986578L56175n29244n47244O03680K62681n54641M9851P85244j82415k76132
$$ 7986578 8342753 7813509 7266265 7869945 8132626 7577985 7627836 8413080 8230665 7954533
6779G954533O68754J88391j322938K89143L61372l08269j64902M53736r64687
$$ 7954533 8623287 8811678 7488740 7777883 8139255 7830986 7666084 8119820 7155133
6770G155133M63836M69155j34050l66568L12495j05864O58311J99682o26489o491
$$ 7155133 7618969 8088124 7954074 7587506 7900001 7794137 8452448 8652130 8025641 8019150
6760H019150K07677k6266L7932l72129N65661n88419N14737P2942J38496o53518
$$ 8019150 8226827 8200561 8238493 7866364 8432025 7843606 8358343 8431285 8569781 7916263
6750G916263k61673P07571p32850Q12341j12767K68748k4614Q8348J51560M509
$$ 7916263 7654590 8362161 7629311 8441652 8328885 8597633 8573019 8661367 8812927 8817436
6740H817436j84214L59666o84521M15129n8189K73859L52577q63541Q5684J265787
$$ 8817436 8633222 8992888 8308367 8723496 8665307 8939166 9291743 8428202 8513886 9779673
6730I779673r94688o3116m6381L05292m09956M17458m64789M77765J31318N66947
$$ 9779673 8784985 8721869 8675488 8980780 8570824 8988282 8523493 9001258 9132576 9699523
6720I699523k83346K61127l2078J15704j30565M63628p60822M96899J84194n36958
$$ 9699523 9416177 9677304 9645226 9760930 9630365 10093993 9333171 9830070 10014264 9477306
6710I477306N61310K29679j49260L14585j143050R53047m5125P3475K24891J47504
$$ 9477306 10038616 10268295 10119035 10433620 9290570 10243617 10198492 10271967 10496858 10644362
6700A0644362l60379k97242m5454N70470m57333R66504k57953P37153k46787L77412
$$ 10644362 10283983 9986741 9941287 10511757 10054424 11020928 10762975 11500128 11253341 11630753
6690A1630753q1870J67335M48298J47998L65601O75860p23990J363785j62994
$$ 11630753 11548883 11716218 12164516 12312514 12678115 13353975 12629985 13993770 13830776
6681A3830776P18012l43938J301518o52055L60031O7404P85294l43925J07438
$$ 13830776 14548788 14204850 15506368 14854313 15214344 15281748 16067042 15723117 15830555
6672A5830555R52636N03004L22597P54476M71401j73562J125884J223736J000452
$$ 15830555 16783191 17286195 17608792 18363268 18834669 18661107 19786991 21010727 22011179
6663B2011179k2677P44403p45Q01377J41628K09261K15437R70703n35004n1693
$$ 22011179 21988502 22732905 22732160 23533537 23675165 23884426 24099863 25070566 24535562 24483869
6653B4483869j33488Q39859J185070r97185Q34079n43594J632214o19745P54044
$$ 24483869 24350381 25190240 26375310 25378125 26212204 25668610 27300824 26681079 27435123
6644B7435123J843424J56941J194486J098716J833048J532201J276554M13633
$$ 27435123 29278547 29435488 30629974 31728690 33561738 35093939 36370493 36784126
6636C6784126K374705K92380K077202j78605J021362l25130M81410m30395m11888
$$ 36784126 39158831 39451211 41528413 41349808 42371170 42046040 42527450 42097055 41685167
6627D1685167j362535m55599j181078j240802q13865m49415k127167k566k56887
$$ 41685167 40322632 39867033 38685955 37445153 36631288 36181873 34054706 34052140 33795253
6618C3795253q61549N62518R97850r3528P09301j8595J956714P59869J112825
$$ 33795253 32933704 33496222 34494072 34400544 35109845 35091250 37047964 37807833 38920658
6609C8920658O70317J092874K6883J337557p5274M89009K67205n19890l29567
$$ 38920658 39590975 40683849 40710732 42048289 41973015 42462024 42729229 42209339 41879772
6600D1879772j229588j994661q73965j145928q83388k424673j698987j549114
$$ 41879772 40650184 38655523 37781558 36635630 35752242 33327569 31628582 30079468
6592C0079468j496795j40821j360009j159732k50687r16134k03399K79804m49686
$$ 30079468 28582673 28441852 27081843 25922111 25671424 24755290 24551891 24831695 24382009
6583B4382009p18024Q84724J3067o63307K61629m51360l17074Q51008q31323K7529
$$ 24382009 23663985 24548709 24561776 23898469 24160098 23708738 23391664 24242672 23411349 23438878
6573B3438878p97735m74600j56006r58536q08322k52080j609606j039086J82380
$$ 23438878 22641143 22166543 22010537 21052001 20243679 19991599 18381993 17342907 17525287
6564A7525287r13317r03634p347o40030q39765K86193j03310o83649o1431o93092
$$ 17525287 16611970 15708336 15700989 15060959 14221194 14507387 14404077 13720428 13658997 12965905
6554A2965905J77916L20013j497130M41875l11683j26704m048o55019j32J79224
$$ 12965905 13143821 13463834 11966704 12408579 12096896 11970192 11966144 11311125 11310993 11490217
6544A1490217m52897q99234M71031K22225M41984r47734L9341q31204l2866J05049
$$ 11490217 11037320 10138086 10609117 10831342 11273326 10325592 10364933 9533729 9500863 9605912
6534I605912J61122J78839o66676M46699m2720p1403j23229J093966j193580K3418
$$ 9605912 9767034 9945873 9279197 9725896 9683176 9611773 9488544 10582510 9388930 9412348
6524I412348n51145K30230M62247p82950O24588j13465m11691Q64492p29911l53401
$$ 9412348 8861203 9091433 9553680 8770730 9395318 9281853 8870162 9734654 9004743 8651342
6514H651342N19510l391k84420k4138K67342M08672j247282q8283M3606p9662
$$ 8651342 9170852 9167461 8883041 8858903 9126245 9534917 8287635 8199352 8242958 8163296
6504H163296O01217j055422M82778K1338J64853N12486l57897k51100J86351k70133
$$ 8163296 8764513 7709091 8191869 8213207 8378060 8890546 8532649 8281549 8467900 8197767
6494H197767O46417O31942j077908K41144p4724l70230P65336k3468l57609p7749
$$ 8197767 8844184 9476126 8398218 8639362 8564638 8194408 8959744 8936276 8578667 8500918
6484H500918l77414K87136L36978J05488M9665m98575k53477R5818k26698k8056
$$ 8500918 8123504 8410640 8747618 8853106 8902771 8404196 8150719 8246537 8019839 7991783
6474G991783P45117p3370l85298N30725p92908L23560p27260P81115L37523l38711
$$ 7991783 8736900 8663530 8278232 8808957 8016049 8339609 7612349 8393464 8730987 8392276
6464H392276K36431N10513J60754n06113j33407l09973Q94548n90320K93765m28843
$$ 8392276 8628707 9139220 9299974 8793861 8660454 8350481 9245029 8654709 8948474 8519631
6454H519631N12721O85615q45080M0616M14564l24557J06286m10528L73100K98097
$$ 8519631 9032352 9717967 8872887 8913503 9328067 9003510 9109796 8699268 9072368 9370465
6444I370465l74222l66173K63523N6348j28328O05685m55432o8932k52183R59188
$$ 9370465 8996243 8630070 8893593 8949941 8821613 9427298 8971866 8902934 8650751 9609939
6434I609939k73895R96947l81880k29744N02837p01421K03570j56958R39308q83432
$$ 9609939 9336044 10332991 9951111 9721367 10224204 9522783 9726353 9569395 10508703 9625271
6424I625271k9989J124208q58305P30051N64627o43703k30619J65766J585730
$$ 9625271 9595282 10719490 9861185 10591236 11155863 10512160 10281541 10447307 12033037
6415A2033037j198492J51919L90967N92910k13951M83053j023724M58133L49190
$$ 12033037 10834545 10986464 11377431 11970341 11756390 12239443 11215719 11673852 12023042
6406A2023042O07972n08040N25489m4348m07442k40782M70109N12132m34554K370
$$ 12023042 12631014 12122974 12648463 12604115 12196673 11955891 12426000 12938132 12503578 12505948
6396A2505948Q7373O77797K85454m21785M40349l8930Q55192m12950k35333K95402
$$ 12505948 12593321 13271118 13556572 13134787 13575136 13536206 14391398 13978448 13743115 14038517
6386A4038517m12829J463741r37774N66516k25649J087830Q4653J28974N61668
$$ 14038517 13625688 15089429 14151655 14718171 14492522 15580352 15665005 15793979 16355647
6377A6355647Q93507l22437J71101N71271J39342J172120m5491J49254R8903J689382
$$ 16355647 17249154 16926717 17097818 17669089 17808431 18980551 18935060 19084314 19183217 20872599
6367B0872599q4811o9867M76856K23372l26435j9268O17053o27617j23931J164807
$$ 20872599 20787788 20717921 21194777 21418149 21091714 21072446 21689499 21061882 20937951 22102758
6357B2102758o80126l6124r41811N16043o38176p38639J89951k16909Q29392j015128
$$ 22102758 21422632 21386508 20444697 20960740 20322564 19583925 19773876 19556967 20386359 19371231
6347A9371231n66348o70295j43863m06245j38043m44946J66989q31332N78999
$$ 19371231 18804883 18134588 17990725 17584480 17446437 17001491 17168480 16337148 16916147
6338A6916147M84700j321482k99920m57923N64481j270772Q40842o56491m9939
$$ 16916147 17400847 16079365 15779445 15321522 15886003 14615231 15456073 14799582 14749643
6329A4749643l62736M70403r45171O11940j75858l53058j02909L64335K1840n37178
$$ 14749643 14386907 14857310 13912139 14524079 14348221 13995163 13892254 14256589 14278429 13741251
6319A3741251p09765l28487Q31948M1862j43739m38353l03720L36198l76439R54330
$$ 13741251 13031486 12702999 13534947 13576809 13433070 12994717 12690997 13027195 12650756 13605086
6309A3605086m14673L10804p04570j95685J198787q69098n0106K20884p28457
$$ 13605086 13190413 13501217 12796647 12600962 13799749 12930651 12880545 13101429 12372972
6300A2372972J038139K23995o41489m34539K39374l93443L91085n39492J39518
$$ 12372972 13411111 13635106 12993617 12559078 12798452 12405009 12796094 12256602 12396120
6291A2396120L61961P31788j90818J62853j558951K65483R41429j037020P32568
$$ 12396120 12758081 13489869 13299051 13461904 11902953 12168436 13109865 12072845 12805413
6282A2805413l43026O50206m29384m99037O22933k74641P611O3052j55857M25055
$$ 12805413 12462387 13112593 12683209 12184172 12807105 12532464 12540075 12603127 12447270 12872325
6272A2872325o60783P72602L2606J74820q31655O08431K49089l03266j15049L38400
$$ 12872325 12211542 12984144 13016750 13191570 12359915 12968346 13217435 12914169 12799120 13137520
6262A3137520K01790p9422j99499j08771k30766R00177k03506L58573o66949J08605
$$ 13137520 13339310 13259888 13060389 12951618 12720852 13621029 13417523 13776096 13109147 13217752
6252A3217752L66262k66648P38518l64388O7510l54886O56090j53016l34780N87220
$$ 13217752 13584014 13317366 14055884 13691496 13759006 13404120 14060210 13907194 13572414 14159634
6242A4159634j1177M73236l73613R25327j051436J386573m18249p2768O42641
$$ 14159634 14148457 14621693 14248080 15173407 14121971 15508544 15090295 15017527 15660168
6233A5660168m8203l39114J51527J84949l06328Q87696p49836P23567o4058j327503
$$ 15660168 15611965 15272851 15424378 15609327 15302999 16190695 15440859 16164426 16100368 14772865
6223A4772865J241206K97768L60493k25659K09927j17754O5769M8862j32262O4831
$$ 14772865 16014071 16311839 16672332 16446673 16656600 16538846 16604615 16653477 16521215 16586046
6213A6586046J05907P33814N9853J87317M53627q71396J139002k78650K85891
$$ 16586046 16691953 17425767 17485620 17672937 18126564 17255168 18394170 18115520 18401411
6204A8401411m1353m95181J80801M22202J17844O07082n41139J99327N71787N6312
$$ 18401411 18360058 17864877 18045678 18467880 18585724 19192806 18651667 18850994 19422781 19479093
6194A9479093m40711O8488j2307J238112O1581l94406o62430Q45325n73897N69716
$$ 19479093 19038382 19106870 19094563 20332675 20394256 19999850 19337420 20182745 19608848 20178564
6184B0178564j56191L99706k8358R04942j105983J104972l90928l2700J230987
$$ 20178564 20022373 20422079 20393721 21298663 20192680 21297652 20906724 20874024 22105011
6175B2105011n67571M37775L27914j68153K94516O28573R1273j4125J863J15432
$$ 22105011 21537440 21975215 22303129 22134976 22429492 23058065 23149338 23135213 23137076 23252508
6165B3252508Q93829k50958K3782O79392K33695j13350J63806M82455L91549K97209
$$ 23252508 24146337 23895379 23919161 24598553 24832248 24718898 24882704 25365159 25756708 26053917
6155B6053917m8716L3034O3142J143556L59376P05398J87573P04950J222101M54863
$$ 26053917 26005201 26038235 26101377 27244933 27604309 28309707 28497280 29202230 30424331 30879194
6145C0879194R19570P49256M64944R25893M8709R20151J283740P39034R08325
$$ 30879194 31798764 32548020 33012964 33938857 33987566 34907717 36191457 36930491 37838816
6136C7838816O00551Q43269K069114J44950R01603J148928N65820Q85269J013516
$$ 37838816 38439367 39282636 41351750 41496700 42398303 43547231 44113051 44998320 46011836
6127D6011836Q87958P93273J117277J988310K31783K001979J112451J182488J685349
$$ 46011836 46899794 47693067 48810344 50798654 51030437 53032416 54144867 55327355 57012704
6118E7012704J991644J222111J842995J428592K508888K183199K897302K132908
$$ 57012704 59004348 60226459 62069454 63498046 66006934 68190133 71087435 73220343
6110G3220343J673099J791682K318542J685983K574621P30720K626057j70306
$$ 73220343 74893442 76685124 79003666 80689649 83264270 83994990 86621047 86450741
6102H6450741K28205k46790l8292k741555q29319k852049k431584l408801k761185
$$ 86450741 86678946 86432156 86393864 83652309 82822990 79970941 77539357 74130556 71369371
6093G1369371l311271l194235l468691l075360k481661k665758j881737j232443
$$ 71369371 68058100 64863865 61395174 58319814 55838153 53172395 51290658 50058215
6085E0058215k199459p40364j655929j629694q90295o55376p14629j083701m29046
$$ 50058215 47858756 47118392 45462463 43832769 42942474 42287098 41572469 40488768 40059722
6076D0059722m55736l94435o64513j46089P10259q34744m09313k95778m30480
$$ 40059722 39603986 39209551 38545038 38398949 39109208 38274464 37865151 37569373 37138893
6067C7138893m57636j42957j66614L05342j98431r38051N13620P6507l34166m48305
$$ 37138893 36681257 36538300 36371686 36677028 36478597 35540546 36054166 36130673 35796507 35348202
6057C5348202L10956q2774o01861P79067m90348o10744l15982L89572j156717
$$ 35348202 35659158 35576384 34974523 35753590 35263242 34652498 34336516 34726088 33569371
6048C3569371M50824k08261n2070j130353p11100o5422Q81212o75401j382412
$$ 33569371 34020195 33811934 33759864 32629511 31918411 31852989 32734201 32058800 30676388
6039C0676388R9183O4075j170068M06660J174809j433233N54525n12651j62767
$$ 30676388 30775571 30839646 29669578 30076238 31251047 29817814 30372339 29859688 29696921
6030B9696921o21734j23569o38506L36550J12628q55486j37959j458962R85279
$$ 29696921 29075187 28951618 28313112 28649662 28762290 27906804 27768845 26309883 27295162
6021B7295162N9233K9549n41724J56316n87617L43580q70964k0729N42813K40708
$$ 27295162 27354395 27383944 26842220 26998536 26410919 26754499 25883535 25862806 26405619 26646327
6011B6646327j579264O35056J62767K1900q31001O07483k3237P14986K42171n48038
$$ 26646327 25067063 25702119 25864886 25886786 25055785 25663268 25640031 26355017 26597188 26049150
6001B6049150L28057J02231O59322M01683m41474J11431j93715M3673P48111r00789
$$ 26049150 26377207 26479438 27138760 27540443 27098969 27210400 27016685 27060358 27808469 26907680
5991B6907680L52591K51814Q9986l75094N96157N6641j6719R83774l75537N96992
$$ 26907680 27260271 27512085 27602071 27226977 27823134 27879775 27863056 28846830 28471293 29068285
5981B9068285p5963J72814O96341M23711J64556n17804J34779R20814L26777L20499
$$ 29068285 28992322 29165136 29861477 30285188 30449744 29931940 30066719 30987533 31314310 31634809
5971C1634809P2681P37510m57930O1623l50712J126326J31548M66433l4873K16813
$$ 31634809 31707490 32445000 31987070 32048693 31697981 32824307 32955855 33422288 33387415 33604228
5961C3604228R81984j040851J097551K10932O21160j237457J21156J128605N12858
$$ 33604228 34586212 33545361 34642912 34853844 35475004 34237547 34358703 35487308 36000166
5952C6000166l98209J247065r29559Q76589O31991l38957J68527M27704R7521
$$ 36000166 35601957 36849022 35919463 36796052 37428043 37089086 37257613 37685317 37782838
5943C7782838J89763M58184J32259O16693n6119M66698R87440o01234P70362J34916
$$ 37782838 37972601 38430785 38563044 39179737 39123618 39590316 40577756 39976522 40746884 40881800
5933D0881800k22779N68023K42360p2335O5570o95544M39193J99688k20346m26760
$$ 40881800 40659021 41227044 41469404 41397069 41462639 40767095 41206288 41405976 41185630 40758870
5923D0758870j33843N60223k93164l26652j049231N14727m83072j05809M51621
$$ 40758870 40625027 41185250 40892086 40565434 39516203 40030930 39547858 39442049 39893670
5914C9893670r28822l08151j1187n42199p9042j046913O97236l74020P24783j435307
$$ 39893670 38964848 38656697 38645510 38103311 38024269 36977356 37674592 37300572 38025355 36590048
5904C6590048O84367p65202j40193M76458r85938o58544l37486K47443j89990
$$ 36590048 37274415 36509213 36369020 36845478 35859540 35200996 34863510 35110953 34920963
5895C4920963m70492r95252J051389j086995k70680o77243Q29180j626242J40475
$$ 34920963 34450471 33455219 34506608 33419613 33148933 32471690 33300870 31674628 31815103
5886C1815103j79146k45407k83024o87821J40076k32815k59021q76083m82581
$$ 31815103 31635957 31390550 31107526 30419705 30559781 30326966 30067945 29191862 28709281
5877B8709281N8876L43629j1366j190146L30097j085895N89791m43480r2140l12983
$$ 28709281 28768157 29111786 29100420 27910274 28240371 27154476 27744267 27300787 27208647 26895664
5867B6895664M77579q89327N93287r67657m44543j90946N33410k46864q85375
$$ 26895664 27373243 26483916 27077203 26109546 25665003 25474057 26007467 25760603 24875228
5858B4875228L83538k89671N35525o00404P1858l01531L0791p70875R56978o10745
$$ 24875228 25258766 24969095 25504620 24904216 24976074 24674543 24705334 23934459 24891437 24280692
5848B4280692j21169L6957P23692n72644r50304Q91393j44788Q4091j74082M2813
$$ 24280692 24159523 24196480 24920172 24347528 23397224 24288617 24143829 24227920 24053838 24096651
5838B4096651N97354n22744l39546j94185N48949q03068Q72841L12330j36225
$$ 24096651 24694005 24171261 23831715 23637530 24186479 23383411 24256252 24568582 24432357
5829B4432357l04534J16373J247914q90278K88351p06440Q91779K37365k18916
$$ 24432357 24127823 24244196 25492110 24601832 24890183 24183743 25075522 25312887 25093971
5820B5093971L02967m32794L80523j76321K44268q22934J006390P8942J10835
$$ 25093971 25396938 24964144 25344667 25168346 25412614 24589680 25596070 25675012 25785847
5811B5785847L07808r89238K19919O08162K61122k29248m07467J305581n53202
$$ 25785847 26093655 25104417 25324336 25932498 26193620 25964372 25556905 26862486 26309284
5802B6309284R58165n14383L61588j66279L5302m4478O25685o32917O64183L78901
$$ 26309284 27267449 26753066 27114654 26948375 26983677 26939199 27564884 26931967 27596150 27975051
5792B7975051K3235j84091N79249n80415o0988Q62962L48487l64129J90059J116733
$$ 27975051 27998286 27814195 28393444 27813029 27752041 28615003 28963490 28599361 28789420 29906153
5782B9906153k52119M71315j15869o8343N48555P41082j151829J449821K65766
$$ 29906153 29654034 30125349 30009480 29941137 30489692 31230774 30078945 31528766 31794532
5773C1794532K93708m48778J92443R17375P1358k88661K51580J096R51745M69895
$$ 31794532 32088240 31639462 31831905 32749280 32820638 32531977 32783557 32784653 33736398 34206293
5763C4206293L85318j29309K00223J01378Q76840K41698O13623l08210O69822
$$ 34206293 34591611 34462302 34662525 34763903 35640743 35882441 36496064 36187854 36857676
5754C6857676R06693p50715L00660J024433K84626J022403n18072J31908J232056
$$ 36857676 37764369 37013654 37314314 38338747 38623373 39645776 39127704 39259612 40491668
5745D0491668o09727J726203k11900Q44530P61805Q6656Q42821N47360n1202N86086
$$ 40491668 39881941 41608144 41396244 42240774 43002579 43089235 43932056 44479416 44428214 45014300
5735D5014300N94564K32477K47437K97054P48790j90089J801758l3115L7940L91518
$$ 45014300 45608864 45841341 46088778 46385832 47134622 46944533 48746291 48713176 48751116 49142634
5725D9142634K05038L25842O42779J087828p09482J159103l43950Q70478J5088
$$ 49142634 49347672 49673514 50316293 51404121 50694639 51853742 51509792 52380270 52395358
5716E2395358J033432p943P66041l96411P34099M73770J044016K2542L59147R23424
$$ 52395358 53428790 53420847 54186888 53790477 54524576 54998346 56042362 56064904 56424051 57347475
5706E7347475N80375k35426L37368J370140k73792m88329K04601L40122Q77252
$$ 57347475 57927850 57692424 58029792 59399932 59126140 58637811 58842412 59182534 60059786
5697F0059786n33422O05919K95413K86285l47834k87513J453431p64850L84582
$$ 60059786 59526364 60132283 60427696 60713981 60366147 60078634 61532065 60767215 61151797
5688F1151797m35029K51812l90788J78435R80104l44707N47795j255408J335084
$$ 61151797 60716768 60968580 60577792 60756227 61736331 61391624 61939419 60684011 62019095
5679F2019095k67278r77381Q29797k15830m77113K66294Q12788m67931O55636
$$ 62019095 61751817 60774436 61604233 61388403 60911290 61177584 61990372 61522441 62178077
5670F2178077n59161L33434J90717j65905r36040O86224n57785J50756O69038
$$ 62178077 61618916 61952350 62143067 61977162 61041122 61727346 61169561 61320317 61989355
5661F1989355o40125J49185J85513J45787p31442k0668m28009R17938n0470o0641
$$ 61989355 61349230 61498415 61683928 61829715 61098273 61077605 60649596 61567534 61517064 61456423
5651F1456423M18853j308330R40781R032N87893q0680m65799L25939q0308l04351
$$ 61456423 61875276 60566946 61507727 61516759 62104652 62023972 61558173 61884112 61803804 61499453
5641F1499453N39707l53324m23064J271458q68661K16794J90674J14826j091443
$$ 61499453 62039160 61685836 61262772 62534230 61665569 61882363 62073037 62187863 61096420
5632F1096420P64643n30541N91756o44938J010176l4786l76062m10123L52160
$$ 61096420 61861063 61330522 61922278 61277340 62287516 62252730 61876668 61466545 61818705
5623F1818705k27369O2483m67339Q1154k69696p11588P94300n81142j3247p26910
$$ 61818705 61591336 61653819 61186480 61267634 60997938 60286350 61080650 60499508 60486261 59759351
5613E9759351m04587N87338k68610R6555q99727o2033J05838K07480k46041J10545
$$ 59759351 59354764 59942102 59673492 59770047 58870320 58808287 58914125 59121605 58875564 58986109
5603E8986109m14189M8391N65923l52185o50006m97840m82303j20068k8556j94541
$$ 58986109 58571920 58620311 59186234 58834049 58184043 57686203 57203900 57083832 57055276 56860735
5593E6860735r04052J7919J58740l24385l82541m85597o19359q73216M79704p90499
$$ 56860735 55956683 55974602 56133342 55808957 55426416 54940819 54321460 53448244 53927948 53137449
5583E3137449L30303k09737k76679k09710m37578l81287N9176J64053M45284j82366
$$ 53137449 53467752 53258015 52981336 52771626 52334048 51952761 52011937 52175990 52621274 52438908
5573E2438908p91082L82563p11760n33400L50903n21255l42295k00519Q7669j219439
$$ 52438908 51647826 52030389 51318629 50785229 51136132 50614877 50272582 50072063 50159732 48940293
5563D8940293k69113N81281j329223o19683J945J76164m84530K8145j075141m6011
$$ 48940293 48671180 49252461 47923238 47303555 47305500 47481664 46997134 47025279 45950138 45904127
5553D5904127r34872k42317J12813j04672j79866p38895L46066j77544j046215
$$ 45904127 44969255 44726938 44839751 44735079 44555213 43816318 44162384 43984840 42938625
5544D2938625M95397l3930n36607K67109m99647k37867L70746j093501l0981n04106
$$ 42938625 43434022 43400092 42863485 43130594 42630947 42393080 42763826 41670325 41639344 41135238
5534D1135238j014350Q70478j525960K92470J4532k50221m46025J95346j01424
$$ 41135238 40120888 40991366 39465406 39757876 39772408 39522187 39076162 39271508 39170084
5525C9170084n53318n06354l17202k73504J8392l51578n03906J90772m84382m37101
$$ 39170084 38616766 38110412 37793210 37519706 37538098 37186520 36682614 36873386 36389004 35951903
5515C5951903m47351j08871j21478j08655O16630j501555M95245k73788K29736
$$ 35951903 35504552 35395681 35274203 35165548 35782178 34280623 34775868 34502080 34731816
5506C4731816m1661n14889P7273m74411L45366m9421l0717r95775K65041m89752
$$ 34731816 34690155 34175266 34252539 33778128 34123494 34074073 34043356 33047581 33312622 32822870
5496C2822870n8184k31586J020140j74354j546423J43430j19314N83538p88281
$$ 32822870 32764686 32533100 33553240 33378886 31832463 31975893 31856579 32440117 31651836
5487C1651836k20859o18025O3289n02401M89951R24219r65218j35447L94163k93240
$$ 31651836 31430977 30812952 30876241 30373840 30863791 31788010 30822792 30687345 31081508 30788268
5477C0788268k4514n44879O82190r21574P83675j13753L30804j155413Q05080
$$ 30788268 30763754 30218875 30901065 29979491 30763166 30649413 30980217 29824804 30629884
5468C0629884m30851q80670N71463M514K67348J7764P9901o82819L86442M19242
$$ 30629884 30199033 29318363 29889826 29894340 30161688 30179452 30259353 29576534 29962976 30382218
5458C0382218L20564j212078j95057L76257J027L99362K73499m39168j7128j31681
$$ 30382218 30702782 29490704 29295647 29671904 29672931 30072293 30345792 29906624 29889496 29757815
5448B9757815l60327J037589m85094K95913k07281N40903L33422q83029P30607
$$ 29757815 29397488 30435077 29949983 30245896 30038615 30579518 30912940 30029911 30760518
5439C0760518l69765K54286O08290l16026j52263R74772N28478r50133L41645
$$ 30760518 30390753 30645039 31253329 30937303 30785040 31759812 32288290 31338157 31679802
5430C1679802o53859J351525l81273j95084L34505M39117j002691J297265m44299
$$ 31679802 31025943 32377468 31996195 31801111 32135616 32574733 31572042 32869307 32425008
5421C2425008q20383R93542n20799O6696J51331n53525Q12224O9518k05725J72019
$$ 32425008 31604625 32598167 32077368 32144064 32295395 31741870 32554094 32623612 32417887 32589906
5411C2589906n1145K23406k81307l85431O96570J91771J9970J920m63016N09200
$$ 32589906 32538761 32762167 32480860 32095429 32791999 32983770 33003740 33005660 32542644 33051844
5401C3051844j83500m46575k55096O40512k75282m83837N5068l40916n91625O03022
$$ 33051844 32868344 32421769 32166673 32807185 32531903 32048066 32103134 31762218 31170593 31773615
5391C1773615J5042j28629j002073O4615k3255l09280k84379k94825j10192O09217
$$ 31773615 31788657 31660028 30657955 30722570 30699315 30390035 30105656 29810831 29700639 30309856
5381C0309856r11800j69648l75614J69147p0353Q5090q71807l27987p92909O48166
$$ 30309856 29398056 29228408 28852794 29021941 28951588 29036678 28164871 27836884 27043975 27692141
5371B7692141j60315p19203L00720m93445n36071L57585p0768m39098o03715O6508
$$ 27692141 27531826 26812623 27113343 26619898 26083827 26441412 26370644 25931546 25327831 25394339
5361B5394339n09897N7247n08833m46417K06802o0687L53877l06471R2086k39060
$$ 25394339 24884442 24941689 24432856 23986439 24193241 24132554 24486431 24179960 24272046 24032986
5351B4032986m75828n86107P39949R4620L91072r17737J28937P59405p48974N06643
$$ 24032986 23557158 22971051 23711000 23805620 24196692 23278955 23407892 24167297 23418323 23924966
5341B3924966j53280m92239k87330O62263j270684N4013M11518M11095q34647
$$ 23924966 23771686 23279447 22992117 23654380 22383696 22437709 22849227 23260322 22425675
5332B2425675M65115O6957n02279R82618n03667m84403o43553J56168Q09041q56705
$$ 22425675 22890790 22957747 22455468 23438086 22934419 22450016 21806463 21962631 22771672 21914967
5322B1914967N39195l14116r50938N65910r0418L63603n49911n85109O44814K01229
$$ 21914967 22454162 22140046 21189108 21755018 21664600 22028203 21478292 20893183 21537997 21739226
5312B1739226m05206M39845j452278P29358l57155N31155o72682k0574j30033
$$ 21739226 21334020 21773865 20321587 21050945 20693790 21224945 20552263 20531689 20401656
5303B0401656r2838j11144l11197L1059n68958J18204l02563l59884M06762L78164
$$ 20401656 20308818 20197674 19886477 19917536 19348578 19466782 19164219 18804335 19211097 19589261
5293A9589261l57529k64862m31943m46467M34934J59295q5644m01561N52163n52323
$$ 19589261 19231732 18966870 18534927 18088460 18523394 18682689 18597045 18195484 18747647 18195324
5283A8195324k92213j17331r0028p81558P15039M771j160999M09116q37294R80144
$$ 18195324 17903111 17785780 17695752 16914194 17629233 17634004 16473005 16882121 16044827 17024971
5273A7024971k28361n78388q03683N72231M34597m03116m7487r77249J69257j89681
$$ 17024971 16796610 16218222 15414539 15986770 16421367 16018251 15970764 14993515 15162772 14973091
5263A4973091J78691O24184n08130l16594j45396m82117m52308K87447N07805
$$ 14973091 15151782 15775966 15267836 14951242 14805846 14323729 13871421 14158868 14666673
5254A4666673j74020k4478p13687p2739K72496L80270j80580n39465M37247q35076
$$ 14666673 14492653 14468175 13754488 13681749 13954245 14334515 14153935 13614470 14051717 13216641
5244A3216641Q68944k49945K23180m54603m2550k69765O87700m53905R7759j59890
$$ 13216641 14085585 13835640 14058820 13604217 13561667 13291902 13979602 13525697 13623456 13463566
5234A3463566L11750k09594o64235J534036j177455m74154L00696k46628m31853
$$ 13463566 13775316 13565722 12901487 14435523 13258068 12783914 13084610 12837982 12406129
5225A2406129J098864n75459J11985k72315q5067L59311k00042q80182J753565
$$ 12406129 13504993 12929534 13041519 12769204 12684137 13043448 12843406 11963224 13716789
5216A3716789j264240l56151R44599j323392N25123M43928l54113K55612k05316
$$ 13716789 12452549 12096398 13040997 11717605 12242728 12686656 12332543 12588155 12382839
5207A2382839M29738j05731n06662K28016m62732N02475l93921R2718j53032K80727
$$ 12382839 12812577 12706846 12200184 12428200 11965468 12467943 12074022 12166740 12013708 12294435
5197A2294435j21439m21238l19731J245503q76271Q47048o72556l92412O68221
$$ 12294435 12172996 11751758 11432027 12677530 11801259 12648307 11975751 11583339 12251560
5188A2251560k62712J93323l50249J044936n93201r03208j77759R67578n19280
$$ 12251560 11988848 12182171 11831922 12876858 12283657 11380449 11202690 12170268 11650988
5179A1650988J169974q81111l12710L80396L64965m65454J26019K73752o40919
$$ 11650988 12820962 11939851 11627141 12007537 12372502 11907048 12033067 12306819 11665900
5170A1665900J19486K85245l88564j92883N79242m75910L53749K10030m09987
$$ 11665900 11785386 12070631 11682067 11489184 12068426 11592516 11946265 12156295 11746308
5161A1746308p22200N13445L86075J82615n36143M92813j82109r3935k0230P02953
$$ 11746308 11024108 11537553 11923628 12106243 11570100 12062913 11880804 11786869 11766639 12469592
5151A2469592o84037N30285q66789L79498L96644j21632l19902M47697P7769j96181
$$ 12469592 11785555 12315840 11449051 11828549 12225193 12103561 11783659 12231356 12309125 12112944
5141A2112944N3121M56084q72161L66209N011j3906m29911o85967J353166L99459
$$ 12112944 12166065 12622149 11749988 12116197 12121208 12107302 11677391 10991424 12344590 12744049
5131A2744049p76374M83177J6J38575J94407j05892n61854L01315o47646M09163
$$ 12744049 11967675 12450852 12450868 12589443 12783850 12677958 12116104 12417419 11769773 12178936
5121A2178936k4862M37120o61747M63208l51750L91909N29356q36667l02521O06560
$$ 12178936 12154074 12591194 11929447 12392655 12040905 12432814 12962170 12125503 11822982 12429542
5111A2429542J90304J634J39980q33272K9894n5349O96884P02820N2740j99589
$$ 12429542 12619846 12621480 12761460 11928188 11958082 11902733 12599617 13302437 13355177 13155588
5101A3155588l30957K27237K83979M75544M36658q42725L29342m41305O49979
$$ 13155588 12824631 13051868 13335847 13811391 14248049 13405324 13734666 13293361 13943340
5092A3943340o3357M70181R41279j520253J571254r97630M6612M93963l28977
$$ 13943340 13879983 14350164 15291443 13771190 15342444 14344814 14391426 14885389 14556412
5083A4556412P23243M1155L71758k47161K54185j069556Q80055P04864n63810
$$ 14556412 15279655 15320810 15692568 15445407 15699592 14630036 15510091 16214955 15651145
5074A5651145N55879j87328R485N2396R23214K92932o2863k44637R13531p52140
$$ 15651145 16207024 16019696 16029181 16081577 17004791 17297723 17234860 16990223 17903754 17151614
5064A7151614N53713R923R7963K87729Q05829M47941k16943M8202M87123J23209
$$ 17151614 17705327 17715250 17813213 18100942 18906771 19354712 19137769 19185971 19673094 19796303
5054A9796303N74300M12979l23814R10805K81387k12700M12215j12456L24149
$$ 19796303 20370603 20783582 20459768 21370573 21651960 21439260 21851475 21739019 22063168
5045B2063168m36121J281342J84909p184R16888q30086L32249l34402Q44218P29014
$$ 22063168 21627047 22908389 23093298 23086114 24003002 23172916 23505165 23170763 24014981 24743995
5035B4743995j60548J098248L5210M35189J3571M25116J05115J063026o77381
$$ 24743995 24583447 25681695 25716905 26152094 26165665 26590781 26695896 27758922 27081541
5026B7081541J213029k17009L53667R96201J67614K63577Q21364O23970M71002
$$ 27081541 28294570 28077561 28431228 29427429 29595043 29858620 30679984 31303954 31774956
5017C1774956Q3084J283331J69139Q15548K16398K52055o4307J828921k19430
$$ 31774956 31858040 33141371 33310510 34126058 34342456 34594511 34530204 36359125 36139695
5008C6139695l08196R49299J71577Q12080j67581R28296k4093P86781l49468J043527
$$ 36139695 35831499 36780798 36952375 37764455 37596874 38525170 38501077 39287858 38938390 39981917
4998C9981917Q71810J23214M42673R03243N40345M80300J29661J042990L38412
$$ 39981917 40853727 40976941 41419614 42322857 42863202 43343502 43473163 44516153 44854565
4989D4854565R29499Q81356L11672O13996J195081k25474J481778R60524P48407
$$ 44854565 45784064 46665420 46977092 47591088 48786169 48560695 50042473 51002997 51751404
4980E1751404j051783J434640J86298J371891m6530j57736k47739J131608k86853
$$ 51751404 50699621 52134261 52320559 53692450 53645920 53488184 53240445 54372053 54085200
4971E4085200J67416k92737Q26726p54819P13128q9629m87646J213049J14406
$$ 54085200 54252616 53959879 54786605 54031786 54744914 54655285 54167639 55380688 55495094
4962E5495094j72237L84010O09874l98546J776735p17072J083236k95045J418821
$$ 55495094 55322857 55706867 56316741 55918195 57694930 56977858 58061094 57766049 59184870
4953E9184870M03182L90491J016904l6444K04907O21423N32007J05848j40126
$$ 59184870 59588052 59978543 60995447 60959003 61163910 61785333 62317340 62423188 62283062
4944F2283062P37919j39823k08037R45076k60325l35174k64743j029724N92034
$$ 62283062 63020981 62881158 62673121 63618197 63357872 63022698 62757955 61728231 62320265
4935F2320265J07532M79856j465634L14041R8373n62656l17144o07301l39711
$$ 62320265 62427797 62907653 61442019 61756060 61854433 61291777 60974633 60367332 60027621
4926F0027621j202717M69626r79070n75215m19750j830133k63934j851981K94724
$$ 60027621 58824904 59294530 58315460 57740245 57320495 55490362 55226428 53374447 53669171
4917E3669171r66228n8678j771363o24642m92646j488006m03432j15244j63852
$$ 53669171 52702943 52644265 50872902 50248260 49755614 48267608 47864176 47748932 47585080
4908D7585080k543096n71575j77114k029968L48074p52756j099206Q5680j082333
$$ 47585080 45041984 44470409 44293295 42263327 42611401 41858645 40759439 40845119 39762786
4899C9762786K03943n25692r70463n27313j42103p70577J24217j120307l94870
$$ 39762786 39966729 39441037 38470574 37943261 37801158 37030581 37154798 36034491 35639621
4890C5639621n57128m23692K19817m07509j350510P18191n67459n64916n99377
$$ 35639621 35082493 34658801 34878618 34471109 33120599 33838790 33271331 32706415 32107038
4881C2107038J58178o46990l1791k51762m80217p25705P30043q70239m55203k8268
$$ 32107038 32265216 31618226 31586435 31334673 30854456 30128751 30858794 29988555 29533352 29505084
4871B9505084l6696l93139J40849l39815K71716q32682q06001J36261m62898L4475
$$ 29505084 29468388 29075249 29216098 28876283 29147999 28315317 27509316 27645577 27182679 27217154
4861B7217154O06935N72801j149419m23905Q44648k54673k90545P1128M13301
$$ 27217154 27824089 28396890 27247471 26823566 27668214 27413541 27122996 27194124 27607425
4852B7607425m1082o36249q1925P41546n62203j2769M44816j03146j42792P39243
$$ 27607425 27566343 26930094 26848169 27589715 27027512 27014743 27459559 27356413 27213621 27952864
4842B7952864r3543P39563r32944M93089Q28246l06572L96029Q6921k45394J543300
$$ 27952864 27859321 28598884 27665940 28159029 28987275 28680703 29076732 29163653 28918259 30461559
4832C0461559j359813J266939m94533L37098K81250R42954n9384K29279K47192
$$ 30461559 29101746 30368685 29874152 30211250 30492500 31435454 31376070 31605349 31852541
4823C1852541O44296P45788Q50972l16094N66866M56468O55898M62848J70375
$$ 31852541 32496837 33242625 34093597 33777503 34344369 34800837 35456735 35919583 36089958
4814C6089958N23289M60957O45309N32163J060558P69967M96340R68527N87434
$$ 36089958 36613247 37074204 37719513 38251676 39312234 40082201 40578541 41547068 42134502
4805D2134502O23135J148014M07851P38866R88210Q09571Q90151J400299n02178
$$ 42134502 42757637 43905651 44313502 45052368 46040578 46850149 47740300 49140599 48638421
4796D8638421J542181P51878J256096J108657L70960J147719L16403Q15939J078805
$$ 48638421 50180602 50932480 52188576 53297233 53668193 54815912 55132315 55948254 57027059
4787E7027059N88828M70161J051352M65623R0020J067218m83130P09873O57612
$$ 57027059 57615887 58086048 59137400 59603023 59693043 60760261 60277131 60987004 61644616
4778F1644616O83241K5602N80680N69808m87332L80747O31414J448517o32009
$$ 61644616 62327857 62353459 62934139 63503947 63016615 63397362 64028776 65477293 64845284
4769F4845284K34639J133045j44070j21267Q204J189184L77745k94642J781404
$$ 64845284 65079923 66212968 66068898 65947631 65955835 67145019 67522764 67228122 69009526
4760F9009526q46623L57417n9880N26417L28786j50044L54348n07054K18574K74569
$$ 69009526 68162903 68520320 68460440 68986857 69315643 69165599 69519947 69012893 69231467 69506036
4750F9506036j30682N22885p19305l75807N07755M64001J68462J15320L41741
$$ 69506036 69375354 69898239 69178934 68803127 69310882 69774883 69943345 70058665 70400406
4741G0400406j77145J23005L60286Q36151r94710L25804Q23499L54868o54933
$$ 70400406 70223261 70346266 70706552 71542703 70547993 70873797 71697296 72052164 71397231
4732G1397231P9801P19371M05968j93312K25971l13256O96243m29341j49430J5734
$$ 71397231 71477032 72196403 72602371 72409059 72635030 72321774 73018017 72588676 72439246 72454980
4722G2454980J50760N58623m27798M3481L03369j139567J126887o54293O77381
$$ 72454980 72605740 73164363 72736565 72780046 73083415 71943848 73070735 72416442 73093823
4713G3093823k22427j15519K42221Q54601j204912L82038L93755j90446J90088
$$ 73093823 72871396 72755877 72998098 73852699 72647787 73029825 73423580 73233134 73423222
4704G3423222K02361j47442Q07692R8297j50742R2075J91780J26938R33095j99450
$$ 73423222 73625583 73478141 74285833 74384130 74233388 74325463 74517243 74644181 75577276 75377826
4694G5377826n08947P46055j24986L60244J036151o08733J386350L08008j2540
$$ 75377826 74868879 75614934 75489948 75850192 76886343 76277610 77663960 77971968 77959428
4685G7959428R36295M66830m06005M48406R46246O552Q8396J277993l31768J045390
$$ 77959428 78895723 79362553 78956548 79404954 80351200 80357752 80446148 81724141 81392373 82437763
4675H2437763j017744J95212o54065L56855M29966n55086o54195p59319Q5272
$$ 82437763 81420019 81615231 80961166 81318021 81747987 81192901 80538706 79779387 79864659
4666G9864659j442260L45206k2737p56956n60909j37952j08721J37913R80420
$$ 79864659 78422399 78767605 78744868 77987912 77427003 77289051 77180330 77318243 78298663
4657G8298663p71762l40950o65489j39324K41556n26022r69123k98568j543553
$$ 78298663 77526901 77185951 76520462 76381138 76622694 76096672 75127549 74828981 73285428
4648G3285428J24550m97211j076139m57470j684704r48347j955253p95173p84436
$$ 73285428 73409978 72912767 71836628 71379158 69694454 68746107 66790854 65995681 65211245
4639F5211245k60911r43040p41762q00944j488200q93486j33180j446103K89716
$$ 65211245 64950334 64007294 63265532 62464588 60976388 60082902 59949722 58503619 58793335
4630E8793335q99125M2016r18914l99408k57478j163123K97820Q27448p20638
$$ 58793335 57894210 57936226 57017312 56617904 56360426 55197303 55495123 56322571 55601933
4621E5601933l29022l26708p15606R49280J77439j6362o77611N23349P74943q13852
$$ 55601933 55272911 54946203 54230597 55179877 55357316 55340954 54663343 55186692 55961635 55147783
4611E5147783p52193M95125K43537P1836o00976L26042J80492k28211Q750l35491
$$ 55147783 54395590 54890715 55134252 55206088 54605112 54931154 55111646 54883435 54892185 54556694
4601E4556694M61008j135525K46299k90004N37916p83069k59642j25402P75071
$$ 54556694 55017702 53882177 54128476 53838472 54376388 53593319 53333677 53208275 53983346
4592E3983346k5917j134500L56956n54452J246598m54129k56231o9333p63121
$$ 53983346 53957429 52822929 53179885 52625433 53872031 53417902 53161671 53092338 52329217
4583E2329217K64665q887N08589o26956r80158J502289q02459M65592K66645k80077
$$ 52329217 52593882 52584995 53093584 52466628 51486470 52988759 52186300 52651892 52918537 52638460
4573E2638460q89787J80704m90265R66702n33617m80207K47095n03300o5805L98386
$$ 52638460 51748673 51929377 51439112 52405814 51872197 51391990 51639085 51135785 51069980 51468366
4563E1468366P670n92822Q38740q90523k40194M81106J25342l27548J63093q18100
$$ 51468366 51476036 50883214 51721954 50831431 50591237 51072343 51197685 50870137 51033230 50215130
4553E0215130P56747L63147m64627o88268J96413K48004L30467m44662M76001
$$ 50215130 50971877 51335024 50870397 50182129 50378542 50626546 50957013 50512351 50988352
4544E0988352R61354o96039q40007K40673Q06380j33762R7092N43027j68711l2508
$$ 50988352 51949706 51253667 50413660 50654333 51460713 51326951 51424043 51967070 51798359 51765851
4534E1765851j53100O63272j88960P85953m04305J061876m72003M61083L27643
$$ 51765851 51612751 52276023 52087063 52873016 52468711 53530587 53058584 53519667 53847310
4525E3847310P00559P99303R8781r1517J339779J043676Q3082N14392K93481J307571
$$ 53847310 54547869 55347172 55445953 55354436 56694215 57737891 57820973 58335365 58628846 59936417
4515E9936417M71796J147493Q14944J728120Q73385J473767R42598M11869J498984
$$ 59936417 60408213 61555706 62370650 64098770 64972155 66445922 67388520 67800389 69299373
4506F9299373R09042J930226L64560R06349J281313J112350J722161J284472R78307
$$ 69299373 70208415 72138641 72503201 73409550 74690863 75803213 77525374 78809846 79788153
4497G9788153J305432N86676J734006J593429M41865K046095J915712P01379K541454
$$ 79788153 81093585 81680261 83414267 85007696 85449561 87495656 89411368 90112747 92654201
4488I2654201J335930K814860J215945K721198L379117L048124L605768K206301
$$ 92654201 93990131 96804991 98020936 100742134 104121251 107169375 110775143 112981444
4480A12981444L937142M410730M096694M547615M567368O016905N477394O735773
$$ 112981444 116918586 121329316 125426010 129973625 134540993 140557898 146035292 152771065
4472A52771065O876343O989743P118079P067486Q495644Q047092P951002P008908
$$ 152771065 159647408 166637151 173755230 180822716 189318360 197365452 205316454 212325362
4464B12325362Q270535P560913O734494N747052N469259N327043L381313L217035
$$ 212325362 220595897 228156810 234891304 240638356 246107615 251434658 254815971 258033006
4456B58033006L854329J231682K042456J371004J951469J932165K002950L254451
$$ 258033006 261887335 263119017 265161473 266532477 268483946 270416111 272419061 275673512
4448B75673512M121466L491799N850199P265768P654463Q999347R952564J1190832
$$ 275673512 279794978 283286777 289136976 296402744 304057207 313056554 323009118 334199950
4440C34199950J1389401J4866664J4325845J4727984J6691705J7026530J6029034
$$ 334199950 345589351 360456015 374781860 389509844 406201549 423228079 439257113
4433D39257113J6339445J6205494J4378302J4264513J0564161Q188833O320204
$$ 439257113 455596558 471802052 486180354 500444867 511009028 519197861 525518065
4426E25518065L144458j519348m711581p229200r908160j2561671j5496036j5369383
$$ 525518065 528662523 527143175 522431594 515202394 505294234 492732563 477236527 461867144
4418D61867144j7048703j6676604j7513404j5831654j5053745j5365390j3024528
$$ 461867144 444818441 428141837 410628433 394796779 379743034 364377644 351353116
4411C51353116j2938285j1808107r856172r415253r194690q270571q356603p083107
$$ 351353116 338414831 326606724 316750552 307335299 298140609 289870038 281513435 274430328
4403B74430328o152690o608734o278267o845806n651740n584758n183425n238486
$$ 274430328 268277638 261668904 255390637 248544831 242893091 237308333 232124908 226886422
4395B26886422n423310n086883n230649n331587m471694m626421l961188m848795
$$ 226886422 221463112 216376229 211145580 205813993 201342299 196715878 192754690 187905895
4387A87905895m422189m041258k764662m564645l437233k954984k525251k807630
$$ 187905895 183483706 179442448 176677786 172113141 168675908 165720924 163195673 160388043
4379A60388043j393274j817255j516078p84432o77997o16008N61403o97940J167207
$$ 160388043 158994769 157177514 155661436 154877004 154199007 153582999 154144402 153446462 154613669
4370A54613669J44751J063941Q49493J804939O73705J148398J158940M90688J709443
$$ 154613669 154758420 155822361 156671854 158476793 159150498 160298896 161457836 161948524 163657967
4361A63657967R43923J49566P66453m7359K84354p3281l03417n76655K75136j075190
$$ 163657967 164601890 164751456 165517909 165470550 165754904 165681623 165378206 164801551 165076687 164001497
4351A64001497o63861j05736k08305K99365M31774J056636J702205J770434J030801
$$ 164001497 163337636 163231900 163023595 163322960 163754734 164811370 166513575 168284009 169314810
4342A69314810K303396J910319L442334L126109K839086L488536L370347L215741
$$ 169314810 171618206 173528525 176970859 180096968 182936054 186424590 189794937 193010678
4334A93010678K672635L105676K754820K111584J325922J978187J92887k78333
$$ 193010678 195683313 198788989 201543809 203655393 204981315 206959502 207152389 206874056
4326B06874056j7896j123687q51370j508029j524365k896536j554477j694664
$$ 206874056 206856160 205732473 204881103 203373074 201848709 198952173 197397696 195703032
4318A95703032j967995j494783j694100j790487j443594j799582j621061q93306
$$ 195703032 193735037 192240254 190546154 188755667 187312073 185512491 183891430 182998124
4310A82998124j608785j037453j177015m35724j366934O3619j496153j339109
$$ 182998124 181389339 180351886 179174871 178739147 177372213 177435832 175939679 174600570
4302A74600570j033313k022514j699205q95353k858492j973328k896868k008727
$$ 174600570 173567257 171544743 169845538 168950185 166091693 164118365 161221497 159212770
4294A59212770k450051j982785k048259k753469j541712k378644n41320k195631
$$ 159212770 156762719 154779934 152731675 149978206 148436494 146057850 145516530 143320899
4286A43320899p07527p73982j423173o00077m72813j220756J8310q68302j160340
$$ 143320899 142613372 141839390 140416217 139816140 139343327 138122571 138140881 137272579 136112239
4277A36112239k08105N2423j607091j300371k004540j267248j625423j657488
$$ 136112239 135904134 135956557 134349466 133049095 131044555 129777307 128151884 126494396
4269A26494396l149299j953692k555393l349589j748092l368948l915344l127602
$$ 126494396 123345097 121391405 118836012 115486423 113738331 110369383 106454039 103326437
4261A03326437k230566k787854k349574k645229k506958k428739j641827k731001
$$ 103326437 101095871 98308017 95958443 93313214 90806256 88377517 86735690 84004689
4253H4004689j740690k266777j501821k647801j644692k378346r16237k002439
$$ 84004689 82263999 79997222 78495401 75847600 74202908 71824562 70908325 68905886
4245F8905886k017317j609104j734075q49022j245613j805374j9846j949129j527544
$$ 68905886 66888569 65279465 63545390 62696368 61450755 59645381 59625535 57676406 56148862
4236E6148862r82311l70938j752884p24924m24113p57821q54058n69332q99011
$$ 56148862 55166551 54795613 53042729 52317805 51893692 51135871 50281813 49712481 48813470
4227D8813470l33036m04698K95988j118370L43544q95380j271643o62774n36558
$$ 48813470 48480434 48075736 48371724 47253354 47596898 46701518 45429875 44767101 44230543
4218D4230543o88033o98780j241982l93154j068588p36880j365270j040964q75893
$$ 44230543 43542510 42843730 41601748 41208594 40140006 39403126 38037856 36996892 36120999
4209C6120999j508448L97405j619113j149996r44763o88106j067891k27921j03388
$$ 36120999 34612551 35009956 33390843 32240847 31296084 30607978 29540087 29312166 29208778
4200B9208778j174740j89611j360727q80036K97596l15972n11457m7958n72435
$$ 29208778 28034038 27844427 26483700 25603664 25901260 25585288 25073831 25025873 24453438
4191B4453438k17156r84566o88113n49554J81725J37550k13118j364982L17617
$$ 24453438 24236282 23251716 22563603 22014049 22195774 22333324 22120206 20755224 21072841
4182B1072841K93544q35674q46287J34730l28630K11041k3059L1839j092312J24896
$$ 21072841 21366385 20530711 19684424 19819154 19490524 19701565 19678506 19710345 18618033 18742929
4172A8742929o94883J109335j455017l55307M10234o96146q23879L13767k20104
$$ 18742929 18048046 19157381 17702364 17347057 17757291 17061145 16237266 16551033 16330929
4163A6330929O2336j719172J259972j008160O1312M87977j252417Q45067j253270
$$ 16330929 16393265 14674093 15934065 14925905 14987217 15475194 14222777 15067844 13814574
4154A3814574O91493j02717K99624j367236N93274J45722L441o14091O53617l80035
$$ 13814574 14506067 14403350 14702974 13335738 13929012 14074734 14078175 13464084 14117701 13737666
4144A3737666m18155l66408q6303J75572p15448K9094n02247L82276L60024n03947
$$ 13737666 13319511 12953103 12866800 13042372 12326924 12356018 11853771 12236047 12596071 12092124
4134A2092124Q13625j51633q04859R75665n25391k93267K95867l52136l00879
$$ 12092124 12905749 12754116 11949257 12924922 12399531 12106264 12402131 12049995 11749116
4125A1749116L76770o66075P87610p37463R9930L97685j2253j97901l45604r6138
$$ 11749116 12125886 11459811 12247421 11509958 11609888 12007573 11995320 11797419 11451815 11355677
4115A1355677K00026n78391K85583j080189Q02433n99881o00443L35350r5994
$$ 11355677 11555703 10977312 11262895 10182706 10985139 10385258 9784815 10120165 10024171
4106A0024171M36019N00777q00523n26259L43831r63576J09475O2549j36125N68202
$$ 10024171 10460190 10960967 10160444 9634185 9978016 9014440 9123915 9186464 9050339 9618541
4096I618541J94525o75241O4037p96064k43883j68763L66972O62540r72308M61923
$$ 9618541 9813066 9137825 9201862 8405798 8161915 7993152 8360124 9022664 8050356 8512279
4086H512279o79167J67738L43398m84890J81462l81680R7488J95398r7543n26256
$$ 8512279 7833112 8000850 8344248 7859358 8040820 7659140 7756628 7952026 7854483 7328227
4076G328227p2343j63231k90067M54255l28532L99549m79313J99575l33116m83166
$$ 7328227 7255884 7092653 6802586 7256841 6928309 7327858 6848545 7048120 6715004 6231838
4066F231838P84029j58920q17144O84220M26518o4916M27760n76743Q5091m59800
$$ 6231838 7015867 6856947 6039803 6724023 7150541 7085625 7513385 6936642 7021733 6561933
4056F561933O98670k96287J42466j33978O87778j14529j074970P37957r1567r3879
$$ 6561933 7260603 6964316 7106782 6972804 7660582 7546053 6471083 7209040 7117473 7023594
4046G023594J30167J26757n45967J223228j081061N86634L73013p13360N22505
$$ 7023594 7153761 7280518 6734551 7957779 6876718 7463352 7836365 7123005 7645510
4037G645510j58086l25787L57519j75403Q2687O77570M78396K56738k55720p55349
$$ 7645510 7487424 7161637 7519156 7343753 7426440 8104010 8582406 8839144 8583424 7828075
4027G828075N73822K9912j008847M45983j080p8150l01075J129546p49031K27604
$$ 7828075 8401897 8431809 7422962 7868945 7867865 7789715 7488640 8618186 7869155 8096759
4017H096759q45717q3244Q1315n1612n75133j77456O00199o75819N99363L11870
$$ 8096759 7251042 7167798 7249113 7197501 6622368 6444912 7045111 6369292 6968655 7280525
4007G280525q60678L77092n01560j58540M16199o5361P24985n45306o25172N81340
$$ 7280525 6419847 6796939 6295379 6136839 6553038 6487677 7212662 6667356 6042184 6623524
3997F623524p01320O82415l95491l2001J32511p23141l62018l1165O90018j286009
$$ 6623524 5922204 6604619 6209128 6177127 6309638 5586497 5224479 5193314 5883332 4597323
3987D597323L27420K87770o19844k72943O10934k65085j024695M19632r24104
$$ 4597323 4924743 5212513 4592669 4319726 4930660 4665575 3640880 4060512 3136408
3978C136408Q86991m8869q226J06645l08817r97117Q56950q53941j1062m96637
$$ 3136408 4023399 3974530 3966304 4072949 3764132 2767015 3623965 2770024 2758962 2262325
3968B262325J168119j482961J139736K39209m21236J11736j192345k07977J116316
$$ 2262325 3430444 1947483 3087219 3326428 2905192 3016928 1824583 1616606 2732922
3959B732922j236641N91368l02625j98609M17338j99197J55281m72790J58278
$$ 2732922 1496281 2087649 1785024 1586415 2003753 1804556 1959837 1487047 1645325
3950A645325j01030m05208N94728m95909K41189J64407r11309R07761l73868j36600
$$ 1645325 1544295 1139087 1733815 1237906 1479095 1643502 732193 1639954 1266086 1129486
3940A129486l36603K17106K65086j37746n87843L11910J9475L92530m56471J95701
$$ 1129486 792883 1009989 1275075 1137329 549486 861396 880871 1273401 816930 1012631
3930A012631l37976o98810O4021J358733K32547o97278j39363k1855j14867l33391
$$ 1012631 674655 -24155 39866 1398599 1631146 933868 794505 772650 657783 324392
3920C24392k0355j83076O34896o44734O77968l52366L55645l14884p5851k06561
$$ 324392 304037 120961 755857 111123 789091 436725 792370 477486 401635 195074
3910A95074P13582n46698J18183j086709O34814N59615o18396p3027k21561K05426
$$ 195074 908656 361958 480141 -606568 28246 587861 -30535 -103562 -325123 -119697
3900a19697K52851N83233k59348K37639K00875r93957N73073m43163P09742j226679
$$ -119697 133154 716387 457039 694678 895553 -98404 474669 31506 741248 -485431
3890d85431k00086L52137J22569Q38122o17159k55715L66043r56175J541095p34271
$$ -485431 -685517 -333380 -210811 627311 10152 -245563 120480 -835695 705400 -28871
3880b8871M98457J45554l89387o13569m5278n03126O70223N12544o25788K82880
$$ -28871 469586 615140 225753 -387816 -433094 -936220 -265997 246547 -379241 -96361
3870i6361N117J0643j03419P3090R9917o85290O25920j77660o04963J114768p62161
$$ -96361 -91244 -80601 -184020 -110930 -11013 -696303 -70383 -248043 -853006 261762 -500399
3859e00399L92789K65283O77849j935919P04158R51780j441173M08366Q4000r19467
$$ -500399 -107610 157673 835522 -1100397 -396239 555541 -885632 -477266 -393266 -1312733
3849a312733J073215j51294l8421k51845j29094L56494m47904Q11214l71272K85324
$$ -1312733 -239518 -390812 -429233 -681078 -810172 -453678 -901582 -90368 -461640 -176316
3839a76316l9589p35647M59081J09938j100214R06290m12582K16136j51329Q2661
$$ -176316 -215905 -951552 -492471 -382533 -1482747 -576457 -989039 -772903 -924232 -841571
3829h41571M37240j69496L61177k27246J62722p44298R01250j062759P87255M855
$$ -841571 -404331 -573827 -212650 -439896 -277174 -1021472 -120222 -1182981 -395726 -390871
3819c90871q1203N47754j130750j35710R61942l59839n32013O10345k65612l47480
$$ -390871 -472074 75680 -1055070 -1190780 -228838 -588677 -1120690 -510345 -775957 -1123437
3809a123437O39422L63174r73361j98835R24059k98162K99683O55593j082651
$$ -1123437 -484015 -120841 -1094202 -1293037 -368978 -667140 -367457 288136 -794515
3800g94515J73423J82327l44660M66339p59994O65149n57577p766M61085L1250
$$ -794515 -621092 -438765 -783425 -317086 -1077080 -411931 -969508 -977274 -516189 -484939
3790d84939p69008P94348M13099m59084K97103j07183M33368J22160j755355J24446
$$ -484939 -1253947 -459599 -46500 -505584 -208481 -315664 117704 239864 -1515491 -1391045
3780a391045J291423o92326O59558k1353o36859K99599j25249L52162L40278P8339
$$ -1391045 -99622 -791948 -132390 -153743 -790602 -491003 -616252 -264090 76188 154527
3770A54527o58249L26109k57719k0309J159713o75156m29741m3140Q2523l80228
$$ 154527 -503722 -177613 -435332 -455641 704072 28916 -400825 -443965 -361442 -741670
3760g41670K52613J04584q67211J104128j54118l82879J54500l49305N02077j66927
$$ -741670 -489057 -384473 -1251684 -147556 -301674 -684553 -530053 -879358 -377281 -544208
3750e44208N13143q94180N30089l37949L47954n73275J009246j24138n6762p71633
$$ -544208 -31065 -925245 -395156 -733105 -385151 -958426 50820 -73318 -130080 -901713
3740i01713R5563k35656J66027m19338J010843l88266K24968J24047p80632J211537
$$ -901713 -806150 -1041806 -875779 -1295117 -284274 -672540 -447572 -323525 -1104157 107380
3730A07380j064371O2231Q4902P1885J97907j31819J08836k97434J45292P47963
$$ 107380 -956991 -894760 -809858 -737973 -540066 -671885 -563049 -860483 -715191 32772
3720C2772j239360O07424Q2620l02694m8920n22903M14501l50045J072910j01281
$$ 32772 -1206588 -599164 -516544 -819238 -868158 -1391061 -976560 -1326605 -253695 -354976
3710c54976j80421m00738J46459J686942j773994n41053K48294K62299K04755
$$ -354976 -535397 -936135 -789676 897266 -876728 -1417781 -1169487 -907188 -702433
3701g02433j74320J45083L03372k40149K56489j69610L0181j32231m24103J477819
$$ -702433 -876753 -731670 -428298 -668447 -411958 -581568 -551387 -683618 -1107721 370098
3691C70098j083430j01187L58401m62403R31603p45017M93561n55913J91346n35073
$$ 370098 -713332 -814519 -456118 -918521 13082 -731935 -238374 -794287 -602941 -1138014
3681a138014M98300J34181J06834l33575o50176P29012K98106K66350o15400L40850
$$ -1138014 -639714 -505533 -398699 -732274 -1382450 -653438 -355332 -88982 -704382 -363532
3671c63532j070524O50571p4454j45922J98659J30610J21853o32598L17711M20465
$$ -363532 -1434056 -783485 -857939 -1003861 -805202 -674592 -552739 -1185337 -867626 -447161
3661d47161m41535m67858O99609j40606k62002L35687N7096J02178K81356j21553
$$ -447161 -888696 -1356554 -656945 -797551 -1059553 -723866 -666770 -564592 -283236 -404789
3651d04789k70164J43145m77620L55227P83319j225227K62746L64836m50306N07219
$$ -404789 -674953 -531808 -1009428 -654201 129118 -1096109 -833363 -468527 -918833 -411614
3641d11614j61062L92823p74700L59133l37960K29250R08657j122306M26594J46731
$$ -411614 -572676 -179853 -954553 -595420 -933380 -704130 204527 -917779 -491185 -344454
3631c44454K98282o63371N45842l90954m8766j43553K36335J09646q62525J700855
$$ -344454 -46172 -709543 -163701 -554655 -603421 -746974 -510639 -400993 -1263518 437337
3621D37337j468703J107230K67875j233716N19245k61338p61372J81558M22847
$$ 437337 -1031366 75864 343739 -889977 -370732 -632070 -1393442 -1211884 -789037
3612g89037J34217m45513R49286p22955K62567k4330J53267L96811n3001m42821
$$ -789037 -654820 -1100333 -151047 -874002 -611435 -635765 -482498 -85687 -138688 -581509
3602e81509N23547n49346m87499Q12717m9052P3941o6528o62419p4551M66018
$$ -581509 -57962 -607308 -1094807 -282090 -331142 -257201 -323729 -986148 -1060699 -594681
3592e94681L27476p4466o87775K14973O98921q32025o9573K94636K90334p1807
$$ -594681 -267205 -341671 -1029446 -814473 -115552 -947577 -1017150 -722514 -432180 -503987
3582e03987j22785N93581j066017P34823j106313N05120K65751Q0578K01871l93753
$$ -503987 -626772 -33191 -1099208 -364385 -1470698 -965578 -699827 -619249 -417378 -811131
3572h11131N83050k63484O00482r66961P21930l29560L51260q45412M56405L30519
$$ -811131 -228081 -491565 108917 -858044 -136114 -465674 -114414 -959826 -503421 -172902
3562a72902m91949n44307O68847L36752K30899j102837L35891N71514J09229p60263
$$ -172902 -664851 -1209158 -540311 -203559 27340 -1075497 -739606 -168092 -58863 -819126
3552h19126M19971R3720J6835M03462r82611Q19012M02201j13452l95425J42333
$$ -819126 -399155 -305435 -288600 114862 -867749 -48737 353464 240012 -155413 -13080
3542a3080N55483p56073J62869l34631O57762J11401n39502O33644J96872L05651
$$ -13080 542403 -213670 -50801 -385432 272330 383731 -155771 477873 674745 980396
3532I80396o50252N5885N6179j72661o4235m26852L06820l90043M66665o10522
$$ 980396 330144 386029 442208 269547 205312 -221540 85280 -304763 161902 -448620
3522d48620J128892l65425l68108Q03811k00882p89053n87102J389836n55039
$$ -448620 680272 314847 -53261 750550 549668 -239385 -826487 563349 8310
3513H310P98580l35374n72909k09708O90844q70266r544P38835j18101j57282
$$ 8310 806890 471516 -101393 -311101 379743 -490523 -500067 238768 120667 -36615
3503c6615O39318q04354j7211P88024l48479L55130r15125L43564j90830P45788
$$ -36615 602703 -201651 -218862 569162 220683 575813 -339312 4252 -186578 559210
3493E59210j133660P87101j134987O35788M81851l61542l66825j8894P98314J84853
$$ 559210 -574450 212651 -922336 -286548 195303 -166239 -533064 -551958 246356 431209
3483D31209q09445Q22291r93919O35499R18869p47784l48503k3416j74714k52647
$$ 431209 -378236 444055 -549864 85635 1004504 256720 -91783 -115199 -289913 -542560
3473e42560R7481J492223m90651p89248l98775M36126p4869M14655P05605l42929
$$ -542560 -445079 1047144 556493 -232755 -631530 -195404 -270273 144382 849987 507058
3463E07058L3434J025016n87793n3451j92486L48385O24761r96636J039268r7539
$$ 507058 540492 1565508 977715 924264 731778 1080163 1704924 708288 1747556 1650017
3453A650017j57405P45623o44804N38438k6069k52407M87599O38823p34693L18140
$$ 1650017 1492612 2238235 1593431 2131869 2105800 1853393 2340992 2979815 2245122 2563262
3443B563262j43890p05347J21791Q19757m17286K84401j82861k95152l23082P4355
$$ 2563262 2419372 1714025 1835816 2655573 2238287 2522688 2339827 2044675 1721593 1795948
3433A795948M77890m52154J20844L12655J5144K43574j44671p6375l11533N64726
$$ 1795948 2273838 1821684 1942528 2255183 2270327 2513901 2369230 2292855 1981322 2546048
3423B546048o46139j05968M87839j032234j02536m85548Q76206j08624n50659
$$ 2546048 1899909 1793941 2281780 1249546 1147010 661462 1537668 1429044 878385
3414H78385J94751k75274j23237k97012N25391K16440k71840l17222n75426J581381
$$ 878385 1073136 797862 674625 377613 903004 1119444 847604 530382 -45044 1536337
3404A536337j372159k6563M10248j73347n8676l94072J053536r0927O06048j345646
$$ 1536337 164178 137615 547863 374516 315840 -78232 975304 884377 1490425 144779
3394A44779M94141q1808L41902l00470L64498M7809M40667L52422n97515l26318
$$ 144779 638920 557112 899014 598544 963042 1010851 1451518 1803940 1206425 880107
3384H80107J50272P54811J23137m17542P31446p74950n27315Q768J04939Q59191
$$ 880107 1030379 1785190 1908327 1490785 2222231 1447281 919966 928734 1033673 1892864
3374A892864j081173L79832P73965j820381M11152m2080k40275O49825m20105
$$ 1892864 811691 1191523 1965488 145107 556259 514179 273904 923729 503624
3365E03624n92639N15217p20259O77760J97657j26107m13396K13007m10306N6000
$$ 503624 -89015 426202 -294057 383703 581360 455253 41857 254864 -155442 -99442
3355i9442N85406l31640N48140j80591J8088j19302l86820p0793J721193j460367
$$ -99442 485964 154324 702464 521873 539961 420659 33839 -36954 1684239 223872
3345B23872L04550K62713k68232L87193J69706J70616N59973o25561K94920J647643
$$ 223872 528422 791135 522903 910096 1079802 1250418 1810391 1184830 1479750 3127393
3335C127393r31199k59775J206129j26756M63781M46588O03607R4908J56237k8383
$$ 3127393 2196194 1936419 3142548 3015792 3479573 3926161 4529768 4624676 4780913 4752530
3325D752530M9260p62808O16998o37545N27098l28193J87983o04666j320575K6026
$$ 4752530 4801790 4038982 4655980 4018435 4545533 4217340 4405323 3800657 2480082 2506108
3315B506108l5433q97660k23588J66414n58845K91024q88362K41512l56680K71239
$$ 2506108 2470675 1573015 1349427 1515841 956996 1248020 359658 601170 244490 515729
3305E15729k23429r4482O03517q44077k64841M54699L22552p62207l1300m00883
$$ 515729 292300 197818 801335 -42742 -307583 147116 469668 -292539 -323839 -724722
3295g24722n86199K32937J496096n29328m59151l80863L78948K94962L83266l58420
$$ -724722 -1310921 -1077984 418112 -111216 -570367 -951230 -572282 -277320 105946 -252474
3285b52474J27468p90106M53573j16752l17353Q41956k30818m36063K46222j8693
$$ -252474 -125006 -915112 -461539 -578291 -895644 -53688 -284506 -720569 -474347 -493040
3275d93040L94276p36674K56152J87168j47212L55014o07961l05174R70369J18538
$$ -493040 -98764 -835438 -579286 -392118 -539330 -184316 -792277 -1097451 -127082 -8544
3265h544q77667M70920k18897l78545J162119r11110J002905p58314n67444J10160
$$ -8544 -886211 -415291 -634188 -1012733 149386 -761724 241181 -517133 -1084577 -974417
3255i74417J48904J29005l7829K17431P3368q59886R13602j38469J05459k89405
$$ -974417 -825513 -696508 -734337 -516906 -443538 -1303424 -389822 -528291 -422832 -712237
3245g12237j56521l8546P40175j53844m94767l67656n2M49040q7846k046L95111
$$ -712237 -868758 -907304 -167129 -320973 -815740 -1183396 -1183448 -734408 -822254 -824300 -429189
3234d29189J41092o588p90861J31939J196373j043080K60851R40711p97198o21347
$$ -429189 -288097 -294685 -1085546 -953607 242766 -800314 -539463 401248 -395950 -1017297
3224a017297O49707q2873K74428m91570q91692J436413k40708j69206J94925p23171
$$ -1017297 -367590 -450463 -176035 -667605 -1559297 -122884 -363592 -532798 -337873 -1061044
3214a061044N83955r87504J164286p58785M5663N98237R6241n06317K07749j098594
$$ -1061044 -477089 -1464593 -300307 -1059092 -1013429 -415192 -318951 -825268 -617519 -1716113
3204a716113N98811L49708N58645J12099p59898P90260r53370N3412J79872K89557
$$ -1716113 -1117302 -767594 -208949 -96850 -856748 -66488 -1019858 -966446 -786574 -497017
3194d97017k72916K95508k44747m39100R91024n82056L92247P3923K17874j09709
$$ -497017 -769933 -474425 -719172 -1158272 -167248 -749304 -357057 -283134 -65260 -174969
3184a74969l24519l42142L07357j41818k21365J1669L19169J22220k82459q91670
$$ -174969 -499488 -841630 -534273 -676091 -897456 -885787 -566618 -444398 -726857 -1618527
3174a618527J070198q05579Q44777m85689K33466O0720k46746Q16761r90157P12535
$$ -1618527 -548329 -1353908 -509131 -994820 -761354 -700634 -947380 -130619 -1120776 -408241
3164d08241o3186K78040J05576l11505n25501J11393K27847n3502p78032Q86099
$$ -408241 -471427 -193387 -87811 -399316 -924817 -813424 -585577 -639079 -1417111 -531012
3154e31012q4841j10512r3835M36516p26665P52240l58040j154603P65585L56090
$$ -531012 -615853 -726365 -820200 -383684 -1110349 -358109 -716149 -1870752 -1105167 -749077
3144g49077l98720p16969J058870J76256K74651L16615j276262N44008J02742
$$ -749077 -1147797 -1864766 -805896 -629640 -354989 -38374 -1314636 -770628 -667886
3135f67886O1772L24734J44069p32648L04982M09387Q453n23527k57112Q89239
$$ -667886 -606114 -281380 -137311 -869959 -564977 -155590 -147137 -670664 -927776 -38537
3125c8537m54583J59880M8763j021724N1036P36113r00455N96890K50025m18872
$$ -38537 -493120 -333240 -284477 -1306201 -1255165 -519052 -1419507 -822617 -572592 -991464
3115i91464j53670N96870K31545q16063K89635L08428k48368L21478p62501R39042
$$ -991464 -1145134 -548264 -316719 -1132782 -843147 -534719 -783087 -461609 -1224110 -285068
3105b85068l77771j26698k85984Q16566K2089m18559M15215K12284m16591M17313
$$ -285068 -662839 -789537 -1075521 -258955 -236866 -655425 -240210 -27926 -444517 -27204
3095b7204m96899m85709N71791q11339P63072l32391N3248N62676n73059K04603
$$ -27204 -524103 -1009812 -438021 -1249360 -486288 -818679 -765431 -202755 -775814 -571211
3085e71211o86048N89862O818l07035L87084M88386L63886j108873Q28560n92867
$$ -571211 -1257259 -667397 -660579 -967614 -580530 -92144 271742 -837131 -8571 -601438
3075f01438M97103r26213J94958n85222J38471J069068q29380N07665K32068o06136
$$ -601438 -104335 -1030548 -835590 -1420812 -1282341 -213273 -1042653 -534988 -302920 -909056
3065i09056o5893Q44654l57307m61272K02358K91500q54220R97518K08172j37017
$$ -909056 -974949 -130295 -487602 -948874 -746516 -455016 -1309236 -311718 -103546 -240563
3055b40563n48003R094R68517j349616N80731M75284o00701l56345Q67792j485957
$$ -240563 -788566 -779472 189045 -1160571 -579840 -104556 -705257 -1061602 -193810 -1679767
3045a679767J040941m99688R38901n11584P4898N89792m85112m37886N95425l93180
$$ -1679767 -638826 -1138514 -199613 -711197 -636299 -46507 -531619 -969505 -374080 -767260
3035g67260q4368j94435Q71689p67347R61375r88224O2921L77200p38237J109969
$$ -767260 -851628 -1046063 -174374 -941721 19654 -968570 -905649 -528449 -1266686 -156717
3025a56717q01964P25867j350021N57800J34021p13084N83499N35115n24723K27806
$$ -156717 -958681 -232814 -1582835 -1025035 -891014 -1604098 -1020599 -485484 -1010207 -782401
3015g82401K11473j49209n08758R23872K5776j111667J067771k75846K97775n33435
$$ -782401 -570928 -720137 -1228895 -305023 -279247 -1390914 -323143 -598989 -301214 -834649
3005h34649k30264L59148l48682K35883O14689J69223m49514J27125r63198J381613
$$ -834649 -1064913 -705765 -1054447 -818564 -203875 -34652 -484166 -357041 -1320239 61374
2995F1374n08985o72684J38516O36598j91374p09492l6553J099468q67527K7259
$$ 61374 -447611 -1120295 -981779 -345181 -536555 -1246047 -1282600 -183132 -1050659 -1023400
2985a023400J9624L93210m55097p4864J97574j78246Q21179p04990K42928k13228
$$ -1023400 -1003776 -610566 -1065663 -1140527 -942953 -1121199 -300020 -1005010 -762082 -975310
2975i75310J126187k05792j731381N36009K97310P91722o69217J03384K56942
$$ -975310 150877 -54915 -1786296 -1250287 -952977 -161255 -830472 -727088 -470146
2966d70146j09985n07549Q54299n06042Q15648j020402J81878L50741J41689q42681
$$ -470146 -580131 -1087680 -233381 -739423 76225 -944177 -762299 -411558 -269869 -1112550
2956a112550J005822j027704J156023j12749p13530J28025r03604J062257M42984
$$ -1112550 -106728 -1134432 21591 -91158 -804688 -676663 -1580267 -518010 -75026
2947g5026r94466R47738o68419O92210m88825j78241q3185O69021q41692M26176
$$ -75026 -1069492 -121754 -790173 -97963 -586788 -765029 -848214 -179193 -1020885 -594709
2937e94709j05447P24303p37243P48110p49894L37026l57056K5857l06666J9760
$$ -594709 -700156 24147 -713096 35014 -714880 -377854 -734910 -709053 -1015719 -995959
2927i95959L74651o59611K81002J35310J59012o90915R03604q42003J337378m90384
$$ -995959 -621308 -1280919 -999917 -864607 -705595 -1396510 -492906 -1334909 2469 -487915
2917d87915m75729m87111R76292J19187p6318q63524J321375j33531l11618R2462
$$ -487915 -963644 -1450755 -474463 -355276 -431594 -1295118 26257 -107274 -418892 -326430
2907c26430j59375n27568K69920j29266J2554l87033m8754J58201P15838r66555
$$ -326430 -485805 -1013373 -743453 -872719 -860165 -1247198 -1295952 -1137751 -421913 -1388468
2897a388468O52477l46801J26154L38761k60761j48832O83655l5513m52347K86422
$$ -1388468 -735991 -1082792 -956638 -617877 -878638 -1027470 -343815 -379328 -831675 -545253
2887e45253o26545K7403R05936l88282O3522q96635k4142R82820M1586m60627
$$ -545253 -1171798 -1144395 -238459 -626741 -563219 -1459854 -1483996 -501176 -459590 -920217
2877i20217O27399o86339J38954M39893m46457J036746p90183L34228n43214l81494
$$ -920217 -292818 -979157 -840203 -400310 -846767 189979 -600204 -265976 -809190 -1190684
2867a190684N50663l62001Q41387r80392M99859K61153m22447M25128l01036N61603
$$ -1190684 -640021 -1002022 -160635 -1141027 -641168 -380015 -802462 -377334 -678370 -116767
2857a16767j33328q72215L08850K83935P51805l79982j187863R89490m07077m80308
$$ -116767 -250095 -1122310 -813460 -529525 222280 -157702 -1345565 -356075 -763152 -1243460
2847a243460M83963j91053j33438K25580n21832O56448J064591j287771r6937
$$ -1243460 -759497 -950550 -1083988 -858408 -1380240 -723792 340799 -946972 -1043909
2838a043909J051856m96152j004541N80672n4178J41898m35311M26616L71270
$$ -1043909 7947 -488205 -1492746 -912074 -966252 -824354 -1259665 -833049 -461779
2829d61779p04514O49211o6512k21226k16109P26422k76594J08693l78954Q14
$$ -461779 -1166293 -517082 -583594 -804820 -1020929 -294507 -571101 -462408 -841362 -840548
2819h40548N52384R2551p11175P27720O8834n80561j09669J22457L23714L19036
$$ -840548 -288164 -195613 -906788 -179068 -110234 -690795 -800464 -678007 -354293 -35257
2809c5257j397543J309335j027950l39672N79126Q57524j034711J81542m3406
$$ -35257 -1432800 -123465 -1151415 -1491087 -911961 -54437 -1089148 -907606 -951012
2800i51012J74643L36582k36286p64121M35392K74130K02248N31979p01501M99718
$$ -951012 -776369 -439787 -676073 -1440194 -1004802 -730672 -528424 3555 -697946 -198228
2790a98228k63239p37014J233212q22076r5386q2539P73469j219242O14457P7324
$$ -198228 -461467 -1198481 34731 -787345 -882731 -965270 -191801 -1411043 -796586 -719262
2780g19262N1115k65440L9808Q61736m68415M03045q70826N2964j10013l07726
$$ -719262 -668147 -933587 -893779 -32043 -500458 -97413 -968239 -915275 -1025288 -1333014
2770a333014N21369k59626K68268p24428J054503p14820O05753J01822k21822
$$ -1333014 -811645 -1071271 -803003 -1527431 -472928 -1187748 -581995 -480173 -701995
2761g01995K67259k73179m2306r71995P24467M03923k03568j02778L71602m0066
$$ -701995 -434736 -707915 -750221 -1722216 -997749 -593826 -797394 -900172 -528570 -568636
2751e68636J1134l40447R2772q79425K84017Q96953P4556m22347M04770l01496
$$ -568636 -557502 -897949 -805177 -1684602 -1400585 -503632 -429076 -851423 -446653 -748149
2741g48149k85241o35466Q65203k89716R6355K30738M86984j82603p05304O21545
$$ -748149 -1033390 -1668856 -803653 -1093369 -997014 -766276 -279292 -461895 -1167199 -545654
2731e45654K81622j44970P33991q75652n55941O02826M27742r69308P02405j516
$$ -545654 -264032 -409002 324989 -550663 -1106604 -503778 -76036 -1045344 -342939 -344455
2721c44455l54048k82939j5924k02546R52056m27612j09276M59847o23690J160813
$$ -344455 -698503 -981442 -997366 -1199912 -247856 -675468 -784744 -324897 -948587 212226
2711B12226n02009J58305m34764K99809r18911Q29570m62256n57644P27705L84936
$$ 212226 -289783 -131478 -566242 -266433 -1185344 -355774 -818030 -1375674 -647969 -263033
2701b63033m35684k98410J597967j739693J139535q35988Q3281j84009M04235
$$ -263033 -698717 -997127 600840 -1138853 682 -835306 -752025 -936034 -531799
2692e31799L95619K57726r34427J75425l07164m6050O05989n09309L43934L41543
$$ -531799 -136180 121546 -812881 -637456 -944620 -990670 -384681 -893990 -550056 -208513
2682b08513n58991K12624L59247n1331J25985j586235J167761J23049o90188L90239
$$ -208513 -767504 -554880 -195633 -246964 -120979 -1707214 -539453 -416404 -1106592 -716353
2672g16353j49584K02215p5726O51754n86523J56123k09801O17782m072l87102
$$ -716353 -865937 -663722 -739448 -87694 -674217 -518094 -727895 -110113 -114185 -501287
2662e01287l00270K40175K35440M57090k74122l77255r09004j40986L64766R23908
$$ -501287 -801557 -561382 -325942 131148 -142974 -520229 -1429233 -1570219 -1205453 -281545
2652b81545m36100j4650K96597j21933j37431J132356q13300j44975O52225q24966
$$ -281545 -717645 -732295 -435698 -557631 -695062 437294 -376006 -520981 131244 -693722
2642f93722k93461l75K54980K74873n88895K66597j85845M60614l16303L61862
$$ -693722 -987183 -987558 -732578 -457705 -1046600 -780003 -965848 -505234 -821537 -459675
2632d59675j73851K60205p46570R08456M4161j279397Q26285q09070K08414Q11877
$$ -459675 -633526 -373321 -1119891 -211435 -167274 -1446671 -620386 -1429456 -1221042 -409165
2622d09165l18717P86115j236900Q84171o77978K03889n46223j30275J006676
$$ -409165 -727882 58233 -1178667 -294496 -972474 -768585 -1314808 -1445083 -438407
2613d38407l28805P23801l873k7872j001371Q16217j166236R95556J69457o19770
$$ -438407 -767212 -43411 -47284 -75156 -1076527 -260310 -1426546 -430990 -261533 -881303
2603h81303n0934O93982K85520q07128R9599J85201L29859o82746N2470n5483
$$ -881303 -932237 -238255 47265 -759863 -660264 -475063 -145204 -827950 -775480 -830963
2593h30963P92391j408771J10223Q36440k53817O22648p46881j11101p7327Q33452
$$ -830963 -38572 -1447343 -1337120 -500680 -754497 -131849 -878730 -989831 -1067158 -233706
2583b33706j83995j61951j51905L86484p8361l78446L34252m80923L67290N21626
$$ -233706 -417701 -579652 -731557 -345073 -423434 -801880 -467628 -948551 -581261 -59635
2573e9635m86030k5954K52618p46909J443412p32096k86520m63502N51466K77179
$$ -59635 -545665 -571619 -319001 -1065910 377502 -354594 -641114 -1104616 -553150 -275971
2563b75971r7585k23496N8675j16095j56269L60899o09136k99624J79167K05652
$$ -275971 -373556 -597052 -538377 -654472 -810741 -449842 -1058978 -1358602 -1179435 -973783
2553i73783M94281k0716j92494j19851M35759k95270j06167R79035q62828L35755
$$ -973783 -479502 -500218 -692712 -812563 -376804 -672074 -778241 200794 -662034 -326279
2543c26279m69162P52744j038472O28930p94958K48800P45183J5281j055100J017068
$$ -326279 -795441 -42697 -1081169 -452239 -1247197 -998397 -253214 -237933 -1293033 -275965
2533b75965m88220l51989Q61930p02153L3332n2397o340O07026o20826N38852
$$ -275965 -764185 -1116174 -254244 -956397 -923065 -975462 -981802 -374776 -995602 -456750
2523d56750P44716q18606L2832o4523p2127j79709l56178N19165J89373l04627
$$ -456750 287966 -530640 -497808 -562331 -634458 -814167 -1170345 -651180 -461807 -766434
2513g66434K70556J28144q32389M47808M20616q10990L55561L16037L69779n04370
$$ -766434 -495878 -367734 -1200123 -752315 -331699 -1142689 -787128 -471091 -101312 -605682
2503f05682K38274k58284l8521K309L2515j49021P02219n35308j0414l18945M33579
$$ -605682 -367408 -625692 -664213 -661904 -629389 -778410 -76191 -611499 -621913 -940858 -507279
2492e07279K42729n48527L27704p1414j00280l10630k65157o5136L83121j47822
$$ -507279 -264550 -813077 -485373 -556787 -657067 -967697 -1232854 -1297990 -914869 -1062691
2482a062691j72829N33465L52448p6954n47287J52466K66142P89667j03055q20413
$$ -1062691 -1235520 -702055 -349607 -426561 -973848 -821382 -555240 234427 131372 -689041
2472f89041l68382M72345m69829N3420L58094o40191J53269L69026m01079K74035
$$ -689041 -1057423 -585078 -1054907 -1001487 -643393 -1283584 -1130315 -761289 -1162368 -888333
2462h88333N3633L46947O6304J2984M23642l87945q8549q5479P6740j41187L02282
$$ -888333 -834700 -487753 -421449 -408465 15177 -372768 -461317 -546796 -470056 -611243 -308961
2451c08961l82752l54757j9564K07590L26172K8381L5708q3651L17770l69944
$$ -308961 -691713 -1046470 -1066034 -858444 -532272 -503891 -468183 -551834 -234064 -604008
2441f04008N09863l67770R78736j775195O46232j10163K40722j0733M4739k03246
$$ -604008 -94145 -461915 516821 -1258374 -612142 -722305 -481583 -492316 -447577 -650823
2431f50823R1751N63559j87967j262320Q82151r93046J661007r90742j50368M32280
$$ -650823 -559072 4487 -183480 -1445800 -563649 -1556695 104312 -886430 -1036798 -604518
2421f04518L56360J27988p60166o8319J007656k99833l10947l5485M22828n822
$$ -604518 -248158 -120170 -880336 -948655 59001 -240832 -551779 -587264 -164436 -170258
2411a70258m63447m71258N30305O30413r34524N31510n80190L27872M55962m50389
$$ -170258 -633705 -1104963 -574658 55755 -878769 -347259 -927449 -599577 -143615 -594004
2401e94004J50556J71505o29017L18014k99935J21492M18165l64351l81006P69731
$$ -594004 -443448 -271943 -900960 -582946 -882881 -761389 -343224 -707575 -1088581 -318850
2391c18850n97030K95573L71236n56919p8669n81178O09455k93847L38903L78656
$$ -318850 -915880 -620307 -249071 -805990 -884659 -1465837 -856382 -1150229 -811326 -432670
2381d32670M59276o19633J12507L2841o23416J43828M63508k2177K30286r3828
$$ -432670 26606 -593027 -480520 -447679 -1071095 -927267 -463759 -485936 -255650 -349478
2371c49478j077182P02487L31037m10605J125590n06441l39349M22687N7744q62383
$$ -349478 -1426660 -724173 -393136 -803741 321849 -184592 -523941 -101254 -43510 -905893
2361i05893O64538l89296K32534K96255j078194M67900M32740n10240j47157m8034
$$ -905893 -241355 -630651 -398117 -101862 -1180056 -712156 -279416 -789656 -936813 -984847
2351i84847J71036M07087K00057j059527J513334p99406k19828J049930j363663
$$ -984847 -813811 -406724 -206667 -1266194 247140 -552266 -772094 277836 -1085827
2342a085827J307858j150036q6803R62580q67824k06951O22728r8300l8587l3704
$$ -1085827 222031 -928005 -1014808 -52228 -920052 -1127003 -504275 -602575 -641162 -674866
2332f74866L87670o22453M15821N0824k29005J13488k77806p889L83578m95303
$$ -674866 -287196 -909649 -493828 -443004 -672009 -558521 -836327 -844216 -460638 -955941
2322i55941J51067K14028L93936m55990j61231L51732k75714J75220P7721J15920
$$ -955941 -804874 -590846 -196910 -652900 -814131 -462399 -738113 -562893 -485172 -369252
2312c69252k44084q12498O1715Q23568N6915m11791R92657j269809O2469N75568
$$ -369252 -613336 -1425834 -1364119 -540551 -483636 -895427 97230 -1172579 -1110110 -534542
2302e34542k64854O4023N99866j260884J151212l03326k336n98874M12159P79548
$$ -534542 -799396 -735373 -135507 -1396391 -245179 -548505 -550841 -1149715 -737556 41992
2292D1992n16974o72879L77373o85040m1312J254188l19571M90385m37295m1157
$$ 41992 -474982 -1147861 -770488 -1455528 -1496840 -242652 -562223 -71838 -509133 -550290
2282e50290L03005j50261k63356K71779p24077Q98981j016314J139352p2122n60409
$$ -550290 -247285 -397546 -660902 -389123 -1113200 -214219 -1230533 -91181 -163303 -723712
2272g23712N1501l38670N56780J99573j14609o41840O56562p95097K82554j97403
$$ -723712 -672211 -1010881 -454101 -254528 -369137 -1010977 -354415 -1149512 -866958 -1064361
2262a064361P06781m31546K56231j63586Q16444m09843L09393q37945m29087M68218
$$ -1064361 -357580 -789126 -532895 -696481 119963 -289880 19513 -818432 -1247519 -779301
2252g79301j44628J83138Q43838l10900k54388m774l38824l2487L96139j5020
$$ -779301 -923929 -740791 103047 -207853 -462241 -467015 -805839 -838326 -442187 -457207
2242d57207O467q39319O13408M4397l20517Q30790k35738k7233M39678r95475
$$ -457207 -450740 -1290059 -676651 -632254 -952771 -121981 -357719 -384952 54726 -940749
2232i40749P98104k89929L0089m94016Q91614o79710k59753O50249m25255R3174
$$ -940749 -142645 -432574 -402485 -896501 -4887 -684597 -944350 -294101 -719356 -626182
2222f26182L89179l26375m76382L36879N44085k21279m13655n43523R84169q26970
$$ -626182 -237003 -563378 -1039760 -702881 -158796 -380075 -793730 -1337253 -353084 -1180054
2212a180054J167319o66260n28790M02064N03934l4136k77082j3137q47134K134073
$$ -1180054 -12735 -678995 -1207785 -805721 -301787 -335923 -613005 -626142 -1473276 660797
2202F60797j469438m9790k4158m02087J98506M35073P56349p5578n05716L64975
$$ 660797 -808641 -858431 -882589 -1284676 -1086170 -651097 105252 29674 -476042 -111067
2192a11067j66838L48182j409014P60157L71330r71366M24539k25769O53998n48478
$$ -111067 -277905 70277 -1338737 -578580 -207250 -1178616 -754077 -979846 -325848 -874326
2182h74326M39888K8856k31553J95093J25242M78968j68832J15896m98005M34898
$$ -874326 -434438 -405582 -637135 -442042 -316800 162168 -6664 109232 -388773 46125
2172D6125j018827L15757j92353J61068J71232k7722L56438j12713q7088n12085
$$ 46125 -972702 -656945 -849298 -688230 -516998 -544720 -188282 -300995 -388083 -900168
2162i00168P16735l11815J98496o60394N07754o25310N07555P9345O69570j337438
$$ -900168 -183433 -495248 -296752 -957146 -449392 -1074702 -567147 -487802 181768 -1155670
2152a155670M18784J97330M24799j02129J5915p7240j61556n47723L26022m6953
$$ -1155670 -736886 -539556 -114757 -216886 -200971 -278211 -439767 -987490 -661468 -708421
2142g08421j80203M70859j2262P1087o35065M477K25521J54917m81613J121585
$$ -708421 -888624 -417765 -430027 -358940 -994005 -989528 -764007 -609090 -1090703 30882
2132C0882J22014j31626p19913P20106q29581M04744l83793M30624k6998J96857
$$ 30882 152896 21270 -698643 21463 -808118 -403374 -787167 -356543 -383541 -186684
2122a86684k06348n31383N0136l56434L39202R03394o54532M25420l59275j36319
$$ -186684 -393032 -924415 -874279 -1230713 -891511 11883 -642649 -217229 -576504 -712823
2112g12823q5808L68142p03272R90755l80509n38441M12947L18990l54165P87902
$$ -712823 -798631 -430489 -1133761 -143006 -523515 -1061956 -649009 -330019 -684184 103718
2102A03718q56039K23812m02115Q15516j7671l32660L31073m36521n38732k11960
$$ 103718 -752321 -528509 -930624 -115108 -132779 -465439 -134366 -570887 -1109619 -1321579
2092a321579P59361k13594K8891O10886o80853L56875p67242N58227N98700L8442
$$ -1321579 -562218 -775812 -746921 -136035 -816888 -460013 -1227255 -669028 -70328 -31886
2082c1886j305177J308733j326598J119893n52804r535K97322N6618m53880L19371
$$ -31886 -1337063 -28330 -1354928 -235035 -787839 -797374 -500052 -443434 -897314 -577943
2072e77943j27090N49901k31761J74466o01884L42001M39821q16370K04328J003898
$$ -577943 -705033 -155132 -386893 -212427 -814311 -472310 -32489 -848859 -644531 359367
2062C59367j457792J06626Q82376k15126q08954N04573l1937N01381q82041P03867
$$ 359367 -1098425 -991799 -109423 -324549 -1133503 -628930 -660867 -159486 -1041527 -337660
2052c37660r56639J025979l63085R15975j620702J407040n90857O1559j92653
$$ -337660 -1294299 -268320 -631405 284570 -1336132 70908 -519949 -458390 -651043
2043f51043K21423l12781J31445M5531m49262M34909p79194J059455J01742o23694
$$ -651043 -429620 -742401 -610956 -565425 -1014687 -579778 -1358972 -299517 -197775 -821469
2033h21469J83613M51160q99453J273484n00715n5969M4935P73927j294077J92867
$$ -821469 -637856 -186696 -1086149 187335 -313380 -369349 -324414 449513 -844564 -651697
2023f51697N8626n54759p6543K12825j57932O22195k15453N77215p7639n48890
$$ -651697 -593071 -1147830 -1224373 -1011548 -1169480 -547285 -762738 -185523 -263162 -812052
2013h12052P46231j79380l67911j87120r4874L58808L02110J09147n59588K17866
$$ -812052 -65821 -245201 -613112 -800232 -895106 -536298 -234188 -125041 -684629 -466763
2003d66763k70775k03229o02684N42223l91729P25554J00699q86012P54059l54499
$$ -466763 -737538 -940767 -1543451 -1001228 -1392957 -667403 -566704 -1452716 -698657 -1053156
1993a053156Q61928M54747j388434J04763J314503p84007j61315L16751q0101
$$ -1053156 -191228 263519 -1124915 -1020152 294351 -489656 -650971 -334220 -414321
1984d14321L17576o64471j1585n00360P47642J41596N36878k47783N7119n80906
$$ -414321 -96745 -761216 -772801 -1273161 -525519 -383923 152955 -94828 -37709 -618615
1974f18615o06787J187316m08769L99436r99377Q8544j91434J81311P85462o40589
$$ -618615 -1225402 -38086 -446855 -47419 -1046796 -958252 -1149686 -968375 -182913 -823502
1964h23502K79415J25860q09195P38466M84265j373277O32849J42371L02058Q8773
$$ -823502 -544087 -418227 -1227422 -488956 -4691 -1377968 -745119 -602748 -300690 -211917
1954b11917k62900L53892q73048Q67172K49838q87890O94685l44980l59151K90430
$$ -211917 -474817 -120925 -993973 -126801 123037 -764853 -70168 -415148 -774299 -483869
1944d83869o14485K81735J00277R5049J30078o50867N66060m77138L75322n32088
$$ -483869 -1098354 -816619 -716342 -621293 -491215 -1142082 -576022 -1053160 -677838 -1209926
1934a209926L52270M95651P20290k122574R61229j19464m75962J391306k52543
$$ -1209926 -857656 -362005 358285 -1764289 -803060 -922524 -1398486 -7180 -259723
1925b59723K9594j14152K46831p51013L23318M25876o59068L68519n60097J070139
$$ -259723 -230129 -344281 -97450 -848463 -525145 -99269 -758337 -389818 -949915 120224
1915A20224o48234l15632P46365o64536j4308K38785m40032L43469j52322r570
$$ 120224 -528010 -843642 -97277 -761813 -776121 -537336 -977368 -633899 -786221 -795791
1905g95791L84159p33472R05528J37717k54561j74635j05953L3578o11858J90441
$$ -795791 -411632 -1145104 -239576 -101859 -356420 -531055 -637008 -603430 -1215288 -1024847
1895a024847R8621Q60825k70568N97152j501286J54707R51330q47601r4170N96669
$$ -1024847 -926226 -65401 -335969 261183 -1240103 -1085396 -134066 -981667 -1075837 -479168
1885d79168m3858o2078J54918m33461P81010l8943m40894k32133J0121P23730
$$ -479168 -523026 -585104 -430186 -863647 -82637 -121580 -562474 -794607 -784486 -60756
1875f0756o83158P7163O24300n34036R2898p8214L08259O9343n35401J07814K99632
$$ -60756 -743914 -666751 -42451 -576487 -483589 -561803 -253544 -184201 -719602 -611788 -312156
1864c12156K92083J58674j386511L50975K10185j32872L3535n38630P5103L85527
$$ -312156 -20073 138601 -1247910 -896935 -686750 -819622 -786087 -1324717 -1249614 -864087
1854h64087K46900J07365j26664L29669k41214j05092m418L485k03671M83745
$$ -864087 -617187 -509822 -636486 -306817 -548031 -653123 -657541 -654056 -857727 -373982
1844c73982o73459O28901j56382n9547l37974j25741N17504k05685K6021L96281
$$ -373982 -1047441 -418540 -574922 -634469 -972443 -1098184 -580680 -786365 -760344 -364063
1834c64063J53484m33147O4607N75210o43482K53851R4580o38519N89961N14388
$$ -364063 -210579 -643726 -579119 -3909 -647391 -393540 -298960 -937479 -347518 166870
1824A66870j343616K05613k90497Q9761K00778M63029M126j83643M12787k21581
$$ 166870 -1176746 -971133 -1261630 -1171869 -971091 -508062 -503936 -687579 -274792 -496373
1814d96373j44411N69103n50879j18755N00069l50233L82955q83031Q82207k80051
$$ -496373 -640784 -71681 -622560 -741315 -241246 -591479 -208524 -1091555 -209348 -489399
1804d89399r26291J188684q5582L61511j248681J111363j10820o17133q53805
$$ -489399 -1415690 -227006 -312588 48923 -1199758 -88395 -199215 -816348 -1670153
1795a670153J587797k0216m21640m46143L20340N27315p35905P23449r25220J195193
$$ -1670153 -82356 -102572 -524212 -970355 -650015 -122700 -858605 -135156 -1060376 134817
1785A34817o59647k28730N59265l78413l19161L70111n3492K21879J45192r44700
$$ 134817 -524830 -753560 -194295 -572708 -891869 -521758 -575250 -353371 -208179 -1152879
1775a152879P77777r94070Q72143k12383K87413j21774k0090L31867n60207M67244
$$ -1152879 -375102 -1369172 -497029 -709412 -421999 -543773 -563863 -231996 -792203 -324959
1765c24959O9317k28187j41129L01119j04903K59270j77578l67177m4484J088782
$$ -324959 -255642 -483829 -624958 -323839 -428742 -169472 -347050 -714227 -758711 330071
1755C30071p54164p52996O19798M25633q3271K00566o55232m25115O99743k33618
$$ 330071 -424093 -1177089 -557291 -131658 -214929 -14363 -669595 -1094710 -394967 -628585
1745f28585K59098l75257K05948l62741J25275N00953j22193K57827p69064J67204
$$ -628585 -369487 -744744 -538796 -901537 -776262 -275309 -397502 -139675 -908739 -741535
1735g41535O86228p35930M2898K06331j24209q08810M39165M51057L38627j10905
$$ -741535 -55307 -791237 -748339 -542008 -666217 -1475027 -1035862 -584805 -246178 -357083
1725c57083j8690k0903o84518M57893M86856n33432M11486j88863k74367M13177
$$ -357083 -375773 -396676 -1081194 -623301 -136445 -669877 -258391 -447254 -721621 -308444
1715c08444m79905M41955m85723k13053j23207J57793L56926l73937J19228N11051
$$ -308444 -788349 -346394 -832117 -1045170 -1168377 -1010584 -653658 -1027595 -908367 -397316
1705c97316K72380n28362N00343o30437L62779k07539p9673K7062Q68506j298336
$$ -397316 -124936 -653298 -152955 -783392 -420613 -628152 -707825 -680763 187743 -1110593
1695a110593N40302N66848p55018j91318L47740L11828l20974R774J23441q63155
$$ -1110593 -570291 -3443 -758461 -949779 -602039 -290211 -611185 -601411 -477970 -1341125
1685a341125R18139P3035P02929q81042l7568O10782k51314l55027L41666l31505
$$ -1341125 -422986 -349951 352978 -528064 -565632 45150 -206164 -561191 -219525 -551030
1675e51030Q8550l05369P69930o53688r7497l91541L5102J038632l66257n08299
$$ -551030 -462480 -767849 2081 -651607 -749104 -1140645 -1105543 -66911 -433168 -941467
1665i41467R78008p13642k44099K82229j94212K47311r7339J43919l52581p73323
$$ -941467 36541 -677101 -921200 -638971 -833183 -585872 -683211 -539292 -891873 -1665196
1655a665196J014281L75693J52235j032840N03071q0226K67774K02336k17884
$$ -1665196 -650915 -275222 -122987 -1155827 -652756 -732982 -465208 -262872 -480756
1646d80756p9323q39907R55077m91784m00200M24142m91616J65864J286065j062304
$$ -480756 -560079 -1399986 -444909 -936693 -1336893 -912751 -1404367 -1238503 47562 -1014742
$$ [...]
##END NTUPLES=NMR SPECTRUM
##END=
